[
    {
        "alias": "git",
        "index": "git_grimoirelab_171229_enriched_171229",
        "filter": "*",
        "routing.index": "-",
        "routing.search": "-"
    },
    {
        "alias": "git_author",
        "index": "git_grimoirelab_171229_enriched_171229",
        "filter": "*",
        "routing.index": "-",
        "routing.search": "-"
    },
    {
        "alias": "git_enrich",
        "index": "git_grimoirelab_171229_enriched_171229",
        "filter": "*",
        "routing.index": "-",
        "routing.search": "-"
    },
    {
        "alias": "github_issues",
        "index": "github_grimoirelab_170908_enriched_170908b",
        "filter": "*",
        "routing.index": "-",
        "routing.search": "-"
    },
    {
        "alias": "github_issues_enrich",
        "index": "github_grimoirelab_170908_enriched_170908b",
        "filter": "*",
        "routing.index": "-",
        "routing.search": "-"
    },
    {
        "alias": "issues_closed",
        "index": "github_grimoirelab_170908_enriched_170908b",
        "filter": "*",
        "routing.index": "-",
        "routing.search": "-"
    },
    {
        "alias": "issues_created",
        "index": "github_grimoirelab_170908_enriched_170908b",
        "filter": "*",
        "routing.index": "-",
        "routing.search": "-"
    },
    {
        "alias": "issues_updated",
        "index": "github_grimoirelab_170908_enriched_170908b",
        "filter": "*",
        "routing.index": "-",
        "routing.search": "-"
    },
    {
        "alias": "mbox",
        "index": "pipermail_grimoirelab_170908__enriched_170908b",
        "filter": "-",
        "routing.index": "-",
        "routing.search": "-"
    },
    {
        "alias": "mbox_enrich",
        "index": "pipermail_grimoirelab_170908__enriched_170908b",
        "filter": "-",
        "routing.index": "-",
        "routing.search": "-"
    }
]
