5000000
29012392
30.5 30.5 1.
0 0 1.
0.e+00 5.e-09 5.e-9
spherebox.bin
1 60 1 60
1 60 1 60
1 60 1 60
2
1. 0.01 0.002 1.37
5. 0.10 0.010 1.37
4	1
30.0	20.0	1.0
30.0	40.0	1.0
20.0	30.0	1.0
40.0	30.0	1.0
