{
  "parent": "betterwithmods_core:block/front_top_faced",
  "textures": {
    "front": "betterwithmods_mechanist:block/redstone/detector/detector_front_on",
    "side": "betterwithmods_mechanist:block/redstone/detector/detector_top_on",
    "back": "betterwithmods_mechanist:block/redstone/detector/detector_top_on",
    "top": "betterwithmods_mechanist:block/redstone/detector/detector_top_on",
    "bottom": "betterwithmods_mechanist:block/redstone/detector/detector_top_on"
  }
}
