{
	"geometry.vertical_windmill_sails": {
		"texturewidth": 128,
		"textureheight": 128,
		"visible_bounds_width": 8,
		"visible_bounds_height": 6,
		"visible_bounds_offset": [0, 3, 0],
		"bones": [
			{
				"name": "sail",
				"pivot": [0, 0, 0],
				"cubes": [
					{"origin": [-22, -48, 69], "size": [19, 99, 2], "uv": [0, 0]}
				]
			}
		]
	}
}