{
	"credit": "Made with Blockbench",
	"parent": "block/block",
	"textures": {
		"all": "betterwithmods_mechanist:block/baking/raw_cookie",
		"particle": "betterwithmods_mechanist:block/baking/raw_cookie"
	},
	"elements": [
		{
			"from": [3, 0, 6],
			"to": [7, 1, 10],
			"faces": {
				"north": {"uv": [0, 0, 4, 1], "texture": "#all"},
				"east": {"uv": [0, 0, 4, 1], "texture": "#all"},
				"south": {"uv": [0, 0, 4, 1], "texture": "#all"},
				"west": {"uv": [8, 8, 12, 9], "texture": "#all"},
				"up": {"uv": [10, 6, 14, 10], "texture": "#all"},
				"down": {"uv": [0, 0, 4, 4], "texture": "#all"}
			}
		},
		{
			"from": [9, 0, 6],
			"to": [13, 1, 10],
			"faces": {
				"north": {"uv": [0, 0, 4, 1], "texture": "#all"},
				"east": {"uv": [4, 10, 8, 11], "texture": "#all"},
				"south": {"uv": [0, 0, 4, 1], "texture": "#all"},
				"west": {"uv": [10, 6, 14, 7], "texture": "#all"},
				"up": {"uv": [1, 3, 5, 7], "texture": "#all"},
				"down": {"uv": [0, 0, 4, 4], "texture": "#all"}
			}
		},
		{
			"from": [3, 0, 1],
			"to": [7, 1, 5],
			"faces": {
				"north": {"uv": [3, 13, 7, 14], "texture": "#all"},
				"east": {"uv": [0, 0, 4, 1], "texture": "#all"},
				"south": {"uv": [0, 0, 4, 1], "texture": "#all"},
				"west": {"uv": [6, 6, 10, 7], "texture": "#all"},
				"up": {"uv": [6, 10, 10, 14], "texture": "#all"},
				"down": {"uv": [0, 0, 4, 4], "texture": "#all"}
			}
		},
		{
			"from": [9, 0, 1],
			"to": [13, 1, 5],
			"faces": {
				"north": {"uv": [7, 6, 11, 7], "texture": "#all"},
				"east": {"uv": [9, 7, 13, 8], "texture": "#all"},
				"south": {"uv": [0, 0, 4, 1], "texture": "#all"},
				"west": {"uv": [0, 9, 4, 10], "texture": "#all"},
				"up": {"uv": [1, 9, 5, 13], "texture": "#all"},
				"down": {"uv": [0, 0, 4, 4], "texture": "#all"}
			}
		},
		{
			"from": [3, 0, 11],
			"to": [7, 1, 15],
			"faces": {
				"north": {"uv": [0, 0, 4, 1], "texture": "#all"},
				"east": {"uv": [0, 0, 4, 1], "texture": "#all"},
				"south": {"uv": [0, 0, 4, 1], "texture": "#all"},
				"west": {"uv": [3, 15, 7, 16], "texture": "#all"},
				"up": {"uv": [1, 3, 5, 7], "texture": "#all"},
				"down": {"uv": [0, 0, 4, 4], "texture": "#all"}
			}
		},
		{
			"from": [9, 0, 11],
			"to": [13, 1, 15],
			"faces": {
				"north": {"uv": [2, 9, 6, 10], "texture": "#all"},
				"east": {"uv": [2, 4, 6, 5], "texture": "#all"},
				"south": {"uv": [0, 0, 4, 1], "texture": "#all"},
				"west": {"uv": [2, 4, 6, 5], "texture": "#all"},
				"up": {"uv": [2, 5, 6, 9], "texture": "#all"},
				"down": {"uv": [0, 0, 4, 4], "texture": "#all"}
			}
		}
	]
}
