{
  "parent": "betterwithmods_mechanist:block/base/pot",
  "textures": {
    "top": "betterwithmods_mechanist:block/cauldron/cauldron_top",
    "bottom": "betterwithmods_mechanist:block/cauldron/cauldron_bottom",
    "side": "betterwithmods_mechanist:block/cauldron/cauldron_side"
  }
}
