{
	"credit": "Made with Blockbench",
	"textures": {
		"switch": "betterwithmods_mechanist:block/turntable/switch",
		"particle": "betterwithmods_mechanist:block/turntable/switch"
	},
	"elements": [
		{
			"from": [10, 5, -2],
			"to": [12, 7, 0],
			"faces": {
				"north": {"uv": [0, 0, 2, 2], "texture": "#switch"},
				"east": {"uv": [0, 0, 2, 2], "texture": "#switch"},
				"south": {"uv": [0, 0, 2, 2], "texture": "#switch"},
				"west": {"uv": [0, 0, 2, 2], "texture": "#switch"},
				"up": {"uv": [0, 0, 2, 2], "texture": "#switch"},
				"down": {"uv": [0, 0, 2, 2], "texture": "#switch"}
			}
		},
		{
			"from": [-2, 5, 4],
			"to": [0, 7, 6],
			"faces": {
				"north": {"uv": [0, 0, 2, 2], "texture": "#switch"},
				"east": {"uv": [0, 0, 2, 2], "texture": "#switch"},
				"south": {"uv": [0, 0, 2, 2], "texture": "#switch"},
				"west": {"uv": [0, 0, 2, 2], "texture": "#switch"},
				"up": {"uv": [0, 0, 2, 2], "texture": "#switch"},
				"down": {"uv": [0, 0, 2, 2], "texture": "#switch"}
			}
		},
		{
			"from": [4, 5, 16],
			"to": [6, 7, 18],
			"faces": {
				"north": {"uv": [0, 0, 2, 2], "texture": "#switch"},
				"east": {"uv": [0, 0, 2, 2], "texture": "#switch"},
				"south": {"uv": [0, 0, 2, 2], "texture": "#switch"},
				"west": {"uv": [0, 0, 2, 2], "texture": "#switch"},
				"up": {"uv": [0, 0, 2, 2], "texture": "#switch"},
				"down": {"uv": [0, 0, 2, 2], "texture": "#switch"}
			}
		},
		{
			"from": [16, 5, 10],
			"to": [18, 7, 12],
			"faces": {
				"north": {"uv": [0, 0, 2, 2], "texture": "#switch"},
				"east": {"uv": [0, 0, 2, 2], "texture": "#switch"},
				"south": {"uv": [0, 0, 2, 2], "texture": "#switch"},
				"west": {"uv": [0, 0, 2, 2], "texture": "#switch"},
				"up": {"uv": [0, 0, 2, 2], "texture": "#switch"},
				"down": {"uv": [0, 0, 2, 2], "texture": "#switch"}
			}
		}
	],
	"groups": [
		{
			"name": "group",
			"children": [0, 1, 2, 3]
		}
	]
}