{
  "variants": {
    "facing=up": {
      "model": "betterwithmods_mechanist:block/bark/bark",
      "uvlock": true
    },
    "facing=down": {
      "model": "betterwithmods_mechanist:block/bark/bark",
      "x": 180,
      "uvlock": true
    },
    "facing=north": {
      "model": "betterwithmods_mechanist:block/bark/bark",
      "x": 270,
      "y": 180,
      "uvlock": true
    },
    "facing=south": {
      "model": "betterwithmods_mechanist:block/bark/bark",
      "x": 270,
      "uvlock": true
    },
    "facing=west": {
      "model": "betterwithmods_mechanist:block/bark/bark",
      "x": 270,
      "y": 90,
      "uvlock": true
    },
    "facing=east": {
      "model": "betterwithmods_mechanist:block/bark/bark",
      "x": 270,
      "y": 270,
      "uvlock": true
    }
  }
}
