{
	"credit": "Made with Blockbench",
	"parent": "block/block",
	"elements": [
		{
			"from": [0, 14, 0],
			"to": [16, 16, 16],
			"color": 7,
			"faces": {
				"north": {"uv": [0, 0, 16, 2], "texture": "#all"},
				"east": {"uv": [0, 0, 16, 2], "texture": "#all"},
				"south": {"uv": [0, 0, 16, 2], "texture": "#all"},
				"west": {"uv": [0, 0, 16, 2], "texture": "#all"},
				"up": {"uv": [0, 0, 16, 16], "texture": "#all"},
				"down": {"uv": [0, 0, 16, 16], "texture": "#all"}
			}
		}
	]
}
