{
	"credit": "Made with Blockbench",
	"textures": {
		"0": "betterwithmods_mechanist:block/handcrank/handcrank_lever",
		"1": "betterwithmods_mechanist:block/handcrank/handcrank_side",
		"2": "betterwithmods_mechanist:block/handcrank/handcrank_top",
		"3": "betterwithmods_mechanist:block/handcrank/handcrank_bottom",
		"particle": "betterwithmods_mechanist:block/handcrank/handcrank_lever"
	},
	"elements": [
		{
			"name": "a",
			"from": [0, 0, 0],
			"to": [16, 2, 16],
			"faces": {
				"north": {"uv": [0, 14, 16, 16], "texture": "#1"},
				"east": {"uv": [0, 14, 16, 16], "texture": "#1"},
				"south": {"uv": [0, 14, 16, 16], "texture": "#1"},
				"west": {"uv": [0, 14, 16, 16], "texture": "#1"},
				"up": {"uv": [0, 0, 16, 16], "texture": "#2"},
				"down": {"uv": [0, 0, 16, 16], "texture": "#3"}
			}
		},
		{
			"name": "b",
			"from": [9, 2, 0],
			"to": [16, 3, 16],
			"faces": {
				"north": {"uv": [0, 12, 7, 13], "texture": "#1"},
				"east": {"uv": [0, 12, 16, 13], "texture": "#1"},
				"south": {"uv": [9, 12, 16, 13], "texture": "#1"},
				"west": {"uv": [0, 12, 16, 13], "texture": "#1"},
				"up": {"uv": [9, 0, 16, 16], "texture": "#2"},
				"down": {"uv": [0, 0, 7, 16], "texture": "#2"}
			}
		},
		{
			"name": "c",
			"from": [0, 2, 0],
			"to": [7, 3, 16],
			"faces": {
				"north": {"uv": [9, 12, 16, 13], "texture": "#1"},
				"east": {"uv": [0, 12, 16, 13], "texture": "#1"},
				"south": {"uv": [0, 12, 7, 13], "texture": "#1"},
				"west": {"uv": [0, 12, 16, 13], "texture": "#1"},
				"up": {"uv": [0, 0, 7, 16], "texture": "#2"},
				"down": {"uv": [0, 0, 7, 16], "texture": "#2"}
			}
		},
		{
			"name": "d",
			"from": [7, 2, 0],
			"to": [9, 3, 2],
			"faces": {
				"north": {"uv": [7, 12, 9, 13], "texture": "#1"},
				"east": {"uv": [0, 0, 2, 1], "texture": "#1"},
				"south": {"uv": [7, 12, 9, 13], "texture": "#1"},
				"west": {"uv": [0, 0, 2, 1], "texture": "#1"},
				"up": {"uv": [7, 0, 9, 2], "texture": "#2"},
				"down": {"uv": [0, 0, 2, 2], "texture": "#2"}
			}
		},
		{
			"name": "e",
			"from": [7, 2, 14],
			"to": [9, 3, 16],
			"faces": {
				"north": {"uv": [7, 12, 9, 13], "texture": "#1"},
				"east": {"uv": [0, 0, 2, 1], "texture": "#1"},
				"south": {"uv": [7, 12, 9, 13], "texture": "#1"},
				"west": {"uv": [0, 0, 2, 1], "texture": "#1"},
				"up": {"uv": [7, 14, 9, 16], "texture": "#2"},
				"down": {"uv": [0, 0, 2, 2], "texture": "#2"}
			}
		},
		{
			"from": [7, 1, 7],
			"to": [9, 16, 9],
			"rotation": {"angle": -45, "axis": "x", "origin": [8, 2, 8]},
			"faces": {
				"north": {"uv": [2, 0, 4, 15], "texture": "#0"},
				"east": {"uv": [0, 0, 2, 15], "texture": "#0"},
				"south": {"uv": [6, 0, 8, 15], "texture": "#0"},
				"west": {"uv": [4, 0, 6, 15], "texture": "#0"},
				"up": {"uv": [4, 0, 6, 1], "texture": "#0"},
				"down": {"uv": [0, 0, 2, 2], "texture": "#0"}
			}
		}
	],
	"groups": [
		{
			"name": "bottom",
			"children": [0, 1, 2, 3, 4]
		},
		{
			"name": "lever",
			"children": [5]
		}
	]
}
