{
  "parent": "betterwithmods_mechanist:block/mech/joint",
  "textures": {
    "up": "betterwithmods_mechanist:block/gearbox/input_broken",
    "side": "betterwithmods_mechanist:block/gearbox/side_broken"
  }
}
