{
  "variants": {
    "facing=up,powered=false": {
      "model": "betterwithmods_mechanist:block/saw/saw"
    },
    "facing=down,powered=false": {
      "model": "betterwithmods_mechanist:block/saw/saw",
      "x": 180
    },
    "facing=north,powered=false": {
      "model": "betterwithmods_mechanist:block/saw/saw",
      "x": 270,
      "y": 180
    },
    "facing=south,powered=false": {
      "model": "betterwithmods_mechanist:block/saw/saw",
      "x": 270
    },
    "facing=west,powered=false": {
      "model": "betterwithmods_mechanist:block/saw/saw",
      "x": 270,
      "y": 90
    },
    "facing=east,powered=false": {
      "model": "betterwithmods_mechanist:block/saw/saw",
      "x": 270,
      "y": 270
    },
    "facing=up,powered=true": {
      "model": "betterwithmods_mechanist:block/saw/saw_on"
    },
    "facing=down,powered=true": {
      "model": "betterwithmods_mechanist:block/saw/saw_on",
      "x": 180
    },
    "facing=north,powered=true": {
      "model": "betterwithmods_mechanist:block/saw/saw_on",
      "x": 270,
      "y": 180
    },
    "facing=south,powered=true": {
      "model": "betterwithmods_mechanist:block/saw/saw_on",
      "x": 270
    },
    "facing=west,powered=true": {
      "model": "betterwithmods_mechanist:block/saw/saw_on",
      "x": 270,
      "y": 90
    },
    "facing=east,powered=true": {
      "model": "betterwithmods_mechanist:block/saw/saw_on",
      "x": 270,
      "y": 270
    }
  }
}
