{
  "parent": "betterwithmods_core:block/front_top_faced",
  "textures": {
    "front": "betterwithmods_mechanist:block/redstone/detector/detector_front_off",
    "side": "betterwithmods_mechanist:block/redstone/detector/detector_side_off",
    "back": "betterwithmods_mechanist:block/redstone/detector/detector_side_off",
    "top": "betterwithmods_mechanist:block/redstone/detector/detector_top_off",
    "bottom": "betterwithmods_mechanist:block/redstone/detector/detector_top_off"
  }
}
