{
    "parent": "block/fire_side",
    "textures": {
        "particle": "betterwithmods_mechanist:block/stoked_fire/fire_1",
        "fire": "betterwithmods_mechanist:block/stoked_fire/fire_1"
    }
}
