{
  "parent": "betterwithmods_mechanist:block/dynamic/corner/corner",
  "textures": {
    "particle": "#all",
    "down": "#all",
    "up": "#all",
    "north": "#all",
    "east": "#all",
    "south": "#all",
    "west": "#all"
  }
}
