{
  "multipart": [
    {
      "when": {
        "AND": [
          {"axis": "x"},
          {"powered": "false"}
        ]
      },
      "apply": {
        "model": "betterwithmods_mechanist:block/axle/axle",
        "x": 90, "y": 90
      }
    },
    {
      "when": {
        "AND": [
          {"axis": "y"},
          {"powered": "false"}
        ]
      },
      "apply": {
        "model": "betterwithmods_mechanist:block/axle/axle"
      }
    },
    {
      "when": {
        "AND": [
          {"axis": "z"},
          {"powered": "false"}
        ]
      },
      "apply": {
        "model": "betterwithmods_mechanist:block/axle/axle",
        "x": 90
      }
    },
    {
      "when": {
        "AND": [
          {"axis": "x"},
          {"powered": "true"}
        ]
      },
      "apply": {
        "model": "betterwithmods_mechanist:block/axle/axle_powered",
        "x": 90, "y": 90
      }
    },
    {
      "when": {
        "AND": [
          {"axis": "y"},
          {"powered": "true"}
        ]
      },
      "apply": {
        "model": "betterwithmods_mechanist:block/axle/axle_powered"
      }
    },
    {
      "when": {
        "AND": [
          {"axis": "z"},
          {"powered": "true"}
        ]
      },
      "apply": {
        "model": "betterwithmods_mechanist:block/axle/axle_powered",
        "x": 90
      }
    }
  ]
}
