{
  "variants": {
    "facing=north,powered=false": {"model": "betterwithmods_mechanist:block/bellows/bellows_unpowered"},
    "facing=south,powered=false": {"model": "betterwithmods_mechanist:block/bellows/bellows_unpowered", "y": 180},
    "facing=west,powered=false": {"model": "betterwithmods_mechanist:block/bellows/bellows_unpowered", "y": 270},
    "facing=east,powered=false": {"model": "betterwithmods_mechanist:block/bellows/bellows_unpowered", "y": 90},
    "facing=north,powered=true": {"model": "betterwithmods_mechanist:block/bellows/bellows_powered"},
    "facing=south,powered=true": {"model": "betterwithmods_mechanist:block/bellows/bellows_powered", "y": 180},
    "facing=west,powered=true": {"model": "betterwithmods_mechanist:block/bellows/bellows_powered", "y": 270},
    "facing=east,powered=true": {"model": "betterwithmods_mechanist:block/bellows/bellows_powered", "y": 90}
  }
}

