{
    "parent": "block/fire_floor",
    "textures": {
        "particle": "betterwithmods_mechanist:block/stoked_fire/fire_1",
        "fire": "betterwithmods_mechanist:block/stoked_fire/fire_1"
    }
}
