{
   "ctm": {
     "ctm_version": 1,
     "type": "bwm_strata",
     "layer": "SOLID",
     "textures": [
        "geolosys:blocks/quartz_vanilla_1",
        "geolosys:blocks/quartz_vanilla_2"
     ]
   }
}