{
   "ctm": {
     "ctm_version": 1,
     "type": "bwm_strata",
     "layer": "SOLID",
     "textures": [
        "nuclearcraft:blocks/ore_magnesium_1",
        "nuclearcraft:blocks/ore_magnesium_2"
     ]
   }
}