{
   "ctm": {
     "ctm_version": 1,
     "type": "bwm_strata",
     "layer": "SOLID",
     "textures": [
        "embers:blocks/ore_nickel_vanilla_1",
        "embers:blocks/ore_nickel_vanilla_2"
     ]
   }
}