{
   "ctm": {
     "ctm_version": 1,
     "type": "bwm_strata",
     "layer": "SOLID",
     "textures": [
        "aetherworks:blocks/aether_ore_overlay_1",
        "aetherworks:blocks/aether_ore_overlay_2"
     ]
   }
}