{
   "ctm": {
     "ctm_version": 1,
     "type": "bwm_strata",
     "layer": "SOLID",
     "textures": [
        "techreborn:blocks/ore/galena_ore_1",
        "techreborn:blocks/ore/galena_ore_2"
     ]
   }
}