{
   "ctm": {
     "ctm_version": 1,
     "type": "bwm_strata",
     "layer": "SOLID",
     "textures": [
        "magneticraft:blocks/ore_block/tungsten_1",
        "magneticraft:blocks/ore_block/tungsten_2"
     ]
   }
}