{
   "ctm": {
     "ctm_version": 1,
     "type": "bwm_strata",
     "layer": "SOLID",
     "textures": [
        "appliedenergistics2:blocks/charged_quartz_ore_1",
        "appliedenergistics2:blocks/charged_quartz_ore_2"
     ]
   }
}