{
  "core-uuid": "3de95a7c-c7ee-4d4e-8583-c2a9f38500ef",
  "switchname": "freeswitch.local",
  "channel_data": {
    "state": "CS_REPORTING",
    "direction": "inbound",
    "state_number": "11",
    "flags": "0=1;1=1;3=1;38=1;39=1;41=1;44=1;49=1;54=1;113=1;114=1;123=1;160=1;165=1;166=1",
    "caps": "1=1;2=1;3=1;4=1;5=1;6=1;8=1;9=1"
  },
  "callStats": {
    "audio": {
      "inbound": {
        "raw_bytes": 103888,
        "media_bytes": 103544,
        "packet_count": 604,
        "media_packet_count": 602,
        "skip_packet_count": 139,
        "jitter_packet_count": 0,
        "dtmf_packet_count": 0,
        "cng_packet_count": 0,
        "flush_packet_count": 2,
        "largest_jb_size": 0,
        "jitter_min_variance": 21.90909090909091,
        "jitter_max_variance": 188.15384615384616,
        "jitter_loss_rate": 0,
        "jitter_burst_rate": 0,
        "mean_interval": 20.824016563146998,
        "flaw_total": 35,
        "quality_percentage": 92,
        "mos": 4.384864,
        "errorLog": [{
          "start": 1619464554429875,
          "stop": 1619464557269880,
          "flaws": 10,
          "consecutiveFlaws": 4,
          "durationMS": 2840
        }, {
          "start": 1619464550049875,
          "stop": 1619464553649875,
          "flaws": 12,
          "consecutiveFlaws": 4,
          "durationMS": 3600
        }, {
          "start": 1619464545769874,
          "stop": 1619464549389875,
          "flaws": 12,
          "consecutiveFlaws": 4,
          "durationMS": 3620
        }]
      },
      "outbound": {
        "raw_bytes": 123460,
        "media_bytes": 122980,
        "packet_count": 715,
        "media_packet_count": 715,
        "skip_packet_count": 0,
        "dtmf_packet_count": 30,
        "cng_packet_count": 0,
        "rtcp_packet_count": 0,
        "rtcp_octet_count": 0
      }
    }
  },
  "variables": {
    "direction": "inbound",
    "uuid": "22acb6a6-b624-40d9-86ad-8b83d7c4b41a",
    "session_id": "15",
    "sip_from_user": "14152127102",
    "sip_from_uri": "14152127102@172.0.0.19",
    "sip_from_host": "172.0.0.19",
    "channel_name": "sofia/external/14152127102@172.0.0.19",
    "sip_local_network_addr": "172.0.0.1",
    "sip_network_ip": "172.0.0.19",
    "sip_network_port": "5060",
    "sip_invite_stamp": "1619464542269875",
    "sip_received_ip": "172.0.0.19",
    "sip_received_port": "5060",
    "sip_via_protocol": "udp",
    "sip_authorized": "true",
    "sip_acl_authed_by": "domains",
    "sip_from_user_stripped": "14152127102",
    "sofia_profile_name": "external",
    "sofia_profile_url": "sip:mod_sofia@172.0.0.1:5080",
    "recovery_profile_name": "external",
    "sip_invite_route_uri": "<sip:172.0.0.19;lr=on;ftag=as0b1f2f9e;vsf=AAAAAAAAAAAAAAAAAAAAAAAJBQADBwIAAAQEAAMGATo1MDgw;vst=AAAAAAcBDgYKcwYJChsBcwEbBR8AGBwBDTYuMQ-->",
    "sip_invite_record_route": "<sip:172.0.0.19;lr=on;ftag=as0b1f2f9e;vsf=AAAAAAAAAAAAAAAAAAAAAAAJBQADBwIAAAQEAAMGATo1MDgw;vst=AAAAAAcBDgYKcwYJChsBcwEbBR8AGBwBDTYuMQ-->",
    "sip_req_params": "transport=udp;gw=98199e6d-b0eb-4b3c-8348-fb95fb10907b",
    "sip_req_user": "27872379850",
    "sip_req_port": "5080",
    "sip_req_uri": "27872379850@172.0.0.1:5080",
    "sip_req_host": "172.0.0.1",
    "sip_to_user": "27872379850",
    "sip_to_uri": "27872379850@172.0.0.1",
    "sip_to_host": "172.0.0.1",
    "sip_contact_user": "14152127102",
    "sip_contact_port": "5080",
    "sip_contact_uri": "14152127102@172.0.0.99:5080",
    "sip_contact_host": "172.0.0.99",
    "sip_user_agent": "MY SBC",
    "sip_via_host": "172.0.0.19",
    "sip_gateway": "98199e6d-b0eb-4b3c-8348-fb95fb10907b",
    "switch_r_sdp": "v=0\r\no=sipprovider 1722326900 1722326900 IN IP4 172.0.0.99\r\ns=MY MGW\r\nc=IN IP4 172.0.0.99\r\nt=0 0\r\nm=audio 14724 RTP/AVP 0 8 9 18 3 101\r\na=rtpmap:0 PCMU/8000\r\na=rtpmap:8 PCMA/8000\r\na=rtpmap:9 G722/8000\r\na=rtpmap:18 G729/8000\r\na=fmtp:18 annexb=no\r\na=rtpmap:3 GSM/8000\r\na=rtpmap:101 telephone-event/8000\r\na=fmtp:101 0-16\r\na=maxptime:150\r\n",
    "ep_codec_string": "CORE_PCM_MODULE.PCMU@8000h@20i@64000b,CORE_PCM_MODULE.PCMA@8000h@20i@64000b,mod_com_g729.G729@8000h@20i@8000b",
    "caller_destination": "27872379850",
    "call_direction": "inbound",
    "domain_uuid": "6deeb671-b569-4e3e-ae19-bf17ccde8954",
    "domain_name": "mycompany.freeswitch.local",
    "record_append": "true",
    "record_in_progress": "true",
    "caller_id_number": "14152127102",
    "provider_call_id": "2469d8446e7e420036758f3650022fbf@172.0.0.99:5080",
    "rtp_use_codec_string": "PCMU,PCMA,G729,G723,AMR,iLBC,speex,H264,H263,H261,H263-1998,H263-2000,H264-103",
    "remote_video_media_flow": "inactive",
    "remote_text_media_flow": "inactive",
    "remote_audio_media_flow": "sendrecv",
    "rtp_audio_recv_pt": "0",
    "rtp_use_codec_name": "PCMU",
    "rtp_use_codec_rate": "8000",
    "rtp_use_codec_ptime": "20",
    "rtp_use_codec_channels": "1",
    "rtp_last_audio_codec_string": "PCMU@8000h@20i@1c",
    "original_read_codec": "PCMU",
    "original_read_rate": "8000",
    "write_codec": "PCMU",
    "write_rate": "8000",
    "dtmf_type": "rfc2833",
    "local_media_ip": "172.16.3.101",
    "local_media_port": "21590",
    "advertised_media_ip": "172.0.0.1",
    "rtp_use_timer_name": "soft",
    "rtp_use_pt": "0",
    "rtp_use_ssrc": "2023035238",
    "rtp_2833_send_payload": "101",
    "rtp_2833_recv_payload": "101",
    "remote_media_ip": "172.0.0.99",
    "remote_media_port": "14724",
    "max_forwards": "68",
    "transfer_history": "1619464542:d4371789-fc9c-4ca2-a6bf-14444a73bfc2:bl_xfer:1001/mycompany.freeswitch.local/XML",
    "transfer_source": "1619464542:d4371789-fc9c-4ca2-a6bf-14444a73bfc2:bl_xfer:1001/mycompany.freeswitch.local/XML",
    "user_exists": "false",
    "from_user_exists": "false",
    "DP_MATCH": "ARRAY::inbound|:inbound",
    "effective_caller_id_name": "TEST",
    "origination_caller_id_name": "TEST",
    "caller_id_name": "TEST",
    "INSTANT_NOC": "YES",
    "call_uuid": "22acb6a6-b624-40d9-86ad-8b83d7c4b41a",
    "codec_string": "G729,PCMU,PCMA,OPUS,G722,iLBC,speex,AMR,G723,H264,H263,H261,H263-1998,H263-2000,H264-103",
    "X_NOTICE": "RECORDING_OUTBOUND",
    "record_path": "/var/lib/freeswitch/recordings/mycompany.freeswitch.local/2021/Apr/26",
    "record_name": "22acb6a6-b624-40d9-86ad-8b83d7c4b41a.wav",
    "recording_follow_transfer": "true",
    "XO_DIALTONE": "YES",
    "X_DIALTONE": "YES",
    "instant_ringback": "true",
    "origination_callee_id_name": "1001",
    "export_vars": "call_direction,call_direction,call_direction,origination_callee_id_name",
    "RFC2822_DATE": "Mon, 26 Apr 2021 21:15:42 +0200",
    "ring_group_uuid": "3a11bef6-c5a1-4770-b201-853548275457",
    "ringback": "tone_stream://%(2000,4000,440,480);loops=-1",
    "transfer_ringback": "tone_stream://%(2000,4000,440,480);loops=-1",
    "call_timeout": "120",
    "uuids": "123a0762-7e19-40a2-8121-c637c95afb48",
    "ignore_early_media": "true",
    "hangup_after_bridge": "true",
    "continue_on_fail": "true",
    "current_application_data": "{sip_invite_domain=mycompany.freeswitch.local,call_direction=inbound,confirm=false,leg_timeout=120,originate_delay_start=0,dialed_extension=1000,extension_uuid=55bfdc0f-65cc-40e0-bbfe-f33b6563ddc5,api_on_answer='uuid_record 22acb6a6-b624-40d9-86ad-8b83d7c4b41a start /var/lib/freeswitch/recordings/mycompany.freeswitch.local/archive/2021/Apr/26/22acb6a6-b624-40d9-86ad-8b83d7c4b41a.wav',record_path='/var/lib/freeswitch/recordings/mycompany.freeswitch.local/archive/2021/Apr/26',record_name=22acb6a6-b624-40d9-86ad-8b83d7c4b41a.wav}user/1000@mycompany.freeswitch.local",
    "current_application": "bridge",
    "dialed_user": "1000",
    "dialed_domain": "mycompany.freeswitch.local",
    "originated_legs": "ARRAY::f7f053dc-093a-49ad-8af4-b7e7997ea095;1001;1000|:55dfe1d4-c3dd-477a-a904-2e97f2614175;1001;1000|:375dfa6a-f499-4945-9bba-4b12e4172c1d;1001;1000|:55dfe1d4-c3dd-477a-a904-2e97f2614175;1001;1000",
    "read_codec": "PCMU",
    "read_rate": "8000",
    "rtp_local_sdp_str": "v=0\r\no=FreeSWITCH 1619442952 1619442954 IN IP4 172.0.0.1\r\ns=FreeSWITCH\r\nc=IN IP4 172.0.0.1\r\nt=0 0\r\nm=audio 21590 RTP/AVP 0 101\r\na=rtpmap:0 PCMU/8000\r\na=rtpmap:101 telephone-event/8000\r\na=fmtp:101 0-16\r\na=ptime:20\r\na=sendrecv\r\n",
    "endpoint_disposition": "ANSWER",
    "originate_causes": "ARRAY::f7f053dc-093a-49ad-8af4-b7e7997ea095;LOSE_RACE|:55dfe1d4-c3dd-477a-a904-2e97f2614175;NONE|:375dfa6a-f499-4945-9bba-4b12e4172c1d;LOSE_RACE|:55dfe1d4-c3dd-477a-a904-2e97f2614175;NONE",
    "originate_disposition": "SUCCESS",
    "DIALSTATUS": "SUCCESS",
    "last_bridge_to": "55dfe1d4-c3dd-477a-a904-2e97f2614175",
    "bridge_channel": "sofia/internal/1000@10.1.1.242:5060",
    "bridge_uuid": "55dfe1d4-c3dd-477a-a904-2e97f2614175",
    "signal_bond": "55dfe1d4-c3dd-477a-a904-2e97f2614175",
    "sip_to_tag": "jFUBrgFD8vS4j",
    "sip_from_tag": "as0b1f2f9e",
    "sip_cseq": "102",
    "sip_call_id": "2469d8446e7e420036758f3650022fbf@172.0.0.99:5080",
    "sip_full_via": "SIP/2.0/UDP 172.0.0.19;branch=z9hG4bKc5b2.0b18521ca2d8869f9cd987d5bbaecf79.0,SIP/2.0/UDP 172.0.0.99:5080;received=172.0.0.99;branch=z9hG4bK676a2ecf;rport=5080",
    "sip_from_display": "+1410000000",
    "sip_full_from": "\"+1410000000\" <sip:14152127102@172.0.0.19>;tag=as0b1f2f9e",
    "sip_full_to": "<sip:27872379850@172.0.0.1>;tag=jFUBrgFD8vS4j",
    "last_sent_callee_id_name": "1001",
    "last_sent_callee_id_number": "1000",
    "switch_m_sdp": "v=0\r\no=- 20044 20045 IN IP4 10.1.1.242\r\ns=SDP data\r\nc=IN IP4 10.1.1.242\r\nt=0 0\r\nm=audio 12754 RTP/AVP 0 101\r\na=rtpmap:0 PCMU/8000\r\na=rtpmap:101 telephone-event/8000\r\na=fmtp:101 0-15\r\na=ptime:20\r\n",
    "video_media_flow": "inactive",
    "text_media_flow": "inactive",
    "audio_media_flow": "sendrecv",
    "sip_hangup_phrase": "OK",
    "last_bridge_hangup_cause": "NORMAL_CLEARING",
    "last_bridge_proto_specific_hangup_cause": "sip:200",
    "bridge_hangup_cause": "NORMAL_CLEARING",
    "record_file_size": "236524",
    "record_samples": "118240",
    "record_seconds": "14",
    "record_ms": "14780",
    "record_completion_cause": "success-silence",
    "hangup_cause": "NORMAL_CLEARING",
    "hangup_cause_q850": "16",
    "digits_dialed": "none",
    "start_stamp": "2021-04-26 21:15:42",
    "profile_start_stamp": "2021-04-26 21:15:42",
    "answer_stamp": "2021-04-26 21:15:44",
    "bridge_stamp": "2021-04-26 21:15:44",
    "progress_stamp": "2021-04-26 21:15:42",
    "progress_media_stamp": "2021-04-26 21:15:42",
    "end_stamp": "2021-04-26 21:15:57",
    "start_epoch": "1619464542",
    "start_uepoch": "1619464542269875",
    "profile_start_epoch": "1619464542",
    "profile_start_uepoch": "1619464542289874",
    "answer_epoch": "1619464544",
    "answer_uepoch": "1619464544729875",
    "bridge_epoch": "1619464544",
    "bridge_uepoch": "1619464544749876",
    "last_hold_epoch": "0",
    "last_hold_uepoch": "0",
    "hold_accum_seconds": "0",
    "hold_accum_usec": "0",
    "hold_accum_ms": "0",
    "resurrect_epoch": "0",
    "resurrect_uepoch": "0",
    "progress_epoch": "1619464542",
    "progress_uepoch": "1619464542469875",
    "progress_media_epoch": "1619464542",
    "progress_media_uepoch": "1619464542269875",
    "end_epoch": "1619464557",
    "end_uepoch": "1619464557249875",
    "last_app": "bridge",
    "last_arg": "{sip_invite_domain=mycompany.freeswitch.local,call_direction=inbound,confirm=false,leg_timeout=120,originate_delay_start=0,dialed_extension=1000,extension_uuid=55bfdc0f-65cc-40e0-bbfe-f33b6563ddc5,api_on_answer='uuid_record 22acb6a6-b624-40d9-86ad-8b83d7c4b41a start /var/lib/freeswitch/recordings/mycompany.freeswitch.local/archive/2021/Apr/26/22acb6a6-b624-40d9-86ad-8b83d7c4b41a.wav',record_path='/var/lib/freeswitch/recordings/mycompany.freeswitch.local/archive/2021/Apr/26',record_name=22acb6a6-b624-40d9-86ad-8b83d7c4b41a.wav}user/1000@mycompany.freeswitch.local",
    "caller_id": "\"+1410000000\" <14152127102>",
    "duration": "15",
    "billsec": "13",
    "progresssec": "0",
    "answersec": "2",
    "waitsec": "2",
    "progress_mediasec": "0",
    "flow_billsec": "15",
    "mduration": "14980",
    "billmsec": "12520",
    "progressmsec": "200",
    "answermsec": "2460",
    "waitmsec": "2480",
    "progress_mediamsec": "0",
    "flow_billmsec": "14980",
    "uduration": "14980000",
    "billusec": "12520000",
    "progressusec": "200000",
    "answerusec": "2460000",
    "waitusec": "2480001",
    "progress_mediausec": "0",
    "flow_billusec": "14980000",
    "sip_hangup_disposition": "send_bye",
    "rtp_audio_in_raw_bytes": "103888",
    "rtp_audio_in_media_bytes": "103544",
    "rtp_audio_in_packet_count": "604",
    "rtp_audio_in_media_packet_count": "602",
    "rtp_audio_in_skip_packet_count": "139",
    "rtp_audio_in_jitter_packet_count": "0",
    "rtp_audio_in_dtmf_packet_count": "0",
    "rtp_audio_in_cng_packet_count": "0",
    "rtp_audio_in_flush_packet_count": "2",
    "rtp_audio_in_largest_jb_size": "0",
    "rtp_audio_in_jitter_min_variance": "21.91",
    "rtp_audio_in_jitter_max_variance": "188.15",
    "rtp_audio_in_jitter_loss_rate": "0.00",
    "rtp_audio_in_jitter_burst_rate": "0.00",
    "rtp_audio_in_mean_interval": "20.82",
    "rtp_audio_in_flaw_total": "35",
    "rtp_audio_in_quality_percentage": "92.00",
    "rtp_audio_in_mos": "4.38",
    "rtp_audio_out_raw_bytes": "123460",
    "rtp_audio_out_media_bytes": "122980",
    "rtp_audio_out_packet_count": "715",
    "rtp_audio_out_media_packet_count": "715",
    "rtp_audio_out_skip_packet_count": "0",
    "rtp_audio_out_dtmf_packet_count": "30",
    "rtp_audio_out_cng_packet_count": "0",
    "rtp_audio_rtcp_packet_count": "0",
    "rtp_audio_rtcp_octet_count": "0"
  },
  "app_log": {
    "applications": [{
      "app_name": "export",
      "app_data": "call_direction=inbound",
      "app_stamp": "1619464542276910"
    }, {
      "app_name": "set",
      "app_data": "caller_destination=27872379850",
      "app_stamp": "1619464542277163"
    }, {
      "app_name": "set",
      "app_data": "caller_id_name=+1410000000",
      "app_stamp": "1619464542277402"
    }, {
      "app_name": "export",
      "app_data": "call_direction=inbound",
      "app_stamp": "1619464542277761"
    }, {
      "app_name": "export",
      "app_data": "call_direction=inbound",
      "app_stamp": "1619464542279293"
    }, {
      "app_name": "set",
      "app_data": "domain_uuid=6deeb671-b569-4e3e-ae19-bf17ccde8954",
      "app_stamp": "1619464542279628"
    }, {
      "app_name": "set",
      "app_data": "domain_name=mycompany.freeswitch.local",
      "app_stamp": "1619464542279947"
    }, {
      "app_name": "set",
      "app_data": "record_path=/var/lib/freeswitch/recordings/mycompany.freeswitch.local/archive/2021/Apr/26",
      "app_stamp": "1619464542280447"
    }, {
      "app_name": "set",
      "app_data": "record_name=22acb6a6-b624-40d9-86ad-8b83d7c4b41a.wav",
      "app_stamp": "1619464542280780"
    }, {
      "app_name": "set",
      "app_data": "record_append=true",
      "app_stamp": "1619464542281090"
    }, {
      "app_name": "set",
      "app_data": "record_in_progress=true",
      "app_stamp": "1619464542281417"
    }, {
      "app_name": "set",
      "app_data": "recording_follow_transfer=true",
      "app_stamp": "1619464542281748"
    }, {
      "app_name": "set",
      "app_data": "caller_id_number=14152127102",
      "app_stamp": "1619464542282492"
    }, {
      "app_name": "log",
      "app_data": "WARNING [inbound routes] INCOMING CALL / ip: 172.0.0.19 / domain: mycompany.freeswitch.local / efeccaller:  / sipusrfrom: 14152127102 / siipauth:  / dest: 27872379850",
      "app_stamp": "1619464542282924"
    }, {
      "app_name": "set",
      "app_data": "codec_string=PCMU,PCMA,G729,G723,AMR,iLBC,speex,H264,H263,H261,H263-1998,H263-2000,H264-103",
      "app_stamp": "1619464542283251"
    }, {
      "app_name": "log",
      "app_data": "WARNING [codec_string] (domain:mycompany.freeswitch.local) (call_direction:inbound) inbound: PCMU,PCMA,G729,G723,AMR,iLBC,speex,H264,H263,H261,H263-1998,H263-2000,H264-103 (2469d8446e7e420036758f3650022fbf@172.0.0.99:5080)",
      "app_stamp": "1619464542283573"
    }, {
      "app_name": "set",
      "app_data": "provider_call_id=2469d8446e7e420036758f3650022fbf@172.0.0.99:5080",
      "app_stamp": "1619464542283936"
    }, {
      "app_name": "set",
      "app_data": "hangup_after_bridge=true",
      "app_stamp": "1619464542284235"
    }, {
      "app_name": "set",
      "app_data": "continue_on_fail=true",
      "app_stamp": "1619464542284542"
    }, {
      "app_name": "record_session",
      "app_data": "/var/lib/freeswitch/recordings/mycompany.freeswitch.local/archive/2021/Apr/26/22acb6a6-b624-40d9-86ad-8b83d7c4b41a.wav",
      "app_stamp": "1619464542288170"
    }, {
      "app_name": "transfer",
      "app_data": "1001 XML mycompany.freeswitch.local",
      "app_stamp": "1619464542299100"
    }, {
      "app_name": "set",
      "app_data": "user_exists=false",
      "app_stamp": "1619464542322193"
    }, {
      "app_name": "set",
      "app_data": "from_user_exists=false",
      "app_stamp": "1619464542326697"
    }, {
      "app_name": "set",
      "app_data": "effective_caller_id_name=TEST",
      "app_stamp": "1619464542329365"
    }, {
      "app_name": "set",
      "app_data": "origination_caller_id_name=TEST",
      "app_stamp": "1619464542329871"
    }, {
      "app_name": "set",
      "app_data": "caller_id_name=TEST",
      "app_stamp": "1619464542330354"
    }, {
      "app_name": "set",
      "app_data": "INSTANT_NOC=YES",
      "app_stamp": "1619464542330862"
    }, {
      "app_name": "set",
      "app_data": "emergency_caller_id_name=",
      "app_stamp": "1619464542332527"
    }, {
      "app_name": "set",
      "app_data": "emergency_caller_id_number=",
      "app_stamp": "1619464542333055"
    }, {
      "app_name": "set",
      "app_data": "outbound_caller_id_name=",
      "app_stamp": "1619464542333623"
    }, {
      "app_name": "set",
      "app_data": "outbound_caller_id_number=",
      "app_stamp": "1619464542334103"
    }, {
      "app_name": "set",
      "app_data": "codec_string=G729,PCMU,PCMA,OPUS,G722,iLBC,speex,AMR,G723,H264,H263,H261,H263-1998,H263-2000,H264-103",
      "app_stamp": "1619464542335777"
    }, {
      "app_name": "log",
      "app_data": "WARNING [codec_string] (domain:mycompany.freeswitch.local) (call_direction:inbound) internal: G729,PCMU,PCMA,OPUS,G722,iLBC,speex,AMR,G723,H264,H263,H261,H263-1998,H263-2000,H264-103",
      "app_stamp": "1619464542336353"
    }, {
      "app_name": "set",
      "app_data": "X_NOTICE=RECORDING_OUTBOUND",
      "app_stamp": "1619464542336882"
    }, {
      "app_name": "set",
      "app_data": "record_path=/var/lib/freeswitch/recordings/mycompany.freeswitch.local/2021/Apr/26",
      "app_stamp": "1619464542337463"
    }, {
      "app_name": "set",
      "app_data": "record_name=22acb6a6-b624-40d9-86ad-8b83d7c4b41a.wav",
      "app_stamp": "1619464542337923"
    }, {
      "app_name": "set",
      "app_data": "recording_follow_transfer=true",
      "app_stamp": "1619464542338421"
    }, {
      "app_name": "record_session",
      "app_data": "/var/lib/freeswitch/recordings/mycompany.freeswitch.local/2021/Apr/26/22acb6a6-b624-40d9-86ad-8b83d7c4b41a.wav",
      "app_stamp": "1619464542338954"
    }, {
      "app_name": "ring_ready",
      "app_data": "",
      "app_stamp": "1619464542349903"
    }, {
      "app_name": "set",
      "app_data": "XO_DIALTONE=YES",
      "app_stamp": "1619464542350137"
    }, {
      "app_name": "set",
      "app_data": "ringback=%(2000,4000,440,480)",
      "app_stamp": "1619464542350456"
    }, {
      "app_name": "set",
      "app_data": "instant_ringback=true",
      "app_stamp": "1619464542350775"
    }, {
      "app_name": "ring_ready",
      "app_data": "",
      "app_stamp": "1619464542351090"
    }, {
      "app_name": "set",
      "app_data": "X_DIALTONE=YES",
      "app_stamp": "1619464542351321"
    }, {
      "app_name": "set",
      "app_data": "ringback=%(2000,4000,440,480)",
      "app_stamp": "1619464542351642"
    }, {
      "app_name": "set",
      "app_data": "instant_ringback=true",
      "app_stamp": "1619464542351963"
    }, {
      "app_name": "set",
      "app_data": "RFC2822_DATE=Mon, 26 Apr 2021 21:15:42 +0200",
      "app_stamp": "1619464542352310"
    }, {
      "app_name": "export",
      "app_data": "origination_callee_id_name=1001",
      "app_stamp": "1619464542352604"
    }, {
      "app_name": "set",
      "app_data": "RFC2822_DATE=Mon, 26 Apr 2021 21:15:42 +0200",
      "app_stamp": "1619464542353030"
    }, {
      "app_name": "ring_ready",
      "app_data": "",
      "app_stamp": "1619464542353348"
    }, {
      "app_name": "set",
      "app_data": "ring_group_uuid=3a11bef6-c5a1-4770-b201-853548275457",
      "app_stamp": "1619464542353618"
    }, {
      "app_name": "lua",
      "app_data": "app.lua ring_groups",
      "app_stamp": "1619464542353970"
    }, {
      "app_name": "ring_ready",
      "app_data": "",
      "app_stamp": "1619464542360328"
    }, {
      "app_name": "set",
      "app_data": "call_timeout=120",
      "app_stamp": "1619464542389601"
    }, {
      "app_name": "set",
      "app_data": "uuids=123a0762-7e19-40a2-8121-c637c95afb48",
      "app_stamp": "1619464542390111"
    }, {
      "app_name": "export",
      "app_data": "sip_h_Alert-Info=",
      "app_stamp": "1619464542390531"
    }, {
      "app_name": "set",
      "app_data": "ignore_early_media=true",
      "app_stamp": "1619464542396803"
    }, {
      "app_name": "set",
      "app_data": "hangup_after_bridge=true",
      "app_stamp": "1619464542397194"
    }, {
      "app_name": "set",
      "app_data": "continue_on_fail=true",
      "app_stamp": "1619464542397624"
    }, {
      "app_name": "bind_digit_action",
      "app_data": "local,*2,exec:record_session,/var/lib/freeswitch/recordings/mycompany.freeswitch.local/archive/2021/Apr/26/22acb6a6-b624-40d9-86ad-8b83d7c4b41a.wav,both",
      "app_stamp": "1619464542398052"
    }, {
      "app_name": "digit_action_set_realm",
      "app_data": "local",
      "app_stamp": "1619464542398540"
    }, {
      "app_name": "bridge",
      "app_data": "{sip_invite_domain=mycompany.freeswitch.local,call_direction=inbound,confirm=false,leg_timeout=120,originate_delay_start=0,dialed_extension=1000,extension_uuid=55bfdc0f-65cc-40e0-bbfe-f33b6563ddc5,api_on_answer='uuid_record 22acb6a6-b624-40d9-86ad-8b83d7c4b41a start /var/lib/freeswitch/recordings/mycompany.freeswitch.local/archive/2021/Apr/26/22acb6a6-b624-40d9-86ad-8b83d7c4b41a.wav',record_path='/var/lib/freeswitch/recordings/mycompany.freeswitch.local/archive/2021/Apr/26',record_name=22acb6a6-b624-40d9-86ad-8b83d7c4b41a.wav}user/1000@mycompany.freeswitch.local",
      "app_stamp": "1619464542399041"
    }]
  },
  "callflow": [{
    "dialplan": "XML",
    "profile_index": "2",
    "extension": {
      "name": "default-codecs-internal",
      "number": "1001",
      "applications": [{
        "app_name": "set",
        "app_data": "codec_string=${global_codec_prefs_internal}"
      }, {
        "app_name": "log",
        "app_data": "WARNING [codec_string] (domain:${domain_name}) (call_direction:${call_direction}) internal: ${codec_string}"
      }, {
        "app_name": "set",
        "app_data": "X_NOTICE=RECORDING_OUTBOUND"
      }, {
        "app_name": "set",
        "app_data": "record_path=/var/lib/freeswitch/recordings/${domain_name}/${strftime(%Y)}/${strftime(%b)}/${strftime(%d)}"
      }, {
        "app_name": "set",
        "app_data": "record_name=${uuid}.${record_ext}"
      }, {
        "app_name": "set",
        "app_data": "recording_follow_transfer=true"
      }, {
        "app_name": "record_session",
        "app_data": "${record_path}/${record_name}"
      }, {
        "app_name": "ring_ready",
        "app_data": ""
      }, {
        "app_name": "set",
        "app_data": "XO_DIALTONE=YES"
      }, {
        "app_name": "set",
        "app_data": "ringback=${us-ring}"
      }, {
        "app_name": "set",
        "app_data": "instant_ringback=true"
      }, {
        "app_name": "ring_ready",
        "app_data": ""
      }, {
        "app_name": "set",
        "app_data": "X_DIALTONE=YES"
      }, {
        "app_name": "set",
        "app_data": "ringback=${us-ring}"
      }, {
        "app_name": "set",
        "app_data": "instant_ringback=true"
      }, {
        "app_name": "set",
        "app_data": "RFC2822_DATE=${strftime(%a, %d %b %Y %T %z)}"
      }, {
        "app_name": "export",
        "app_data": "origination_callee_id_name=${destination_number}"
      }, {
        "app_name": "set",
        "app_data": "RFC2822_DATE=${strftime(%a, %d %b %Y %T %z)}"
      }, {
        "app_name": "ring_ready",
        "app_data": ""
      }, {
        "app_name": "set",
        "app_data": "ring_group_uuid=3a11bef6-c5a1-4770-b201-853548275457"
      }, {
        "app_name": "lua",
        "app_data": "app.lua ring_groups"
      }, {
        "last_executed": "true",
        "app_name": "hash",
        "app_data": "insert/${domain_name}-last_dial/${caller_id_number}/${destination_number}"
      }, {
        "app_name": "ring_ready",
        "app_data": ""
      }, {
        "app_name": "set",
        "app_data": "ring_group_uuid=80dac25d-fcbf-4a72-8ca7-5699a3f1886d"
      }, {
        "app_name": "lua",
        "app_data": "app.lua ring_groups"
      }],
      "current_app": "hash"
    },
    "caller_profile": {
      "username": "14152127102",
      "dialplan": "XML",
      "caller_id_name": "+1410000000",
      "ani": "14152127102",
      "aniii": "",
      "caller_id_number": "14152127102",
      "network_addr": "172.0.0.19",
      "rdnis": "27872379850",
      "destination_number": "1001",
      "uuid": "22acb6a6-b624-40d9-86ad-8b83d7c4b41a",
      "source": "mod_sofia",
      "context": "mycompany.freeswitch.local",
      "chan_name": "sofia/external/14152127102@172.0.0.19",
      "originatee": {
        "originatee_caller_profiles": [{
          "username": "14152127102",
          "dialplan": "XML",
          "caller_id_name": "TEST",
          "ani": "14152127102",
          "aniii": "",
          "caller_id_number": "14152127102",
          "network_addr": "10.1.1.242",
          "rdnis": "27872379850",
          "destination_number": "1000",
          "uuid": "55dfe1d4-c3dd-477a-a904-2e97f2614175",
          "source": "mod_sofia",
          "context": "mycompany.freeswitch.local",
          "chan_name": "sofia/internal/1000@10.1.1.242:5060"
        }, {
          "username": "14152127102",
          "dialplan": "XML",
          "caller_id_name": "TEST",
          "ani": "14152127102",
          "aniii": "",
          "caller_id_number": "14152127102",
          "network_addr": "10.1.1.242",
          "rdnis": "27872379850",
          "destination_number": "1000",
          "uuid": "55dfe1d4-c3dd-477a-a904-2e97f2614175",
          "source": "mod_sofia",
          "context": "mycompany.freeswitch.local",
          "chan_name": "sofia/internal/1000@10.1.1.242:5060"
        }]
      }
    },
    "times": {
      "created_time": "1619464542269875",
      "profile_created_time": "1619464542289874",
      "progress_time": "1619464542469875",
      "progress_media_time": "1619464542269875",
      "answered_time": "1619464544729875",
      "bridged_time": "1619464544749876",
      "last_hold_time": "0",
      "hold_accum_time": "0",
      "hangup_time": "1619464557249875",
      "resurrect_time": "0",
      "transfer_time": "0"
    }
  }, {
    "dialplan": "XML",
    "profile_index": "1",
    "extension": {
      "name": "caller-details",
      "number": "27872379850",
      "applications": [{
        "app_name": "set",
        "app_data": "caller_id_number=${caller_id_number}"
      }, {
        "app_name": "log",
        "app_data": "WARNING [inbound routes] INCOMING CALL / ip: ${sip_network_ip} / domain: ${domain_name} / efeccaller: ${effective_caller_id_number} / sipusrfrom: ${sip_from_user} / siipauth: ${sip_auth_username} / dest: ${destination_number}"
      }, {
        "app_name": "set",
        "app_data": "codec_string=${global_codec_prefs}"
      }, {
        "app_name": "log",
        "app_data": "WARNING [codec_string] (domain:${domain_name}) (call_direction:${call_direction}) inbound: ${codec_string} (${sip_call_id})"
      }, {
        "app_name": "set",
        "app_data": "provider_call_id=${sip_call_id}"
      }, {
        "app_name": "set",
        "app_data": "hangup_after_bridge=true"
      }, {
        "app_name": "set",
        "app_data": "continue_on_fail=true"
      }, {
        "app_name": "record_session",
        "app_data": "${record_path}/${record_name}"
      }, {
        "app_name": "transfer",
        "app_data": "1001 XML mycompany.freeswitch.local"
      }]
    },
    "caller_profile": {
      "username": "14152127102",
      "dialplan": "XML",
      "caller_id_name": "+1410000000",
      "ani": "14152127102",
      "aniii": "",
      "caller_id_number": "14152127102",
      "network_addr": "172.0.0.19",
      "rdnis": "",
      "destination_number": "27872379850",
      "uuid": "22acb6a6-b624-40d9-86ad-8b83d7c4b41a",
      "source": "mod_sofia",
      "context": "public",
      "chan_name": "sofia/external/14152127102@172.0.0.19"
    },
    "times": {
      "created_time": "1619464542269875",
      "profile_created_time": "1619464542269875",
      "progress_time": "0",
      "progress_media_time": "1619464542269875",
      "answered_time": "0",
      "bridged_time": "0",
      "last_hold_time": "0",
      "hold_accum_time": "0",
      "hangup_time": "0",
      "resurrect_time": "0",
      "transfer_time": "1619464542289874"
    }
  }]
}