[root]
Children=1 4 6 8
Description=Root node
Exclude=0
ExcludeTOL=0
FileName=F.prj
Label=F.prj
Type=ROOT
[1]
Children=2 3
Description=
Exclude=0
ExcludeTOL=0
FileName=Variables
Label=Variables
Type=Fol
[2]
Children=
Description=
Exclude=0
ExcludeTOL=0
FileName=F0_00_project.tol
Label=F0_00_project.tol
Type=TOL
[3]
Children=
Description=
Exclude=0
ExcludeTOL=0
FileName=F0_01_variables.tol
Label=F0_01_variables.tol
Type=TOL
[4]
Children=5
Description=
Exclude=0
ExcludeTOL=0
FileName=Model
Label=Model
Type=Fol
[5]
Children=
Description=
Exclude=0
ExcludeTOL=0
FileName=F1_02_model.tol
Label=F1_02_model.tol
Type=TOL
[6]
Children=7 11
Description=
Exclude=0
ExcludeTOL=0
FileName=Estimation
Label=Estimation
Type=Fol
[7]
Children=
Description=
Exclude=0
ExcludeTOL=0
FileName=F1_E_03_estimation_est.tol
Label=F1_E_03_estimation_est.tol
Type=TOL
[11]
Children=
Description=
Exclude=0
ExcludeTOL=0
FileName=F1_E_03_estimation_BSR.tol
Label=F1_E_03_estimation_BSR.tol
Type=TOL
[8]
Children=9 12
Description=
Exclude=0
ExcludeTOL=0
FileName=Forecast
Label=Forecast
Type=Fol
[9]
Children=
Description=
Exclude=0
ExcludeTOL=0
FileName=F1_E_04_forecast_est.tol
Label=F1_E_04_forecast_est.tol
Type=TOL
[12]
Children=
Description=
Exclude=0
ExcludeTOL=0
FileName=F1_E_04_forecast_sample.tol
Label=F1_E_04_forecast_sample.tol
Type=TOL
[Included TOL Files]
Set F.1=Include("F0_00_project.tol");
Set F.2=Include("F0_01_variables.tol");
Set F.3=Include("F1_02_model.tol");
Set F.4=Include("F1_E_03_estimation_est.tol");
Set F.5=Include("F1_E_03_estimation_BSR.tol");
Set F.6=Include("F1_E_04_forecast_est.tol");
Set F.7=Include("F1_E_04_forecast_sample.tol");
