﻿{
  "name" : "kheops",
  "targetType" : "staticLibrary",
  "authors" : [
    "Basile Burg"
  ],
  "targetPath" : "bin",
  "targetName" : "kheops",
  "dependencies" : {
    "iz" : {
      "version" : "*"
    },
    "x11" : {
      "version" : "*"
    },
    "imageformats" : {
      "version" : "*"
    }
  },
  "license" : "BSL-1.0",
  "description" : "GUI framework based on Cairo",
  "importPaths" : [
    "src"
  ],
  "lflags" : [
    "-lX11",
    "-lcairo",
    "-lfreetype"
  ]
}
