﻿{
  "name" : "dbeaengine",
  "license" : "LGPL v3",
  "author" : "Basile B.",
  "description" : "A library to disassemble x86(64) byte code, based on beaengine and allowing self-disassembly",
  "sourcePaths" : [
    "src"
  ],
  "importPaths" : [
    "src"
  ],
  "targetPath" : "bin",
  "targetName" : "dbeaengine",
  "targetType" : "staticLibrary",
  "sourceFiles-linux-x86" : [
    "objects\/coff32\/beaengine.o"
  ],
  "sourceFiles-linux-x86_64" : [
    "objects\/coff64\/beaengine.o"
  ],
  "sourceFiles-windows-x86" : [
    "objects\\omf32\\beaengine.obj"
  ]
}
