﻿{
  "name" : "isitthere",
  "targetType" : "executable",
  "targetPath" : "bin",
  "targetName" : "isitthere",
  "license" : "Boost",
  "authors" : [
    "Basile Burg"
  ],
  "description" : "A tool that generates perfect hash sets"
}