<?xml version="1.0" encoding="UTF-8" standalone="no"?>
<!-- Created with Inkscape (http://www.inkscape.org/) -->

<svg
   xmlns:dc="http://purl.org/dc/elements/1.1/"
   xmlns:cc="http://creativecommons.org/ns#"
   xmlns:rdf="http://www.w3.org/1999/02/22-rdf-syntax-ns#"
   xmlns:svg="http://www.w3.org/2000/svg"
   xmlns="http://www.w3.org/2000/svg"
   xmlns:sodipodi="http://sodipodi.sourceforge.net/DTD/sodipodi-0.dtd"
   xmlns:inkscape="http://www.inkscape.org/namespaces/inkscape"
   width="51.655594mm"
   height="41.676449mm"
   viewBox="0 0 51.655594 41.676449"
   version="1.1"
   id="svg8"
   inkscape:version="0.92.5 (2060ec1f9f, 2020-04-08)"
   sodipodi:docname="TsetSE_logo.svg">
  <defs
     id="defs2" />
  <sodipodi:namedview
     id="base"
     pagecolor="#ffffff"
     bordercolor="#666666"
     borderopacity="1.0"
     inkscape:pageopacity="0.0"
     inkscape:pageshadow="2"
     inkscape:zoom="3.1385899"
     inkscape:cx="92.606726"
     inkscape:cy="65.779178"
     inkscape:document-units="mm"
     inkscape:current-layer="layer1"
     showgrid="false"
     fit-margin-top="0"
     fit-margin-left="0"
     fit-margin-right="0"
     fit-margin-bottom="0"
     inkscape:window-width="1680"
     inkscape:window-height="1000"
     inkscape:window-x="1366"
     inkscape:window-y="26"
     inkscape:window-maximized="1" />
  <metadata
     id="metadata5">
    <rdf:RDF>
      <cc:Work
         rdf:about="">
        <dc:format>image/svg+xml</dc:format>
        <dc:type
           rdf:resource="http://purl.org/dc/dcmitype/StillImage" />
        <dc:title></dc:title>
      </cc:Work>
    </rdf:RDF>
  </metadata>
  <g
     inkscape:label="Layer 1"
     inkscape:groupmode="layer"
     id="layer1"
     transform="translate(-65.295637,-113.3594)">
    <path
       style="fill:#000000;fill-opacity:0.25609759;stroke:#000000;stroke-width:0.26458332px;stroke-linecap:butt;stroke-linejoin:miter;stroke-opacity:1"
       d="m 87.174553,132.22817 c -15.804567,-8.58356 -20.846064,-8.38813 -21.745755,-5.74239 0.141247,3.5635 9.947731,11.6745 16.944746,9.60202 3.772305,0.95228 3.388949,-1.41206 3.388949,-1.41206 0.906645,1.10088 0.628137,3.12354 3.577222,2.63585 l 0.282414,-0.94138 c -2.171283,-0.53354 -2.21668,-2.39576 -2.447576,-4.14204 z"
       id="path826"
       inkscape:connector-curvature="0"
       sodipodi:nodetypes="ccccccc" />
    <path
       sodipodi:nodetypes="ccccccc"
       inkscape:connector-curvature="0"
       id="path828"
       d="m 95.345606,131.99958 c 15.413374,-9.26769 20.458584,-9.2933 21.473314,-6.68951 0.015,3.56626 -9.42675,12.09908 -16.50783,10.33511 -3.726973,1.11662 -3.447557,-1.26224 -3.447557,-1.26224 -0.857553,1.13954 -0.490702,3.14806 -3.458326,2.79003 l -0.323378,-0.92811 c 2.145822,-0.62814 2.109599,-2.49057 2.263777,-4.24528 z"
       style="fill:#000000;fill-opacity:0.25609759;stroke:#000000;stroke-width:0.26458332px;stroke-linecap:butt;stroke-linejoin:miter;stroke-opacity:1" />
    <path
       style="fill:none;stroke:#000000;stroke-width:0.76499999;stroke-linecap:butt;stroke-linejoin:miter;stroke-miterlimit:4;stroke-dasharray:none;stroke-opacity:1"
       d="m 87.208184,138.73771 -3.636158,2.56319 -0.83453,1.3114 0.83453,6.08014 -2.682412,5.18599 0.298045,0.59609 v 0 h -0.05961"
       id="path839"
       inkscape:connector-curvature="0"
       sodipodi:nodetypes="cccccccc" />
    <path
       sodipodi:nodetypes="cccccccc"
       inkscape:connector-curvature="0"
       id="path841"
       d="m 94.944788,138.91654 3.636158,2.56319 0.83453,1.3114 -0.83453,6.08014 2.682414,5.18599 -0.29805,0.59609 v 0 h 0.0596"
       style="fill:none;stroke:#000000;stroke-width:0.76499999;stroke-linecap:butt;stroke-linejoin:miter;stroke-miterlimit:4;stroke-dasharray:none;stroke-opacity:1" />
    <path
       style="fill:#000000;fill-opacity:0.82317074;stroke:#e60000;stroke-width:0.76499999;stroke-linecap:butt;stroke-linejoin:miter;stroke-miterlimit:4;stroke-dasharray:none;stroke-opacity:1"
       d="m 89.339713,137.31159 c -1.957581,0.74897 -2.064449,1.81243 -2.459381,2.82693 -0.74801,5.59884 1.996886,9.30923 4.023618,9.7461 3.495226,-0.26391 4.585981,-4.43257 4.709123,-9.29903 -0.176259,-1.02514 -0.570279,-2.30318 -3.029794,-3.45477 l 0.962199,-1.30746 c 0.600043,-0.49996 1.200085,-0.16663 1.800128,-3.82378 0.03775,-1.82392 0.259251,-3.70033 -1.312176,-5.06449 1.069857,-1.14302 1.309989,-3.25592 -2.652608,-3.2785 -2.304228,0.0203 -5.674337,0.0977 -3.427525,3.51694 -1.330806,0.49225 -0.96493,3.98348 -0.864331,6.73584 0.364246,0.96169 0.553002,2.10103 1.877462,2.34162 l 0.373285,1.0606 v 0"
       id="path843"
       inkscape:connector-curvature="0"
       sodipodi:nodetypes="cccccccccccccc" />
    <path
       style="fill:none;stroke:#000000;stroke-width:0.76499999;stroke-linecap:butt;stroke-linejoin:miter;stroke-miterlimit:4;stroke-dasharray:none;stroke-opacity:1"
       d="m 89.056066,119.7522 c -0.562058,4.70442 0.913175,3.29864 1.937298,3.81498 1.461572,-0.10762 2.603132,-0.67871 1.788273,-4.08323"
       id="path845"
       inkscape:connector-curvature="0"
       sodipodi:nodetypes="ccc" />
    <path
       style="fill:none;stroke:#000000;stroke-width:0.86500001;stroke-linecap:butt;stroke-linejoin:miter;stroke-miterlimit:4;stroke-dasharray:none;stroke-opacity:1"
       d="m 89.652159,113.55284 c 1.309753,2.61921 0.906419,6.66599 1.341205,10.01434 0.223953,-3.23849 -0.604612,-7.17865 0.715309,-9.68649"
       id="path847"
       inkscape:connector-curvature="0"
       sodipodi:nodetypes="ccc" />
    <path
       style="fill:none;stroke:#000000;stroke-width:0.86500001;stroke-linecap:butt;stroke-linejoin:miter;stroke-miterlimit:4;stroke-dasharray:none;stroke-opacity:1"
       d="m 90.814537,113.64226 0.178827,9.92492"
       id="path849"
       inkscape:connector-curvature="0" />
    <path
       style="fill:none;stroke:#000000;stroke-width:0.76499999;stroke-linecap:butt;stroke-linejoin:miter;stroke-miterlimit:4;stroke-dasharray:none;stroke-opacity:1"
       d="m 95.166004,128.2167 2.503586,-0.17883 2.175732,-5.78209 4.768738,-3.57655 -1.01336,-0.59609 v 0"
       id="path851"
       inkscape:connector-curvature="0" />
    <path
       style="fill:none;stroke:#000000;stroke-width:0.76499999;stroke-linecap:butt;stroke-linejoin:miter;stroke-miterlimit:4;stroke-dasharray:none;stroke-opacity:1"
       d="m 86.850528,128.39552 -2.920849,0.32785 -2.265148,-5.30521 -4.798536,-3.42753 -0.417264,1.19219"
       id="path853"
       inkscape:connector-curvature="0" />
    <path
       style="fill:none;stroke:#000000;stroke-width:0.76499999;stroke-linecap:butt;stroke-linejoin:miter;stroke-miterlimit:4;stroke-dasharray:none;stroke-opacity:1"
       d="m 81.038635,136.80041 -5.364821,6.40798 0.506677,0.44707"
       id="path855"
       inkscape:connector-curvature="0" />
    <path
       style="fill:none;stroke:#000000;stroke-width:0.76499999;stroke-linecap:butt;stroke-linejoin:miter;stroke-miterlimit:4;stroke-dasharray:none;stroke-opacity:1"
       d="m 101.15672,135.99569 1.01336,2.71221 4.23225,3.72558 -0.0596,0.80472"
       id="path857"
       inkscape:connector-curvature="0" />
  </g>
</svg>
