{
   "import":    ["coupy"],
   "dll":       "os.path.join(coupy.coupling.coupy_dir(),'lib','libC++ouPy-test.so')",
   "hfiles":    ["\"hello_world.h\""],
   "functions": [ { "name":   "hello_world" } ]
}

