54272
40032
21984
16480
25472
34224
32944
29584
35968
48272
50224
35312
17584
14880
26992
37696
36960
32928
37424
46848
46000
30288
14368
15072
30208
42016
40608
34880
37104
44032
41328
26000
12736
17120
34592
46448
43248
35136
35088
40144
36848
22960
12992
20752
39632
50272
44368
33648
31760
36032
33376
21664
15024
25392
44464
52784
43648
30512
27696
32368
31248
22160
18480
30480
48464
53600
41120
26320
23760
29920
30944
24320
22784
35168
51056
52544
37200
21648
20512
28976
32384
27680
27168
38720
51808
49728
32352
17296
18608
29936
35312
31680
31008
40784
50752
45584
27312
13984
18496
32544
39248
35520
33616
41040
48048
40784
22752
12144
20144
36512
43472
38496
34528
39520
44160
36064
19392
12176
23472
41280
47264
40000
33696
36640
39920
32016
17680
14016
28080
46096
49968
39760
31136
32816
35920
29312
17776
17376
33232
50160
51024
37824
27408
28816
32912
28288
19600
21792
38128
52944
50256
34320
23024
25376
31376
29136
22816
26368
42112
54000
47712
29696
18800
23152
31616
31536
26816
30768
44656
53168
43696
24720
15408
22576
33632
35088
30816
33904
45408
50656
38896
20064
13360
23840
37088
39120
34192
35520
44384
46768
33888
16480
13152
26864
41456
42944
36240
35344
41776
42304
29472
14432
14736
31168
46096
45824
36672
33456
38096
37936
26288
14256
18000
36224
50240
47248
35232
30144
34080
34448
24704
15840
22432
41152
53152
46832
32208
26112
30416
32256
24912
18928
27312
45424
54416
44624
27984
21984
27808
31824
26816
22960
32016
48336
53808
40912
23200
18512
26768
33136
30016
27200
35680
49520
51408
36128
18608
16304
27520
36032
34000
30960
37936
48864
47600
30944
14928
15792
29984
40000
37840
33632
38416
46528
43056
26320
12640
17088
33888
44384
40928
34640
37104
42960
38384
22720
12176
20064
38688
48400
42656
33936
34336
38864
34384
20624
13536
24496
43664
51472
42704
31488
30560
34896
31552
20416
16512
29504
48032
52960
41008
27728
26464
31856
30400
21936
20672
34464
51184
52592
37600
23232
22912
30240
31056
24864
25104
38560
52688
50432
33072
18816
20480
30384
33360
28640
29312
41328
52352
46720
27968
15040
19600
32240
36864
32656
32560
42416
50240
42016
23152
12640
20576
35680
40944
36032
34304
41680
46752
37168
19232
11936
23296
40080
44976
38240
34240
39280
42480
32720
16816
13104
27472
44896
48096
38736
32432
35824
38256
29376
16192
15920
32496
49296
49872
37536
29184
31792
34704
27568
17360
20048
37504
52624
49824
34656
25088
28112
32464
27568
