G75*
%MOIN*%
%OFA0B0*%
%FSLAX25Y25*%
%IPPOS*%
%LPD*%
%AMOC8*
5,1,8,0,0,1.08239X$1,22.5*
%
%ADD10R,0.20000X0.09000*%
%ADD11C,0.00400*%
%ADD12C,0.03100*%
%ADD13C,0.03962*%
D10*
X0082548Y0035533D03*
X0082548Y0070333D03*
X0082548Y0111533D03*
X0082548Y0146333D03*
X0082548Y0187533D03*
X0082548Y0222333D03*
X0140348Y0146333D03*
X0140348Y0111533D03*
D11*
X0073448Y0029933D02*
X0073448Y0227933D01*
X0149448Y0227933D01*
X0149448Y0029933D01*
X0073448Y0029933D01*
X0073448Y0030129D02*
X0149448Y0030129D01*
X0149448Y0030527D02*
X0073448Y0030527D01*
X0073448Y0030926D02*
X0149448Y0030926D01*
X0149448Y0031324D02*
X0073448Y0031324D01*
X0073448Y0031723D02*
X0149448Y0031723D01*
X0149448Y0032121D02*
X0073448Y0032121D01*
X0073448Y0032520D02*
X0149448Y0032520D01*
X0149448Y0032918D02*
X0073448Y0032918D01*
X0073448Y0033317D02*
X0149448Y0033317D01*
X0149448Y0033715D02*
X0073448Y0033715D01*
X0073448Y0034114D02*
X0149448Y0034114D01*
X0149448Y0034512D02*
X0073448Y0034512D01*
X0073448Y0034911D02*
X0149448Y0034911D01*
X0149448Y0035309D02*
X0073448Y0035309D01*
X0073448Y0035708D02*
X0149448Y0035708D01*
X0149448Y0036106D02*
X0073448Y0036106D01*
X0073448Y0036505D02*
X0149448Y0036505D01*
X0149448Y0036903D02*
X0073448Y0036903D01*
X0073448Y0037302D02*
X0149448Y0037302D01*
X0149448Y0037700D02*
X0073448Y0037700D01*
X0073448Y0038099D02*
X0149448Y0038099D01*
X0149448Y0038497D02*
X0073448Y0038497D01*
X0073448Y0038896D02*
X0149448Y0038896D01*
X0149448Y0039294D02*
X0073448Y0039294D01*
X0073448Y0039693D02*
X0149448Y0039693D01*
X0149448Y0040091D02*
X0073448Y0040091D01*
X0073448Y0040490D02*
X0149448Y0040490D01*
X0149448Y0040888D02*
X0073448Y0040888D01*
X0073448Y0041287D02*
X0149448Y0041287D01*
X0149448Y0041685D02*
X0073448Y0041685D01*
X0073448Y0042084D02*
X0149448Y0042084D01*
X0149448Y0042482D02*
X0073448Y0042482D01*
X0073448Y0042881D02*
X0149448Y0042881D01*
X0149448Y0043279D02*
X0073448Y0043279D01*
X0073448Y0043678D02*
X0149448Y0043678D01*
X0149448Y0044077D02*
X0073448Y0044077D01*
X0073448Y0044475D02*
X0149448Y0044475D01*
X0149448Y0044874D02*
X0073448Y0044874D01*
X0073448Y0045272D02*
X0149448Y0045272D01*
X0149448Y0045671D02*
X0073448Y0045671D01*
X0073448Y0046069D02*
X0149448Y0046069D01*
X0149448Y0046468D02*
X0073448Y0046468D01*
X0073448Y0046866D02*
X0149448Y0046866D01*
X0149448Y0047265D02*
X0073448Y0047265D01*
X0073448Y0047663D02*
X0149448Y0047663D01*
X0149448Y0048062D02*
X0073448Y0048062D01*
X0073448Y0048460D02*
X0149448Y0048460D01*
X0149448Y0048859D02*
X0073448Y0048859D01*
X0073448Y0049257D02*
X0149448Y0049257D01*
X0149448Y0049656D02*
X0073448Y0049656D01*
X0073448Y0050054D02*
X0149448Y0050054D01*
X0149448Y0050453D02*
X0073448Y0050453D01*
X0073448Y0050851D02*
X0149448Y0050851D01*
X0149448Y0051250D02*
X0073448Y0051250D01*
X0073448Y0051648D02*
X0149448Y0051648D01*
X0149448Y0052047D02*
X0073448Y0052047D01*
X0073448Y0052445D02*
X0149448Y0052445D01*
X0149448Y0052844D02*
X0073448Y0052844D01*
X0073448Y0053242D02*
X0149448Y0053242D01*
X0149448Y0053641D02*
X0073448Y0053641D01*
X0073448Y0054039D02*
X0149448Y0054039D01*
X0149448Y0054438D02*
X0073448Y0054438D01*
X0073448Y0054836D02*
X0149448Y0054836D01*
X0149448Y0055235D02*
X0073448Y0055235D01*
X0073448Y0055633D02*
X0149448Y0055633D01*
X0149448Y0056032D02*
X0073448Y0056032D01*
X0073448Y0056430D02*
X0149448Y0056430D01*
X0149448Y0056829D02*
X0073448Y0056829D01*
X0073448Y0057227D02*
X0149448Y0057227D01*
X0149448Y0057626D02*
X0073448Y0057626D01*
X0073448Y0058024D02*
X0149448Y0058024D01*
X0149448Y0058423D02*
X0073448Y0058423D01*
X0073448Y0058821D02*
X0149448Y0058821D01*
X0149448Y0059220D02*
X0073448Y0059220D01*
X0073448Y0059618D02*
X0149448Y0059618D01*
X0149448Y0060017D02*
X0073448Y0060017D01*
X0073448Y0060415D02*
X0149448Y0060415D01*
X0149448Y0060814D02*
X0073448Y0060814D01*
X0073448Y0061212D02*
X0149448Y0061212D01*
X0149448Y0061611D02*
X0073448Y0061611D01*
X0073448Y0062010D02*
X0149448Y0062010D01*
X0149448Y0062408D02*
X0073448Y0062408D01*
X0073448Y0062807D02*
X0149448Y0062807D01*
X0149448Y0063205D02*
X0073448Y0063205D01*
X0073448Y0063604D02*
X0149448Y0063604D01*
X0149448Y0064002D02*
X0073448Y0064002D01*
X0073448Y0064401D02*
X0149448Y0064401D01*
X0149448Y0064799D02*
X0073448Y0064799D01*
X0073448Y0065198D02*
X0149448Y0065198D01*
X0149448Y0065596D02*
X0073448Y0065596D01*
X0073448Y0065995D02*
X0149448Y0065995D01*
X0149448Y0066393D02*
X0073448Y0066393D01*
X0073448Y0066792D02*
X0149448Y0066792D01*
X0149448Y0067190D02*
X0073448Y0067190D01*
X0073448Y0067589D02*
X0149448Y0067589D01*
X0149448Y0067987D02*
X0073448Y0067987D01*
X0073448Y0068386D02*
X0149448Y0068386D01*
X0149448Y0068784D02*
X0073448Y0068784D01*
X0073448Y0069183D02*
X0149448Y0069183D01*
X0149448Y0069581D02*
X0073448Y0069581D01*
X0073448Y0069980D02*
X0149448Y0069980D01*
X0149448Y0070378D02*
X0073448Y0070378D01*
X0073448Y0070777D02*
X0149448Y0070777D01*
X0149448Y0071175D02*
X0073448Y0071175D01*
X0073448Y0071574D02*
X0149448Y0071574D01*
X0149448Y0071972D02*
X0073448Y0071972D01*
X0073448Y0072371D02*
X0149448Y0072371D01*
X0149448Y0072769D02*
X0073448Y0072769D01*
X0073448Y0073168D02*
X0149448Y0073168D01*
X0149448Y0073566D02*
X0073448Y0073566D01*
X0073448Y0073965D02*
X0149448Y0073965D01*
X0149448Y0074363D02*
X0073448Y0074363D01*
X0073448Y0074762D02*
X0149448Y0074762D01*
X0149448Y0075160D02*
X0073448Y0075160D01*
X0073448Y0075559D02*
X0149448Y0075559D01*
X0149448Y0075957D02*
X0073448Y0075957D01*
X0073448Y0076356D02*
X0149448Y0076356D01*
X0149448Y0076754D02*
X0073448Y0076754D01*
X0073448Y0077153D02*
X0149448Y0077153D01*
X0149448Y0077551D02*
X0073448Y0077551D01*
X0073448Y0077950D02*
X0149448Y0077950D01*
X0149448Y0078348D02*
X0073448Y0078348D01*
X0073448Y0078747D02*
X0149448Y0078747D01*
X0149448Y0079145D02*
X0073448Y0079145D01*
X0073448Y0079544D02*
X0149448Y0079544D01*
X0149448Y0079943D02*
X0073448Y0079943D01*
X0073448Y0080341D02*
X0149448Y0080341D01*
X0149448Y0080740D02*
X0073448Y0080740D01*
X0073448Y0081138D02*
X0149448Y0081138D01*
X0149448Y0081537D02*
X0073448Y0081537D01*
X0073448Y0081935D02*
X0149448Y0081935D01*
X0149448Y0082334D02*
X0073448Y0082334D01*
X0073448Y0082732D02*
X0149448Y0082732D01*
X0149448Y0083131D02*
X0073448Y0083131D01*
X0073448Y0083529D02*
X0149448Y0083529D01*
X0149448Y0083928D02*
X0073448Y0083928D01*
X0073448Y0084326D02*
X0149448Y0084326D01*
X0149448Y0084725D02*
X0073448Y0084725D01*
X0073448Y0085123D02*
X0149448Y0085123D01*
X0149448Y0085522D02*
X0073448Y0085522D01*
X0073448Y0085920D02*
X0149448Y0085920D01*
X0149448Y0086319D02*
X0073448Y0086319D01*
X0073448Y0086717D02*
X0149448Y0086717D01*
X0149448Y0087116D02*
X0073448Y0087116D01*
X0073448Y0087514D02*
X0149448Y0087514D01*
X0149448Y0087913D02*
X0073448Y0087913D01*
X0073448Y0088311D02*
X0149448Y0088311D01*
X0149448Y0088710D02*
X0073448Y0088710D01*
X0073448Y0089108D02*
X0149448Y0089108D01*
X0149448Y0089507D02*
X0073448Y0089507D01*
X0073448Y0089905D02*
X0149448Y0089905D01*
X0149448Y0090304D02*
X0073448Y0090304D01*
X0073448Y0090702D02*
X0149448Y0090702D01*
X0149448Y0091101D02*
X0073448Y0091101D01*
X0073448Y0091499D02*
X0149448Y0091499D01*
X0149448Y0091898D02*
X0073448Y0091898D01*
X0073448Y0092296D02*
X0149448Y0092296D01*
X0149448Y0092695D02*
X0073448Y0092695D01*
X0073448Y0093093D02*
X0149448Y0093093D01*
X0149448Y0093492D02*
X0073448Y0093492D01*
X0073448Y0093890D02*
X0149448Y0093890D01*
X0149448Y0094289D02*
X0073448Y0094289D01*
X0073448Y0094687D02*
X0149448Y0094687D01*
X0149448Y0095086D02*
X0073448Y0095086D01*
X0073448Y0095484D02*
X0149448Y0095484D01*
X0149448Y0095883D02*
X0073448Y0095883D01*
X0073448Y0096281D02*
X0149448Y0096281D01*
X0149448Y0096680D02*
X0073448Y0096680D01*
X0073448Y0097079D02*
X0149448Y0097079D01*
X0149448Y0097477D02*
X0073448Y0097477D01*
X0073448Y0097876D02*
X0149448Y0097876D01*
X0149448Y0098274D02*
X0073448Y0098274D01*
X0073448Y0098673D02*
X0149448Y0098673D01*
X0149448Y0099071D02*
X0073448Y0099071D01*
X0073448Y0099470D02*
X0149448Y0099470D01*
X0149448Y0099868D02*
X0073448Y0099868D01*
X0073448Y0100267D02*
X0149448Y0100267D01*
X0149448Y0100665D02*
X0073448Y0100665D01*
X0073448Y0101064D02*
X0149448Y0101064D01*
X0149448Y0101462D02*
X0073448Y0101462D01*
X0073448Y0101861D02*
X0149448Y0101861D01*
X0149448Y0102259D02*
X0073448Y0102259D01*
X0073448Y0102658D02*
X0149448Y0102658D01*
X0149448Y0103056D02*
X0073448Y0103056D01*
X0073448Y0103455D02*
X0149448Y0103455D01*
X0149448Y0103853D02*
X0073448Y0103853D01*
X0073448Y0104252D02*
X0149448Y0104252D01*
X0149448Y0104650D02*
X0073448Y0104650D01*
X0073448Y0105049D02*
X0149448Y0105049D01*
X0149448Y0105447D02*
X0073448Y0105447D01*
X0073448Y0105846D02*
X0149448Y0105846D01*
X0149448Y0106244D02*
X0073448Y0106244D01*
X0073448Y0106643D02*
X0149448Y0106643D01*
X0149448Y0107041D02*
X0073448Y0107041D01*
X0073448Y0107440D02*
X0149448Y0107440D01*
X0149448Y0107838D02*
X0073448Y0107838D01*
X0073448Y0108237D02*
X0149448Y0108237D01*
X0149448Y0108635D02*
X0073448Y0108635D01*
X0073448Y0109034D02*
X0149448Y0109034D01*
X0149448Y0109432D02*
X0073448Y0109432D01*
X0073448Y0109831D02*
X0149448Y0109831D01*
X0149448Y0110229D02*
X0073448Y0110229D01*
X0073448Y0110628D02*
X0149448Y0110628D01*
X0149448Y0111026D02*
X0073448Y0111026D01*
X0073448Y0111425D02*
X0149448Y0111425D01*
X0149448Y0111823D02*
X0073448Y0111823D01*
X0073448Y0112222D02*
X0149448Y0112222D01*
X0149448Y0112620D02*
X0073448Y0112620D01*
X0073448Y0113019D02*
X0149448Y0113019D01*
X0149448Y0113417D02*
X0073448Y0113417D01*
X0073448Y0113816D02*
X0149448Y0113816D01*
X0149448Y0114214D02*
X0073448Y0114214D01*
X0073448Y0114613D02*
X0149448Y0114613D01*
X0149448Y0115012D02*
X0073448Y0115012D01*
X0073448Y0115410D02*
X0149448Y0115410D01*
X0149448Y0115809D02*
X0073448Y0115809D01*
X0073448Y0116207D02*
X0149448Y0116207D01*
X0149448Y0116606D02*
X0073448Y0116606D01*
X0073448Y0117004D02*
X0149448Y0117004D01*
X0149448Y0117403D02*
X0073448Y0117403D01*
X0073448Y0117801D02*
X0149448Y0117801D01*
X0149448Y0118200D02*
X0073448Y0118200D01*
X0073448Y0118598D02*
X0149448Y0118598D01*
X0149448Y0118997D02*
X0073448Y0118997D01*
X0073448Y0119395D02*
X0149448Y0119395D01*
X0149448Y0119794D02*
X0073448Y0119794D01*
X0073448Y0120192D02*
X0149448Y0120192D01*
X0149448Y0120591D02*
X0073448Y0120591D01*
X0073448Y0120989D02*
X0149448Y0120989D01*
X0149448Y0121388D02*
X0073448Y0121388D01*
X0073448Y0121786D02*
X0149448Y0121786D01*
X0149448Y0122185D02*
X0073448Y0122185D01*
X0073448Y0122583D02*
X0149448Y0122583D01*
X0149448Y0122982D02*
X0073448Y0122982D01*
X0073448Y0123380D02*
X0149448Y0123380D01*
X0149448Y0123779D02*
X0073448Y0123779D01*
X0073448Y0124177D02*
X0149448Y0124177D01*
X0149448Y0124576D02*
X0073448Y0124576D01*
X0073448Y0124974D02*
X0149448Y0124974D01*
X0149448Y0125373D02*
X0073448Y0125373D01*
X0073448Y0125771D02*
X0149448Y0125771D01*
X0149448Y0126170D02*
X0073448Y0126170D01*
X0073448Y0126568D02*
X0149448Y0126568D01*
X0149448Y0126967D02*
X0073448Y0126967D01*
X0073448Y0127365D02*
X0149448Y0127365D01*
X0149448Y0127764D02*
X0073448Y0127764D01*
X0073448Y0128162D02*
X0149448Y0128162D01*
X0149448Y0128561D02*
X0073448Y0128561D01*
X0073448Y0128959D02*
X0149448Y0128959D01*
X0149448Y0129358D02*
X0073448Y0129358D01*
X0073448Y0129756D02*
X0149448Y0129756D01*
X0149448Y0130155D02*
X0073448Y0130155D01*
X0073448Y0130553D02*
X0149448Y0130553D01*
X0149448Y0130952D02*
X0073448Y0130952D01*
X0073448Y0131350D02*
X0149448Y0131350D01*
X0149448Y0131749D02*
X0073448Y0131749D01*
X0073448Y0132148D02*
X0149448Y0132148D01*
X0149448Y0132546D02*
X0073448Y0132546D01*
X0073448Y0132945D02*
X0149448Y0132945D01*
X0149448Y0133343D02*
X0073448Y0133343D01*
X0073448Y0133742D02*
X0149448Y0133742D01*
X0149448Y0134140D02*
X0073448Y0134140D01*
X0073448Y0134539D02*
X0149448Y0134539D01*
X0149448Y0134937D02*
X0073448Y0134937D01*
X0073448Y0135336D02*
X0149448Y0135336D01*
X0149448Y0135734D02*
X0073448Y0135734D01*
X0073448Y0136133D02*
X0149448Y0136133D01*
X0149448Y0136531D02*
X0073448Y0136531D01*
X0073448Y0136930D02*
X0149448Y0136930D01*
X0149448Y0137328D02*
X0073448Y0137328D01*
X0073448Y0137727D02*
X0149448Y0137727D01*
X0149448Y0138125D02*
X0073448Y0138125D01*
X0073448Y0138524D02*
X0149448Y0138524D01*
X0149448Y0138922D02*
X0073448Y0138922D01*
X0073448Y0139321D02*
X0149448Y0139321D01*
X0149448Y0139719D02*
X0073448Y0139719D01*
X0073448Y0140118D02*
X0149448Y0140118D01*
X0149448Y0140516D02*
X0073448Y0140516D01*
X0073448Y0140915D02*
X0149448Y0140915D01*
X0149448Y0141313D02*
X0073448Y0141313D01*
X0073448Y0141712D02*
X0149448Y0141712D01*
X0149448Y0142110D02*
X0073448Y0142110D01*
X0073448Y0142509D02*
X0149448Y0142509D01*
X0149448Y0142907D02*
X0073448Y0142907D01*
X0073448Y0143306D02*
X0149448Y0143306D01*
X0149448Y0143704D02*
X0073448Y0143704D01*
X0073448Y0144103D02*
X0149448Y0144103D01*
X0149448Y0144501D02*
X0073448Y0144501D01*
X0073448Y0144900D02*
X0149448Y0144900D01*
X0149448Y0145298D02*
X0073448Y0145298D01*
X0073448Y0145697D02*
X0149448Y0145697D01*
X0149448Y0146095D02*
X0073448Y0146095D01*
X0073448Y0146494D02*
X0149448Y0146494D01*
X0149448Y0146892D02*
X0073448Y0146892D01*
X0073448Y0147291D02*
X0149448Y0147291D01*
X0149448Y0147689D02*
X0073448Y0147689D01*
X0073448Y0148088D02*
X0149448Y0148088D01*
X0149448Y0148486D02*
X0073448Y0148486D01*
X0073448Y0148885D02*
X0149448Y0148885D01*
X0149448Y0149283D02*
X0073448Y0149283D01*
X0073448Y0149682D02*
X0149448Y0149682D01*
X0149448Y0150081D02*
X0073448Y0150081D01*
X0073448Y0150479D02*
X0149448Y0150479D01*
X0149448Y0150878D02*
X0073448Y0150878D01*
X0073448Y0151276D02*
X0149448Y0151276D01*
X0149448Y0151675D02*
X0073448Y0151675D01*
X0073448Y0152073D02*
X0149448Y0152073D01*
X0149448Y0152472D02*
X0073448Y0152472D01*
X0073448Y0152870D02*
X0149448Y0152870D01*
X0149448Y0153269D02*
X0073448Y0153269D01*
X0073448Y0153667D02*
X0149448Y0153667D01*
X0149448Y0154066D02*
X0073448Y0154066D01*
X0073448Y0154464D02*
X0149448Y0154464D01*
X0149448Y0154863D02*
X0073448Y0154863D01*
X0073448Y0155261D02*
X0149448Y0155261D01*
X0149448Y0155660D02*
X0073448Y0155660D01*
X0073448Y0156058D02*
X0149448Y0156058D01*
X0149448Y0156457D02*
X0073448Y0156457D01*
X0073448Y0156855D02*
X0149448Y0156855D01*
X0149448Y0157254D02*
X0073448Y0157254D01*
X0073448Y0157652D02*
X0149448Y0157652D01*
X0149448Y0158051D02*
X0073448Y0158051D01*
X0073448Y0158449D02*
X0149448Y0158449D01*
X0149448Y0158848D02*
X0073448Y0158848D01*
X0073448Y0159246D02*
X0149448Y0159246D01*
X0149448Y0159645D02*
X0073448Y0159645D01*
X0073448Y0160043D02*
X0149448Y0160043D01*
X0149448Y0160442D02*
X0073448Y0160442D01*
X0073448Y0160840D02*
X0149448Y0160840D01*
X0149448Y0161239D02*
X0073448Y0161239D01*
X0073448Y0161637D02*
X0149448Y0161637D01*
X0149448Y0162036D02*
X0073448Y0162036D01*
X0073448Y0162434D02*
X0149448Y0162434D01*
X0149448Y0162833D02*
X0073448Y0162833D01*
X0073448Y0163231D02*
X0149448Y0163231D01*
X0149448Y0163630D02*
X0073448Y0163630D01*
X0073448Y0164028D02*
X0149448Y0164028D01*
X0149448Y0164427D02*
X0073448Y0164427D01*
X0073448Y0164825D02*
X0149448Y0164825D01*
X0149448Y0165224D02*
X0073448Y0165224D01*
X0073448Y0165622D02*
X0149448Y0165622D01*
X0149448Y0166021D02*
X0073448Y0166021D01*
X0073448Y0166419D02*
X0149448Y0166419D01*
X0149448Y0166818D02*
X0073448Y0166818D01*
X0073448Y0167216D02*
X0149448Y0167216D01*
X0149448Y0167615D02*
X0073448Y0167615D01*
X0073448Y0168014D02*
X0149448Y0168014D01*
X0149448Y0168412D02*
X0073448Y0168412D01*
X0073448Y0168811D02*
X0149448Y0168811D01*
X0149448Y0169209D02*
X0073448Y0169209D01*
X0073448Y0169608D02*
X0149448Y0169608D01*
X0149448Y0170006D02*
X0073448Y0170006D01*
X0073448Y0170405D02*
X0149448Y0170405D01*
X0149448Y0170803D02*
X0073448Y0170803D01*
X0073448Y0171202D02*
X0149448Y0171202D01*
X0149448Y0171600D02*
X0073448Y0171600D01*
X0073448Y0171999D02*
X0149448Y0171999D01*
X0149448Y0172397D02*
X0073448Y0172397D01*
X0073448Y0172796D02*
X0149448Y0172796D01*
X0149448Y0173194D02*
X0073448Y0173194D01*
X0073448Y0173593D02*
X0149448Y0173593D01*
X0149448Y0173991D02*
X0073448Y0173991D01*
X0073448Y0174390D02*
X0149448Y0174390D01*
X0149448Y0174788D02*
X0073448Y0174788D01*
X0073448Y0175187D02*
X0149448Y0175187D01*
X0149448Y0175585D02*
X0073448Y0175585D01*
X0073448Y0175984D02*
X0149448Y0175984D01*
X0149448Y0176382D02*
X0073448Y0176382D01*
X0073448Y0176781D02*
X0149448Y0176781D01*
X0149448Y0177179D02*
X0073448Y0177179D01*
X0073448Y0177578D02*
X0149448Y0177578D01*
X0149448Y0177976D02*
X0073448Y0177976D01*
X0073448Y0178375D02*
X0149448Y0178375D01*
X0149448Y0178773D02*
X0073448Y0178773D01*
X0073448Y0179172D02*
X0149448Y0179172D01*
X0149448Y0179570D02*
X0073448Y0179570D01*
X0073448Y0179969D02*
X0149448Y0179969D01*
X0149448Y0180367D02*
X0073448Y0180367D01*
X0073448Y0180766D02*
X0149448Y0180766D01*
X0149448Y0181164D02*
X0073448Y0181164D01*
X0073448Y0181563D02*
X0149448Y0181563D01*
X0149448Y0181961D02*
X0073448Y0181961D01*
X0073448Y0182360D02*
X0149448Y0182360D01*
X0149448Y0182758D02*
X0073448Y0182758D01*
X0073448Y0183157D02*
X0149448Y0183157D01*
X0149448Y0183555D02*
X0073448Y0183555D01*
X0073448Y0183954D02*
X0149448Y0183954D01*
X0149448Y0184352D02*
X0073448Y0184352D01*
X0073448Y0184751D02*
X0149448Y0184751D01*
X0149448Y0185150D02*
X0073448Y0185150D01*
X0073448Y0185548D02*
X0149448Y0185548D01*
X0149448Y0185947D02*
X0073448Y0185947D01*
X0073448Y0186345D02*
X0149448Y0186345D01*
X0149448Y0186744D02*
X0073448Y0186744D01*
X0073448Y0187142D02*
X0149448Y0187142D01*
X0149448Y0187541D02*
X0073448Y0187541D01*
X0073448Y0187939D02*
X0149448Y0187939D01*
X0149448Y0188338D02*
X0073448Y0188338D01*
X0073448Y0188736D02*
X0149448Y0188736D01*
X0149448Y0189135D02*
X0073448Y0189135D01*
X0073448Y0189533D02*
X0149448Y0189533D01*
X0149448Y0189932D02*
X0073448Y0189932D01*
X0073448Y0190330D02*
X0149448Y0190330D01*
X0149448Y0190729D02*
X0073448Y0190729D01*
X0073448Y0191127D02*
X0149448Y0191127D01*
X0149448Y0191526D02*
X0073448Y0191526D01*
X0073448Y0191924D02*
X0149448Y0191924D01*
X0149448Y0192323D02*
X0073448Y0192323D01*
X0073448Y0192721D02*
X0149448Y0192721D01*
X0149448Y0193120D02*
X0073448Y0193120D01*
X0073448Y0193518D02*
X0149448Y0193518D01*
X0149448Y0193917D02*
X0073448Y0193917D01*
X0073448Y0194315D02*
X0149448Y0194315D01*
X0149448Y0194714D02*
X0073448Y0194714D01*
X0073448Y0195112D02*
X0149448Y0195112D01*
X0149448Y0195511D02*
X0073448Y0195511D01*
X0073448Y0195909D02*
X0149448Y0195909D01*
X0149448Y0196308D02*
X0073448Y0196308D01*
X0073448Y0196706D02*
X0149448Y0196706D01*
X0149448Y0197105D02*
X0073448Y0197105D01*
X0073448Y0197503D02*
X0149448Y0197503D01*
X0149448Y0197902D02*
X0073448Y0197902D01*
X0073448Y0198300D02*
X0149448Y0198300D01*
X0149448Y0198699D02*
X0073448Y0198699D01*
X0073448Y0199097D02*
X0149448Y0199097D01*
X0149448Y0199496D02*
X0073448Y0199496D01*
X0073448Y0199894D02*
X0149448Y0199894D01*
X0149448Y0200293D02*
X0073448Y0200293D01*
X0073448Y0200691D02*
X0149448Y0200691D01*
X0149448Y0201090D02*
X0073448Y0201090D01*
X0073448Y0201488D02*
X0149448Y0201488D01*
X0149448Y0201887D02*
X0073448Y0201887D01*
X0073448Y0202285D02*
X0149448Y0202285D01*
X0149448Y0202684D02*
X0073448Y0202684D01*
X0073448Y0203083D02*
X0149448Y0203083D01*
X0149448Y0203481D02*
X0073448Y0203481D01*
X0073448Y0203880D02*
X0149448Y0203880D01*
X0149448Y0204278D02*
X0073448Y0204278D01*
X0073448Y0204677D02*
X0149448Y0204677D01*
X0149448Y0205075D02*
X0073448Y0205075D01*
X0073448Y0205474D02*
X0149448Y0205474D01*
X0149448Y0205872D02*
X0073448Y0205872D01*
X0073448Y0206271D02*
X0149448Y0206271D01*
X0149448Y0206669D02*
X0073448Y0206669D01*
X0073448Y0207068D02*
X0149448Y0207068D01*
X0149448Y0207466D02*
X0073448Y0207466D01*
X0073448Y0207865D02*
X0149448Y0207865D01*
X0149448Y0208263D02*
X0073448Y0208263D01*
X0073448Y0208662D02*
X0149448Y0208662D01*
X0149448Y0209060D02*
X0073448Y0209060D01*
X0073448Y0209459D02*
X0149448Y0209459D01*
X0149448Y0209857D02*
X0073448Y0209857D01*
X0073448Y0210256D02*
X0149448Y0210256D01*
X0149448Y0210654D02*
X0073448Y0210654D01*
X0073448Y0211053D02*
X0149448Y0211053D01*
X0149448Y0211451D02*
X0073448Y0211451D01*
X0073448Y0211850D02*
X0149448Y0211850D01*
X0149448Y0212248D02*
X0073448Y0212248D01*
X0073448Y0212647D02*
X0149448Y0212647D01*
X0149448Y0213045D02*
X0073448Y0213045D01*
X0073448Y0213444D02*
X0149448Y0213444D01*
X0149448Y0213842D02*
X0073448Y0213842D01*
X0073448Y0214241D02*
X0149448Y0214241D01*
X0149448Y0214639D02*
X0073448Y0214639D01*
X0073448Y0215038D02*
X0149448Y0215038D01*
X0149448Y0215436D02*
X0073448Y0215436D01*
X0073448Y0215835D02*
X0149448Y0215835D01*
X0149448Y0216233D02*
X0073448Y0216233D01*
X0073448Y0216632D02*
X0149448Y0216632D01*
X0149448Y0217030D02*
X0073448Y0217030D01*
X0073448Y0217429D02*
X0149448Y0217429D01*
X0149448Y0217827D02*
X0073448Y0217827D01*
X0073448Y0218226D02*
X0149448Y0218226D01*
X0149448Y0218624D02*
X0073448Y0218624D01*
X0073448Y0219023D02*
X0149448Y0219023D01*
X0149448Y0219421D02*
X0073448Y0219421D01*
X0073448Y0219820D02*
X0149448Y0219820D01*
X0149448Y0220219D02*
X0073448Y0220219D01*
X0073448Y0220617D02*
X0149448Y0220617D01*
X0149448Y0221016D02*
X0073448Y0221016D01*
X0073448Y0221414D02*
X0149448Y0221414D01*
X0149448Y0221813D02*
X0073448Y0221813D01*
X0073448Y0222211D02*
X0149448Y0222211D01*
X0149448Y0222610D02*
X0073448Y0222610D01*
X0073448Y0223008D02*
X0149448Y0223008D01*
X0149448Y0223407D02*
X0073448Y0223407D01*
X0073448Y0223805D02*
X0149448Y0223805D01*
X0149448Y0224204D02*
X0073448Y0224204D01*
X0073448Y0224602D02*
X0149448Y0224602D01*
X0149448Y0225001D02*
X0073448Y0225001D01*
X0073448Y0225399D02*
X0149448Y0225399D01*
X0149448Y0225798D02*
X0073448Y0225798D01*
X0073448Y0226196D02*
X0149448Y0226196D01*
X0149448Y0226595D02*
X0073448Y0226595D01*
X0073448Y0226993D02*
X0149448Y0226993D01*
X0149448Y0227392D02*
X0073448Y0227392D01*
X0073448Y0227790D02*
X0149448Y0227790D01*
D12*
X0127948Y0145933D03*
X0124148Y0145933D03*
X0127948Y0138933D03*
X0127948Y0133933D03*
X0127948Y0123933D03*
X0127948Y0118933D03*
X0127948Y0111933D03*
X0124148Y0111933D03*
X0116148Y0111933D03*
X0113948Y0118933D03*
X0113948Y0123933D03*
X0113948Y0128933D03*
X0113948Y0133933D03*
X0108948Y0133933D03*
X0108948Y0128933D03*
X0108948Y0123933D03*
X0108948Y0118933D03*
X0108948Y0111933D03*
X0094948Y0123933D03*
X0094948Y0133933D03*
X0093948Y0145933D03*
X0108948Y0145933D03*
X0108948Y0138933D03*
X0113948Y0138933D03*
X0116148Y0145933D03*
X0093948Y0111933D03*
D13*
X0083948Y0101933D03*
X0073948Y0091933D03*
X0083948Y0081933D03*
X0093948Y0071933D03*
X0083948Y0061933D03*
X0078948Y0041933D03*
X0088948Y0031933D03*
X0098948Y0041933D03*
X0108948Y0051933D03*
X0118948Y0041933D03*
X0108948Y0031933D03*
X0128948Y0031933D03*
X0138948Y0041933D03*
X0128948Y0051933D03*
X0118948Y0061933D03*
X0108948Y0071933D03*
X0118948Y0081933D03*
X0108948Y0091933D03*
X0118948Y0101933D03*
X0128948Y0091933D03*
X0138948Y0081933D03*
X0128948Y0071933D03*
X0138948Y0061933D03*
X0148948Y0051933D03*
X0148948Y0031933D03*
X0148948Y0071933D03*
X0148948Y0091933D03*
X0138948Y0101933D03*
X0138948Y0121933D03*
X0138948Y0135933D03*
X0138948Y0155933D03*
X0128948Y0165933D03*
X0118948Y0155933D03*
X0108948Y0165933D03*
X0118948Y0175933D03*
X0108948Y0185933D03*
X0118948Y0195933D03*
X0108948Y0205933D03*
X0098948Y0215933D03*
X0108948Y0225933D03*
X0118948Y0215933D03*
X0128948Y0205933D03*
X0138948Y0195933D03*
X0128948Y0185933D03*
X0138948Y0175933D03*
X0148948Y0165933D03*
X0148948Y0185933D03*
X0148948Y0205933D03*
X0138948Y0215933D03*
X0128948Y0225933D03*
X0148948Y0225933D03*
X0093948Y0185933D03*
X0083948Y0175933D03*
X0073948Y0165933D03*
X0083948Y0155933D03*
X0093948Y0165933D03*
X0083948Y0135933D03*
X0083948Y0121933D03*
X0093948Y0091933D03*
X0083948Y0195933D03*
X0078948Y0215933D03*
X0088948Y0225933D03*
M02*
