%
M48
M72
T01C0.02362
T02C0.04000
T03C0.11000
%
T01
X58933Y36933
X68933Y46933
X58933Y56933
X78933Y56933
X98433Y60933
X120933Y56933
X135933Y56933
X145933Y46933
X155933Y36933
X155933Y56933
X146433Y74933
X155933Y76933
X145933Y86933
X135933Y96933
X125933Y86933
X115933Y96933
X105933Y86933
X98433Y83933
X93433Y78933
X98433Y74933
X103433Y78933
X118433Y74933
X128933Y74933
X135933Y74933
X155933Y96933
X88933Y86933
X78933Y76933
X68933Y86933
X58933Y76933
X58933Y96933
X78933Y96933
X93433Y38933
X103433Y38933
X113433Y38933
T02
X129933Y38933
X129933Y48933
T03
X98433Y28933
X98433Y104933
M30
