%
M48
M72
T01C0.0236
T02C0.0276
T03C0.0354
T04C0.0394
T05C0.0748
%
T01
X9677Y8993
X10510Y9768
X10072Y10581
X10510Y10893
X10550Y11393
X11677Y11306
X12603Y12416
X12103Y12916
X11603Y13416
X11103Y13916
X10460Y14393
X9590Y13381
X8652Y13381
X9635Y12456
X7715Y11881
X7740Y10931
X9385Y10456
X6090Y13506
X13203Y11916
X13853Y11566
X14603Y11566
X15353Y11566
X16103Y11566
X16877Y11337
X17477Y10737
X17877Y11787
X17377Y12287
X16877Y12787
X16277Y13137
X15527Y13237
X14777Y13337
X14177Y13737
X14003Y14435
X14003Y15185
X18531Y14991
X18627Y14237
X19127Y13487
X19627Y12737
X19627Y11987
X19627Y11237
X19377Y10487
X20877Y9887
X21277Y10687
X21677Y11487
X21977Y12387
X22277Y13287
X22477Y14287
X20377Y9087
X16740Y7281
X15927Y10056
T02
X18510Y9193
X19010Y9730
X19510Y9193
X19510Y8193
X19010Y7730
X18510Y8193
T03
X17260Y7952
X17260Y8702
X16510Y8702
X16510Y7952
X15760Y7952
X15760Y8702
X15010Y8702
X15010Y7952
X14260Y7952
X14260Y8702
X13510Y8702
X13510Y7952
X12760Y7952
X12760Y8702
X12010Y8702
X12010Y7952
X12010Y9452
X12760Y9452
X13510Y9452
X14260Y9452
X15010Y9452
X15760Y9452
X16510Y9452
X17260Y9452
T04
X5960Y7871
X6960Y7871
X6960Y8871
X5960Y8871
X5960Y9871
X6960Y9871
X6960Y10871
X5960Y10871
X5960Y11871
X6960Y11871
T05
X9710Y7943
X12010Y6653
X19510Y6653
X21809Y7943
M30
