<?xml version="1.0" encoding="utf-8"?>
<!DOCTYPE eagle SYSTEM "eagle.dtd">
<eagle version="7.7.0">
<drawing>
<settings>
<setting alwaysvectorfont="no"/>
<setting verticaltext="up"/>
</settings>
<grid distance="0.1" unitdist="inch" unit="inch" style="lines" multiple="1" display="no" altdistance="0.01" altunitdist="inch" altunit="inch"/>
<layers>
<layer number="1" name="Top" color="4" fill="1" visible="no" active="no"/>
<layer number="2" name="Route2" color="1" fill="3" visible="no" active="no"/>
<layer number="3" name="Route3" color="4" fill="3" visible="no" active="no"/>
<layer number="4" name="Route4" color="1" fill="4" visible="no" active="no"/>
<layer number="5" name="Route5" color="4" fill="4" visible="no" active="no"/>
<layer number="6" name="Route6" color="1" fill="8" visible="no" active="no"/>
<layer number="7" name="Route7" color="4" fill="8" visible="no" active="no"/>
<layer number="8" name="Route8" color="1" fill="2" visible="no" active="no"/>
<layer number="9" name="Route9" color="4" fill="2" visible="no" active="no"/>
<layer number="10" name="Route10" color="1" fill="7" visible="no" active="no"/>
<layer number="11" name="Route11" color="4" fill="7" visible="no" active="no"/>
<layer number="12" name="Route12" color="1" fill="5" visible="no" active="no"/>
<layer number="13" name="Route13" color="4" fill="5" visible="no" active="no"/>
<layer number="14" name="Route14" color="1" fill="6" visible="no" active="no"/>
<layer number="15" name="Route15" color="4" fill="6" visible="no" active="no"/>
<layer number="16" name="Bottom" color="1" fill="1" visible="no" active="no"/>
<layer number="17" name="Pads" color="2" fill="1" visible="no" active="no"/>
<layer number="18" name="Vias" color="2" fill="1" visible="no" active="no"/>
<layer number="19" name="Unrouted" color="6" fill="1" visible="no" active="no"/>
<layer number="20" name="Dimension" color="15" fill="1" visible="no" active="no"/>
<layer number="21" name="tPlace" color="7" fill="1" visible="no" active="no"/>
<layer number="22" name="bPlace" color="7" fill="1" visible="no" active="no"/>
<layer number="23" name="tOrigins" color="15" fill="1" visible="no" active="no"/>
<layer number="24" name="bOrigins" color="15" fill="1" visible="no" active="no"/>
<layer number="25" name="tNames" color="7" fill="1" visible="no" active="no"/>
<layer number="26" name="bNames" color="7" fill="1" visible="no" active="no"/>
<layer number="27" name="tValues" color="7" fill="1" visible="no" active="no"/>
<layer number="28" name="bValues" color="7" fill="1" visible="no" active="no"/>
<layer number="29" name="tStop" color="7" fill="3" visible="no" active="no"/>
<layer number="30" name="bStop" color="7" fill="6" visible="no" active="no"/>
<layer number="31" name="tCream" color="7" fill="4" visible="no" active="no"/>
<layer number="32" name="bCream" color="7" fill="5" visible="no" active="no"/>
<layer number="33" name="tFinish" color="6" fill="3" visible="no" active="no"/>
<layer number="34" name="bFinish" color="6" fill="6" visible="no" active="no"/>
<layer number="35" name="tGlue" color="7" fill="4" visible="no" active="no"/>
<layer number="36" name="bGlue" color="7" fill="5" visible="no" active="no"/>
<layer number="37" name="tTest" color="7" fill="1" visible="no" active="no"/>
<layer number="38" name="bTest" color="7" fill="1" visible="no" active="no"/>
<layer number="39" name="tKeepout" color="4" fill="11" visible="no" active="no"/>
<layer number="40" name="bKeepout" color="1" fill="11" visible="no" active="no"/>
<layer number="41" name="tRestrict" color="4" fill="10" visible="no" active="no"/>
<layer number="42" name="bRestrict" color="1" fill="10" visible="no" active="no"/>
<layer number="43" name="vRestrict" color="2" fill="10" visible="no" active="no"/>
<layer number="44" name="Drills" color="7" fill="1" visible="no" active="no"/>
<layer number="45" name="Holes" color="7" fill="1" visible="no" active="no"/>
<layer number="46" name="Milling" color="3" fill="1" visible="no" active="no"/>
<layer number="47" name="Measures" color="7" fill="1" visible="no" active="no"/>
<layer number="48" name="Document" color="7" fill="1" visible="no" active="no"/>
<layer number="49" name="Reference" color="7" fill="1" visible="no" active="no"/>
<layer number="50" name="dxf" color="7" fill="1" visible="no" active="no"/>
<layer number="51" name="tDocu" color="6" fill="1" visible="no" active="no"/>
<layer number="52" name="bDocu" color="7" fill="1" visible="no" active="no"/>
<layer number="53" name="tGND_GNDA" color="7" fill="9" visible="no" active="no"/>
<layer number="54" name="bGND_GNDA" color="1" fill="9" visible="no" active="no"/>
<layer number="56" name="wert" color="7" fill="1" visible="no" active="no"/>
<layer number="57" name="tCAD" color="7" fill="1" visible="no" active="no"/>
<layer number="59" name="tCarbon" color="7" fill="1" visible="no" active="no"/>
<layer number="60" name="bCarbon" color="7" fill="1" visible="no" active="no"/>
<layer number="90" name="Modules" color="5" fill="1" visible="yes" active="yes"/>
<layer number="91" name="Nets" color="2" fill="1" visible="yes" active="yes"/>
<layer number="92" name="Busses" color="1" fill="1" visible="yes" active="yes"/>
<layer number="93" name="Pins" color="2" fill="1" visible="no" active="yes"/>
<layer number="94" name="Symbols" color="4" fill="1" visible="yes" active="yes"/>
<layer number="95" name="Names" color="7" fill="1" visible="yes" active="yes"/>
<layer number="96" name="Values" color="7" fill="1" visible="yes" active="yes"/>
<layer number="97" name="Info" color="7" fill="1" visible="yes" active="yes"/>
<layer number="98" name="Guide" color="6" fill="1" visible="yes" active="yes"/>
<layer number="99" name="SpiceOrder" color="7" fill="1" visible="no" active="no"/>
<layer number="100" name="Muster" color="7" fill="1" visible="no" active="no"/>
<layer number="101" name="Patch_Top" color="12" fill="4" visible="yes" active="yes"/>
<layer number="102" name="Vscore" color="7" fill="1" visible="yes" active="yes"/>
<layer number="103" name="tMap" color="7" fill="1" visible="yes" active="yes"/>
<layer number="104" name="Name" color="16" fill="1" visible="yes" active="yes"/>
<layer number="105" name="tPlate" color="7" fill="1" visible="yes" active="yes"/>
<layer number="106" name="bPlate" color="7" fill="1" visible="yes" active="yes"/>
<layer number="107" name="Crop" color="7" fill="1" visible="yes" active="yes"/>
<layer number="108" name="tplace-old" color="10" fill="1" visible="yes" active="yes"/>
<layer number="109" name="ref-old" color="11" fill="1" visible="yes" active="yes"/>
<layer number="110" name="fp0" color="7" fill="1" visible="yes" active="yes"/>
<layer number="111" name="LPC17xx" color="7" fill="1" visible="yes" active="yes"/>
<layer number="112" name="tSilk" color="7" fill="1" visible="yes" active="yes"/>
<layer number="113" name="IDFDebug" color="7" fill="1" visible="yes" active="yes"/>
<layer number="114" name="Badge_Outline" color="11" fill="1" visible="no" active="no"/>
<layer number="116" name="Patch_BOT" color="9" fill="4" visible="yes" active="yes"/>
<layer number="118" name="Rect_Pads" color="7" fill="1" visible="yes" active="yes"/>
<layer number="121" name="_tsilk" color="7" fill="1" visible="yes" active="yes"/>
<layer number="122" name="_bsilk" color="7" fill="1" visible="yes" active="yes"/>
<layer number="123" name="tTestmark" color="7" fill="1" visible="yes" active="yes"/>
<layer number="124" name="bTestmark" color="7" fill="1" visible="yes" active="yes"/>
<layer number="125" name="_tNames" color="7" fill="1" visible="yes" active="yes"/>
<layer number="126" name="_bNames" color="7" fill="1" visible="yes" active="yes"/>
<layer number="127" name="_tValues" color="7" fill="1" visible="yes" active="yes"/>
<layer number="128" name="_bValues" color="7" fill="1" visible="yes" active="yes"/>
<layer number="129" name="Mask" color="7" fill="1" visible="yes" active="yes"/>
<layer number="131" name="tAdjust" color="7" fill="1" visible="yes" active="yes"/>
<layer number="132" name="bAdjust" color="7" fill="1" visible="yes" active="yes"/>
<layer number="144" name="Drill_legend" color="7" fill="1" visible="yes" active="yes"/>
<layer number="150" name="Notes" color="7" fill="1" visible="yes" active="yes"/>
<layer number="151" name="HeatSink" color="7" fill="1" visible="yes" active="yes"/>
<layer number="152" name="_bDocu" color="7" fill="1" visible="yes" active="yes"/>
<layer number="153" name="FabDoc1" color="7" fill="1" visible="yes" active="yes"/>
<layer number="154" name="FabDoc2" color="7" fill="1" visible="yes" active="yes"/>
<layer number="155" name="FabDoc3" color="7" fill="1" visible="yes" active="yes"/>
<layer number="199" name="Contour" color="7" fill="1" visible="yes" active="yes"/>
<layer number="200" name="200bmp" color="1" fill="10" visible="yes" active="yes"/>
<layer number="201" name="201bmp" color="2" fill="10" visible="yes" active="yes"/>
<layer number="202" name="202bmp" color="3" fill="10" visible="yes" active="yes"/>
<layer number="203" name="203bmp" color="4" fill="10" visible="yes" active="yes"/>
<layer number="204" name="204bmp" color="5" fill="10" visible="yes" active="yes"/>
<layer number="205" name="205bmp" color="6" fill="10" visible="yes" active="yes"/>
<layer number="206" name="206bmp" color="7" fill="10" visible="yes" active="yes"/>
<layer number="207" name="207bmp" color="8" fill="10" visible="yes" active="yes"/>
<layer number="208" name="208bmp" color="9" fill="10" visible="yes" active="yes"/>
<layer number="209" name="209bmp" color="7" fill="1" visible="yes" active="yes"/>
<layer number="210" name="210bmp" color="7" fill="1" visible="yes" active="yes"/>
<layer number="211" name="211bmp" color="7" fill="1" visible="yes" active="yes"/>
<layer number="212" name="212bmp" color="7" fill="1" visible="yes" active="yes"/>
<layer number="213" name="213bmp" color="7" fill="1" visible="yes" active="yes"/>
<layer number="214" name="214bmp" color="7" fill="1" visible="yes" active="yes"/>
<layer number="215" name="215bmp" color="7" fill="1" visible="yes" active="yes"/>
<layer number="216" name="216bmp" color="7" fill="1" visible="yes" active="yes"/>
<layer number="217" name="217bmp" color="18" fill="1" visible="no" active="no"/>
<layer number="218" name="218bmp" color="19" fill="1" visible="no" active="no"/>
<layer number="219" name="219bmp" color="20" fill="1" visible="no" active="no"/>
<layer number="220" name="220bmp" color="21" fill="1" visible="no" active="no"/>
<layer number="221" name="221bmp" color="22" fill="1" visible="no" active="no"/>
<layer number="222" name="222bmp" color="23" fill="1" visible="no" active="no"/>
<layer number="223" name="223bmp" color="24" fill="1" visible="no" active="no"/>
<layer number="224" name="224bmp" color="25" fill="1" visible="no" active="no"/>
<layer number="225" name="225bmp" color="7" fill="1" visible="yes" active="yes"/>
<layer number="226" name="226bmp" color="7" fill="1" visible="yes" active="yes"/>
<layer number="227" name="227bmp" color="7" fill="1" visible="yes" active="yes"/>
<layer number="228" name="228bmp" color="7" fill="1" visible="yes" active="yes"/>
<layer number="229" name="229bmp" color="7" fill="1" visible="yes" active="yes"/>
<layer number="230" name="230bmp" color="7" fill="1" visible="yes" active="yes"/>
<layer number="231" name="231bmp" color="7" fill="1" visible="yes" active="yes"/>
<layer number="248" name="Housing" color="7" fill="1" visible="yes" active="yes"/>
<layer number="249" name="Edge" color="7" fill="1" visible="yes" active="yes"/>
<layer number="250" name="Descript" color="3" fill="1" visible="no" active="no"/>
<layer number="251" name="SMDround" color="12" fill="11" visible="no" active="no"/>
<layer number="253" name="tPins" color="13" fill="1" visible="yes" active="yes"/>
<layer number="254" name="cooling" color="7" fill="1" visible="yes" active="yes"/>
<layer number="255" name="routoute" color="7" fill="1" visible="yes" active="yes"/>
</layers>
<schematic xreflabel="%F%N/%S.%C%R" xrefpart="/%S.%C%R">
<libraries>
<library name="con-coax">
<description>&lt;b&gt;Coax Connectors&lt;/b&gt;&lt;p&gt;
Radiall  and M/A COM.&lt;p&gt;
&lt;author&gt;Created by librarian@cadsoft.de&lt;/author&gt;</description>
<packages>
<package name="J502-ND">
<description>&lt;b&gt;SMA 50 Ohm&lt;/b&gt; End Launch Jack Receptacle - Round Contact&lt;p&gt;
Johnson Components&lt;br&gt;
Source: www.johnsoncomponents.com .. J502-ND.pdf</description>
<wire x1="-4.65" y1="3.85" x2="4.65" y2="3.85" width="0.2032" layer="51"/>
<wire x1="4.65" y1="3.85" x2="4.65" y2="-3.85" width="0.2032" layer="51"/>
<wire x1="4.65" y1="-3.85" x2="-4.65" y2="-3.85" width="0.2032" layer="51"/>
<wire x1="-4.65" y1="-3.85" x2="-4.65" y2="3.85" width="0.2032" layer="51"/>
<wire x1="-4.9" y1="-3.5" x2="-4.9" y2="-1.8" width="0" layer="46"/>
<wire x1="-4.9" y1="-1.8" x2="-3.6" y2="-1.8" width="0" layer="46" curve="-180"/>
<wire x1="-3.6" y1="-1.8" x2="-3.6" y2="-3.5" width="0" layer="46"/>
<wire x1="-3.6" y1="-3.5" x2="-4.9" y2="-3.5" width="0" layer="46" curve="-180"/>
<wire x1="3.6" y1="-3.5" x2="3.6" y2="-1.8" width="0" layer="46"/>
<wire x1="3.6" y1="-1.8" x2="4.9" y2="-1.8" width="0" layer="46" curve="-180"/>
<wire x1="4.9" y1="-1.8" x2="4.9" y2="-3.5" width="0" layer="46"/>
<wire x1="4.9" y1="-3.5" x2="3.6" y2="-3.5" width="0" layer="46" curve="-180"/>
<circle x="0" y="0" radius="3.1999" width="0.2032" layer="51"/>
<circle x="0" y="0" radius="1.7" width="0.2032" layer="21"/>
<pad name="1" x="0" y="0" drill="1"/>
<pad name="2" x="-4.25" y="0.4" drill="1.5"/>
<pad name="3" x="4.25" y="0.4" drill="1.5"/>
<pad name="4" x="4.25" y="-2.65" drill="1.3" shape="long" rot="R90"/>
<pad name="5" x="-4.25" y="-2.65" drill="1.3" shape="long" rot="R90"/>
<text x="-2.54" y="4.445" size="1.27" layer="25">&gt;NAME</text>
<text x="-3.175" y="-5.715" size="1.27" layer="27">&gt;VALUE</text>
</package>
<package name="J502-ND-142-0701-801/806">
<description>&lt;b&gt;SMA 50 Ohm&lt;/b&gt; Board Thickness &lt;b&gt;0.062&lt;/b&gt; Inch, End Launch Jack Receptacle&lt;p&gt;
Johnson Components&lt;br&gt;
Source: www.johnsoncomponents.com .. J502-ND.pdf</description>
<wire x1="0" y1="5.588" x2="0" y2="-5.588" width="0" layer="20"/>
<wire x1="-1.55" y1="-4.65" x2="-1.55" y2="-2" width="0.2032" layer="21"/>
<wire x1="-1.55" y1="-2" x2="-3.7" y2="-2" width="0.2032" layer="21"/>
<wire x1="-3.7" y1="-2" x2="-4.45" y2="-2.75" width="0.2032" layer="21"/>
<wire x1="-4.45" y1="-2.75" x2="-8.25" y2="-2.75" width="0.2032" layer="21"/>
<wire x1="-8.25" y1="-2.75" x2="-8.25" y2="-1.9" width="0.2032" layer="21"/>
<wire x1="-8.25" y1="-1.9" x2="-9.425" y2="-1.9" width="0.2032" layer="21"/>
<wire x1="-9.425" y1="-1.9" x2="-9.425" y2="1.9" width="0.2032" layer="21"/>
<wire x1="-9.425" y1="1.9" x2="-8.25" y2="1.9" width="0.2032" layer="21"/>
<wire x1="-8.25" y1="1.9" x2="-8.25" y2="2.75" width="0.2032" layer="21"/>
<wire x1="-8.25" y1="2.75" x2="-4.45" y2="2.75" width="0.2032" layer="21"/>
<wire x1="-4.45" y1="2.75" x2="-3.7" y2="2" width="0.2032" layer="21"/>
<wire x1="-3.7" y1="2" x2="-1.55" y2="2" width="0.2032" layer="21"/>
<wire x1="-1.55" y1="2" x2="-1.55" y2="4.65" width="0.2032" layer="21"/>
<wire x1="-1.55" y1="4.65" x2="4.65" y2="4.65" width="0.2032" layer="51"/>
<wire x1="4.65" y1="-4.65" x2="-1.55" y2="-4.65" width="0.2032" layer="51"/>
<wire x1="4.65" y1="-4.65" x2="4.65" y2="-3.85" width="0.2032" layer="51"/>
<wire x1="4.65" y1="-3.85" x2="-0.1" y2="-3.85" width="0.2032" layer="51"/>
<wire x1="-0.1" y1="-3.85" x2="-0.1" y2="3.85" width="0.2032" layer="21"/>
<wire x1="-0.1" y1="3.85" x2="4.65" y2="3.85" width="0.2032" layer="51"/>
<wire x1="4.65" y1="3.85" x2="4.65" y2="4.65" width="0.2032" layer="51"/>
<wire x1="-1.55" y1="4.65" x2="-0.1" y2="4.65" width="0.2032" layer="21"/>
<wire x1="-0.1" y1="-4.65" x2="-1.55" y2="-4.65" width="0.2032" layer="21"/>
<smd name="1" x="2.5654" y="0" dx="5.08" dy="2.286" layer="1"/>
<smd name="G@1" x="2.5654" y="4.4196" dx="5.08" dy="2.286" layer="1"/>
<smd name="G@2" x="2.5654" y="-4.4196" dx="5.08" dy="2.286" layer="1"/>
<smd name="G@4" x="2.5654" y="-4.4196" dx="5.08" dy="2.286" layer="16"/>
<smd name="G@3" x="2.5654" y="4.4196" dx="5.08" dy="2.286" layer="16"/>
<text x="0.635" y="6.35" size="1.778" layer="25">&gt;NAME</text>
<text x="1.27" y="-8.89" size="1.778" layer="27">&gt;VALUE</text>
<rectangle x1="-0.025" y1="-0.5" x2="4.05" y2="0.5" layer="51"/>
</package>
<package name="J502-ND-142-0701-851/861">
<description>&lt;b&gt;SMA 50 Ohm&lt;/b&gt; Board Thickness &lt;b&gt;0.062&lt;/b&gt; Inch, End Launch Jack Receptacle&lt;p&gt;
Johnson Components&lt;br&gt;
Source: www.johnsoncomponents.com .. J502-ND.pdf</description>
<wire x1="0" y1="5.588" x2="0" y2="-5.588" width="0" layer="20"/>
<wire x1="-1.55" y1="-4.65" x2="-1.55" y2="-2" width="0.2032" layer="21"/>
<wire x1="-1.55" y1="-2" x2="-3.7" y2="-2" width="0.2032" layer="21"/>
<wire x1="-3.7" y1="-2" x2="-4.45" y2="-2.75" width="0.2032" layer="21"/>
<wire x1="-4.45" y1="-2.75" x2="-8.25" y2="-2.75" width="0.2032" layer="21"/>
<wire x1="-8.25" y1="-2.75" x2="-8.25" y2="-1.9" width="0.2032" layer="21"/>
<wire x1="-8.25" y1="-1.9" x2="-9.425" y2="-1.9" width="0.2032" layer="21"/>
<wire x1="-9.425" y1="-1.9" x2="-9.425" y2="1.9" width="0.2032" layer="21"/>
<wire x1="-9.425" y1="1.9" x2="-8.25" y2="1.9" width="0.2032" layer="21"/>
<wire x1="-8.25" y1="1.9" x2="-8.25" y2="2.75" width="0.2032" layer="21"/>
<wire x1="-8.25" y1="2.75" x2="-4.45" y2="2.75" width="0.2032" layer="21"/>
<wire x1="-4.45" y1="2.75" x2="-3.7" y2="2" width="0.2032" layer="21"/>
<wire x1="-3.7" y1="2" x2="-1.55" y2="2" width="0.2032" layer="21"/>
<wire x1="-1.55" y1="2" x2="-1.55" y2="4.65" width="0.2032" layer="21"/>
<wire x1="-1.55" y1="4.65" x2="4.65" y2="4.65" width="0.2032" layer="51"/>
<wire x1="4.65" y1="-4.65" x2="-1.55" y2="-4.65" width="0.2032" layer="51"/>
<wire x1="4.65" y1="-4.65" x2="4.65" y2="-3.85" width="0.2032" layer="51"/>
<wire x1="4.65" y1="-3.85" x2="-0.1" y2="-3.85" width="0.2032" layer="51"/>
<wire x1="-0.1" y1="-3.85" x2="-0.1" y2="3.85" width="0.2032" layer="21"/>
<wire x1="-0.1" y1="3.85" x2="4.65" y2="3.85" width="0.2032" layer="51"/>
<wire x1="4.65" y1="3.85" x2="4.65" y2="4.65" width="0.2032" layer="51"/>
<wire x1="-1.55" y1="4.65" x2="-0.1" y2="4.65" width="0.2032" layer="21"/>
<wire x1="-0.1" y1="-4.65" x2="-1.55" y2="-4.65" width="0.2032" layer="21"/>
<smd name="1" x="2.5654" y="0" dx="5.08" dy="2.286" layer="1"/>
<smd name="G@1" x="2.5654" y="4.4196" dx="5.08" dy="2.286" layer="1"/>
<smd name="G@2" x="2.5654" y="-4.4196" dx="5.08" dy="2.286" layer="1"/>
<smd name="G@4" x="2.5654" y="-4.4196" dx="5.08" dy="2.286" layer="16"/>
<smd name="G@3" x="2.5654" y="4.4196" dx="5.08" dy="2.286" layer="16"/>
<text x="0.635" y="6.35" size="1.778" layer="25">&gt;NAME</text>
<text x="1.27" y="-8.89" size="1.778" layer="27">&gt;VALUE</text>
<rectangle x1="-0.025" y1="-0.5" x2="4.05" y2="0.5" layer="51"/>
</package>
<package name="J502-ND-142-0701-871/876">
<description>&lt;b&gt;SMA 50 Ohm&lt;/b&gt; Board Thickness &lt;b&gt;0.062&lt;/b&gt; Inch, End Launch Jack Receptacle&lt;p&gt;
Johnson Components&lt;br&gt;
Source: www.johnsoncomponents.com .. J502-ND.pdf</description>
<wire x1="0" y1="5.588" x2="0" y2="-5.588" width="0" layer="20"/>
<wire x1="-1.55" y1="-4.65" x2="-1.55" y2="-2" width="0.2032" layer="21"/>
<wire x1="-1.55" y1="-2" x2="-3.7" y2="-2" width="0.2032" layer="21"/>
<wire x1="-3.7" y1="-2" x2="-4.45" y2="-2.75" width="0.2032" layer="21"/>
<wire x1="-4.45" y1="-2.75" x2="-8.25" y2="-2.75" width="0.2032" layer="21"/>
<wire x1="-8.25" y1="-2.75" x2="-8.25" y2="-1.9" width="0.2032" layer="21"/>
<wire x1="-8.25" y1="-1.9" x2="-9.425" y2="-1.9" width="0.2032" layer="21"/>
<wire x1="-9.425" y1="-1.9" x2="-9.425" y2="1.9" width="0.2032" layer="21"/>
<wire x1="-9.425" y1="1.9" x2="-8.25" y2="1.9" width="0.2032" layer="21"/>
<wire x1="-8.25" y1="1.9" x2="-8.25" y2="2.75" width="0.2032" layer="21"/>
<wire x1="-8.25" y1="2.75" x2="-4.45" y2="2.75" width="0.2032" layer="21"/>
<wire x1="-4.45" y1="2.75" x2="-3.7" y2="2" width="0.2032" layer="21"/>
<wire x1="-3.7" y1="2" x2="-1.55" y2="2" width="0.2032" layer="21"/>
<wire x1="-1.55" y1="2" x2="-1.55" y2="4.65" width="0.2032" layer="21"/>
<wire x1="-1.55" y1="4.65" x2="4.65" y2="4.65" width="0.2032" layer="51"/>
<wire x1="4.65" y1="-4.65" x2="-1.55" y2="-4.65" width="0.2032" layer="51"/>
<wire x1="4.65" y1="-4.65" x2="4.65" y2="-3.85" width="0.2032" layer="51"/>
<wire x1="4.65" y1="-3.85" x2="-0.1" y2="-3.85" width="0.2032" layer="51"/>
<wire x1="-0.1" y1="-3.85" x2="-0.1" y2="3.85" width="0.2032" layer="21"/>
<wire x1="-0.1" y1="3.85" x2="4.65" y2="3.85" width="0.2032" layer="51"/>
<wire x1="4.65" y1="3.85" x2="4.65" y2="4.65" width="0.2032" layer="51"/>
<wire x1="-1.55" y1="4.65" x2="-0.1" y2="4.65" width="0.2032" layer="21"/>
<wire x1="-0.1" y1="-4.65" x2="-1.55" y2="-4.65" width="0.2032" layer="21"/>
<smd name="1" x="2.5654" y="0" dx="5.08" dy="2.286" layer="1"/>
<smd name="G@1" x="2.5654" y="4.4196" dx="5.08" dy="2.286" layer="1"/>
<smd name="G@2" x="2.5654" y="-4.4196" dx="5.08" dy="2.286" layer="1"/>
<smd name="G@4" x="2.5654" y="-4.4196" dx="5.08" dy="2.286" layer="16"/>
<smd name="G@3" x="2.5654" y="4.4196" dx="5.08" dy="2.286" layer="16"/>
<text x="0.635" y="6.35" size="1.778" layer="25">&gt;NAME</text>
<text x="1.27" y="-8.89" size="1.778" layer="27">&gt;VALUE</text>
<rectangle x1="-0.025" y1="-0.5" x2="4.05" y2="0.5" layer="51"/>
</package>
<package name="J502-ND-142-0701-881/886">
<description>&lt;b&gt;SMA 50 Ohm&lt;/b&gt; Board Thickness &lt;b&gt;0.031&lt;/b&gt; Inch, End Launch Jack Receptacle&lt;p&gt;
Johnson Components&lt;br&gt;
Source: www.johnsoncomponents.com .. J502-ND.pdf</description>
<wire x1="0" y1="5.588" x2="0" y2="-5.588" width="0" layer="20"/>
<wire x1="-1.55" y1="-4.65" x2="-1.55" y2="-2" width="0.2032" layer="21"/>
<wire x1="-1.55" y1="-2" x2="-3.7" y2="-2" width="0.2032" layer="21"/>
<wire x1="-3.7" y1="-2" x2="-4.45" y2="-2.75" width="0.2032" layer="21"/>
<wire x1="-4.45" y1="-2.75" x2="-8.25" y2="-2.75" width="0.2032" layer="21"/>
<wire x1="-8.25" y1="-2.75" x2="-8.25" y2="-1.9" width="0.2032" layer="21"/>
<wire x1="-8.25" y1="-1.9" x2="-9.425" y2="-1.9" width="0.2032" layer="21"/>
<wire x1="-9.425" y1="-1.9" x2="-9.425" y2="1.9" width="0.2032" layer="21"/>
<wire x1="-9.425" y1="1.9" x2="-8.25" y2="1.9" width="0.2032" layer="21"/>
<wire x1="-8.25" y1="1.9" x2="-8.25" y2="2.75" width="0.2032" layer="21"/>
<wire x1="-8.25" y1="2.75" x2="-4.45" y2="2.75" width="0.2032" layer="21"/>
<wire x1="-4.45" y1="2.75" x2="-3.7" y2="2" width="0.2032" layer="21"/>
<wire x1="-3.7" y1="2" x2="-1.55" y2="2" width="0.2032" layer="21"/>
<wire x1="-1.55" y1="2" x2="-1.55" y2="4.65" width="0.2032" layer="21"/>
<wire x1="-0.1" y1="-3.85" x2="-0.1" y2="3.85" width="0.2032" layer="21"/>
<wire x1="-1.55" y1="4.65" x2="-0.1" y2="4.65" width="0.2032" layer="21"/>
<wire x1="-0.1" y1="-4.65" x2="-1.55" y2="-4.65" width="0.2032" layer="21"/>
<wire x1="-1.55" y1="4.65" x2="4.65" y2="4.65" width="0.2032" layer="51"/>
<wire x1="4.65" y1="-4.65" x2="-1.55" y2="-4.65" width="0.2032" layer="51"/>
<wire x1="4.65" y1="-4.65" x2="4.65" y2="-3.85" width="0.2032" layer="51"/>
<wire x1="4.65" y1="-3.85" x2="-0.1" y2="-3.85" width="0.2032" layer="51"/>
<wire x1="-0.1" y1="3.85" x2="4.65" y2="3.85" width="0.2032" layer="51"/>
<wire x1="4.65" y1="3.85" x2="4.65" y2="4.65" width="0.2032" layer="51"/>
<smd name="1" x="2.5654" y="0" dx="5.08" dy="1.143" layer="1"/>
<smd name="G@1" x="2.5654" y="4.4196" dx="5.08" dy="2.286" layer="1"/>
<smd name="G@2" x="2.5654" y="-4.4196" dx="5.08" dy="2.286" layer="1"/>
<smd name="G@4" x="2.5654" y="-4.4196" dx="5.08" dy="2.286" layer="16"/>
<smd name="G@3" x="2.5654" y="4.4196" dx="5.08" dy="2.286" layer="16"/>
<text x="0.635" y="6.35" size="1.778" layer="25">&gt;NAME</text>
<text x="1.27" y="-8.89" size="1.778" layer="27">&gt;VALUE</text>
<rectangle x1="-0.025" y1="-0.5" x2="4.05" y2="0.5" layer="51"/>
</package>
<package name="J502-ND-142-0711-821/826">
<description>&lt;b&gt;SMA 50 Ohm&lt;/b&gt; Board Thickness &lt;b&gt;0.062&lt;/b&gt; Inch, End Launch Jack Receptacle&lt;p&gt;
Johnson Components&lt;br&gt;
Source: www.johnsoncomponents.com .. J502-ND.pdf</description>
<wire x1="0" y1="5.588" x2="0" y2="-5.588" width="0" layer="20"/>
<wire x1="-1.55" y1="-4.65" x2="-1.55" y2="-2" width="0.2032" layer="21"/>
<wire x1="-1.55" y1="-2" x2="-3.7" y2="-2" width="0.2032" layer="21"/>
<wire x1="-3.7" y1="-2" x2="-4.45" y2="-2.75" width="0.2032" layer="21"/>
<wire x1="-4.45" y1="-2.75" x2="-8.25" y2="-2.75" width="0.2032" layer="21"/>
<wire x1="-8.25" y1="-2.75" x2="-8.25" y2="-1.9" width="0.2032" layer="21"/>
<wire x1="-8.25" y1="-1.9" x2="-9.425" y2="-1.9" width="0.2032" layer="21"/>
<wire x1="-9.425" y1="-1.9" x2="-9.425" y2="1.9" width="0.2032" layer="21"/>
<wire x1="-9.425" y1="1.9" x2="-8.25" y2="1.9" width="0.2032" layer="21"/>
<wire x1="-8.25" y1="1.9" x2="-8.25" y2="2.75" width="0.2032" layer="21"/>
<wire x1="-8.25" y1="2.75" x2="-4.45" y2="2.75" width="0.2032" layer="21"/>
<wire x1="-4.45" y1="2.75" x2="-3.7" y2="2" width="0.2032" layer="21"/>
<wire x1="-3.7" y1="2" x2="-1.55" y2="2" width="0.2032" layer="21"/>
<wire x1="-1.55" y1="2" x2="-1.55" y2="4.65" width="0.2032" layer="21"/>
<wire x1="-1.55" y1="4.65" x2="4.1" y2="4.65" width="0.2032" layer="51"/>
<wire x1="4.1" y1="-4.65" x2="-1.55" y2="-4.65" width="0.2032" layer="51"/>
<wire x1="4.1" y1="-4.65" x2="4.1" y2="-3.85" width="0.2032" layer="51"/>
<wire x1="4.1" y1="-3.85" x2="-0.1" y2="-3.85" width="0.2032" layer="51"/>
<wire x1="-0.1" y1="-3.85" x2="-0.1" y2="3.85" width="0.2032" layer="21"/>
<wire x1="-0.1" y1="3.85" x2="4.1" y2="3.85" width="0.2032" layer="51"/>
<wire x1="4.1" y1="3.85" x2="4.1" y2="4.65" width="0.2032" layer="51"/>
<wire x1="-1.55" y1="4.65" x2="-0.1" y2="4.65" width="0.2032" layer="21"/>
<wire x1="-0.1" y1="-4.65" x2="-1.55" y2="-4.65" width="0.2032" layer="21"/>
<smd name="1" x="2.1154" y="0" dx="4.191" dy="1.778" layer="1"/>
<smd name="G@1" x="2.1154" y="3.4946" dx="4.191" dy="2.667" layer="1"/>
<smd name="G@2" x="2.1154" y="-3.4946" dx="4.191" dy="2.667" layer="1"/>
<smd name="G@4" x="2.1154" y="-3.4946" dx="4.191" dy="2.667" layer="16"/>
<smd name="G@3" x="2.1154" y="3.4946" dx="4.191" dy="2.667" layer="16"/>
<text x="0.635" y="6.35" size="1.778" layer="25">&gt;NAME</text>
<text x="1.27" y="-8.89" size="1.778" layer="27">&gt;VALUE</text>
<rectangle x1="-0.025" y1="-0.5" x2="4.05" y2="0.5" layer="51"/>
</package>
<package name="J502-ND-142-0711-871/876">
<description>&lt;b&gt;SMA 50 Ohm&lt;/b&gt; Board Thickness &lt;b&gt;0.047&lt;/b&gt; Inch, End Launch Jack Receptacle&lt;p&gt;
Johnson Components&lt;br&gt;
Source: www.johnsoncomponents.com .. J502-ND.pdf</description>
<wire x1="0" y1="5.588" x2="0" y2="-5.588" width="0" layer="20"/>
<wire x1="-1.55" y1="-4.65" x2="-1.55" y2="-2" width="0.2032" layer="21"/>
<wire x1="-1.55" y1="-2" x2="-3.7" y2="-2" width="0.2032" layer="21"/>
<wire x1="-3.7" y1="-2" x2="-4.45" y2="-2.75" width="0.2032" layer="21"/>
<wire x1="-4.45" y1="-2.75" x2="-8.25" y2="-2.75" width="0.2032" layer="21"/>
<wire x1="-8.25" y1="-2.75" x2="-8.25" y2="-1.9" width="0.2032" layer="21"/>
<wire x1="-8.25" y1="-1.9" x2="-9.425" y2="-1.9" width="0.2032" layer="21"/>
<wire x1="-9.425" y1="-1.9" x2="-9.425" y2="1.9" width="0.2032" layer="21"/>
<wire x1="-9.425" y1="1.9" x2="-8.25" y2="1.9" width="0.2032" layer="21"/>
<wire x1="-8.25" y1="1.9" x2="-8.25" y2="2.75" width="0.2032" layer="21"/>
<wire x1="-8.25" y1="2.75" x2="-4.45" y2="2.75" width="0.2032" layer="21"/>
<wire x1="-4.45" y1="2.75" x2="-3.7" y2="2" width="0.2032" layer="21"/>
<wire x1="-3.7" y1="2" x2="-1.55" y2="2" width="0.2032" layer="21"/>
<wire x1="-1.55" y1="2" x2="-1.55" y2="4.65" width="0.2032" layer="21"/>
<wire x1="-0.1" y1="-3.85" x2="-0.1" y2="3.85" width="0.2032" layer="21"/>
<wire x1="-1.55" y1="4.65" x2="-0.1" y2="4.65" width="0.2032" layer="21"/>
<wire x1="-0.1" y1="-4.65" x2="-1.55" y2="-4.65" width="0.2032" layer="21"/>
<wire x1="-1.55" y1="4.65" x2="4.65" y2="4.65" width="0.2032" layer="51"/>
<wire x1="4.65" y1="-4.65" x2="-1.55" y2="-4.65" width="0.2032" layer="51"/>
<wire x1="4.65" y1="-4.65" x2="4.65" y2="-3.85" width="0.2032" layer="51"/>
<wire x1="4.65" y1="-3.85" x2="-0.1" y2="-3.85" width="0.2032" layer="51"/>
<wire x1="-0.1" y1="3.85" x2="4.65" y2="3.85" width="0.2032" layer="51"/>
<wire x1="4.65" y1="3.85" x2="4.65" y2="4.65" width="0.2032" layer="51"/>
<smd name="1" x="2.5654" y="0" dx="5.08" dy="1.905" layer="1"/>
<smd name="G@1" x="2.5654" y="4.4196" dx="5.08" dy="2.286" layer="1"/>
<smd name="G@2" x="2.5654" y="-4.4196" dx="5.08" dy="2.286" layer="1"/>
<smd name="G@4" x="2.5654" y="-4.4196" dx="5.08" dy="2.286" layer="16"/>
<smd name="G@3" x="2.5654" y="4.4196" dx="5.08" dy="2.286" layer="16"/>
<text x="0.635" y="6.35" size="1.778" layer="25">&gt;NAME</text>
<text x="1.27" y="-8.89" size="1.778" layer="27">&gt;VALUE</text>
<rectangle x1="-0.025" y1="-0.5" x2="4.05" y2="0.5" layer="51"/>
</package>
<package name="J502-ND-142-0711-881/886">
<description>&lt;b&gt;SMA 50 Ohm&lt;/b&gt; Board Thickness &lt;b&gt;0.047&lt;/b&gt; Inch, End Launch Jack Receptacle&lt;p&gt;
Johnson Components&lt;br&gt;
Source: www.johnsoncomponents.com .. J502-ND.pdf</description>
<wire x1="0" y1="5.588" x2="0" y2="-5.588" width="0" layer="20"/>
<wire x1="-1.55" y1="-4.65" x2="-1.55" y2="-2" width="0.2032" layer="21"/>
<wire x1="-1.55" y1="-2" x2="-3.7" y2="-2" width="0.2032" layer="21"/>
<wire x1="-3.7" y1="-2" x2="-4.45" y2="-2.75" width="0.2032" layer="21"/>
<wire x1="-4.45" y1="-2.75" x2="-8.25" y2="-2.75" width="0.2032" layer="21"/>
<wire x1="-8.25" y1="-2.75" x2="-8.25" y2="-1.9" width="0.2032" layer="21"/>
<wire x1="-8.25" y1="-1.9" x2="-9.425" y2="-1.9" width="0.2032" layer="21"/>
<wire x1="-9.425" y1="-1.9" x2="-9.425" y2="1.9" width="0.2032" layer="21"/>
<wire x1="-9.425" y1="1.9" x2="-8.25" y2="1.9" width="0.2032" layer="21"/>
<wire x1="-8.25" y1="1.9" x2="-8.25" y2="2.75" width="0.2032" layer="21"/>
<wire x1="-8.25" y1="2.75" x2="-4.45" y2="2.75" width="0.2032" layer="21"/>
<wire x1="-4.45" y1="2.75" x2="-3.7" y2="2" width="0.2032" layer="21"/>
<wire x1="-3.7" y1="2" x2="-1.55" y2="2" width="0.2032" layer="21"/>
<wire x1="-1.55" y1="2" x2="-1.55" y2="4.65" width="0.2032" layer="21"/>
<wire x1="-0.1" y1="-3.85" x2="-0.1" y2="3.85" width="0.2032" layer="21"/>
<wire x1="-1.55" y1="4.65" x2="-0.1" y2="4.65" width="0.2032" layer="21"/>
<wire x1="-0.1" y1="-4.65" x2="-1.55" y2="-4.65" width="0.2032" layer="21"/>
<wire x1="-1.55" y1="4.65" x2="4.65" y2="4.65" width="0.2032" layer="51"/>
<wire x1="4.65" y1="-4.65" x2="-1.55" y2="-4.65" width="0.2032" layer="51"/>
<wire x1="4.65" y1="-4.65" x2="4.65" y2="-3.85" width="0.2032" layer="51"/>
<wire x1="4.65" y1="-3.85" x2="-0.1" y2="-3.85" width="0.2032" layer="51"/>
<wire x1="-0.1" y1="3.85" x2="4.65" y2="3.85" width="0.2032" layer="51"/>
<wire x1="4.65" y1="3.85" x2="4.65" y2="4.65" width="0.2032" layer="51"/>
<smd name="1" x="2.5654" y="0" dx="5.08" dy="1.905" layer="1"/>
<smd name="G@1" x="2.5654" y="4.4196" dx="5.08" dy="2.286" layer="1"/>
<smd name="G@2" x="2.5654" y="-4.4196" dx="5.08" dy="2.286" layer="1"/>
<smd name="G@4" x="2.5654" y="-4.4196" dx="5.08" dy="2.286" layer="16"/>
<smd name="G@3" x="2.5654" y="4.4196" dx="5.08" dy="2.286" layer="16"/>
<text x="0.635" y="6.35" size="1.778" layer="25">&gt;NAME</text>
<text x="1.27" y="-8.89" size="1.778" layer="27">&gt;VALUE</text>
<rectangle x1="-0.025" y1="-0.5" x2="4.05" y2="0.5" layer="51"/>
</package>
<package name="SMA-142-0701-871">
<description>&lt;b&gt;SMA Connector&lt;/b&gt; HF-Steckverbinder PC END BLKHD JCK GLD .062" BOARDS&lt;p&gt;
Hersteller: Emerson / Johnson&lt;br&gt;
Source: &lt;a href="http://emersonconnectivity.com/OA_MEDIA/drawings/dr-1420701871.pdf"&gt; Data sheet&lt;a&gt;</description>
<wire x1="-4.65" y1="4.65" x2="4.65" y2="4.65" width="0.2032" layer="21"/>
<wire x1="4.65" y1="4.65" x2="4.65" y2="-4.65" width="0.2032" layer="51"/>
<wire x1="4.65" y1="-4.65" x2="-4.65" y2="-4.65" width="0.2032" layer="51"/>
<wire x1="-4.65" y1="-4.65" x2="-4.65" y2="4.65" width="0.2032" layer="51"/>
<wire x1="-4.65" y1="1.7" x2="-4.65" y2="4.65" width="0.2032" layer="21"/>
<wire x1="4.65" y1="4.65" x2="4.65" y2="1.7" width="0.2032" layer="21"/>
<wire x1="2.745" y1="-4.65" x2="-2.745" y2="-4.65" width="0.2032" layer="21"/>
<circle x="0" y="0" radius="3.2378" width="0.2032" layer="51"/>
<circle x="0" y="0" radius="1.4199" width="0.2032" layer="21"/>
<pad name="1" x="0" y="0" drill="0.762" diameter="1.524"/>
<pad name="2@1" x="-4.2545" y="0" drill="1.524" diameter="2.54"/>
<pad name="2@2" x="4.2545" y="0" drill="1.524" diameter="2.54"/>
<pad name="2@3" x="-4.2545" y="-3.1496" drill="2.159" diameter="2.794"/>
<pad name="2@4" x="4.2545" y="-3.1496" drill="2.159" diameter="2.794"/>
<text x="-5.08" y="5.08" size="1.27" layer="25">&gt;NAME</text>
<text x="-5.08" y="-6.35" size="1.27" layer="27">&gt;VALUE</text>
<rectangle x1="-4.775" y1="-0.5" x2="-3.75" y2="0.5" layer="51"/>
<rectangle x1="-4.775" y1="-3.2432" x2="-3.75" y2="-2.2432" layer="51"/>
<rectangle x1="-4.775" y1="-4.0814" x2="-3.75" y2="-3.0814" layer="51"/>
<rectangle x1="3.75" y1="-0.5" x2="4.775" y2="0.5" layer="51" rot="R180"/>
<rectangle x1="3.75" y1="-3.2432" x2="4.775" y2="-2.2432" layer="51" rot="R180"/>
<rectangle x1="3.75" y1="-4.0814" x2="4.775" y2="-3.0814" layer="51" rot="R180"/>
</package>
</packages>
<symbols>
<symbol name="BNC-FGND">
<wire x1="0" y1="-2.54" x2="-0.762" y2="-1.778" width="0.254" layer="94"/>
<wire x1="0" y1="0" x2="-0.508" y2="0" width="0.1524" layer="94"/>
<wire x1="-2.54" y1="0.508" x2="-0.762" y2="0.508" width="0.254" layer="94"/>
<wire x1="-0.762" y1="0.508" x2="-0.508" y2="0" width="0.254" layer="94"/>
<wire x1="-0.508" y1="0" x2="-0.762" y2="-0.508" width="0.254" layer="94"/>
<wire x1="-0.762" y1="-0.508" x2="-2.54" y2="-0.508" width="0.254" layer="94"/>
<wire x1="-2.54" y1="2.54" x2="0" y2="0.508" width="0.3048" layer="94" curve="-79.611142" cap="flat"/>
<wire x1="-2.54" y1="-2.54" x2="0" y2="-0.508" width="0.3048" layer="94" curve="79.611142" cap="flat"/>
<text x="-2.54" y="-5.08" size="1.778" layer="96">&gt;VALUE</text>
<text x="-2.54" y="3.302" size="1.778" layer="95">&gt;NAME</text>
<pin name="1" x="2.54" y="0" visible="off" length="short" direction="pas" rot="R180"/>
<pin name="2" x="2.54" y="-2.54" visible="off" length="short" direction="pas" rot="R180"/>
</symbol>
</symbols>
<devicesets>
<deviceset name="SMA-" prefix="X">
<description>&lt;b&gt;SMA 50 Ohm&lt;/b&gt; End Launch Jack Receptacle - Round Contact&lt;p&gt;
Johnson Components&lt;br&gt;
Source: www.johnsoncomponents.com .. J502-ND.pdf</description>
<gates>
<gate name="G1" symbol="BNC-FGND" x="0" y="0"/>
</gates>
<devices>
<device name="J502-ND" package="J502-ND">
<connects>
<connect gate="G1" pin="1" pad="1"/>
<connect gate="G1" pin="2" pad="2 3 4 5"/>
</connects>
<technologies>
<technology name="">
<attribute name="MF" value="" constant="no"/>
<attribute name="MPN" value="" constant="no"/>
<attribute name="OC_FARNELL" value="unknown" constant="no"/>
<attribute name="OC_NEWARK" value="unknown" constant="no"/>
</technology>
</technologies>
</device>
<device name="142-0701-801/806" package="J502-ND-142-0701-801/806">
<connects>
<connect gate="G1" pin="1" pad="1"/>
<connect gate="G1" pin="2" pad="G@1 G@2 G@3 G@4"/>
</connects>
<technologies>
<technology name="">
<attribute name="MF" value="JOHNSON COMPONENTS" constant="no"/>
<attribute name="MPN" value="142-0701-801" constant="no"/>
<attribute name="OC_FARNELL" value="1608592" constant="no"/>
<attribute name="OC_NEWARK" value="90F2624" constant="no"/>
</technology>
</technologies>
</device>
<device name="142-0701-851/861" package="J502-ND-142-0701-851/861">
<connects>
<connect gate="G1" pin="1" pad="1"/>
<connect gate="G1" pin="2" pad="G@1 G@2 G@3 G@4"/>
</connects>
<technologies>
<technology name="">
<attribute name="MF" value="JOHNSON COMPONENTS" constant="no"/>
<attribute name="MPN" value="142-0701-851" constant="no"/>
<attribute name="OC_FARNELL" value="1019325" constant="no"/>
<attribute name="OC_NEWARK" value="99F6798" constant="no"/>
</technology>
</technologies>
</device>
<device name="142-0701-871/876" package="J502-ND-142-0701-871/876">
<connects>
<connect gate="G1" pin="1" pad="1"/>
<connect gate="G1" pin="2" pad="G@1 G@2 G@3 G@4"/>
</connects>
<technologies>
<technology name="">
<attribute name="MF" value="JOHNSON COMPONENTS" constant="no"/>
<attribute name="MPN" value="142-0701-871" constant="no"/>
<attribute name="OC_FARNELL" value="1339835" constant="no"/>
<attribute name="OC_NEWARK" value="91B6105" constant="no"/>
</technology>
</technologies>
</device>
<device name="142-0701-881/886" package="J502-ND-142-0701-881/886">
<connects>
<connect gate="G1" pin="1" pad="1"/>
<connect gate="G1" pin="2" pad="G@1 G@2 G@3 G@4"/>
</connects>
<technologies>
<technology name="">
<attribute name="MF" value="JOHNSON COMPONENTS" constant="no"/>
<attribute name="MPN" value="142-0701-881" constant="no"/>
<attribute name="OC_FARNELL" value="1608603" constant="no"/>
<attribute name="OC_NEWARK" value="08B906" constant="no"/>
</technology>
</technologies>
</device>
<device name="142-0711-821/826" package="J502-ND-142-0711-821/826">
<connects>
<connect gate="G1" pin="1" pad="1"/>
<connect gate="G1" pin="2" pad="G@1 G@2 G@3 G@4"/>
</connects>
<technologies>
<technology name="">
<attribute name="MF" value="JOHNSON COMPONENTS" constant="no"/>
<attribute name="MPN" value="142-0711-821" constant="no"/>
<attribute name="OC_FARNELL" value="1019328" constant="no"/>
<attribute name="OC_NEWARK" value="16F3627" constant="no"/>
</technology>
</technologies>
</device>
<device name="142-0711-871/876" package="J502-ND-142-0711-871/876">
<connects>
<connect gate="G1" pin="1" pad="1"/>
<connect gate="G1" pin="2" pad="G@1 G@2 G@3 G@4"/>
</connects>
<technologies>
<technology name="">
<attribute name="MF" value="JOHNSON COMPONENTS" constant="no"/>
<attribute name="MPN" value="142-0711-871" constant="no"/>
<attribute name="OC_FARNELL" value="unknown" constant="no"/>
<attribute name="OC_NEWARK" value="01C1639" constant="no"/>
</technology>
</technologies>
</device>
<device name="142-0711-881/886" package="J502-ND-142-0711-881/886">
<connects>
<connect gate="G1" pin="1" pad="1"/>
<connect gate="G1" pin="2" pad="G@1 G@2 G@3 G@4"/>
</connects>
<technologies>
<technology name="">
<attribute name="MF" value="JOHNSON COMPONENTS" constant="no"/>
<attribute name="MPN" value="142-0711-881" constant="no"/>
<attribute name="OC_FARNELL" value="unknown" constant="no"/>
<attribute name="OC_NEWARK" value="50B4464" constant="no"/>
</technology>
</technologies>
</device>
<device name="142-0701-871/880" package="SMA-142-0701-871">
<connects>
<connect gate="G1" pin="1" pad="1"/>
<connect gate="G1" pin="2" pad="2@1 2@2 2@3 2@4"/>
</connects>
<technologies>
<technology name="">
<attribute name="MF" value="JOHNSON COMPONENTS" constant="no"/>
<attribute name="MPN" value="142-0701-871" constant="no"/>
<attribute name="OC_FARNELL" value="1339835" constant="no"/>
<attribute name="OC_NEWARK" value="91B6105" constant="no"/>
</technology>
</technologies>
</device>
</devices>
</deviceset>
</devicesets>
</library>
<library name="supply2">
<description>&lt;b&gt;Supply Symbols&lt;/b&gt;&lt;p&gt;
GND, VCC, 0V, +5V, -5V, etc.&lt;p&gt;
Please keep in mind, that these devices are necessary for the
automatic wiring of the supply signals.&lt;p&gt;
The pin name defined in the symbol is identical to the net which is to be wired automatically.&lt;p&gt;
In this library the device names are the same as the pin names of the symbols, therefore the correct signal names appear next to the supply symbols in the schematic.&lt;p&gt;
&lt;author&gt;Created by librarian@cadsoft.de&lt;/author&gt;</description>
<packages>
</packages>
<symbols>
<symbol name="GND">
<wire x1="-1.27" y1="0" x2="1.27" y2="0" width="0.254" layer="94"/>
<wire x1="1.27" y1="0" x2="0" y2="-1.27" width="0.254" layer="94"/>
<wire x1="0" y1="-1.27" x2="-1.27" y2="0" width="0.254" layer="94"/>
<text x="-1.905" y="-3.175" size="1.778" layer="96">&gt;VALUE</text>
<pin name="GND" x="0" y="2.54" visible="off" length="short" direction="sup" rot="R270"/>
</symbol>
</symbols>
<devicesets>
<deviceset name="GND" prefix="SUPPLY">
<description>&lt;b&gt;SUPPLY SYMBOL&lt;/b&gt;</description>
<gates>
<gate name="GND" symbol="GND" x="0" y="0"/>
</gates>
<devices>
<device name="">
<technologies>
<technology name=""/>
</technologies>
</device>
</devices>
</deviceset>
</devicesets>
</library>
<library name="HolographyCustom">
<packages>
<package name="DZ943">
<smd name="8" x="0" y="2.6797" dx="0.762" dy="2.159" layer="1"/>
<smd name="7" x="1.27" y="2.6797" dx="0.762" dy="2.159" layer="1"/>
<smd name="6" x="2.54" y="2.6797" dx="0.762" dy="2.159" layer="1"/>
<smd name="9" x="-1.27" y="2.6797" dx="0.762" dy="2.159" layer="1"/>
<smd name="10" x="-2.54" y="2.6797" dx="0.762" dy="2.159" layer="1"/>
<smd name="1" x="-2.54" y="-2.6797" dx="0.762" dy="2.159" layer="1"/>
<smd name="2" x="-1.27" y="-2.6797" dx="0.762" dy="2.159" layer="1"/>
<smd name="3" x="0" y="-2.6797" dx="0.762" dy="2.159" layer="1"/>
<smd name="4" x="1.27" y="-2.6797" dx="0.762" dy="2.159" layer="1"/>
<smd name="5" x="2.54" y="-2.6797" dx="0.762" dy="2.159" layer="1"/>
<text x="6.35" y="-2.54" size="1.27" layer="27" font="vector" rot="R90">&gt;VALUE</text>
<text x="-5.08" y="-2.54" size="1.27" layer="25" font="vector" rot="R90">&gt;NAME</text>
<wire x1="-3.81" y1="2.54" x2="-3.81" y2="-1.905" width="0.127" layer="21"/>
<wire x1="-3.81" y1="-1.905" x2="-3.81" y2="-2.54" width="0.127" layer="21"/>
<wire x1="3.81" y1="2.54" x2="3.81" y2="-2.54" width="0.127" layer="21"/>
<wire x1="-3.81" y1="-2.54" x2="-3.175" y2="-2.54" width="0.127" layer="21"/>
<wire x1="-3.81" y1="2.54" x2="-3.175" y2="2.54" width="0.127" layer="21"/>
<wire x1="3.81" y1="2.54" x2="3.175" y2="2.54" width="0.127" layer="21"/>
<wire x1="3.81" y1="-2.54" x2="3.175" y2="-2.54" width="0.127" layer="21"/>
<wire x1="-3.175" y1="-2.54" x2="-3.81" y2="-1.905" width="0.127" layer="21"/>
</package>
</packages>
<symbols>
<symbol name="SCA-3-11">
<wire x1="-2.54" y1="-5.08" x2="2.54" y2="-5.08" width="0.254" layer="94"/>
<wire x1="2.54" y1="-5.08" x2="2.54" y2="-2.54" width="0.254" layer="94"/>
<wire x1="2.54" y1="-2.54" x2="2.54" y2="0" width="0.254" layer="94"/>
<wire x1="2.54" y1="0" x2="2.54" y2="2.54" width="0.254" layer="94"/>
<wire x1="2.54" y1="2.54" x2="2.54" y2="5.08" width="0.254" layer="94"/>
<wire x1="-2.54" y1="-5.08" x2="-2.54" y2="0" width="0.254" layer="94"/>
<wire x1="-2.54" y1="0" x2="-2.54" y2="5.08" width="0.254" layer="94"/>
<wire x1="-2.54" y1="5.08" x2="2.54" y2="5.08" width="0.254" layer="94"/>
<wire x1="-2.54" y1="0" x2="2.54" y2="-2.54" width="0.254" layer="94"/>
<wire x1="2.54" y1="0" x2="-2.54" y2="0" width="0.254" layer="94"/>
<wire x1="-2.54" y1="0" x2="2.54" y2="2.54" width="0.254" layer="94"/>
<text x="-2.54" y="6.35" size="1.778" layer="95">&gt;NAME</text>
<text x="-2.54" y="-7.62" size="1.778" layer="96">&gt;VALUE</text>
<pin name="SUMPORT" x="-7.62" y="0" visible="pad" length="middle"/>
<pin name="P3" x="7.62" y="-2.54" visible="pad" length="middle" rot="R180"/>
<pin name="P2" x="7.62" y="0" visible="pad" length="middle" rot="R180"/>
<pin name="P1" x="7.62" y="2.54" visible="pad" length="middle" rot="R180"/>
<pin name="GND" x="-7.62" y="-5.08" visible="pad" length="middle"/>
</symbol>
</symbols>
<devicesets>
<deviceset name="SCA-3-11" prefix="T">
<gates>
<gate name="G$1" symbol="SCA-3-11" x="0" y="0"/>
</gates>
<devices>
<device name="" package="DZ943">
<connects>
<connect gate="G$1" pin="GND" pad="1 2 4 5 7 9"/>
<connect gate="G$1" pin="P1" pad="6"/>
<connect gate="G$1" pin="P2" pad="8"/>
<connect gate="G$1" pin="P3" pad="10"/>
<connect gate="G$1" pin="SUMPORT" pad="3"/>
</connects>
<technologies>
<technology name=""/>
</technologies>
</device>
</devices>
</deviceset>
</devicesets>
</library>
</libraries>
<attributes>
</attributes>
<variantdefs>
</variantdefs>
<classes>
<class number="0" name="default" width="0" drill="0">
</class>
</classes>
<parts>
<part name="XIN" library="con-coax" deviceset="SMA-" device="142-0701-881/886" value="SMA-142-0701-881/886"/>
<part name="XO2" library="con-coax" deviceset="SMA-" device="142-0701-881/886" value="SMA-142-0701-881/886"/>
<part name="SUPPLY15" library="supply2" deviceset="GND" device=""/>
<part name="SUPPLY16" library="supply2" deviceset="GND" device=""/>
<part name="SUPPLY17" library="supply2" deviceset="GND" device=""/>
<part name="T1" library="HolographyCustom" deviceset="SCA-3-11" device=""/>
<part name="XO3" library="con-coax" deviceset="SMA-" device="142-0701-881/886" value="SMA-142-0701-881/886"/>
<part name="XO1" library="con-coax" deviceset="SMA-" device="142-0701-881/886" value="SMA-142-0701-881/886"/>
<part name="SUPPLY1" library="supply2" deviceset="GND" device=""/>
<part name="SUPPLY2" library="supply2" deviceset="GND" device=""/>
</parts>
<sheets>
<sheet>
<plain>
<text x="119.38" y="53.34" size="1.016" layer="97" align="top-left">Splitter Circuit Board
Copyright (C) 2016-2017 BYU ElectroHolography Research Group

This is free hardware: you can redistribute it and/or modify
it under the terms of the GNU General Public License as published by
the Free Software Foundation, either version 3 of the License, or
(at your option) any later version.

This design is distributed in the hope that it will be useful,
but WITHOUT ANY WARRANTY; without even the implied warranty of
MERCHANTABILITY or FITNESS FOR A PARTICULAR PURPOSE.  See the
GNU General Public License for more details.

You should have received a copy of the GNU General Public License
along with this design.  If not, see &lt;http://www.gnu.org/licenses/&gt;.

Contact: byuholography@gmail.com

Edited by:
Andrew Henrie
Jesse Codling</text>
<text x="121.92" y="109.22" size="1.016" layer="97" align="top-left">SCA-3-11 Datasheet:
https://www.minicircuits.com/pdfs/SCA-3-11.pdf</text>
</plain>
<instances>
<instance part="XIN" gate="G1" x="101.6" y="83.82"/>
<instance part="XO2" gate="G1" x="177.8" y="83.82" rot="MR0"/>
<instance part="SUPPLY15" gate="GND" x="104.14" y="78.74"/>
<instance part="SUPPLY16" gate="GND" x="175.26" y="78.74"/>
<instance part="SUPPLY17" gate="GND" x="129.54" y="76.2"/>
<instance part="T1" gate="G$1" x="137.16" y="83.82"/>
<instance part="XO3" gate="G1" x="177.8" y="96.52" rot="MR0"/>
<instance part="XO1" gate="G1" x="177.8" y="68.58" rot="MR0"/>
<instance part="SUPPLY1" gate="GND" x="175.26" y="63.5"/>
<instance part="SUPPLY2" gate="GND" x="175.26" y="91.44"/>
</instances>
<busses>
</busses>
<nets>
<net name="GND" class="0">
<segment>
<pinref part="XIN" gate="G1" pin="2"/>
<pinref part="SUPPLY15" gate="GND" pin="GND"/>
</segment>
<segment>
<pinref part="XO2" gate="G1" pin="2"/>
<pinref part="SUPPLY16" gate="GND" pin="GND"/>
</segment>
<segment>
<pinref part="T1" gate="G$1" pin="GND"/>
<pinref part="SUPPLY17" gate="GND" pin="GND"/>
</segment>
<segment>
<pinref part="XO1" gate="G1" pin="2"/>
<pinref part="SUPPLY1" gate="GND" pin="GND"/>
</segment>
<segment>
<pinref part="XO3" gate="G1" pin="2"/>
<pinref part="SUPPLY2" gate="GND" pin="GND"/>
</segment>
</net>
<net name="N$8" class="0">
<segment>
<pinref part="XIN" gate="G1" pin="1"/>
<wire x1="104.14" y1="83.82" x2="129.54" y2="83.82" width="0.1524" layer="91"/>
<pinref part="T1" gate="G$1" pin="SUMPORT"/>
</segment>
</net>
<net name="N$10" class="0">
<segment>
<pinref part="XO2" gate="G1" pin="1"/>
<wire x1="144.78" y1="83.82" x2="175.26" y2="83.82" width="0.1524" layer="91"/>
<pinref part="T1" gate="G$1" pin="P2"/>
</segment>
</net>
<net name="N$1" class="0">
<segment>
<pinref part="XO1" gate="G1" pin="1"/>
<wire x1="175.26" y1="68.58" x2="149.86" y2="68.58" width="0.1524" layer="91"/>
<wire x1="149.86" y1="68.58" x2="149.86" y2="81.28" width="0.1524" layer="91"/>
<pinref part="T1" gate="G$1" pin="P3"/>
<wire x1="149.86" y1="81.28" x2="144.78" y2="81.28" width="0.1524" layer="91"/>
</segment>
</net>
<net name="N$2" class="0">
<segment>
<pinref part="T1" gate="G$1" pin="P1"/>
<wire x1="144.78" y1="86.36" x2="149.86" y2="86.36" width="0.1524" layer="91"/>
<wire x1="149.86" y1="86.36" x2="149.86" y2="96.52" width="0.1524" layer="91"/>
<pinref part="XO3" gate="G1" pin="1"/>
<wire x1="149.86" y1="96.52" x2="175.26" y2="96.52" width="0.1524" layer="91"/>
</segment>
</net>
</nets>
</sheet>
</sheets>
</schematic>
</drawing>
<compatibility>
<note version="6.3" minversion="6.2.2" severity="warning">
Since Version 6.2.2 text objects can contain more than one line,
which will not be processed correctly with this version.
</note>
</compatibility>
</eagle>
