%
M48
M72
T01C0.0236
T02C0.0315
T03C0.0320
T04C0.0354
T05C0.0360
T06C0.0394
T07C0.0400
T08C0.0670
T09C0.0937
T10C0.1102
T11C0.1260
%
T01
X5701Y22067
X5751Y25667
X8651Y27867
X9901Y27417
X10451Y27767
X11751Y30067
X13751Y29267
X14726Y30392
X15851Y27867
X18051Y26167
X19251Y27967
X20251Y28967
X21551Y27667
X21651Y26167
X22551Y26167
X23051Y26167
X23751Y26567
X23701Y28167
X23751Y29417
X23751Y30217
X23501Y31217
X24551Y31017
X26551Y32317
X26576Y32892
X26126Y33267
X26301Y35017
X25351Y34867
X23301Y33617
X20801Y35767
X20751Y38167
X18951Y37917
X17901Y35367
X17901Y34867
X17901Y34367
X16151Y33867
X15551Y32767
X14901Y32767
X13951Y33567
X13051Y35367
X12751Y36467
X14301Y36117
X15451Y37917
X15951Y37917
X14601Y38717
X22051Y41267
X24151Y40067
X25451Y40067
X26451Y40517
X27251Y38817
X29401Y38767
X30851Y40617
X33651Y38667
X34351Y40367
X37351Y37267
X37101Y36517
X36751Y34817
X37501Y34817
X35951Y34017
X36151Y32817
X36401Y32017
X35351Y31417
X33251Y32617
X31851Y31717
X30451Y31717
X30451Y32417
X27651Y34817
X26601Y31567
X25326Y28992
X28601Y27067
X30326Y27992
X32826Y27992
X33826Y27992
X34901Y27467
X35101Y28017
X36851Y27767
X37451Y27767
X38051Y26517
X38751Y26367
X38051Y25517
X36701Y25542
X35951Y25267
X34676Y25867
X36701Y26517
X39051Y27717
X37151Y29167
X38101Y31117
X38801Y31117
X40751Y31117
X40851Y31917
X40551Y33917
X41026Y34692
X40501Y35717
X40501Y37667
X39001Y37417
X34451Y34017
X33851Y36467
X40901Y29567
X40451Y25567
X37451Y23467
X32826Y23492
X30326Y23392
X29426Y23392
X29426Y24592
X30326Y24592
X27326Y25492
X25151Y23367
X24651Y23367
X24126Y23317
X24051Y22817
X24001Y22317
X22426Y23842
X21776Y23842
X22151Y24967
X23926Y24567
X24351Y24067
X17451Y23667
X15351Y24867
X12851Y25842
X12351Y24567
X11201Y24767
X8651Y30267
X6851Y30267
X5751Y30067
T02
X28601Y25767
X29351Y25767
X30101Y25767
T03
X28001Y37317
X28001Y38317
X28001Y39317
X25551Y39317
X25551Y38317
X25551Y37317
T04
X11951Y37390
X11951Y38867
X11951Y40343
X11951Y34143
X11951Y32667
X11951Y31190
T05
X16851Y27567
X16851Y26567
X16851Y25567
X20951Y28667
X21951Y28667
X22951Y28667
X22951Y30167
X21951Y30167
X20951Y30167
X30251Y36067
X31251Y36067
X32251Y36067
X34651Y30667
X34651Y29667
X34651Y28667
X39601Y28667
X39601Y29667
X39601Y30667
T06
X39351Y38267
X38351Y38267
X37351Y38267
X36351Y38267
X35351Y38267
X35351Y39267
X36351Y39267
X37351Y39267
X38351Y39267
X39351Y39267
X15801Y23417
X14801Y23417
X13801Y23417
X13801Y22417
X14801Y22417
X15801Y22417
X12801Y22417
X12801Y23417
X11801Y23417
X10801Y23417
X9801Y23417
X8801Y23417
X7801Y23417
X6801Y23417
X6801Y22417
X7801Y22417
X8801Y22417
X9801Y22417
X10801Y22417
X11801Y22417
T07
X17851Y22267
X18851Y22267
X19851Y22267
X20851Y22267
X21851Y22267
X22851Y22267
X24851Y22267
X25851Y22267
X26851Y22267
X27851Y22267
X28851Y22267
X29851Y22267
X30851Y22267
X31851Y22267
X33851Y22267
X34851Y22267
X35851Y22267
X36851Y22267
X37851Y22267
X38851Y22267
X39851Y22267
X40851Y22267
X41851Y24267
X41851Y25267
X41851Y26267
X42851Y26267
X42851Y25267
X42851Y24267
X42851Y27267
X42851Y28267
X42851Y29267
X42851Y30267
X42851Y31267
X42851Y32267
X41851Y32267
X41851Y31267
X41851Y30267
X41851Y29267
X41851Y28267
X41851Y27267
X41851Y33267
X41851Y34267
X41851Y35267
X41851Y36267
X41851Y37267
X41851Y38267
X42851Y38267
X42851Y37267
X42851Y36267
X42851Y35267
X42851Y34267
X42851Y33267
X42851Y39267
X42851Y40267
X42851Y41267
X41851Y41267
X41851Y40267
X41851Y39267
X38851Y41267
X37851Y41267
X36851Y41267
X35851Y41267
X34851Y41267
X33851Y41267
X32851Y41267
X31851Y41267
X29851Y41267
X28851Y41267
X27851Y41267
X26851Y41267
X25851Y41267
X24851Y41267
X23851Y41267
X22851Y41267
X21251Y41267
X20251Y41267
X19251Y41267
X18251Y41267
X17251Y41267
X16251Y41267
X15251Y41267
X14251Y41267
X21951Y33467
X21951Y32467
X21951Y31467
X19851Y31967
X19851Y32967
X19351Y29667
X18351Y29667
X17351Y29667
X16351Y29667
X15351Y29667
X20351Y26567
X20351Y24567
X24731Y24982
X24731Y25967
X24731Y26951
X23451Y35367
X23451Y36367
X23451Y37367
X23451Y38367
X23451Y39367
T08
X21851Y34967
X20051Y34967
X17751Y31667
X14651Y27267
X11551Y27467
X30001Y37967
X30001Y39767
X32401Y39767
X32401Y37967
X35351Y34767
X32551Y34467
X30551Y34467
X30551Y29867
X32551Y29867
X35951Y26167
X33951Y25067
X35951Y23967
T09
X27351Y23998
X27351Y27935
T10
X10180Y30501
X10180Y34832
X10180Y36701
X10180Y41032
T11
X40351Y41267
X42851Y22267
M30
