EESchema Schematic File Version 2
LIBS:device
LIBS:transistors
LIBS:conn
LIBS:linear
LIBS:regul
LIBS:74xx
LIBS:cmos4000
LIBS:adc-dac
LIBS:memory
LIBS:xilinx
LIBS:special
LIBS:microcontrollers
LIBS:dsp
LIBS:microchip
LIBS:analog_switches
LIBS:motorola
LIBS:texas
LIBS:intel
LIBS:audio
LIBS:interface
LIBS:digital-audio
LIBS:philips
LIBS:display
LIBS:cypress
LIBS:siliconi
LIBS:opto
LIBS:atmel
LIBS:contrib
LIBS:valves
LIBS:FIN1108
LIBS:ERM8-RA
LIBS:4816P-1-101LF
LIBS:LSHM-130-02.5-F-DV-N (TDC_Inputs)
LIBS:T1M_10_xx_S_RA_TR_(IO__Power)
LIBS:tps78630kttt
LIBS:tps79533
LIBS:30310-5002hb
LIBS:640456-2
LIBS:wire_connector
LIBS:FTSH-108-02-xx-DV (JTAG)
LIBS:jumper
LIBS:power
LIBS:+4
LIBS:TDC_Mother-cache
EELAYER 27 0
EELAYER END
$Descr A3 16535 11693
encoding utf-8
Sheet 1 7
Title ""
Date "20 apr 2015"
Rev ""
Comp ""
Comment1 ""
Comment2 ""
Comment3 ""
Comment4 ""
$EndDescr
$Comp
L CONNECTER_TO_FLEXIBOARD J2
U 1 1 54419077
P 3100 3400
F 0 "J2" H 3750 -300 60  0000 C CNN
F 1 "ERM8-050-RA" H 3700 4700 50  0000 C CNN
F 2 "~" H 3100 3400 60  0000 C CNN
F 3 "~" H 3100 3400 60  0000 C CNN
F 4 "ERM8-050-RA" H 3100 3400 60  0001 C CNN "Field1"
F 5 "Samtec" H 3100 3400 60  0001 C CNN "Field2"
	1    3100 3400
	1    0    0    -1  
$EndComp
$Sheet
S 8100 4200 1450 300 
U 54603C99
F0 "LVDS_1" 50
F1 "LVDS_FIN1108_BOTTOM.sch" 50
F2 "ASDQ_N[7..0]" I L 8100 4400 60 
F3 "ASDQ_P[7..0]" I L 8100 4300 60 
F4 "LVDS_P[7..0]" I R 9550 4300 60 
F5 "LVDS_N[7..0]" I R 9550 4400 60 
$EndSheet
Entry Wire Line
	5450 2800 5350 2900
Entry Wire Line
	5450 3000 5350 3100
Entry Wire Line
	5450 3200 5350 3300
Entry Wire Line
	5450 3400 5350 3500
Entry Wire Line
	5450 3600 5350 3700
Entry Wire Line
	5450 3800 5350 3900
Entry Wire Line
	5450 4000 5350 4100
Entry Wire Line
	5450 4200 5350 4300
Entry Wire Line
	5500 2900 5400 3000
Entry Wire Line
	5500 3100 5400 3200
Entry Wire Line
	5500 3300 5400 3400
Entry Wire Line
	5500 3500 5400 3600
Entry Wire Line
	5500 3700 5400 3800
Entry Wire Line
	5500 3900 5400 4000
Entry Wire Line
	5500 4100 5400 4200
Entry Wire Line
	5500 4300 5400 4400
$Comp
L GND #PWR01
U 1 1 5455DC68
P 1400 7050
F 0 "#PWR01" H 1400 7050 30  0001 C CNN
F 1 "GND" H 1400 6980 30  0001 C CNN
F 2 "" H 1400 7050 60  0000 C CNN
F 3 "" H 1400 7050 60  0000 C CNN
	1    1400 7050
	1    0    0    -1  
$EndComp
Text Label 7700 3850 2    60   ~ 0
N1A[7..0]
Text Label 7700 3750 2    60   ~ 0
P1A[7..0]
Text Label 7700 6500 2    60   ~ 0
N2A[7..0]
Text Label 7700 6400 2    60   ~ 0
P2A[7..0]
Text Label 7700 4400 2    60   ~ 0
N1B[7..0]
Text Label 7700 4300 2    60   ~ 0
P1B[7..0]
Text Label 7700 7050 2    60   ~ 0
N2B[7..0]
Text Label 7700 6950 2    60   ~ 0
P2B[7..0]
$Comp
L TPS78630KTTT U1
U 1 1 545B1C94
P 5650 9300
F 0 "U1" H 6000 8800 60  0000 C CNN
F 1 "TPS78601KTTT" H 5650 9300 60  0000 C CNN
F 2 "" H 5650 9300 60  0000 C CNN
F 3 "" H 5650 9300 60  0000 C CNN
F 4 "296-14421-1-ND" H 5650 9300 60  0001 C CNN "Field1"
F 5 "Digi-Key" H 5650 9300 60  0001 C CNN "Field2"
	1    5650 9300
	1    0    0    -1  
$EndComp
Text Label 5800 2700 0    60   ~ 0
N2A[7..0]
Text Label 5950 2800 0    60   ~ 0
P2A[7..0]
Text Label 4900 2750 0    60   ~ 0
A2Shield
Text Label 4850 4550 0    60   ~ 0
A2Shield
Text Label 4850 6550 0    60   ~ 0
B2Shield
Text Label 4850 4750 0    60   ~ 0
B2Shield
Text Label 2600 6550 2    60   ~ 0
B1Shield
Text Label 2600 4750 2    60   ~ 0
B1Shield
Text Label 2600 2750 2    60   ~ 0
A1Shield
Text Label 2600 4550 2    60   ~ 0
A1Shield
Text Notes 5350 8850 0    60   ~ 0
4V Regulator\n1.5A Limit\n1.07A Out (estimated)
$Comp
L 30310-5002HB J5
U 1 1 545E3D65
P 13650 4650
F 0 "J5" H 13650 4350 60  0000 C CNN
F 1 "30310-5002HB" V 13650 4650 40  0000 C CNN
F 2 "~" H 13650 4650 60  0000 C CNN
F 3 "~" H 13650 4650 60  0000 C CNN
F 4 "3M15452-ND" H 13650 4650 60  0001 C CNN "Field1"
F 5 "Digi-Key" H 13650 4650 60  0001 C CNN "Field2"
	1    13650 4650
	1    0    0    -1  
$EndComp
$Comp
L TPS79533 U2
U 1 1 545E4761
P 9500 9300
F 0 "U2" H 9850 8800 60  0000 C CNN
F 1 "TPS79533" H 9500 9300 60  0000 C CNN
F 2 "~" H 9500 9300 60  0000 C CNN
F 3 "~" H 9500 9300 60  0000 C CNN
F 4 "296-27106-5-ND" H 9500 9300 60  0001 C CNN "Field1"
F 5 "Digi-Key" H 9500 9300 60  0001 C CNN "Field2"
	1    9500 9300
	1    0    0    -1  
$EndComp
Text Notes 9200 8850 0    60   ~ 0
3.3V Regulator\n0.5A Limit\n0.32A Out (estimated)
$Comp
L GND #PWR02
U 1 1 545EEBDB
P 5650 10350
F 0 "#PWR02" H 5650 10350 30  0001 C CNN
F 1 "GND" H 5650 10280 30  0001 C CNN
F 2 "" H 5650 10350 60  0000 C CNN
F 3 "" H 5650 10350 60  0000 C CNN
	1    5650 10350
	1    0    0    -1  
$EndComp
$Comp
L GND #PWR03
U 1 1 545EF15D
P 9500 10100
F 0 "#PWR03" H 9500 10100 30  0001 C CNN
F 1 "GND" H 9500 10030 30  0001 C CNN
F 2 "" H 9500 10100 60  0000 C CNN
F 3 "" H 9500 10100 60  0000 C CNN
	1    9500 10100
	1    0    0    -1  
$EndComp
Text Label 5200 2200 0    60   ~ 0
C5_P2
Text Label 5200 2300 0    60   ~ 0
C5_N2
Text Label 2250 2300 2    60   ~ 0
C5_N1
Text Label 2250 2200 2    60   ~ 0
C5_P1
Text Label 10400 4600 2    60   ~ 0
C5_P2
Text Label 10400 4700 2    60   ~ 0
C5_N2
Text Label 10400 2050 2    60   ~ 0
C5_N1
Text Label 10400 1950 2    60   ~ 0
C5_P1
Text Label 5200 7000 0    60   ~ 0
TMS
Text Label 5200 6900 0    60   ~ 0
TDO
Text Label 5200 6800 0    60   ~ 0
TDI
Text Label 10400 5200 2    60   ~ 0
TCK
Text Label 10400 5300 2    60   ~ 0
TMS
Text Label 9400 5800 2    60   ~ 0
TDO
$Comp
L GND #PWR04
U 1 1 545FF79F
P 4150 10350
F 0 "#PWR04" H 4150 10350 30  0001 C CNN
F 1 "GND" H 4150 10280 30  0001 C CNN
F 2 "" H 4150 10350 60  0000 C CNN
F 3 "" H 4150 10350 60  0000 C CNN
	1    4150 10350
	1    0    0    -1  
$EndComp
$Comp
L C C3
U 1 1 54600EA9
P 7800 9700
F 0 "C3" H 7800 9800 40  0000 L CNN
F 1 "2.2uF" H 7806 9615 40  0000 L CNN
F 2 "~" H 7838 9550 30  0000 C CNN
F 3 "~" H 7800 9700 60  0000 C CNN
F 4 "587-1263-1-ND" H 7800 9700 60  0001 C CNN "Field1"
F 5 "Digi-Key" H 7800 9700 60  0001 C CNN "Field2"
	1    7800 9700
	1    0    0    -1  
$EndComp
Text Notes 5400 10700 0    60   ~ 0
Vout=(1.2246v)*(1+R1/R2)\nRecommended: R2=30.1kohms   C1=15pF\nR1=((Vout/1.2246v)-1)*R2      R1=68.2k
$Comp
L R R6
U 1 1 54604E86
P 7000 9400
F 0 "R6" V 7080 9400 40  0000 C CNN
F 1 "68.1k" V 7007 9401 40  0000 C CNN
F 2 "~" V 6930 9400 30  0000 C CNN
F 3 "~" H 7000 9400 30  0000 C CNN
F 4 "RMCF0603FT68K1CT-ND" V 7000 9400 60  0001 C CNN "Field1"
F 5 "Digi-Key" V 7000 9400 60  0001 C CNN "Field2"
	1    7000 9400
	1    0    0    -1  
$EndComp
$Comp
L R R7
U 1 1 54604E93
P 7000 10000
F 0 "R7" V 7080 10000 40  0000 C CNN
F 1 "30.1k" V 7007 10001 40  0000 C CNN
F 2 "~" V 6930 10000 30  0000 C CNN
F 3 "~" H 7000 10000 30  0000 C CNN
F 4 "RHM30.1KCFCT-ND" V 7000 10000 60  0001 C CNN "Field1"
F 5 "Digi-Key" V 7000 10000 60  0001 C CNN "Field2"
	1    7000 10000
	1    0    0    -1  
$EndComp
$Comp
L GND #PWR05
U 1 1 54606342
P 7000 10350
F 0 "#PWR05" H 7000 10350 30  0001 C CNN
F 1 "GND" H 7000 10280 30  0001 C CNN
F 2 "" H 7000 10350 60  0000 C CNN
F 3 "" H 7000 10350 60  0000 C CNN
	1    7000 10350
	1    0    0    -1  
$EndComp
$Comp
L C C2
U 1 1 546095D3
P 7350 9400
F 0 "C2" H 7350 9500 40  0000 L CNN
F 1 "15pF" H 7356 9315 40  0000 L CNN
F 2 "~" H 7388 9250 30  0000 C CNN
F 3 "~" H 7350 9400 60  0000 C CNN
F 4 "445-11126-1-ND" H 7350 9400 60  0001 C CNN "Field1"
F 5 "Digi-Key" H 7350 9400 60  0001 C CNN "Field2"
	1    7350 9400
	1    0    0    -1  
$EndComp
$Comp
L GND #PWR06
U 1 1 5460D034
P 7800 10350
F 0 "#PWR06" H 7800 10350 30  0001 C CNN
F 1 "GND" H 7800 10280 30  0001 C CNN
F 2 "" H 7800 10350 60  0000 C CNN
F 3 "" H 7800 10350 60  0000 C CNN
	1    7800 10350
	1    0    0    -1  
$EndComp
$Comp
L C C1
U 1 1 5460F728
P 4150 9900
F 0 "C1" H 4150 10000 40  0000 L CNN
F 1 "2.2uF" H 4156 9815 40  0000 L CNN
F 2 "~" H 4188 9750 30  0000 C CNN
F 3 "~" H 4150 9900 60  0000 C CNN
F 4 "587-1263-1-ND" H 4150 9900 60  0001 C CNN "Field1"
F 5 "Digi-Key" H 4150 9900 60  0001 C CNN "Field2"
	1    4150 9900
	1    0    0    -1  
$EndComp
Text Notes 6750 9100 0    60   ~ 0
4.00V Out (calculated)
Text Label 4850 4400 0    60   ~ 0
N2A7
Text Label 4850 4000 0    60   ~ 0
N2A5
Text Label 4850 4200 0    60   ~ 0
N2A6
Text Label 4850 3800 0    60   ~ 0
N2A4
Text Label 4850 3600 0    60   ~ 0
N2A3
Text Label 4850 3400 0    60   ~ 0
N2A2
Text Label 4850 3200 0    60   ~ 0
N2A1
Text Label 4850 3000 0    60   ~ 0
N2A0
Text Label 5100 4300 0    60   ~ 0
P2A7
Text Label 5100 4100 0    60   ~ 0
P2A6
Text Label 5100 3900 0    60   ~ 0
P2A5
Text Label 5100 3700 0    60   ~ 0
P2A4
Text Label 5100 3500 0    60   ~ 0
P2A3
Text Label 5100 3300 0    60   ~ 0
P2A2
Text Label 5100 3100 0    60   ~ 0
P2A1
Text Label 5100 2900 0    60   ~ 0
P2A0
Entry Wire Line
	2000 2800 2100 2900
Entry Wire Line
	2000 3000 2100 3100
Entry Wire Line
	2000 3200 2100 3300
Entry Wire Line
	2000 3400 2100 3500
Entry Wire Line
	2000 3600 2100 3700
Entry Wire Line
	2000 3800 2100 3900
Entry Wire Line
	2000 4000 2100 4100
Entry Wire Line
	2000 4200 2100 4300
Entry Wire Line
	1950 2900 2050 3000
Entry Wire Line
	1950 3100 2050 3200
Entry Wire Line
	1950 3300 2050 3400
Entry Wire Line
	1950 3500 2050 3600
Entry Wire Line
	1950 3700 2050 3800
Entry Wire Line
	1950 3900 2050 4000
Entry Wire Line
	1950 4100 2050 4200
Entry Wire Line
	1950 4300 2050 4400
Text Label 1650 2700 2    60   ~ 0
N1A[7..0]
Text Label 1500 2800 2    60   ~ 0
P1A[7..0]
Text Label 2600 4400 2    60   ~ 0
N1A7
Text Label 2600 4000 2    60   ~ 0
N1A5
Text Label 2600 4200 2    60   ~ 0
N1A6
Text Label 2600 3800 2    60   ~ 0
N1A4
Text Label 2600 3600 2    60   ~ 0
N1A3
Text Label 2600 3400 2    60   ~ 0
N1A2
Text Label 2600 3200 2    60   ~ 0
N1A1
Text Label 2600 3000 2    60   ~ 0
N1A0
Text Label 2350 4300 2    60   ~ 0
P1A7
Text Label 2350 4100 2    60   ~ 0
P1A6
Text Label 2350 3900 2    60   ~ 0
P1A5
Text Label 2350 3700 2    60   ~ 0
P1A4
Text Label 2350 3500 2    60   ~ 0
P1A3
Text Label 2350 3300 2    60   ~ 0
P1A2
Text Label 2350 3100 2    60   ~ 0
P1A1
Text Label 2350 2900 2    60   ~ 0
P1A0
Entry Wire Line
	5450 4800 5350 4900
Entry Wire Line
	5450 5000 5350 5100
Entry Wire Line
	5450 5200 5350 5300
Entry Wire Line
	5450 5400 5350 5500
Entry Wire Line
	5450 5600 5350 5700
Entry Wire Line
	5450 5800 5350 5900
Entry Wire Line
	5450 6000 5350 6100
Entry Wire Line
	5450 6200 5350 6300
Entry Wire Line
	5500 4900 5400 5000
Entry Wire Line
	5500 5100 5400 5200
Entry Wire Line
	5500 5300 5400 5400
Entry Wire Line
	5500 5500 5400 5600
Entry Wire Line
	5500 5700 5400 5800
Entry Wire Line
	5500 5900 5400 6000
Entry Wire Line
	5500 6100 5400 6200
Entry Wire Line
	5500 6300 5400 6400
Text Label 5800 4700 0    60   ~ 0
N2B[7..0]
Text Label 5950 4800 0    60   ~ 0
P2B[7..0]
Text Label 4850 6400 0    60   ~ 0
N2B7
Text Label 4850 6000 0    60   ~ 0
N2B5
Text Label 4850 6200 0    60   ~ 0
N2B6
Text Label 4850 5800 0    60   ~ 0
N2B4
Text Label 4850 5600 0    60   ~ 0
N2B3
Text Label 4850 5400 0    60   ~ 0
N2B2
Text Label 4850 5200 0    60   ~ 0
N2B1
Text Label 4850 5000 0    60   ~ 0
N2B0
Text Label 5100 6300 0    60   ~ 0
P2B7
Text Label 5100 6100 0    60   ~ 0
P2B6
Text Label 5100 5900 0    60   ~ 0
P2B5
Text Label 5100 5700 0    60   ~ 0
P2B4
Text Label 5100 5500 0    60   ~ 0
P2B3
Text Label 5100 5300 0    60   ~ 0
P2B2
Text Label 5100 5100 0    60   ~ 0
P2B1
Text Label 5100 4900 0    60   ~ 0
P2B0
Entry Wire Line
	2000 4800 2100 4900
Entry Wire Line
	2000 5000 2100 5100
Entry Wire Line
	2000 5200 2100 5300
Entry Wire Line
	2000 5400 2100 5500
Entry Wire Line
	2000 5600 2100 5700
Entry Wire Line
	2000 5800 2100 5900
Entry Wire Line
	2000 6000 2100 6100
Entry Wire Line
	2000 6200 2100 6300
Entry Wire Line
	1950 4900 2050 5000
Entry Wire Line
	1950 5100 2050 5200
Entry Wire Line
	1950 5300 2050 5400
Entry Wire Line
	1950 5500 2050 5600
Entry Wire Line
	1950 5700 2050 5800
Entry Wire Line
	1950 5900 2050 6000
Entry Wire Line
	1950 6100 2050 6200
Entry Wire Line
	1950 6300 2050 6400
Text Label 1650 4700 2    60   ~ 0
N1B[7..0]
Text Label 1500 4800 2    60   ~ 0
P1B[7..0]
Text Label 2600 6400 2    60   ~ 0
N1B7
Text Label 2600 6000 2    60   ~ 0
N1B5
Text Label 2600 6200 2    60   ~ 0
N1B6
Text Label 2600 5800 2    60   ~ 0
N1B4
Text Label 2600 5600 2    60   ~ 0
N1B3
Text Label 2600 5400 2    60   ~ 0
N1B2
Text Label 2600 5200 2    60   ~ 0
N1B1
Text Label 2600 5000 2    60   ~ 0
N1B0
Text Label 2350 6300 2    60   ~ 0
P1B7
Text Label 2350 6100 2    60   ~ 0
P1B6
Text Label 2350 5900 2    60   ~ 0
P1B5
Text Label 2350 5700 2    60   ~ 0
P1B4
Text Label 2350 5500 2    60   ~ 0
P1B3
Text Label 2350 5300 2    60   ~ 0
P1B2
Text Label 2350 5100 2    60   ~ 0
P1B1
Text Label 2350 4900 2    60   ~ 0
P1B0
$Sheet
S 8100 3650 1450 300 
U 546352F5
F0 "LVDS_2" 50
F1 "LVDS_FIN1108_BOTTOM.sch" 50
F2 "ASDQ_N[7..0]" I L 8100 3850 60 
F3 "ASDQ_P[7..0]" I L 8100 3750 60 
F4 "LVDS_P[7..0]" I R 9550 3750 60 
F5 "LVDS_N[7..0]" I R 9550 3850 60 
$EndSheet
$Sheet
S 8100 6300 1450 300 
U 546358D0
F0 "LVDS_3" 50
F1 "LVDS_FIN1108_TOP.sch" 50
F2 "ASDQ_N[7..0]" I L 8100 6500 60 
F3 "ASDQ_P[7..0]" I L 8100 6400 60 
F4 "LVDS_P[7..0]" I R 9550 6400 60 
F5 "LVDS_N[7..0]" I R 9550 6500 60 
$EndSheet
$Comp
L C C6
U 1 1 54649B13
P 10650 9750
F 0 "C6" H 10650 9850 40  0000 L CNN
F 1 "1uF" H 10656 9665 40  0000 L CNN
F 2 "~" H 10688 9600 30  0000 C CNN
F 3 "~" H 10650 9750 60  0000 C CNN
F 4 "587-1242-1-ND" H 10650 9750 60  0001 C CNN "Field1"
F 5 "Digi-Key" H 10650 9750 60  0001 C CNN "Field2"
	1    10650 9750
	1    0    0    -1  
$EndComp
$Comp
L GND #PWR07
U 1 1 54649B19
P 10650 10100
F 0 "#PWR07" H 10650 10100 30  0001 C CNN
F 1 "GND" H 10650 10030 30  0001 C CNN
F 2 "" H 10650 10100 60  0000 C CNN
F 3 "" H 10650 10100 60  0000 C CNN
	1    10650 10100
	1    0    0    -1  
$EndComp
$Comp
L C C5
U 1 1 54649FF0
P 10300 9750
F 0 "C5" H 10300 9850 40  0000 L CNN
F 1 ".01uF" H 10306 9665 40  0000 L CNN
F 2 "~" H 10338 9600 30  0000 C CNN
F 3 "~" H 10300 9750 60  0000 C CNN
F 4 "399-1091-1-ND" H 10300 9750 60  0001 C CNN "Field1"
F 5 "Digi-Key" H 10300 9750 60  0001 C CNN "Field2"
	1    10300 9750
	1    0    0    -1  
$EndComp
$Comp
L GND #PWR08
U 1 1 5464A777
P 10300 10100
F 0 "#PWR08" H 10300 10100 30  0001 C CNN
F 1 "GND" H 10300 10030 30  0001 C CNN
F 2 "" H 10300 10100 60  0000 C CNN
F 3 "" H 10300 10100 60  0000 C CNN
	1    10300 10100
	1    0    0    -1  
$EndComp
$Comp
L C C4
U 1 1 5464C946
P 8400 9750
F 0 "C4" H 8400 9850 40  0000 L CNN
F 1 "1uF" H 8406 9665 40  0000 L CNN
F 2 "~" H 8438 9600 30  0000 C CNN
F 3 "~" H 8400 9750 60  0000 C CNN
F 4 "587-1242-1-ND" H 8400 9750 60  0001 C CNN "Field1"
F 5 "Digi-Key" H 8400 9750 60  0001 C CNN "Field2"
	1    8400 9750
	1    0    0    -1  
$EndComp
$Comp
L GND #PWR09
U 1 1 5464D7AB
P 8400 10100
F 0 "#PWR09" H 8400 10100 30  0001 C CNN
F 1 "GND" H 8400 10030 30  0001 C CNN
F 2 "" H 8400 10100 60  0000 C CNN
F 3 "" H 8400 10100 60  0000 C CNN
	1    8400 10100
	1    0    0    -1  
$EndComp
Text Notes 10200 9250 0    60   ~ 0
3.3v Vout
$Comp
L +3.3V #PWR010
U 1 1 54651080
P 10650 9050
F 0 "#PWR010" H 10650 9010 30  0001 C CNN
F 1 "+3.3V" H 10650 9160 30  0000 C CNN
F 2 "" H 10650 9050 60  0000 C CNN
F 3 "" H 10650 9050 60  0000 C CNN
	1    10650 9050
	1    0    0    -1  
$EndComp
Text Notes 3300 2000 0    60   ~ 0
Orientation on file
Text Label 9400 2550 2    60   ~ 0
TDI
Text Label 10400 2650 2    60   ~ 0
TMS
Text Label 10400 2550 2    60   ~ 0
TCK
Text Label 9400 3150 2    60   ~ 0
TD_Daisy
Text Notes 13550 4400 0    60   ~ 0
JTAG\n
Text Label 5200 2400 0    60   ~ 0
TDC_Out_P2
Text Label 5200 2500 0    60   ~ 0
TDC_Out_N2
Text Label 2250 2500 2    60   ~ 0
TDC_Out_N1
Text Label 2250 2400 2    60   ~ 0
TDC_Out_P1
Text Label 10400 4800 2    60   ~ 0
TDC_Out_P2
Text Label 10400 4900 2    60   ~ 0
TDC_Out_N2
Text Label 10400 2250 2    60   ~ 0
TDC_Out_N1
Text Label 10400 2150 2    60   ~ 0
TDC_Out_P1
Text Label 5200 6700 0    60   ~ 0
TCK
$Comp
L 30310-5002HB J3
U 1 1 545F10AC
P 12900 3150
F 0 "J3" H 12900 2850 60  0000 C CNN
F 1 "30310-5002HB" V 12900 3150 40  0000 C CNN
F 2 "~" H 12900 3150 60  0000 C CNN
F 3 "~" H 12900 3150 60  0000 C CNN
F 4 "3M15452-ND" H 12900 3150 60  0001 C CNN "Field1"
F 5 "Digi-Key" H 12900 3150 60  0001 C CNN "Field2"
	1    12900 3150
	1    0    0    -1  
$EndComp
Text Notes 12850 2900 0    60   ~ 0
AS
Text Label 12700 4450 2    60   ~ 0
TCK
Text Label 12700 4650 2    60   ~ 0
TMS
Text Label 12700 4550 2    60   ~ 0
TDO
NoConn ~ 13250 4750
$Comp
L GND #PWR011
U 1 1 545F5546
P 14600 4500
F 0 "#PWR011" H 14600 4500 30  0001 C CNN
F 1 "GND" H 14600 4430 30  0001 C CNN
F 2 "" H 14600 4500 60  0000 C CNN
F 3 "" H 14600 4500 60  0000 C CNN
	1    14600 4500
	1    0    0    -1  
$EndComp
NoConn ~ 14050 4750
$Comp
L GND #PWR012
U 1 1 545F5D3A
P 14600 4900
F 0 "#PWR012" H 14600 4900 30  0001 C CNN
F 1 "GND" H 14600 4830 30  0001 C CNN
F 2 "" H 14600 4900 60  0000 C CNN
F 3 "" H 14600 4900 60  0000 C CNN
	1    14600 4900
	1    0    0    -1  
$EndComp
Text Label 12700 4850 2    60   ~ 0
TDI
Text Label 9400 5200 2    60   ~ 0
TD_Daisy
NoConn ~ 14050 4650
Text Label 10400 2450 2    60   ~ 0
VccA
Text Label 14200 4550 0    60   ~ 0
Vcca
$Comp
L GND #PWR013
U 1 1 5461A01C
P 13300 3400
F 0 "#PWR013" H 13300 3400 30  0001 C CNN
F 1 "GND" H 13300 3330 30  0001 C CNN
F 2 "" H 13300 3400 60  0000 C CNN
F 3 "" H 13300 3400 60  0000 C CNN
	1    13300 3400
	1    0    0    -1  
$EndComp
$Comp
L GND #PWR014
U 1 1 5461BBFE
P 13700 3750
F 0 "#PWR014" H 13700 3750 30  0001 C CNN
F 1 "GND" H 13700 3680 30  0001 C CNN
F 2 "" H 13700 3750 60  0000 C CNN
F 3 "" H 13700 3750 60  0000 C CNN
	1    13700 3750
	1    0    0    -1  
$EndComp
Text Label 10400 5100 2    60   ~ 0
VccA
$Sheet
S 10950 4500 900  2500
U 5461E2FD
F0 "TDC_2" 50
F1 "TDC_1.sch" 50
F2 "DCLK" I R 11850 5600 60 
F3 "CONF_DONE" I R 11850 5700 60 
F4 "nCONFIG" I R 11850 5800 60 
F5 "TCK" I L 10950 5200 60 
F6 "TDO" I L 10950 5500 60 
F7 "TMS" I L 10950 5300 60 
F8 "TDI" I L 10950 5400 60 
F9 "DATA0" I R 11850 5900 60 
F10 "ASD" I R 11850 6000 60 
F11 "nCS" I R 11850 6150 60 
F12 "VccA" I L 10950 5100 60 
F13 "C5_In+" I L 10950 4600 60 
F14 "C5_In-" I L 10950 4700 60 
F15 "TDC_Out-" I L 10950 4900 60 
F16 "TDC_Out+" I L 10950 4800 60 
F17 "+3.3v" I R 11850 6350 60 
F18 "TDC_In_A_N[7..0]" I L 10950 6650 60 
F19 "TDC_In_A_P[7..0]" I L 10950 6550 60 
F20 "TDC_In_B_N[7..0]" I L 10950 6900 60 
F21 "TDC_In_B_P[7..0]" I L 10950 6800 60 
F22 "nCE" I R 11850 6250 60 
F23 "BOARD_ID0" I L 10950 6150 60 
F24 "SCL" I L 10950 5700 60 
F25 "SDA" I L 10950 5800 60 
F26 "BOARD_ID1" I L 10950 6050 60 
$EndSheet
$Comp
L 30310-5002HB J4
U 1 1 5461EC3D
P 12900 5800
F 0 "J4" H 12900 5500 60  0000 C CNN
F 1 "30310-5002HB" V 12900 5800 40  0000 C CNN
F 2 "~" H 12900 5800 60  0000 C CNN
F 3 "~" H 12900 5800 60  0000 C CNN
F 4 "3M15452-ND" H 12900 5800 60  0001 C CNN "Field1"
F 5 "Digi-Key" H 12900 5800 60  0001 C CNN "Field2"
	1    12900 5800
	1    0    0    -1  
$EndComp
Text Notes 12850 5550 0    60   ~ 0
AS
$Comp
L GND #PWR015
U 1 1 5461EC54
P 13300 6050
F 0 "#PWR015" H 13300 6050 30  0001 C CNN
F 1 "GND" H 13300 5980 30  0001 C CNN
F 2 "" H 13300 6050 60  0000 C CNN
F 3 "" H 13300 6050 60  0000 C CNN
	1    13300 6050
	1    0    0    -1  
$EndComp
$Comp
L GND #PWR016
U 1 1 5461EC65
P 13700 6400
F 0 "#PWR016" H 13700 6400 30  0001 C CNN
F 1 "GND" H 13700 6330 30  0001 C CNN
F 2 "" H 13700 6400 60  0000 C CNN
F 3 "" H 13700 6400 60  0000 C CNN
	1    13700 6400
	1    0    0    -1  
$EndComp
$Comp
L JUMPER JP2
U 1 1 54620B76
P 9850 5500
F 0 "JP2" H 9850 5650 60  0000 C CNN
F 1 "JUMPER" H 9850 5420 40  0000 C CNN
F 2 "~" H 9850 5500 60  0000 C CNN
F 3 "~" H 9850 5500 60  0000 C CNN
F 4 "A105225-ND" H 9850 5500 60  0001 C CNN "Field1"
F 5 "Digi-Key" H 9850 5500 60  0001 C CNN "Field2"
	1    9850 5500
	0    -1   -1   0   
$EndComp
$Comp
L JUMPER JP1
U 1 1 54620FA1
P 9850 2850
F 0 "JP1" H 9850 3000 60  0000 C CNN
F 1 "JUMPER" H 9850 2770 40  0000 C CNN
F 2 "~" H 9850 2850 60  0000 C CNN
F 3 "~" H 9850 2850 60  0000 C CNN
F 4 "A105225-ND" H 9850 2850 60  0001 C CNN "Field1"
F 5 "Digi-Key" H 9850 2850 60  0001 C CNN "Field2"
	1    9850 2850
	0    -1   -1   0   
$EndComp
$Comp
L PWR_FLAG #FLG017
U 1 1 5462D59F
P 1600 6950
F 0 "#FLG017" H 1600 7045 30  0001 C CNN
F 1 "PWR_FLAG" H 1600 7130 30  0000 C CNN
F 2 "" H 1600 6950 60  0000 C CNN
F 3 "" H 1600 6950 60  0000 C CNN
	1    1600 6950
	1    0    0    -1  
$EndComp
$Comp
L PWR_FLAG #FLG018
U 1 1 5462D5C0
P 1600 6650
F 0 "#FLG018" H 1600 6745 30  0001 C CNN
F 1 "PWR_FLAG" H 1600 6830 30  0000 C CNN
F 2 "" H 1600 6650 60  0000 C CNN
F 3 "" H 1600 6650 60  0000 C CNN
	1    1600 6650
	1    0    0    -1  
$EndComp
$Comp
L +5V #PWR019
U 1 1 5462E0BA
P 1400 6650
F 0 "#PWR019" H 1400 6740 20  0001 C CNN
F 1 "+5V" H 1400 6740 30  0000 C CNN
F 2 "" H 1400 6650 60  0000 C CNN
F 3 "" H 1400 6650 60  0000 C CNN
	1    1400 6650
	1    0    0    -1  
$EndComp
$Comp
L +5V #PWR020
U 1 1 5462F996
P 4150 9400
F 0 "#PWR020" H 4150 9490 20  0001 C CNN
F 1 "+5V" H 4150 9490 30  0000 C CNN
F 2 "" H 4150 9400 60  0000 C CNN
F 3 "" H 4150 9400 60  0000 C CNN
	1    4150 9400
	1    0    0    -1  
$EndComp
Text Notes 7700 8700 0    200  ~ 40
Power
Text Notes 2150 1750 0    200  ~ 40
To Feedthrough Board
Text Notes 10500 1650 0    200  ~ 40
TDC Boards\n
Text Notes 8000 3500 0    200  ~ 40
LVDS chips\n
Text Notes 12550 2700 0    200  ~ 40
JTAG & AS Conns\n\n\n
Text Label 6300 3250 0    60   ~ 0
A2Shield
Text Label 5800 3250 0    60   ~ 0
B2Shield
Text Label 1650 3250 2    60   ~ 0
B1Shield
Text Label 1150 3250 2    60   ~ 0
A1Shield
$Comp
L R R4
U 1 1 54645973
P 5800 3600
F 0 "R4" V 5880 3600 50  0000 C CNN
F 1 "1k" V 5800 3600 50  0000 C CNN
F 2 "" H 5800 3600 60  0000 C CNN
F 3 "" H 5800 3600 60  0000 C CNN
F 4 "RHM1.00KCFCT-ND" V 5800 3600 60  0001 C CNN "Field1"
F 5 "Digi-Key" V 5800 3600 60  0001 C CNN "Field2"
	1    5800 3600
	1    0    0    -1  
$EndComp
$Comp
L GND #PWR021
U 1 1 546462AC
P 5800 3950
F 0 "#PWR021" H 5800 3950 30  0001 C CNN
F 1 "GND" H 5800 3880 30  0001 C CNN
F 2 "" H 5800 3950 60  0000 C CNN
F 3 "" H 5800 3950 60  0000 C CNN
	1    5800 3950
	1    0    0    -1  
$EndComp
$Comp
L R R5
U 1 1 546466CD
P 6300 3600
F 0 "R5" V 6380 3600 50  0000 C CNN
F 1 "1k" V 6300 3600 50  0000 C CNN
F 2 "" H 6300 3600 60  0000 C CNN
F 3 "" H 6300 3600 60  0000 C CNN
F 4 "RHM1.00KCFCT-ND" V 6300 3600 60  0001 C CNN "Field1"
F 5 "Digi-Key" V 6300 3600 60  0001 C CNN "Field2"
	1    6300 3600
	1    0    0    -1  
$EndComp
$Comp
L GND #PWR022
U 1 1 546466D5
P 6300 3950
F 0 "#PWR022" H 6300 3950 30  0001 C CNN
F 1 "GND" H 6300 3880 30  0001 C CNN
F 2 "" H 6300 3950 60  0000 C CNN
F 3 "" H 6300 3950 60  0000 C CNN
	1    6300 3950
	1    0    0    -1  
$EndComp
$Comp
L R R1
U 1 1 546477F7
P 1150 3600
F 0 "R1" V 1050 3600 50  0000 C CNN
F 1 "1k" V 1150 3600 50  0000 C CNN
F 2 "" H 1150 3600 60  0000 C CNN
F 3 "" H 1150 3600 60  0000 C CNN
F 4 "RHM1.00KCFCT-ND" V 1150 3600 60  0001 C CNN "Field1"
F 5 "Digi-Key" V 1150 3600 60  0001 C CNN "Field2"
	1    1150 3600
	1    0    0    -1  
$EndComp
$Comp
L GND #PWR023
U 1 1 546477FF
P 1150 3950
F 0 "#PWR023" H 1150 3950 30  0001 C CNN
F 1 "GND" H 1150 3880 30  0001 C CNN
F 2 "" H 1150 3950 60  0000 C CNN
F 3 "" H 1150 3950 60  0000 C CNN
	1    1150 3950
	1    0    0    -1  
$EndComp
$Comp
L R R2
U 1 1 54647805
P 1650 3600
F 0 "R2" V 1550 3600 50  0000 C CNN
F 1 "1k" V 1650 3600 50  0000 C CNN
F 2 "" H 1650 3600 60  0000 C CNN
F 3 "" H 1650 3600 60  0000 C CNN
F 4 "RHM1.00KCFCT-ND" V 1650 3600 60  0001 C CNN "Field1"
F 5 "Digi-Key" V 1650 3600 60  0001 C CNN "Field2"
	1    1650 3600
	1    0    0    -1  
$EndComp
$Comp
L GND #PWR024
U 1 1 5464780D
P 1650 3950
F 0 "#PWR024" H 1650 3950 30  0001 C CNN
F 1 "GND" H 1650 3880 30  0001 C CNN
F 2 "" H 1650 3950 60  0000 C CNN
F 3 "" H 1650 3950 60  0000 C CNN
	1    1650 3950
	1    0    0    -1  
$EndComp
$Comp
L R R3
U 1 1 54650360
P 4800 8850
F 0 "R3" V 4880 8850 50  0000 C CNN
F 1 "4.7k" V 4800 8850 50  0000 C CNN
F 2 "" H 4800 8850 60  0000 C CNN
F 3 "" H 4800 8850 60  0000 C CNN
F 4 "1276-3502-1-ND" V 4800 8850 60  0001 C CNN "Field1"
F 5 "Digi-Key" V 4800 8850 60  0001 C CNN "Field2"
	1    4800 8850
	1    0    0    -1  
$EndComp
$Comp
L +5V #PWR025
U 1 1 5465036F
P 4800 8550
F 0 "#PWR025" H 4800 8640 20  0001 C CNN
F 1 "+5V" H 4800 8640 30  0000 C CNN
F 2 "" H 4800 8550 60  0000 C CNN
F 3 "" H 4800 8550 60  0000 C CNN
	1    4800 8550
	1    0    0    -1  
$EndComp
$Comp
L 640456-2 J1
U 1 1 54662F71
P 850 7000
F 0 "J1" H 850 7300 60  0000 C CNN
F 1 "640456-2" H 850 7000 40  0000 C CNN
F 2 "~" H 850 7000 60  0000 C CNN
F 3 "~" H 850 7000 60  0000 C CNN
F 4 "A1921-ND" H 850 7000 60  0001 C CNN "Field1"
F 5 "Digi-Key" H 850 7000 60  0001 C CNN "Field2"
	1    850  7000
	1    0    0    -1  
$EndComp
$Sheet
S 8100 6850 1450 300 
U 54635FFB
F0 "LVDS_4" 50
F1 "LVDS_FIN1108_TOP.sch" 50
F2 "ASDQ_N[7..0]" I L 8100 7050 60 
F3 "ASDQ_P[7..0]" I L 8100 6950 60 
F4 "LVDS_P[7..0]" I R 9550 6950 60 
F5 "LVDS_N[7..0]" I R 9550 7050 60 
$EndSheet
Text Label 1750 2600 0    60   ~ 0
I2C_CLK
Wire Bus Line
	5450 2700 5450 4200
Wire Bus Line
	5450 2700 5800 2700
Wire Bus Line
	5500 2800 5500 4300
Wire Bus Line
	5500 2800 5950 2800
Wire Wire Line
	4750 2900 5350 2900
Wire Wire Line
	4750 3100 5350 3100
Wire Wire Line
	4750 3300 5350 3300
Wire Wire Line
	4750 3700 5350 3700
Wire Wire Line
	4750 3900 5350 3900
Wire Wire Line
	4750 4100 5350 4100
Wire Wire Line
	4750 4300 5350 4300
Wire Wire Line
	4750 3000 5400 3000
Wire Wire Line
	4750 3200 5400 3200
Wire Wire Line
	4750 3400 5400 3400
Wire Wire Line
	4750 3600 5400 3600
Wire Wire Line
	4750 3800 5400 3800
Wire Wire Line
	4750 4000 5400 4000
Wire Wire Line
	4750 4200 5400 4200
Wire Wire Line
	4750 4400 5400 4400
Wire Wire Line
	2450 6800 2700 6800
Wire Wire Line
	2450 7100 2700 7100
Connection ~ 2450 7000
Wire Wire Line
	4750 2700 4800 2700
Wire Wire Line
	4800 2700 4800 2800
Wire Wire Line
	4800 2800 4750 2800
Wire Wire Line
	4800 2750 4900 2750
Connection ~ 4800 2750
Wire Bus Line
	8100 4400 7700 4400
Wire Wire Line
	4750 4500 4800 4500
Wire Wire Line
	4800 4500 4800 4600
Wire Wire Line
	4800 4600 4750 4600
Wire Wire Line
	4800 4550 4850 4550
Connection ~ 4800 4550
Wire Wire Line
	2700 4500 2650 4500
Wire Wire Line
	2650 4500 2650 4600
Wire Wire Line
	2650 4600 2700 4600
Wire Wire Line
	2650 4550 2600 4550
Connection ~ 2650 4550
Wire Wire Line
	2700 2700 2650 2700
Wire Wire Line
	2650 2700 2650 2800
Wire Wire Line
	2650 2800 2700 2800
Wire Wire Line
	2650 2750 2600 2750
Connection ~ 2650 2750
Wire Wire Line
	2650 4800 2700 4800
Wire Wire Line
	2650 4700 2650 4800
Wire Wire Line
	2650 4700 2700 4700
Wire Wire Line
	2650 4750 2600 4750
Connection ~ 2650 4750
Wire Wire Line
	4800 6600 4750 6600
Wire Wire Line
	4800 6500 4800 6600
Wire Wire Line
	4800 6500 4750 6500
Wire Wire Line
	4800 6550 4850 6550
Connection ~ 4800 6550
Wire Wire Line
	4800 4800 4750 4800
Wire Wire Line
	4800 4700 4800 4800
Wire Wire Line
	4800 4700 4750 4700
Wire Wire Line
	4800 4750 4850 4750
Connection ~ 4800 4750
Wire Wire Line
	2700 6500 2650 6500
Wire Wire Line
	2650 6500 2650 6600
Wire Wire Line
	2650 6600 2700 6600
Wire Wire Line
	2650 6550 2600 6550
Connection ~ 2650 6550
Wire Bus Line
	8100 4300 7700 4300
Wire Wire Line
	4750 2200 5200 2200
Wire Wire Line
	4750 2300 5200 2300
Wire Wire Line
	4750 2400 5200 2400
Wire Wire Line
	4750 2500 5200 2500
Wire Wire Line
	4750 6700 5200 6700
Wire Wire Line
	4750 6800 5200 6800
Wire Wire Line
	4750 6900 5200 6900
Wire Wire Line
	4750 7000 5200 7000
Wire Wire Line
	2250 2200 2700 2200
Wire Wire Line
	2250 2300 2700 2300
Wire Wire Line
	2250 2400 2700 2400
Wire Wire Line
	2250 2500 2700 2500
Wire Bus Line
	8100 3850 7700 3850
Wire Bus Line
	8100 3750 7700 3750
Wire Bus Line
	8100 6500 7700 6500
Wire Bus Line
	8100 6400 7700 6400
Wire Bus Line
	8100 7050 7700 7050
Wire Bus Line
	8100 6950 7700 6950
Wire Bus Line
	9550 6500 9700 6500
Wire Bus Line
	9700 6500 9700 6650
Wire Bus Line
	9700 6650 10950 6650
Wire Bus Line
	9550 6950 9700 6950
Wire Bus Line
	9700 6950 9700 6800
Wire Bus Line
	9700 6800 10950 6800
Wire Bus Line
	9550 6400 9800 6400
Wire Bus Line
	9800 6400 9800 6550
Wire Bus Line
	9800 6550 10950 6550
Wire Bus Line
	9550 7050 9800 7050
Wire Bus Line
	9800 7050 9800 6900
Wire Bus Line
	9800 6900 10950 6900
Wire Bus Line
	9550 3850 9700 3850
Wire Bus Line
	9700 3850 9700 4000
Wire Bus Line
	9700 4000 10950 4000
Wire Bus Line
	9550 4300 9700 4300
Wire Bus Line
	9700 4300 9700 4150
Wire Bus Line
	9700 4150 10950 4150
Wire Bus Line
	9550 3750 9800 3750
Wire Bus Line
	9800 3750 9800 3900
Wire Bus Line
	9800 3900 10950 3900
Wire Bus Line
	9550 4400 9800 4400
Wire Bus Line
	9800 4400 9800 4250
Wire Bus Line
	9800 4250 10950 4250
Wire Wire Line
	5600 9950 5600 10000
Wire Wire Line
	5600 10000 5700 10000
Wire Wire Line
	5700 10000 5700 9950
Wire Wire Line
	5650 10000 5650 10350
Connection ~ 5650 10000
Wire Wire Line
	9450 9950 9450 10000
Wire Wire Line
	9450 10000 9550 10000
Wire Wire Line
	9550 10000 9550 9950
Wire Wire Line
	9500 10000 9500 10100
Connection ~ 9500 10000
Wire Wire Line
	8400 9050 8400 9550
Wire Wire Line
	4150 9450 4900 9450
Wire Wire Line
	10950 1950 10400 1950
Wire Wire Line
	10950 2050 10400 2050
Connection ~ 7800 9150
Wire Wire Line
	7000 10250 7000 10350
Wire Wire Line
	7000 9650 7000 9750
Wire Wire Line
	7350 9700 6400 9700
Connection ~ 7000 9700
Connection ~ 7000 9150
Connection ~ 7350 9150
Wire Wire Line
	6400 9150 7800 9150
Connection ~ 4150 9450
Wire Wire Line
	4150 9400 4150 9700
Wire Wire Line
	10950 5200 10400 5200
Wire Wire Line
	10950 5300 10400 5300
Wire Wire Line
	5350 3500 4750 3500
Wire Bus Line
	2000 2700 2000 4200
Wire Bus Line
	2000 2700 1650 2700
Wire Bus Line
	1950 2800 1950 4300
Wire Bus Line
	1950 2800 1500 2800
Wire Wire Line
	2700 2900 2100 2900
Wire Wire Line
	2700 3100 2100 3100
Wire Wire Line
	2700 3300 2100 3300
Wire Wire Line
	2700 3700 2100 3700
Wire Wire Line
	2700 3900 2100 3900
Wire Wire Line
	2700 4100 2100 4100
Wire Wire Line
	2700 4300 2100 4300
Wire Wire Line
	2700 3000 2050 3000
Wire Wire Line
	2700 3200 2050 3200
Wire Wire Line
	2700 3400 2050 3400
Wire Wire Line
	2700 3600 2050 3600
Wire Wire Line
	2700 3800 2050 3800
Wire Wire Line
	2700 4000 2050 4000
Wire Wire Line
	2700 4200 2050 4200
Wire Wire Line
	2700 4400 2050 4400
Wire Wire Line
	2100 3500 2700 3500
Wire Bus Line
	5450 4700 5450 6200
Wire Bus Line
	5450 4700 5800 4700
Wire Bus Line
	5500 4800 5500 6300
Wire Bus Line
	5500 4800 5950 4800
Wire Wire Line
	4750 4900 5350 4900
Wire Wire Line
	4750 5100 5350 5100
Wire Wire Line
	4750 5300 5350 5300
Wire Wire Line
	4750 5700 5350 5700
Wire Wire Line
	4750 5900 5350 5900
Wire Wire Line
	4750 6100 5350 6100
Wire Wire Line
	4750 6300 5350 6300
Wire Wire Line
	4750 5000 5400 5000
Wire Wire Line
	4750 5200 5400 5200
Wire Wire Line
	4750 5400 5400 5400
Wire Wire Line
	4750 5600 5400 5600
Wire Wire Line
	4750 5800 5400 5800
Wire Wire Line
	4750 6000 5400 6000
Wire Wire Line
	4750 6200 5400 6200
Wire Wire Line
	4750 6400 5400 6400
Wire Wire Line
	5350 5500 4750 5500
Wire Bus Line
	2000 4700 2000 6200
Wire Bus Line
	2000 4700 1650 4700
Wire Bus Line
	1950 4800 1950 6300
Wire Bus Line
	1950 4800 1500 4800
Wire Wire Line
	2700 4900 2100 4900
Wire Wire Line
	2700 5100 2100 5100
Wire Wire Line
	2700 5300 2100 5300
Wire Wire Line
	2700 5700 2100 5700
Wire Wire Line
	2700 5900 2100 5900
Wire Wire Line
	2700 6100 2100 6100
Wire Wire Line
	2700 6300 2100 6300
Wire Wire Line
	2700 5000 2050 5000
Wire Wire Line
	2700 5200 2050 5200
Wire Wire Line
	2700 5400 2050 5400
Wire Wire Line
	2700 5600 2050 5600
Wire Wire Line
	2700 5800 2050 5800
Wire Wire Line
	2700 6000 2050 6000
Wire Wire Line
	2700 6200 2050 6200
Wire Wire Line
	2700 6400 2050 6400
Wire Wire Line
	2100 5500 2700 5500
Wire Wire Line
	10250 9450 10300 9450
Wire Wire Line
	10300 9950 10300 10100
Wire Wire Line
	10300 9450 10300 9550
Wire Wire Line
	10650 9050 10650 9550
Connection ~ 10650 9150
Wire Wire Line
	10650 9950 10650 10100
Wire Wire Line
	8750 9150 8650 9150
Wire Wire Line
	8650 9150 8650 9450
Connection ~ 8650 9450
Wire Wire Line
	8400 9450 8750 9450
Connection ~ 8400 9450
Wire Wire Line
	8400 9950 8400 10100
Wire Wire Line
	10650 9150 10250 9150
Wire Wire Line
	10950 2650 10400 2650
Wire Wire Line
	10950 2550 10400 2550
Wire Wire Line
	10950 4600 10400 4600
Wire Wire Line
	10950 4900 10400 4900
Wire Wire Line
	10950 4700 10400 4700
Wire Wire Line
	10950 4800 10400 4800
Wire Wire Line
	10950 2150 10400 2150
Wire Wire Line
	10950 2250 10400 2250
Connection ~ 2450 7100
Wire Wire Line
	1400 6900 1400 7050
Wire Wire Line
	11850 2950 12500 2950
Wire Wire Line
	11850 3150 12500 3150
Wire Wire Line
	12500 3250 11850 3250
Wire Wire Line
	12700 4450 13250 4450
Wire Wire Line
	13250 4550 12700 4550
Wire Wire Line
	13250 4650 12700 4650
Wire Wire Line
	13250 4850 12700 4850
Wire Wire Line
	9400 2550 10150 2550
Connection ~ 9850 3150
Wire Wire Line
	9400 3150 10150 3150
Wire Wire Line
	10950 2750 10150 2750
Wire Wire Line
	10950 2850 10150 2850
Wire Wire Line
	10150 2750 10150 2550
Wire Wire Line
	10150 2850 10150 3150
Wire Wire Line
	9400 5200 10150 5200
Connection ~ 9850 5800
Wire Wire Line
	9400 5800 10150 5800
Wire Wire Line
	10950 5400 10150 5400
Wire Wire Line
	10950 5500 10150 5500
Wire Wire Line
	10150 5400 10150 5200
Wire Wire Line
	10150 5500 10150 5800
Wire Wire Line
	6400 9700 6400 9450
Wire Wire Line
	10400 2450 10950 2450
Wire Wire Line
	14050 4450 14600 4450
Wire Wire Line
	14600 4850 14050 4850
Wire Wire Line
	14600 4450 14600 4500
Wire Wire Line
	14600 4850 14600 4900
Wire Wire Line
	14050 4550 14200 4550
Wire Wire Line
	13300 3350 13300 3400
Wire Wire Line
	13300 3250 13400 3250
Wire Wire Line
	13400 3250 13400 3500
Wire Wire Line
	13400 3500 11850 3500
Wire Wire Line
	13300 3150 13500 3150
Wire Wire Line
	13500 3150 13500 3600
Wire Wire Line
	13500 3600 11850 3600
Wire Wire Line
	13300 3050 13600 3050
Wire Wire Line
	13600 3050 13600 3700
Wire Wire Line
	13600 3700 11850 3700
Wire Wire Line
	13300 2950 13700 2950
Wire Wire Line
	13700 2950 13700 3750
Wire Wire Line
	10400 5100 10950 5100
Wire Wire Line
	11850 5600 12500 5600
Wire Wire Line
	11850 5700 12500 5700
Wire Wire Line
	11850 5800 12500 5800
Wire Wire Line
	12500 5900 11850 5900
Wire Wire Line
	11850 6000 12500 6000
Wire Wire Line
	13300 6000 13300 6050
Wire Wire Line
	13300 5900 13400 5900
Wire Wire Line
	13400 5900 13400 6150
Wire Wire Line
	13400 6150 11850 6150
Wire Wire Line
	13300 5800 13500 5800
Wire Wire Line
	13500 5800 13500 6250
Wire Wire Line
	13500 6250 11850 6250
Wire Wire Line
	13300 5700 13600 5700
Wire Wire Line
	13600 5700 13600 6350
Wire Wire Line
	13600 6350 11850 6350
Wire Wire Line
	13300 5600 13700 5600
Wire Wire Line
	13700 5600 13700 6400
Connection ~ 9850 5200
Connection ~ 9850 2550
Wire Wire Line
	4750 7100 4750 7200
Wire Wire Line
	4750 7200 2450 7200
Wire Wire Line
	4150 10100 4150 10350
Wire Wire Line
	11850 3050 12500 3050
Wire Wire Line
	11850 3350 12500 3350
Wire Wire Line
	1400 6700 2700 6700
Connection ~ 2450 6700
Wire Wire Line
	7350 9600 7350 9700
Wire Wire Line
	7800 9050 7800 9500
Wire Wire Line
	7800 9900 7800 10350
Wire Wire Line
	5800 3250 5800 3350
Wire Wire Line
	5800 3850 5800 3950
Wire Wire Line
	6300 3250 6300 3350
Wire Wire Line
	6300 3850 6300 3950
Wire Wire Line
	1150 3250 1150 3350
Wire Wire Line
	1150 3850 1150 3950
Wire Wire Line
	1650 3250 1650 3350
Wire Wire Line
	1650 3850 1650 3950
Wire Wire Line
	4800 8550 4800 8600
Connection ~ 1400 6700
Wire Wire Line
	1600 6650 1600 6700
Connection ~ 1400 7000
Wire Wire Line
	1600 6950 1600 7000
Wire Wire Line
	4700 9150 4900 9150
Wire Wire Line
	4800 9100 4800 9150
Connection ~ 4800 9150
Connection ~ 1600 6700
Connection ~ 1600 7000
Wire Wire Line
	2450 7200 2450 7000
Wire Wire Line
	2450 6900 2700 6900
Connection ~ 2450 6800
Wire Wire Line
	2450 6700 2450 6900
Wire Wire Line
	4750 2600 5200 2600
Wire Wire Line
	1400 7000 2700 7000
Wire Wire Line
	1400 6650 1400 6800
Wire Wire Line
	1400 6800 1250 6800
Wire Wire Line
	1400 6900 1250 6900
Wire Wire Line
	2700 2600 1750 2600
Wire Wire Line
	10950 3500 10550 3500
Wire Wire Line
	10550 3500 10550 3600
$Comp
L GND #PWR026
U 1 1 54B181CA
P 10550 3600
F 0 "#PWR026" H 10550 3600 30  0001 C CNN
F 1 "GND" H 10550 3530 30  0001 C CNN
F 2 "" H 10550 3600 60  0000 C CNN
F 3 "" H 10550 3600 60  0000 C CNN
	1    10550 3600
	1    0    0    -1  
$EndComp
$Comp
L +3.3V #PWR027
U 1 1 54B1FB2D
P 10050 7350
F 0 "#PWR027" H 10050 7310 30  0001 C CNN
F 1 "+3.3V" H 10050 7460 30  0000 C CNN
F 2 "" H 10050 7350 60  0000 C CNN
F 3 "" H 10050 7350 60  0000 C CNN
	1    10050 7350
	1    0    0    -1  
$EndComp
$Comp
L R R8
U 1 1 54B209BB
P 10050 7600
F 0 "R8" V 10130 7600 50  0000 C CNN
F 1 "10k" V 10050 7600 50  0000 C CNN
F 2 "" H 10050 7600 60  0000 C CNN
F 3 "" H 10050 7600 60  0000 C CNN
	1    10050 7600
	1    0    0    -1  
$EndComp
$Comp
L R R9
U 1 1 54B209C1
P 10050 8200
F 0 "R9" V 10130 8200 50  0000 C CNN
F 1 "20k" V 10050 8200 50  0000 C CNN
F 2 "" H 10050 8200 60  0000 C CNN
F 3 "" H 10050 8200 60  0000 C CNN
	1    10050 8200
	1    0    0    -1  
$EndComp
Wire Wire Line
	10050 7850 10050 7950
Wire Wire Line
	10050 8450 10050 8600
$Comp
L GND #PWR028
U 1 1 54B20FF3
P 10050 8600
F 0 "#PWR028" H 10050 8600 30  0001 C CNN
F 1 "GND" H 10050 8530 30  0001 C CNN
F 2 "" H 10050 8600 60  0000 C CNN
F 3 "" H 10050 8600 60  0000 C CNN
	1    10050 8600
	1    0    0    -1  
$EndComp
Wire Wire Line
	10050 7900 10500 7900
Wire Wire Line
	10500 7900 10500 6150
Wire Wire Line
	10500 6150 10950 6150
Connection ~ 10050 7900
Text Label 5200 2600 0    60   ~ 0
I2C_DATA
$Comp
L R R12
U 1 1 54B46A80
P 4450 9150
F 0 "R12" V 4530 9150 50  0000 C CNN
F 1 "DNP" V 4450 9150 50  0000 C CNN
F 2 "" H 4450 9150 60  0000 C CNN
F 3 "" H 4450 9150 60  0000 C CNN
	1    4450 9150
	0    -1   -1   0   
$EndComp
Wire Wire Line
	3750 9150 4200 9150
Text Label 3750 9150 0    60   ~ 0
I2C_DATA
Text Notes 3550 8900 0    60   ~ 0
If needed, this could \ncontrol the TDC power.
$Sheet
S 10950 1850 900  2500
U 54661065
F0 "TDC_1" 50
F1 "TDC_1.sch" 50
F2 "DCLK" I R 11850 2950 60 
F3 "CONF_DONE" I R 11850 3050 60 
F4 "nCONFIG" I R 11850 3150 60 
F5 "TCK" I L 10950 2550 60 
F6 "TDO" I L 10950 2850 60 
F7 "TMS" I L 10950 2650 60 
F8 "TDI" I L 10950 2750 60 
F9 "DATA0" I R 11850 3250 60 
F10 "ASD" I R 11850 3350 60 
F11 "nCS" I R 11850 3500 60 
F12 "VccA" I L 10950 2450 60 
F13 "C5_In+" I L 10950 1950 60 
F14 "C5_In-" I L 10950 2050 60 
F15 "TDC_Out-" I L 10950 2250 60 
F16 "TDC_Out+" I L 10950 2150 60 
F17 "+3.3v" I R 11850 3700 60 
F18 "TDC_In_A_N[7..0]" I L 10950 4000 60 
F19 "TDC_In_A_P[7..0]" I L 10950 3900 60 
F20 "TDC_In_B_N[7..0]" I L 10950 4250 60 
F21 "TDC_In_B_P[7..0]" I L 10950 4150 60 
F22 "nCE" I R 11850 3600 60 
F23 "BOARD_ID0" I L 10950 3500 60 
F24 "SCL" I L 10950 3050 60 
F25 "SDA" I L 10950 3150 60 
F26 "BOARD_ID1" I L 10950 3400 60 
$EndSheet
$Comp
L JUMPER JP3
U 1 1 54B5D5B2
P 13350 8450
F 0 "JP3" H 13350 8600 60  0000 C CNN
F 1 "JUMPER" H 13350 8370 40  0000 C CNN
F 2 "~" H 13350 8450 60  0000 C CNN
F 3 "~" H 13350 8450 60  0000 C CNN
F 4 "A105225-ND" H 13350 8450 60  0001 C CNN "Field1"
F 5 "Digi-Key" H 13350 8450 60  0001 C CNN "Field2"
	1    13350 8450
	0    -1   -1   0   
$EndComp
$Comp
L +3.3V #PWR029
U 1 1 54B5D80A
P 12900 7600
F 0 "#PWR029" H 12900 7560 30  0001 C CNN
F 1 "+3.3V" H 12900 7710 30  0000 C CNN
F 2 "" H 12900 7600 60  0000 C CNN
F 3 "" H 12900 7600 60  0000 C CNN
	1    12900 7600
	1    0    0    -1  
$EndComp
$Comp
L R R10
U 1 1 54B5D810
P 12900 7850
F 0 "R10" V 12980 7850 50  0000 C CNN
F 1 "10k" V 12900 7850 50  0000 C CNN
F 2 "" H 12900 7850 60  0000 C CNN
F 3 "" H 12900 7850 60  0000 C CNN
	1    12900 7850
	1    0    0    -1  
$EndComp
$Comp
L R R11
U 1 1 54B5D816
P 12900 8450
F 0 "R11" V 12980 8450 50  0000 C CNN
F 1 "20k" V 12900 8450 50  0000 C CNN
F 2 "" H 12900 8450 60  0000 C CNN
F 3 "" H 12900 8450 60  0000 C CNN
	1    12900 8450
	1    0    0    -1  
$EndComp
Wire Wire Line
	12900 8100 12900 8200
Wire Wire Line
	12900 8700 12900 8850
$Comp
L GND #PWR030
U 1 1 54B5D81F
P 12900 8850
F 0 "#PWR030" H 12900 8850 30  0001 C CNN
F 1 "GND" H 12900 8780 30  0001 C CNN
F 2 "" H 12900 8850 60  0000 C CNN
F 3 "" H 12900 8850 60  0000 C CNN
	1    12900 8850
	1    0    0    -1  
$EndComp
Wire Wire Line
	12900 8150 13850 8150
Connection ~ 12900 8150
Wire Wire Line
	13350 8750 12900 8750
Connection ~ 12900 8750
Text Label 13350 8150 0    60   ~ 0
BOARD_ID1
Connection ~ 13350 8150
Text Label 10450 6050 0    60   ~ 0
BOARD_ID1
Wire Wire Line
	10450 6050 10950 6050
Text Label 10450 3400 0    60   ~ 0
BOARD_ID1
Wire Wire Line
	10450 3400 10950 3400
Text Label 10500 3150 0    60   ~ 0
I2C_DATA
Text Label 10500 3050 0    60   ~ 0
I2C_CLK
Wire Wire Line
	10500 3050 10950 3050
Wire Wire Line
	10500 3150 10950 3150
Text Label 10500 5800 0    60   ~ 0
I2C_DATA
Text Label 10500 5700 0    60   ~ 0
I2C_CLK
Wire Wire Line
	10500 5700 10950 5700
Wire Wire Line
	10500 5800 10950 5800
Wire Wire Line
	7350 9200 7350 9150
$Comp
L +4 #PWR031
U 1 1 55333517
P 7800 9050
F 0 "#PWR031" H 7800 9180 20  0001 C CNN
F 1 "+4" H 7800 9150 30  0000 C CNN
F 2 "~" H 7800 9050 60  0000 C CNN
F 3 "~" H 7800 9050 60  0000 C CNN
	1    7800 9050
	1    0    0    -1  
$EndComp
$Comp
L +4 #PWR032
U 1 1 553335EC
P 8400 9050
F 0 "#PWR032" H 8400 9180 20  0001 C CNN
F 1 "+4" H 8400 9150 30  0000 C CNN
F 2 "~" H 8400 9050 60  0000 C CNN
F 3 "~" H 8400 9050 60  0000 C CNN
	1    8400 9050
	1    0    0    -1  
$EndComp
Wire Wire Line
	9450 9950 9250 9950
$EndSCHEMATC
