PCBNEW-LibModule-V1  Fri 21 Nov 2014 03:53:59 PM EST
# encoding utf-8
Units mm
$INDEX
TPS79533
$EndINDEX
$MODULE TPS79533
Po 0 0 0 15 546FA660 00000000 ~~
Li TPS79533
Sc 0
AR /545E4761
Op 0 0 0
T0 0 -5.3086 1 1 0 0.15 N V 21 N "U2"
T1 0 5.7912 1 1 0 0.15 N V 21 N "TPS79533"
DS 3.2766 1.778 3.2766 -1.778 0.15 21
DS 3.2766 -1.778 -3.2766 -1.778 0.15 21
DS -3.2766 -1.778 -3.2766 1.778 0.15 21
DS -3.2766 1.778 3.2766 1.778 0.15 21
$PAD
Sh "5" R 0.6 2.2 0 0 0
Dr 0 0 0
At SMD N 00888000
Ne 4 "N-0000043"
Po 2.54 3.1
.LocalClearance 0.07
$EndPAD
$PAD
Sh "tab" R 3.5 2.2 0 0 0
Dr 0 0 0
At SMD N 00888000
Ne 0 ""
Po 0 -3.1
$EndPAD
$PAD
Sh "1" R 0.6 2.2 0 0 0
Dr 0 0 0
At SMD N 00888000
Ne 2 "+4V"
Po -2.54 3.1
.LocalClearance 0.07
$EndPAD
$PAD
Sh "2" R 0.6 2.2 0 0 0
Dr 0 0 0
At SMD N 00888000
Ne 2 "+4V"
Po -1.27 3.1
.LocalClearance 0.07
$EndPAD
$PAD
Sh "3" R 0.6 2.2 0 0 0
Dr 0 0 0
At SMD N 00888000
Ne 3 "GND"
Po 0 3.1
.LocalClearance 0.07
$EndPAD
$PAD
Sh "4" R 0.6 2.2 0 0 0
Dr 0 0 0
At SMD N 00888000
Ne 1 "+3.3V"
Po 1.27 3.1
.LocalClearance 0.07
$EndPAD
$EndMODULE TPS79533
$EndLIBRARY
