PCBNEW-LibModule-V1  Fri 09 Jan 2015 02:04:06 PM EST
# encoding utf-8
Units mm
$INDEX
SOCKET_6x3
$EndINDEX
$MODULE SOCKET_6x3
Po 0 0 0 15 54B024D2 00000000 ~~
Li SOCKET_6x3
Sc 0
AR 
Op 0 0 0
T0 10.16 0.635 1 1 0 0.15 N V 21 N "SOCKET_6x3"
T1 7.62 -0.635 1 1 0 0.15 N V 21 N "VAL**"
T2 -1.905 0 1 1 0 0.15 N V 21 N "1"
DS -1.27 -1.27 3.81 -1.27 0.15 21
DS 3.81 -1.27 3.81 6.35 0.15 21
DS 3.81 6.35 -1.27 6.35 0.15 21
DS -1.27 6.35 -1.27 -1.27 0.15 21
$PAD
Sh "1" C 2.0066 2.0066 0 0 0
Dr 1.3208 0 0
At STD N 00E0FFFF
Ne 0 ""
Po 0 0
$EndPAD
$PAD
Sh "2" C 2.0066 2.0066 0 0 0
Dr 1.3208 0 0
At STD N 00E0FFFF
Ne 0 ""
Po 2.54 0
$EndPAD
$PAD
Sh "3" C 2.0066 2.0066 0 0 0
Dr 1.3208 0 0
At STD N 00E0FFFF
Ne 0 ""
Po 0 2.54
$EndPAD
$PAD
Sh "4" C 2.0066 2.0066 0 0 0
Dr 1.3208 0 0
At STD N 00E0FFFF
Ne 0 ""
Po 2.54 2.54
$EndPAD
$PAD
Sh "5" C 2.0066 2.0066 0 0 0
Dr 1.3208 0 0
At STD N 00E0FFFF
Ne 0 ""
Po 0 5.08
$EndPAD
$PAD
Sh "6" C 2.0066 2.0066 0 0 0
Dr 1.3208 0 0
At STD N 00E0FFFF
Ne 0 ""
Po 2.54 5.08
$EndPAD
$EndMODULE SOCKET_6x3
$EndLIBRARY
