PCBNEW-LibModule-V1  Tue 13 Jan 2015 02:34:28 PM EST
# encoding utf-8
Units mm
$INDEX
5-146252-1
$EndINDEX
$MODULE 5-146252-1
Po 0 0 0 15 54B57340 00000000 ~~
Li 5-146252-1
Sc 0
AR 
Op 0 0 0
T0 0 -3.85 1 1 0 0.15 N V 21 N "5-146252-1"
T1 0 3.95 1 1 0 0.15 N V 21 N "VAL**"
DS -1.065 2.44 1.065 2.44 0.15 21
DS -1.065 -2.44 1.065 -2.44 0.15 21
DS -1.065 2.44 -1.065 -2.44 0.15 21
DS 1.065 2.44 1.065 -2.44 0.15 21
$PAD
Sh "1" C 2 2 0 0 0
Dr 1.14 0 0
At STD N 00E0FFFF
Ne 0 ""
Po 0 -1.27
$EndPAD
$PAD
Sh "2" C 2 2 0 0 0
Dr 1.14 0 0
At STD N 00E0FFFF
Ne 0 ""
Po 0 1.27
$EndPAD
$EndMODULE 5-146252-1
$EndLIBRARY
