EESchema Schematic File Version 2
LIBS:device
LIBS:transistors
LIBS:conn
LIBS:linear
LIBS:regul
LIBS:74xx
LIBS:cmos4000
LIBS:adc-dac
LIBS:memory
LIBS:xilinx
LIBS:special
LIBS:microcontrollers
LIBS:dsp
LIBS:microchip
LIBS:analog_switches
LIBS:motorola
LIBS:texas
LIBS:intel
LIBS:audio
LIBS:interface
LIBS:digital-audio
LIBS:philips
LIBS:display
LIBS:cypress
LIBS:siliconi
LIBS:opto
LIBS:atmel
LIBS:contrib
LIBS:valves
LIBS:FIN1108
LIBS:ERM8-RA
LIBS:4816P-1-101LF
LIBS:LSHM-130-02.5-F-DV-N (TDC_Inputs)
LIBS:T1M_10_xx_S_RA_TR_(IO__Power)
LIBS:tps78630kttt
LIBS:tps79533
LIBS:30310-5002hb
LIBS:640456-2
LIBS:wire_connector
LIBS:FTSH-108-02-xx-DV (JTAG)
LIBS:jumper
LIBS:power
LIBS:+4
LIBS:TDC_Mother-cache
EELAYER 27 0
EELAYER END
$Descr A4 11693 8268
encoding utf-8
Sheet 7 7
Title ""
Date "20 apr 2015"
Rev ""
Comp ""
Comment1 ""
Comment2 ""
Comment3 ""
Comment4 ""
$EndDescr
$Comp
L LSHM-130-02.5-F-DV-N_(TDC_INPUTS) J7
U 1 1 54434BB9
P 4100 3700
AR Path="/54661065/54434BB9" Ref="J7"  Part="1" 
AR Path="/5461E2FD/54434BB9" Ref="J10"  Part="1" 
F 0 "J10" H 4100 3550 60  0000 C CNN
F 1 "LSHM-130-02.5-F-DV-N_(TDC_INPUTS)" H 3750 5400 39  0000 C CNN
F 2 "~" H 3600 3300 60  0000 C CNN
F 3 "~" H 3600 3300 60  0000 C CNN
F 4 "LSHM-130-02.5-L-DV-A-N-K-TR-ND" H 4100 3700 60  0001 C CNN "Field1"
F 5 "Digi-Key" H 4100 3700 60  0001 C CNN "Field2"
	1    4100 3700
	1    0    0    -1  
$EndComp
$Comp
L T1M-10-XX-S-RA-TR_(I/O_&_POWER) J6
U 1 1 544A7A84
P 4050 750
AR Path="/54661065/544A7A84" Ref="J6"  Part="1" 
AR Path="/5461E2FD/544A7A84" Ref="J9"  Part="1" 
F 0 "J9" H 3750 400 60  0000 C CNN
F 1 "T1M-10-XX-S-RA-TR_(I/O_&_POWER)" H 3750 900 33  0000 C CNN
F 2 "~" H 3950 500 60  0000 C CNN
F 3 "~" H 3950 500 60  0000 C CNN
F 4 "T1M-10-GF-S-V-TR" H 4050 750 60  0001 C CNN "Field1"
F 5 "Samtec" H 4050 750 60  0001 C CNN "Field2"
	1    4050 750 
	1    0    0    -1  
$EndComp
$Comp
L FTSH-108-02-XX-DV_(JTAG) J8
U 1 1 544A7A93
P 4100 6500
AR Path="/54661065/544A7A93" Ref="J8"  Part="1" 
AR Path="/5461E2FD/544A7A93" Ref="J11"  Part="1" 
F 0 "J11" H 4100 5900 60  0000 C CNN
F 1 "FTSH-108-02-XX-DV_(JTAG)" H 3700 6950 35  0000 C CNN
F 2 "~" H 3750 6500 60  0000 C CNN
F 3 "~" H 3750 6500 60  0000 C CNN
F 4 "FTSH-108-02-L-DV-ES-P-ND" H 4100 6500 60  0001 C CNN "Field1"
F 5 "Digi-Key" H 4100 6500 60  0001 C CNN "Field2"
	1    4100 6500
	1    0    0    -1  
$EndComp
Text HLabel 2900 6200 0    60   Input ~ 0
DCLK
Text HLabel 2900 6300 0    60   Input ~ 0
CONF_DONE
Text HLabel 2900 6400 0    60   Input ~ 0
nCONFIG
Text HLabel 2900 6500 0    60   Input ~ 0
TCK
Text HLabel 2900 6600 0    60   Input ~ 0
TDO
Text HLabel 2900 6700 0    60   Input ~ 0
TMS
Text HLabel 2900 6900 0    60   Input ~ 0
TDI
Text HLabel 5300 6200 2    60   Input ~ 0
DATA0
Text HLabel 5300 6300 2    60   Input ~ 0
ASD
Text HLabel 5300 6500 2    60   Input ~ 0
nCS
Text HLabel 5300 6700 2    60   Input ~ 0
VccA
Text HLabel 4950 1100 2    60   Input ~ 0
C5_In+
Text HLabel 4950 1200 2    60   Input ~ 0
C5_In-
Text HLabel 4950 1300 2    60   Input ~ 0
TDC_Out-
Text HLabel 4950 1400 2    60   Input ~ 0
TDC_Out+
Text HLabel 5300 6600 2    60   Input ~ 0
+3.3v
Text HLabel 2200 2850 0    60   Input ~ 0
TDC_In_A_N[7..0]
Entry Wire Line
	2450 2850 2550 2950
Entry Wire Line
	2450 2950 2550 3050
Entry Wire Line
	2450 3050 2550 3150
Entry Wire Line
	2450 3150 2550 3250
Entry Wire Line
	2450 3250 2550 3350
Entry Wire Line
	2450 3350 2550 3450
Entry Wire Line
	2450 3450 2550 3550
Entry Wire Line
	2450 3550 2550 3650
Entry Wire Line
	2450 3700 2550 3800
Entry Wire Line
	2450 3800 2550 3900
Entry Wire Line
	2450 3900 2550 4000
Entry Wire Line
	2450 4000 2550 4100
Entry Wire Line
	2450 4100 2550 4200
Entry Wire Line
	2450 4200 2550 4300
Entry Wire Line
	2450 4300 2550 4400
Entry Wire Line
	2450 4400 2550 4500
Text HLabel 5850 2850 2    60   Input ~ 0
TDC_In_A_P[7..0]
Entry Wire Line
	5750 2850 5650 2950
Entry Wire Line
	5750 2950 5650 3050
Entry Wire Line
	5750 3050 5650 3150
Entry Wire Line
	5750 3150 5650 3250
Entry Wire Line
	5750 3250 5650 3350
Entry Wire Line
	5750 3350 5650 3450
Entry Wire Line
	5750 3450 5650 3550
Entry Wire Line
	5750 3550 5650 3650
Entry Wire Line
	5750 3700 5650 3800
Entry Wire Line
	5750 3800 5650 3900
Entry Wire Line
	5750 3900 5650 4000
Entry Wire Line
	5750 4000 5650 4100
Entry Wire Line
	5750 4100 5650 4200
Entry Wire Line
	5750 4200 5650 4300
Entry Wire Line
	5750 4300 5650 4400
Entry Wire Line
	5750 4400 5650 4500
Text HLabel 2200 3700 0    60   Input ~ 0
TDC_In_B_N[7..0]
Text HLabel 5850 3700 2    60   Input ~ 0
TDC_In_B_P[7..0]
NoConn ~ 5000 2200
Text Label 5050 2950 0    60   ~ 0
TDC_In_A_P0
NoConn ~ 3200 4950
NoConn ~ 3200 5050
NoConn ~ 5000 4700
NoConn ~ 5000 4800
NoConn ~ 3200 2200
NoConn ~ 3200 2300
NoConn ~ 5000 2300
Text Label 5050 3050 0    60   ~ 0
TDC_In_A_P1
Text Label 5050 3150 0    60   ~ 0
TDC_In_A_P2
Text Label 5050 3250 0    60   ~ 0
TDC_In_A_P3
Text Label 5050 3350 0    60   ~ 0
TDC_In_A_P4
Text Label 5050 3450 0    60   ~ 0
TDC_In_A_P5
Text Label 5050 3550 0    60   ~ 0
TDC_In_A_P6
Text Label 5050 3650 0    60   ~ 0
TDC_In_A_P7
Text Label 5050 3800 0    60   ~ 0
TDC_In_B_P0
Text Label 5050 3900 0    60   ~ 0
TDC_In_B_P1
Text Label 5050 4000 0    60   ~ 0
TDC_In_B_P2
Text Label 5050 4100 0    60   ~ 0
TDC_In_B_P3
Text Label 5050 4200 0    60   ~ 0
TDC_In_B_P4
Text Label 5050 4300 0    60   ~ 0
TDC_In_B_P5
Text Label 5050 4400 0    60   ~ 0
TDC_In_B_P6
Text Label 5050 4500 0    60   ~ 0
TDC_In_B_P7
Text Label 2600 2950 0    60   ~ 0
TDC_In_A_N0
Text Label 2600 3050 0    60   ~ 0
TDC_In_A_N1
Text Label 2600 3150 0    60   ~ 0
TDC_In_A_N2
Text Label 2600 3250 0    60   ~ 0
TDC_In_A_N3
Text Label 2600 3350 0    60   ~ 0
TDC_In_A_N4
Text Label 2600 3450 0    60   ~ 0
TDC_In_A_N5
Text Label 2600 3550 0    60   ~ 0
TDC_In_A_N6
Text Label 2600 3650 0    60   ~ 0
TDC_In_A_N7
Text Label 2600 3800 0    60   ~ 0
TDC_In_B_N0
Text Label 2600 3900 0    60   ~ 0
TDC_In_B_N1
Text Label 2600 4000 0    60   ~ 0
TDC_In_B_N2
Text Label 2600 4100 0    60   ~ 0
TDC_In_B_N3
Text Label 2600 4200 0    60   ~ 0
TDC_In_B_N4
Text Label 2600 4300 0    60   ~ 0
TDC_In_B_N5
Text Label 2600 4400 0    60   ~ 0
TDC_In_B_N6
Text Label 2600 4500 0    60   ~ 0
TDC_In_B_N7
NoConn ~ 5000 5200
NoConn ~ 5000 5300
NoConn ~ 5000 5400
NoConn ~ 5000 5500
NoConn ~ 4500 900 
Text Notes 5350 5650 2    60   ~ 0
Passing in 4v from Motherboard to TDC board
NoConn ~ 4500 700 
Text HLabel 5300 6400 2    60   Input ~ 0
nCE
$Comp
L GND #PWR063
U 1 1 546261F6
P 5250 2700
AR Path="/54661065/546261F6" Ref="#PWR063"  Part="1" 
AR Path="/5461E2FD/546261F6" Ref="#PWR048"  Part="1" 
F 0 "#PWR048" H 5250 2700 30  0001 C CNN
F 1 "GND" H 5250 2630 30  0001 C CNN
F 2 "" H 5250 2700 60  0000 C CNN
F 3 "" H 5250 2700 60  0000 C CNN
	1    5250 2700
	1    0    0    -1  
$EndComp
$Comp
L GND #PWR064
U 1 1 546262DA
P 2950 2700
AR Path="/54661065/546262DA" Ref="#PWR064"  Part="1" 
AR Path="/5461E2FD/546262DA" Ref="#PWR049"  Part="1" 
F 0 "#PWR049" H 2950 2700 30  0001 C CNN
F 1 "GND" H 2950 2630 30  0001 C CNN
F 2 "" H 2950 2700 60  0000 C CNN
F 3 "" H 2950 2700 60  0000 C CNN
	1    2950 2700
	-1   0    0    -1  
$EndComp
$Comp
L GND #PWR065
U 1 1 5462661F
P 5200 5150
AR Path="/54661065/5462661F" Ref="#PWR065"  Part="1" 
AR Path="/5461E2FD/5462661F" Ref="#PWR050"  Part="1" 
F 0 "#PWR050" H 5200 5150 30  0001 C CNN
F 1 "GND" H 5200 5080 30  0001 C CNN
F 2 "" H 5200 5150 60  0000 C CNN
F 3 "" H 5200 5150 60  0000 C CNN
	1    5200 5150
	1    0    0    -1  
$EndComp
$Comp
L GND #PWR066
U 1 1 5462671E
P 3000 4900
AR Path="/54661065/5462671E" Ref="#PWR066"  Part="1" 
AR Path="/5461E2FD/5462671E" Ref="#PWR051"  Part="1" 
F 0 "#PWR051" H 3000 4900 30  0001 C CNN
F 1 "GND" H 3000 4830 30  0001 C CNN
F 2 "" H 3000 4900 60  0000 C CNN
F 3 "" H 3000 4900 60  0000 C CNN
	1    3000 4900
	-1   0    0    -1  
$EndComp
$Comp
L GND #PWR067
U 1 1 54626728
P 5050 7000
AR Path="/54661065/54626728" Ref="#PWR067"  Part="1" 
AR Path="/5461E2FD/54626728" Ref="#PWR052"  Part="1" 
F 0 "#PWR052" H 5050 7000 30  0001 C CNN
F 1 "GND" H 5050 6930 30  0001 C CNN
F 2 "" H 5050 7000 60  0000 C CNN
F 3 "" H 5050 7000 60  0000 C CNN
	1    5050 7000
	1    0    0    -1  
$EndComp
$Comp
L GND #PWR068
U 1 1 546267A9
P 2500 6850
AR Path="/54661065/546267A9" Ref="#PWR068"  Part="1" 
AR Path="/5461E2FD/546267A9" Ref="#PWR053"  Part="1" 
F 0 "#PWR053" H 2500 6850 30  0001 C CNN
F 1 "GND" H 2500 6780 30  0001 C CNN
F 2 "" H 2500 6850 60  0000 C CNN
F 3 "" H 2500 6850 60  0000 C CNN
	1    2500 6850
	1    0    0    -1  
$EndComp
$Comp
L GND #PWR069
U 1 1 54626AA8
P 4700 1700
AR Path="/54661065/54626AA8" Ref="#PWR069"  Part="1" 
AR Path="/5461E2FD/54626AA8" Ref="#PWR054"  Part="1" 
F 0 "#PWR054" H 4700 1700 30  0001 C CNN
F 1 "GND" H 4700 1630 30  0001 C CNN
F 2 "" H 4700 1700 60  0000 C CNN
F 3 "" H 4700 1700 60  0000 C CNN
	1    4700 1700
	1    0    0    -1  
$EndComp
$Comp
L GND #PWR070
U 1 1 54626CC4
P 4700 950
AR Path="/54661065/54626CC4" Ref="#PWR070"  Part="1" 
AR Path="/5461E2FD/54626CC4" Ref="#PWR055"  Part="1" 
F 0 "#PWR055" H 4700 950 30  0001 C CNN
F 1 "GND" H 4700 880 30  0001 C CNN
F 2 "" H 4700 950 60  0000 C CNN
F 3 "" H 4700 950 60  0000 C CNN
	1    4700 950 
	1    0    0    -1  
$EndComp
$Comp
L C C30
U 1 1 546294C3
P 3050 5800
AR Path="/54661065/546294C3" Ref="C30"  Part="1" 
AR Path="/5461E2FD/546294C3" Ref="C34"  Part="1" 
F 0 "C34" H 2950 5900 50  0000 C CNN
F 1 ".01uF" H 2950 5700 50  0000 C CNN
F 2 "" H 3050 5800 60  0000 C CNN
F 3 "" H 3050 5800 60  0000 C CNN
F 4 "399-1091-1-ND" H 3050 5800 60  0001 C CNN "Field1"
F 5 "Digi-Key" H 3050 5800 60  0001 C CNN "Field2"
	1    3050 5800
	1    0    0    -1  
$EndComp
$Comp
L C C29
U 1 1 546294CF
P 2700 5800
AR Path="/54661065/546294CF" Ref="C29"  Part="1" 
AR Path="/5461E2FD/546294CF" Ref="C33"  Part="1" 
F 0 "C33" H 2600 5900 50  0000 C CNN
F 1 ".01uF" H 2600 5700 50  0000 C CNN
F 2 "" H 2700 5800 60  0000 C CNN
F 3 "" H 2700 5800 60  0000 C CNN
F 4 "399-1091-1-ND" H 2700 5800 60  0001 C CNN "Field1"
F 5 "Digi-Key" H 2700 5800 60  0001 C CNN "Field2"
	1    2700 5800
	1    0    0    -1  
$EndComp
$Comp
L GND #PWR071
U 1 1 5462997F
P 1900 6200
AR Path="/54661065/5462997F" Ref="#PWR071"  Part="1" 
AR Path="/5461E2FD/5462997F" Ref="#PWR056"  Part="1" 
F 0 "#PWR056" H 1900 6200 30  0001 C CNN
F 1 "GND" H 1900 6130 30  0001 C CNN
F 2 "" H 1900 6200 60  0000 C CNN
F 3 "" H 1900 6200 60  0000 C CNN
	1    1900 6200
	1    0    0    -1  
$EndComp
$Comp
L CONN_6 P1
U 1 1 54B0DC13
P 7650 1550
AR Path="/54661065/54B0DC13" Ref="P1"  Part="1" 
AR Path="/5461E2FD/54B0DC13" Ref="P2"  Part="1" 
F 0 "P2" H 7600 2000 60  0000 C CNN
F 1 "TD-103-G-A-1" H 7900 1900 60  0000 C CNN
F 2 "" H 7650 1550 60  0000 C CNN
F 3 "" H 7650 1550 60  0000 C CNN
F 4 "TD-103-G-A-1" H 7650 1550 60  0001 C CNN "Field1"
F 5 "Samtec" H 7650 1550 60  0001 C CNN "Field2"
	1    7650 1550
	1    0    0    -1  
$EndComp
Text HLabel 6700 1300 0    60   Input ~ 0
BOARD_ID0
Text HLabel 6700 1500 0    60   Input ~ 0
SCL
$Comp
L GND #PWR072
U 1 1 54B0DF3A
P 6850 1850
AR Path="/54661065/54B0DF3A" Ref="#PWR072"  Part="1" 
AR Path="/5461E2FD/54B0DF3A" Ref="#PWR057"  Part="1" 
F 0 "#PWR057" H 6850 1850 30  0001 C CNN
F 1 "GND" H 6850 1780 30  0001 C CNN
F 2 "" H 6850 1850 60  0000 C CNN
F 3 "" H 6850 1850 60  0000 C CNN
	1    6850 1850
	1    0    0    -1  
$EndComp
Wire Wire Line
	3350 6200 2900 6200
Wire Wire Line
	3350 6300 2900 6300
Wire Wire Line
	3350 6400 2900 6400
Wire Wire Line
	3350 6500 2900 6500
Wire Wire Line
	3350 6600 2900 6600
Wire Wire Line
	3350 6700 2900 6700
Wire Wire Line
	3350 6900 2900 6900
Wire Wire Line
	5300 6200 4850 6200
Wire Wire Line
	5300 6300 4850 6300
Wire Wire Line
	5300 6500 4850 6500
Wire Wire Line
	5300 6700 4850 6700
Wire Wire Line
	4950 1100 4500 1100
Wire Wire Line
	4950 1200 4500 1200
Wire Wire Line
	4950 1300 4500 1300
Wire Wire Line
	4950 1400 4500 1400
Wire Wire Line
	5000 3350 5650 3350
Wire Wire Line
	5000 3450 5650 3450
Wire Wire Line
	5000 3550 5650 3550
Wire Wire Line
	5000 3650 5650 3650
Wire Bus Line
	5850 3700 5750 3700
Wire Bus Line
	5750 3700 5750 4400
Wire Bus Line
	5850 2850 5750 2850
Wire Bus Line
	5750 2850 5750 3550
Wire Bus Line
	2200 2850 2450 2850
Wire Bus Line
	2450 2850 2450 3550
Wire Bus Line
	2200 3700 2450 3700
Wire Bus Line
	2450 3700 2450 4400
Wire Wire Line
	5000 2950 5650 2950
Wire Wire Line
	5000 3050 5650 3050
Wire Wire Line
	5000 3150 5650 3150
Wire Wire Line
	5000 3250 5650 3250
Wire Wire Line
	5000 4200 5650 4200
Wire Wire Line
	5000 4300 5650 4300
Wire Wire Line
	5000 4400 5650 4400
Wire Wire Line
	5000 4500 5650 4500
Wire Wire Line
	5000 3800 5650 3800
Wire Wire Line
	5000 3900 5650 3900
Wire Wire Line
	5000 4000 5650 4000
Wire Wire Line
	5000 4100 5650 4100
Wire Wire Line
	2550 3350 3200 3350
Wire Wire Line
	2550 3450 3200 3450
Wire Wire Line
	2550 3550 3200 3550
Wire Wire Line
	2550 3650 3200 3650
Wire Wire Line
	2550 2950 3200 2950
Wire Wire Line
	2550 3050 3200 3050
Wire Wire Line
	2550 3150 3200 3150
Wire Wire Line
	2550 3250 3200 3250
Wire Wire Line
	2550 4200 3200 4200
Wire Wire Line
	2550 4300 3200 4300
Wire Wire Line
	2550 4400 3200 4400
Wire Wire Line
	2550 4500 3200 4500
Wire Wire Line
	2550 3800 3200 3800
Wire Wire Line
	2550 3900 3200 3900
Wire Wire Line
	2550 4000 3200 4000
Wire Wire Line
	2550 4100 3200 4100
Wire Wire Line
	4850 6600 5300 6600
Wire Wire Line
	1900 5500 3200 5500
Wire Wire Line
	1900 5150 1900 5500
Wire Wire Line
	1900 5400 3200 5400
Connection ~ 1900 5400
Wire Wire Line
	1900 5300 3200 5300
Connection ~ 1900 5300
Wire Wire Line
	1900 5200 3200 5200
Connection ~ 1900 5200
Wire Wire Line
	4850 6400 5300 6400
Wire Wire Line
	5000 2750 5150 2750
Wire Wire Line
	5000 2650 5150 2650
Connection ~ 5150 2650
Wire Wire Line
	5000 2550 5250 2550
Connection ~ 5150 2550
Wire Wire Line
	5150 2750 5150 2450
Wire Wire Line
	5250 2550 5250 2700
Wire Wire Line
	3200 2750 3050 2750
Wire Wire Line
	3200 2650 3050 2650
Connection ~ 3050 2650
Wire Wire Line
	2950 2550 3200 2550
Connection ~ 3050 2550
Wire Wire Line
	3050 2750 3050 2450
Wire Wire Line
	2950 2550 2950 2700
Wire Wire Line
	5000 4950 5200 4950
Wire Wire Line
	5200 4950 5200 5150
Wire Wire Line
	5000 5050 5200 5050
Connection ~ 5200 5050
Wire Wire Line
	3200 4700 3000 4700
Wire Wire Line
	3000 4700 3000 4900
Wire Wire Line
	3200 4800 3000 4800
Connection ~ 3000 4800
Wire Wire Line
	4850 6800 5050 6800
Wire Wire Line
	5050 6800 5050 7000
Wire Wire Line
	4850 6900 5050 6900
Connection ~ 5050 6900
Wire Wire Line
	3350 6800 2500 6800
Wire Wire Line
	2500 6800 2500 6850
Wire Wire Line
	5150 2450 5000 2450
Wire Wire Line
	3050 2450 3200 2450
Wire Wire Line
	4500 1500 4700 1500
Wire Wire Line
	4700 1500 4700 1700
Wire Wire Line
	4500 1600 4700 1600
Connection ~ 4700 1600
Wire Wire Line
	4600 1000 4600 800 
Wire Wire Line
	4600 900  4700 900 
Wire Wire Line
	4700 900  4700 950 
Connection ~ 4600 900 
Wire Wire Line
	4600 800  4500 800 
Wire Wire Line
	4600 1000 4500 1000
Wire Wire Line
	2000 5200 2000 5550
Connection ~ 2000 5200
Wire Wire Line
	2350 5300 2350 5550
Connection ~ 2350 5300
Wire Wire Line
	2700 5400 2700 5600
Connection ~ 2700 5400
Wire Wire Line
	3050 5500 3050 5600
Connection ~ 3050 5500
Wire Wire Line
	3050 6000 3050 6100
Wire Wire Line
	3050 6100 1900 6100
Wire Wire Line
	1900 6100 1900 6200
Wire Wire Line
	2000 6050 2000 6100
Connection ~ 2000 6100
Wire Wire Line
	2350 6050 2350 6100
Connection ~ 2350 6100
Wire Wire Line
	2700 6000 2700 6100
Connection ~ 2700 6100
Wire Wire Line
	6850 1850 6850 1700
Wire Wire Line
	6850 1700 7300 1700
Wire Wire Line
	6700 1500 7300 1500
Wire Wire Line
	6700 1300 7300 1300
Text HLabel 6700 1600 0    60   Input ~ 0
SDA
Wire Wire Line
	6700 1600 7300 1600
Text HLabel 6700 1400 0    60   Input ~ 0
BOARD_ID1
Wire Wire Line
	7300 1400 6700 1400
NoConn ~ 7300 1800
$Comp
L WIRE_CONNECTOR J13
U 1 1 54C01B71
P 6300 6650
AR Path="/54661065/54C01B71" Ref="J13"  Part="1" 
AR Path="/5461E2FD/54C01B71" Ref="J15"  Part="1" 
F 0 "J15" H 6400 7400 60  0000 C CNN
F 1 "wire conn for FTSH" H 6350 6100 60  0001 C CNN
F 2 "" H 6300 6950 60  0000 C CNN
F 3 "" H 6300 6950 60  0000 C CNN
F 4 "FFSD-08-D-02.00-01" H 6300 6650 60  0001 C CNN "Field1"
F 5 "Samtec" H 6300 6650 60  0001 C CNN "Field2"
	1    6300 6650
	-1   0    0    -1  
$EndComp
$Comp
L WIRE_CONNECTOR J12
U 1 1 54C01B80
P 2700 1450
AR Path="/54661065/54C01B80" Ref="J12"  Part="1" 
AR Path="/5461E2FD/54C01B80" Ref="J14"  Part="1" 
F 0 "J14" H 2800 2150 60  0000 C CNN
F 1 "wire conn for T1M" H 3050 2350 60  0001 C CNN
F 2 "" H 2700 1750 60  0000 C CNN
F 3 "" H 2700 1750 60  0000 C CNN
F 4 "S1SS-10-30-01.80-S" H 2700 1450 60  0001 C CNN "Field1"
F 5 "Samtec" H 2700 1450 60  0001 C CNN "Field2"
	1    2700 1450
	1    0    0    -1  
$EndComp
$Comp
L +4 #PWR?
U 1 1 55340D6D
P 1900 5150
AR Path="/5461E2FD/55340D6D" Ref="#PWR?"  Part="1" 
AR Path="/54661065/55340D6D" Ref="#PWR?"  Part="1" 
F 0 "#PWR?" H 1900 5280 20  0001 C CNN
F 1 "+4" H 1900 5250 30  0000 C CNN
F 2 "~" H 1900 5150 60  0000 C CNN
F 3 "~" H 1900 5150 60  0000 C CNN
	1    1900 5150
	1    0    0    -1  
$EndComp
$EndSCHEMATC
