PCBNEW-LibModule-V1  Sun 19 Apr 2015 08:49:10 AM EDT
# encoding utf-8
Units mm
$INDEX
ResPack-CAT16-J4
$EndINDEX
$MODULE ResPack-CAT16-J4
Po 0 0 0 15 5533A430 00000000 ~~
Li ResPack-CAT16-J4
Sc 0
AR 
Op 0 0 0
T0 -0.3556 2.286 1 1 0 0.15 N V 21 N "ResPack-CAT16-J4"
T1 -5.8928 0.6604 1 1 0 0.15 N V 21 N "VAL**"
DS 2.7432 -1.6764 2.9972 -1.6764 0.15 21
DS 2.9972 -1.6764 2.9972 0 0.15 21
DS 2.9972 0 2.7432 0 0.15 21
DS -0.3048 -1.6764 -0.508 -1.6764 0.15 21
DS -0.508 -1.6764 -0.508 0 0.15 21
DS -0.508 0 -0.3048 0 0.15 21
$PAD
Sh "1" R 0.4318 0.889 0 0 0
Dr 0 0 0
At SMD N 00888000
Ne 0 ""
Po 0 0
$EndPAD
$PAD
Sh "2" R 0.4318 0.889 0 0 0
Dr 0 0 0
At SMD N 00888000
Ne 0 ""
Po 0.8128 0
$EndPAD
$PAD
Sh "3" R 0.4318 0.889 0 0 0
Dr 0 0 0
At SMD N 00888000
Ne 0 ""
Po 1.6256 0
$EndPAD
$PAD
Sh "4" R 0.4318 0.889 0 0 0
Dr 0 0 0
At SMD N 00888000
Ne 0 ""
Po 2.4384 0
$EndPAD
$PAD
Sh "5" R 0.4318 0.889 0 0 0
Dr 0 0 0
At SMD N 00888000
Ne 0 ""
Po 2.4384 -1.6764
$EndPAD
$PAD
Sh "6" R 0.4318 0.889 0 0 0
Dr 0 0 0
At SMD N 00888000
Ne 0 ""
Po 1.6256 -1.6764
$EndPAD
$PAD
Sh "7" R 0.4318 0.889 0 0 0
Dr 0 0 0
At SMD N 00888000
Ne 0 ""
Po 0.8128 -1.6764
$EndPAD
$PAD
Sh "8" R 0.4318 0.889 0 0 0
Dr 0 0 0
At SMD N 00888000
Ne 0 ""
Po 0 -1.6764
$EndPAD
$EndMODULE ResPack-CAT16-J4
$EndLIBRARY
