PCBNEW-LibModule-V1  Mon 20 Apr 2015 01:01:56 PM EDT
# encoding utf-8
Units mm
$INDEX
TPS79533
$EndINDEX
$MODULE TPS79533
Po 0 0 0 15 55353102 00000000 ~~
Li TPS79533
Sc 0
AR /545E4761
Op 0 0 0
T0 -3.9624 -0.127 1 1 900 0.15 N V 21 N "U2"
T1 0 5.7912 1 1 0 0.15 N I 21 N "TPS79533"
DS 3.2766 1.778 3.2766 -1.778 0.15 21
DS 3.2766 -1.778 -3.2766 -1.778 0.15 21
DS -3.2766 -1.778 -3.2766 1.778 0.15 21
DS -3.2766 1.778 3.2766 1.778 0.15 21
$PAD
Sh "5" R 0.6 2.2 0 0 0
Dr 0 0 0
At SMD N 00888000
Ne 4 "N-0000036"
Po 2.54 3.1
.LocalClearance 0.07
$EndPAD
$PAD
Sh "tab" R 3.5 2.2 0 0 0
Dr 0 0 0
At SMD N 00888000
Ne 3 "GND"
Po 0 -3.1
.ZoneConnection 2
$EndPAD
$PAD
Sh "1" R 0.6 2.2 0 0 0
Dr 0 0 0
At SMD N 00888000
Ne 2 "+4"
Po -2.54 3.1
.LocalClearance 0.07
$EndPAD
$PAD
Sh "2" R 0.6 2.2 0 0 0
Dr 0 0 0
At SMD N 00888000
Ne 2 "+4"
Po -1.27 3.1
.LocalClearance 0.07
$EndPAD
$PAD
Sh "3" R 0.6 2.2 0 0 0
Dr 0 0 0
At SMD N 00888000
Ne 3 "GND"
Po 0 3.1
.LocalClearance 0.07
$EndPAD
$PAD
Sh "4" R 0.6 2.2 0 0 0
Dr 0 0 0
At SMD N 00888000
Ne 1 "+3.3V"
Po 1.27 3.1
.LocalClearance 0.07
$EndPAD
$PAD
Sh "6" C 0.635 0.635 0 0 0
Dr 0.381 0 0
At STD N 00E0FFFF
Ne 0 ""
Po -3.048 -2.54
.ZoneConnection 2
$EndPAD
$PAD
Sh "6" C 0.635 0.635 0 0 0
Dr 0.381 0 0
At STD N 00E0FFFF
Ne 0 ""
Po -3.048 -3.81
.ZoneConnection 2
$EndPAD
$PAD
Sh "6" C 0.635 0.635 0 0 0
Dr 0.381 0 0
At STD N 00E0FFFF
Ne 0 ""
Po -3.048 -5.207
.ZoneConnection 2
$EndPAD
$PAD
Sh "6" C 0.635 0.635 0 0 0
Dr 0.381 0 0
At STD N 00E0FFFF
Ne 0 ""
Po -1.524 -5.207
.ZoneConnection 2
$EndPAD
$PAD
Sh "6" C 0.635 0.635 0 0 0
Dr 0.381 0 0
At STD N 00E0FFFF
Ne 0 ""
Po -0.127 -5.207
.ZoneConnection 2
$EndPAD
$PAD
Sh "6" C 0.635 0.635 0 0 0
Dr 0.381 0 0
At STD N 00E0FFFF
Ne 0 ""
Po 1.27 -5.207
.ZoneConnection 2
$EndPAD
$PAD
Sh "6" C 0.635 0.635 0 0 0
Dr 0.381 0 0
At STD N 00E0FFFF
Ne 0 ""
Po 2.667 -5.207
.ZoneConnection 2
$EndPAD
$PAD
Sh "6" C 0.635 0.635 0 0 0
Dr 0.381 0 0
At STD N 00E0FFFF
Ne 0 ""
Po 2.667 -3.81
.ZoneConnection 2
$EndPAD
$PAD
Sh "6" C 0.635 0.635 0 0 0
Dr 0.381 0 0
At STD N 00E0FFFF
Ne 0 ""
Po 2.667 -2.54
.ZoneConnection 2
$EndPAD
$EndMODULE TPS79533
$EndLIBRARY
