EESchema Schematic File Version 2
LIBS:30310-5002hb
LIBS:ERM8-RA
LIBS:FIN1108
LIBS:FTSH-108-02-xx-DV (JTAG)
LIBS:jumper
LIBS:LSHM-130-02.5-F-DV-N (TDC_Inputs)
LIBS:power
LIBS:pspice
LIBS:T1M_10_xx_S_RA_TR_(IO__Power)
LIBS:tps78630kttt
LIBS:tps79533
LIBS:+4v
LIBS:640456-2
LIBS:4816P-1-101LF
LIBS:TDC_Mother-cache
EELAYER 27 0
EELAYER END
$Descr A4 11693 8268
encoding utf-8
Sheet 4 7
Title ""
Date "5 dec 2014"
Rev ""
Comp ""
Comment1 ""
Comment2 ""
Comment3 ""
Comment4 ""
$EndDescr
$Comp
L LVDS_FIN1108 U5
U 1 1 544CF9BD
P 6550 3600
AR Path="/54603C99/544CF9BD" Ref="U5"  Part="1" 
AR Path="/546352F5/544CF9BD" Ref="U8"  Part="1" 
AR Path="/546358D0/544CF9BD" Ref="U11"  Part="1" 
AR Path="/54635FFB/544CF9BD" Ref="U14"  Part="1" 
F 0 "U11" H 5950 1950 60  0000 C CNN
F 1 "LVDS_FIN1108" V 6550 3600 79  0000 C CNN
F 2 "" H 6100 3200 60  0000 C CNN
F 3 "" H 6100 3200 60  0000 C CNN
	1    6550 3600
	1    0    0    -1  
$EndComp
Text HLabel 3450 2050 0    60   Input ~ 0
ASDQ_N[7..0]
Text HLabel 3450 1950 0    60   Input ~ 0
ASDQ_P[7..0]
Entry Wire Line
	8850 2200 8750 2300
Entry Wire Line
	8850 2800 8750 2900
Entry Wire Line
	8650 2700 8550 2800
Entry Wire Line
	8850 3400 8750 3500
Entry Wire Line
	8650 3300 8550 3400
Entry Wire Line
	8850 4000 8750 4100
Entry Wire Line
	8650 3900 8550 4000
Text HLabel 9050 1950 2    60   Input ~ 0
LVDS_P[7..0]
Text HLabel 9050 2050 2    60   Input ~ 0
LVDS_N[7..0]
NoConn ~ 5700 4700
$Comp
L +3.3V #PWR028
U 1 1 545F526C
P 6550 800
AR Path="/54603C99/545F526C" Ref="#PWR028"  Part="1" 
AR Path="/546352F5/545F526C" Ref="#PWR033"  Part="1" 
AR Path="/546358D0/545F526C" Ref="#PWR038"  Part="1" 
AR Path="/54635FFB/545F526C" Ref="#PWR043"  Part="1" 
F 0 "#PWR038" H 6550 760 30  0001 C CNN
F 1 "+3.3V" H 6550 910 30  0000 C CNN
F 2 "" H 6550 800 60  0000 C CNN
F 3 "" H 6550 800 60  0000 C CNN
	1    6550 800 
	1    0    0    -1  
$EndComp
Text Label 7450 4400 0    60   ~ 0
LVDS_P0
Text Label 7450 4000 0    60   ~ 0
LVDS_P1
Text Label 7450 3800 0    60   ~ 0
LVDS_P2
Text Label 7450 3400 0    60   ~ 0
LVDS_P3
Text Label 7450 3200 0    60   ~ 0
LVDS_P4
Text Label 7450 2800 0    60   ~ 0
LVDS_P5
Text Label 7450 2600 0    60   ~ 0
LVDS_P6
Text Label 7450 2200 0    60   ~ 0
LVDS_P7
Text Label 7450 4300 0    60   ~ 0
LVDS_N0
Text Label 7450 4100 0    60   ~ 0
LVDS_N1
Text Label 7450 3700 0    60   ~ 0
LVDS_N2
Text Label 7450 3500 0    60   ~ 0
LVDS_N3
Text Label 7450 3100 0    60   ~ 0
LVDS_N4
Text Label 7450 2900 0    60   ~ 0
LVDS_N5
Text Label 7450 2500 0    60   ~ 0
LVDS_N6
Text Label 7450 2300 0    60   ~ 0
LVDS_N7
Text Label 3900 4400 0    60   ~ 0
ASDQ_P0
Text Label 3900 4000 0    60   ~ 0
ASDQ_P1
Text Label 3900 3800 0    60   ~ 0
ASDQ_P2
Text Label 3900 3400 0    60   ~ 0
ASDQ_P3
Text Label 3900 3200 0    60   ~ 0
ASDQ_P4
Text Label 3900 2800 0    60   ~ 0
ASDQ_P5
Text Label 3900 2600 0    60   ~ 0
ASDQ_P6
Text Label 3900 2200 0    60   ~ 0
ASDQ_P7
Text Label 3900 4300 0    60   ~ 0
ASDQ_N0
Text Label 3900 4100 0    60   ~ 0
ASDQ_N1
Text Label 3900 3700 0    60   ~ 0
ASDQ_N2
Text Label 3900 3500 0    60   ~ 0
ASDQ_N3
Text Label 3900 3100 0    60   ~ 0
ASDQ_N4
Text Label 3900 2900 0    60   ~ 0
ASDQ_N5
Text Label 3900 2500 0    60   ~ 0
ASDQ_N6
Text Label 3900 2300 0    60   ~ 0
ASDQ_N7
$Comp
L GND #PWR029
U 1 1 5460C42A
P 7100 5800
AR Path="/54603C99/5460C42A" Ref="#PWR029"  Part="1" 
AR Path="/546352F5/5460C42A" Ref="#PWR034"  Part="1" 
AR Path="/546358D0/5460C42A" Ref="#PWR039"  Part="1" 
AR Path="/54635FFB/5460C42A" Ref="#PWR044"  Part="1" 
F 0 "#PWR039" H 7100 5800 30  0001 C CNN
F 1 "GND" H 7100 5730 30  0001 C CNN
F 2 "" H 7100 5800 60  0000 C CNN
F 3 "" H 7100 5800 60  0000 C CNN
	1    7100 5800
	1    0    0    -1  
$EndComp
$Comp
L +3.3V #PWR030
U 1 1 5460C437
P 8250 4650
AR Path="/54603C99/5460C437" Ref="#PWR030"  Part="1" 
AR Path="/546352F5/5460C437" Ref="#PWR035"  Part="1" 
AR Path="/546358D0/5460C437" Ref="#PWR040"  Part="1" 
AR Path="/54635FFB/5460C437" Ref="#PWR045"  Part="1" 
F 0 "#PWR040" H 8250 4610 30  0001 C CNN
F 1 "+3.3V" H 8250 4760 30  0000 C CNN
F 2 "" H 8250 4650 60  0000 C CNN
F 3 "" H 8250 4650 60  0000 C CNN
	1    8250 4650
	1    0    0    -1  
$EndComp
$Comp
L C C10
U 1 1 5462AD4A
P 7050 1250
AR Path="/54603C99/5462AD4A" Ref="C10"  Part="1" 
AR Path="/546352F5/5462AD4A" Ref="C15"  Part="1" 
AR Path="/546358D0/5462AD4A" Ref="C20"  Part="1" 
AR Path="/54635FFB/5462AD4A" Ref="C25"  Part="1" 
F 0 "C20" V 7000 1350 50  0000 C CNN
F 1 ".01uF" V 7000 1100 50  0000 C CNN
F 2 "" H 7050 1250 60  0000 C CNN
F 3 "" H 7050 1250 60  0000 C CNN
	1    7050 1250
	0    -1   -1   0   
$EndComp
$Comp
L C C11
U 1 1 5462AE4E
P 7050 1600
AR Path="/54603C99/5462AE4E" Ref="C11"  Part="1" 
AR Path="/546352F5/5462AE4E" Ref="C16"  Part="1" 
AR Path="/546358D0/5462AE4E" Ref="C21"  Part="1" 
AR Path="/54635FFB/5462AE4E" Ref="C26"  Part="1" 
F 0 "C21" V 7000 1700 50  0000 C CNN
F 1 ".01uF" V 7000 1450 50  0000 C CNN
F 2 "" H 7050 1600 60  0000 C CNN
F 3 "" H 7050 1600 60  0000 C CNN
	1    7050 1600
	0    -1   -1   0   
$EndComp
$Comp
L C C9
U 1 1 5462AE54
P 6000 1600
AR Path="/54603C99/5462AE54" Ref="C9"  Part="1" 
AR Path="/546352F5/5462AE54" Ref="C14"  Part="1" 
AR Path="/546358D0/5462AE54" Ref="C19"  Part="1" 
AR Path="/54635FFB/5462AE54" Ref="C24"  Part="1" 
F 0 "C19" V 5950 1700 50  0000 C CNN
F 1 ".01uF" V 5950 1450 50  0000 C CNN
F 2 "" H 6000 1600 60  0000 C CNN
F 3 "" H 6000 1600 60  0000 C CNN
	1    6000 1600
	0    -1   -1   0   
$EndComp
$Comp
L C C8
U 1 1 5462AE5A
P 6000 1250
AR Path="/54603C99/5462AE5A" Ref="C8"  Part="1" 
AR Path="/546352F5/5462AE5A" Ref="C13"  Part="1" 
AR Path="/546358D0/5462AE5A" Ref="C18"  Part="1" 
AR Path="/54635FFB/5462AE5A" Ref="C23"  Part="1" 
F 0 "C18" V 5950 1350 50  0000 C CNN
F 1 ".01uF" V 5950 1100 50  0000 C CNN
F 2 "" H 6000 1250 60  0000 C CNN
F 3 "" H 6000 1250 60  0000 C CNN
	1    6000 1250
	0    -1   -1   0   
$EndComp
$Comp
L C C7
U 1 1 5462AE60
P 6000 900
AR Path="/54603C99/5462AE60" Ref="C7"  Part="1" 
AR Path="/546352F5/5462AE60" Ref="C12"  Part="1" 
AR Path="/546358D0/5462AE60" Ref="C17"  Part="1" 
AR Path="/54635FFB/5462AE60" Ref="C22"  Part="1" 
F 0 "C17" V 5950 1000 50  0000 C CNN
F 1 ".01uF" V 5950 750 50  0000 C CNN
F 2 "" H 6000 900 60  0000 C CNN
F 3 "" H 6000 900 60  0000 C CNN
	1    6000 900 
	0    -1   -1   0   
$EndComp
$Comp
L GND #PWR031
U 1 1 5462B475
P 7400 1850
AR Path="/54603C99/5462B475" Ref="#PWR031"  Part="1" 
AR Path="/546352F5/5462B475" Ref="#PWR036"  Part="1" 
AR Path="/546358D0/5462B475" Ref="#PWR041"  Part="1" 
AR Path="/54635FFB/5462B475" Ref="#PWR046"  Part="1" 
F 0 "#PWR041" H 7400 1850 30  0001 C CNN
F 1 "GND" H 7400 1780 30  0001 C CNN
F 2 "" H 7400 1850 60  0000 C CNN
F 3 "" H 7400 1850 60  0000 C CNN
	1    7400 1850
	1    0    0    -1  
$EndComp
$Comp
L GND #PWR032
U 1 1 5462B482
P 5650 1850
AR Path="/54603C99/5462B482" Ref="#PWR032"  Part="1" 
AR Path="/546352F5/5462B482" Ref="#PWR037"  Part="1" 
AR Path="/546358D0/5462B482" Ref="#PWR042"  Part="1" 
AR Path="/54635FFB/5462B482" Ref="#PWR047"  Part="1" 
F 0 "#PWR042" H 5650 1850 30  0001 C CNN
F 1 "GND" H 5650 1780 30  0001 C CNN
F 2 "" H 5650 1850 60  0000 C CNN
F 3 "" H 5650 1850 60  0000 C CNN
	1    5650 1850
	1    0    0    -1  
$EndComp
Wire Bus Line
	3450 2050 3650 2050
Wire Wire Line
	3900 2200 5700 2200
Wire Wire Line
	3750 2300 5700 2300
Wire Wire Line
	3750 2500 5700 2500
Wire Wire Line
	3900 2800 5700 2800
Wire Wire Line
	3750 2900 5700 2900
Wire Wire Line
	3750 3100 5700 3100
Wire Wire Line
	3900 3200 5700 3200
Wire Wire Line
	3900 3400 5700 3400
Wire Wire Line
	3750 3500 5700 3500
Wire Wire Line
	3750 3700 5700 3700
Wire Wire Line
	3900 3800 5700 3800
Wire Wire Line
	3900 4000 5700 4000
Wire Wire Line
	3750 4100 5700 4100
Wire Wire Line
	3900 4400 5700 4400
Wire Bus Line
	9050 2050 8850 2050
Wire Bus Line
	9050 1950 8650 1950
Wire Wire Line
	8550 2200 7400 2200
Wire Wire Line
	8750 2300 7400 2300
Wire Wire Line
	7400 2500 8750 2500
Wire Wire Line
	8550 2800 7400 2800
Wire Wire Line
	8750 2900 7400 2900
Wire Wire Line
	7400 3100 8750 3100
Wire Wire Line
	8550 3400 7400 3400
Wire Wire Line
	8750 3500 7400 3500
Wire Wire Line
	7400 3700 8750 3700
Wire Wire Line
	8550 3800 7400 3800
Wire Wire Line
	8550 4000 7400 4000
Wire Wire Line
	8750 4100 7400 4100
Wire Wire Line
	7400 4300 8750 4300
Wire Wire Line
	8550 4400 7400 4400
Wire Bus Line
	8650 1950 8650 4350
Wire Wire Line
	6350 5650 6350 5500
Wire Wire Line
	6750 5650 6750 5500
Connection ~ 6550 5650
Wire Wire Line
	6650 5650 6650 5500
Connection ~ 6650 5650
Wire Wire Line
	6450 5650 6450 5500
Connection ~ 6450 5650
Connection ~ 6350 5650
Wire Wire Line
	7500 5650 6350 5650
Wire Wire Line
	7400 4700 8250 4700
Wire Bus Line
	3800 1950 3800 4350
Wire Bus Line
	3800 1950 3450 1950
Wire Wire Line
	7400 4800 7500 4800
Wire Wire Line
	7500 4800 7500 5650
Wire Wire Line
	7400 4900 7500 4900
Connection ~ 7500 4900
Wire Wire Line
	7400 5000 7500 5000
Connection ~ 7500 5000
Wire Wire Line
	7400 5100 7500 5100
Connection ~ 7500 5100
Connection ~ 6750 5650
Wire Wire Line
	6550 5500 6550 5650
Connection ~ 7100 5650
Wire Wire Line
	8250 4700 8250 4650
Wire Wire Line
	7100 5650 7100 5800
Wire Wire Line
	6350 1700 6350 1600
Wire Wire Line
	6250 1600 6800 1600
Wire Wire Line
	6450 1700 6450 1250
Wire Wire Line
	6250 1250 6800 1250
Wire Wire Line
	6550 800  6550 1700
Wire Wire Line
	6550 900  6250 900 
Wire Wire Line
	6650 1250 6650 1700
Wire Wire Line
	6750 1600 6750 1700
Wire Wire Line
	5750 900  5650 900 
Wire Wire Line
	5650 900  5650 1850
Wire Wire Line
	5750 1250 5650 1250
Connection ~ 5650 1250
Wire Wire Line
	5750 1600 5650 1600
Connection ~ 5650 1600
Wire Wire Line
	7300 1250 7400 1250
Wire Wire Line
	7400 1250 7400 1850
Wire Wire Line
	7300 1600 7400 1600
Connection ~ 7400 1600
Connection ~ 6450 1250
Connection ~ 6550 1250
Connection ~ 6550 1600
Connection ~ 6350 1600
Connection ~ 6750 1600
Connection ~ 6650 1250
Connection ~ 6550 900 
$Comp
L 4816P-1-101LF U3
U 1 1 5480C3B8
P 5000 2600
AR Path="/54603C99/5480C3B8" Ref="U3"  Part="1" 
AR Path="/546352F5/5480C3B8" Ref="U6"  Part="1" 
AR Path="/546358D0/5480C3B8" Ref="U9"  Part="1" 
AR Path="/54635FFB/5480C3B8" Ref="U12"  Part="1" 
F 0 "U9" H 4750 3100 60  0000 C CNN
F 1 "4816P-1-101LF" H 5050 3200 60  0000 C CNN
F 2 "" H 5000 2600 60  0000 C CNN
F 3 "" H 5000 2600 60  0000 C CNN
	1    5000 2600
	1    0    0    -1  
$EndComp
Wire Wire Line
	3750 4300 5700 4300
$Comp
L 4816P-1-101LF U4
U 1 1 5480CA84
P 5000 3800
AR Path="/54603C99/5480CA84" Ref="U4"  Part="1" 
AR Path="/546352F5/5480CA84" Ref="U7"  Part="1" 
AR Path="/546358D0/5480CA84" Ref="U10"  Part="1" 
AR Path="/54635FFB/5480CA84" Ref="U13"  Part="1" 
F 0 "U10" H 4750 3000 60  0000 C CNN
F 1 "4816P-1-101LF" H 5050 2900 60  0000 C CNN
F 2 "" H 5000 3800 60  0000 C CNN
F 3 "" H 5000 3800 60  0000 C CNN
	1    5000 3800
	1    0    0    -1  
$EndComp
Wire Wire Line
	4400 2200 4400 2250
Connection ~ 4400 2200
Wire Wire Line
	5600 2300 5600 2250
Connection ~ 5600 2300
Wire Wire Line
	4400 2500 4400 2550
Connection ~ 4400 2500
Wire Wire Line
	5600 2600 5600 2550
Connection ~ 5600 2600
Wire Wire Line
	4400 2800 4400 2850
Connection ~ 4400 2800
Wire Wire Line
	4400 3100 4400 3150
Connection ~ 4400 3100
Wire Wire Line
	4400 3400 4400 3450
Connection ~ 4400 3400
Wire Wire Line
	4400 3700 4400 3750
Connection ~ 4400 3700
Wire Wire Line
	4400 4000 4400 4050
Connection ~ 4400 4000
Wire Wire Line
	4400 4300 4400 4350
Connection ~ 4400 4300
Wire Wire Line
	5600 4400 5600 4350
Connection ~ 5600 4400
Wire Wire Line
	5600 4100 5600 4050
Connection ~ 5600 4100
Wire Wire Line
	5600 3800 5600 3750
Connection ~ 5600 3800
Wire Wire Line
	5600 3500 5600 3450
Connection ~ 5600 3500
Wire Wire Line
	5600 3200 5600 3150
Connection ~ 5600 3200
Wire Wire Line
	5600 2900 5600 2850
Connection ~ 5600 2900
NoConn ~ 4400 2400
NoConn ~ 5600 2400
NoConn ~ 5600 2700
NoConn ~ 4400 2700
NoConn ~ 4400 3000
NoConn ~ 5600 3000
NoConn ~ 4400 3300
NoConn ~ 5600 3300
NoConn ~ 4400 3600
NoConn ~ 5600 3600
NoConn ~ 4400 3900
NoConn ~ 5600 3900
NoConn ~ 4400 4200
NoConn ~ 5600 4200
NoConn ~ 5600 4500
NoConn ~ 4400 4500
Entry Wire Line
	3650 2200 3750 2300
Entry Wire Line
	3650 2400 3750 2500
Entry Wire Line
	3650 2800 3750 2900
Entry Wire Line
	3650 3000 3750 3100
Entry Wire Line
	3650 3400 3750 3500
Entry Wire Line
	3650 3600 3750 3700
Entry Wire Line
	3650 4000 3750 4100
Entry Wire Line
	3650 4200 3750 4300
Entry Wire Line
	3800 2100 3900 2200
Entry Wire Line
	3800 2550 3900 2650
Wire Wire Line
	3900 2600 5700 2600
Wire Wire Line
	3900 2600 3900 2650
Entry Wire Line
	3800 2700 3900 2800
Entry Wire Line
	3800 3150 3900 3250
Entry Wire Line
	3800 3300 3900 3400
Entry Wire Line
	3800 3750 3900 3850
Entry Wire Line
	3800 3900 3900 4000
Wire Wire Line
	3900 3200 3900 3250
Wire Wire Line
	3900 3800 3900 3850
Entry Wire Line
	3800 4350 3900 4450
Wire Wire Line
	3900 4400 3900 4450
Wire Bus Line
	3650 2050 3650 4200
Entry Wire Line
	8550 2200 8650 2100
Entry Wire Line
	8750 2500 8850 2400
Wire Wire Line
	8550 2600 8550 2650
Wire Wire Line
	7400 2600 8550 2600
Entry Wire Line
	8550 2650 8650 2550
Entry Wire Line
	8750 3100 8850 3000
Entry Wire Line
	8550 3250 8650 3150
Wire Wire Line
	8550 3200 8550 3250
Wire Wire Line
	8550 3200 7400 3200
Entry Wire Line
	8750 3700 8850 3600
Entry Wire Line
	8550 3850 8650 3750
Wire Wire Line
	8550 3800 8550 3850
Entry Wire Line
	8750 4300 8850 4200
Wire Wire Line
	8550 4400 8550 4450
Entry Wire Line
	8550 4450 8650 4350
Wire Bus Line
	8850 2050 8850 4200
$EndSCHEMATC
