PCBNEW-LibModule-V1  Fri 05 Dec 2014 10:57:05 AM EST
# encoding utf-8
Units mm
$INDEX
4816P-1-101LF
$EndINDEX
$MODULE 4816P-1-101LF
Po 0 0 0 15 5481D5C5 00000000 ~~
Li 4816P-1-101LF
Sc 0
AR /54635FFB/5480CA84
Op 0 0 0
T0 0 0 1 1 900 0.15 N V 21 N "U13"
T1 0 3.175 1 1 0 0.15 N I 21 N "4816P-1-101LF"
$PAD
Sh "1" R 2.0066 0.635 0 0 0
Dr 0 0 0
At SMD N 00888000
Ne 5 "/P2B4"
Po -3.4417 -7.62
.LocalClearance 0.1778
$EndPAD
$PAD
Sh "2" R 2.0066 0.635 0 0 0
Dr 0 0 0
At SMD N 00888000
Ne 0 ""
Po -3.4417 -6.35
.LocalClearance 0.1778
$EndPAD
$PAD
Sh "3" R 2.0066 0.635 0 0 0
Dr 0 0 0
At SMD N 00888000
Ne 6 "/P2B5"
Po -3.4417 -5.08
$EndPAD
$PAD
Sh "5" R 2.0066 0.635 0 0 0
Dr 0 0 0
At SMD N 00888000
Ne 7 "/P2B6"
Po -3.4417 -2.54
$EndPAD
$PAD
Sh "6" R 2.0066 0.635 0 0 0
Dr 0 0 0
At SMD N 00888000
Ne 0 ""
Po -3.4417 -1.27
$EndPAD
$PAD
Sh "7" R 2.0066 0.635 0 0 0
Dr 0 0 0
At SMD N 00888000
Ne 8 "/P2B7"
Po -3.4417 0
$EndPAD
$PAD
Sh "8" R 2.0066 0.635 0 0 0
Dr 0 0 0
At SMD N 00888000
Ne 0 ""
Po -3.4417 1.27
$EndPAD
$PAD
Sh "9" R 2.0066 0.635 0 0 0
Dr 0 0 0
At SMD N 00888000
Ne 0 ""
Po 3.4417 1.27
$EndPAD
$PAD
Sh "10" R 2.0066 0.635 0 0 0
Dr 0 0 0
At SMD N 00888000
Ne 4 "/N2B7"
Po 3.4417 0
$EndPAD
$PAD
Sh "11" R 2.0066 0.635 0 0 0
Dr 0 0 0
At SMD N 00888000
Ne 0 ""
Po 3.4417 -1.27
$EndPAD
$PAD
Sh "12" R 2.0066 0.635 0 0 0
Dr 0 0 0
At SMD N 00888000
Ne 3 "/N2B6"
Po 3.4417 -2.54
$EndPAD
$PAD
Sh "13" R 2.0066 0.635 0 0 0
Dr 0 0 0
At SMD N 00888000
Ne 0 ""
Po 3.4417 -3.81
$EndPAD
$PAD
Sh "14" R 2.0066 0.635 0 0 0
Dr 0 0 0
At SMD N 00888000
Ne 2 "/N2B5"
Po 3.4417 -5.08
$EndPAD
$PAD
Sh "15" R 2.0066 0.635 0 0 0
Dr 0 0 0
At SMD N 00888000
Ne 0 ""
Po 3.4417 -6.35
$EndPAD
$PAD
Sh "16" R 2.0066 0.635 0 0 0
Dr 0 0 0
At SMD N 00888000
Ne 1 "/N2B4"
Po 3.4417 -7.62
$EndPAD
$PAD
Sh "4" R 2.0066 0.635 0 0 0
Dr 0 0 0
At SMD N 00888000
Ne 0 ""
Po -3.4417 -3.81
$EndPAD
$EndMODULE 4816P-1-101LF
$EndLIBRARY
