/*
WARNING: Do NOT edit the input and output ports in this file in a text
editor if you plan to continue editing the block that represents it in
the Block Editor! File corruption is VERY likely to occur.
*/
/*
Copyright (C) 1991-2010 Altera Corporation
Your use of Altera Corporation's design tools, logic functions 
and other software and tools, and its AMPP partner logic 
functions, and any output files from any of the foregoing 
(including device programming or simulation files), and any 
associated documentation or information are expressly subject 
to the terms and conditions of the Altera Program License 
Subscription Agreement, Altera MegaCore Function License 
Agreement, or other applicable license agreement, including, 
without limitation, that your use is for the sole purpose of 
programming logic devices manufactured by Altera and sold by 
Altera or its authorized distributors.  Please refer to the 
applicable agreement for further details.
*/
//#pragma file_not_in_maxplusii_format
(header "graphic" (version "1.3"))
(properties
	(page_setup "header_footer\nDate: %D\n%f\nProject: %j\n\nPage %p of %P\nRevision: %a\nmargin\n0.2\n0.2\n0.2\n0.2\norientation\n2\npaper_size\n3\npaper_source\n15\nfit_page_wide\n1\nfit_page_tall\n1\n")
)
(pin
	(input)
	(rect 80 432 248 448)
	(text "INPUT" (rect 133 0 161 10)(font "Arial" (font_size 6)))
	(text "CK200" (rect 5 0 38 12)(font "Arial" ))
	(pt 168 8)
	(drawing
		(line (pt 92 12)(pt 117 12)(line_width 1))
		(line (pt 92 4)(pt 117 4)(line_width 1))
		(line (pt 121 8)(pt 168 8)(line_width 1))
		(line (pt 92 12)(pt 92 4)(line_width 1))
		(line (pt 117 4)(pt 121 8)(line_width 1))
		(line (pt 117 12)(pt 121 8)(line_width 1))
	)
	(text "VCC" (rect 136 7 156 17)(font "Arial" (font_size 6)))
)
(pin
	(input)
	(rect 48 80 216 96)
	(text "INPUT" (rect 133 0 161 10)(font "Arial" (font_size 6)))
	(text "TCQPNV" (rect 5 0 49 12)(font "Arial" ))
	(pt 168 8)
	(drawing
		(line (pt 92 12)(pt 117 12)(line_width 1))
		(line (pt 92 4)(pt 117 4)(line_width 1))
		(line (pt 121 8)(pt 168 8)(line_width 1))
		(line (pt 92 12)(pt 92 4)(line_width 1))
		(line (pt 117 4)(pt 121 8)(line_width 1))
		(line (pt 117 12)(pt 121 8)(line_width 1))
	)
	(text "VCC" (rect 136 7 156 17)(font "Arial" (font_size 6)))
)
(pin
	(input)
	(rect 48 144 216 160)
	(text "INPUT" (rect 133 0 161 10)(font "Arial" (font_size 6)))
	(text "TCQP[8..0]" (rect 5 0 60 12)(font "Arial" ))
	(pt 168 8)
	(drawing
		(line (pt 92 12)(pt 117 12)(line_width 1))
		(line (pt 92 4)(pt 117 4)(line_width 1))
		(line (pt 121 8)(pt 168 8)(line_width 1))
		(line (pt 92 12)(pt 92 4)(line_width 1))
		(line (pt 117 4)(pt 121 8)(line_width 1))
		(line (pt 117 12)(pt 121 8)(line_width 1))
	)
	(text "VCC" (rect 136 7 156 17)(font "Arial" (font_size 6)))
)
(pin
	(input)
	(rect 48 240 216 256)
	(text "INPUT" (rect 133 0 161 10)(font "Arial" (font_size 6)))
	(text "TCQN[8..0]" (rect 5 0 61 12)(font "Arial" ))
	(pt 168 8)
	(drawing
		(line (pt 92 12)(pt 117 12)(line_width 1))
		(line (pt 92 4)(pt 117 4)(line_width 1))
		(line (pt 121 8)(pt 168 8)(line_width 1))
		(line (pt 92 12)(pt 92 4)(line_width 1))
		(line (pt 117 4)(pt 121 8)(line_width 1))
		(line (pt 117 12)(pt 121 8)(line_width 1))
	)
	(text "VCC" (rect 136 7 156 17)(font "Arial" (font_size 6)))
)
(pin
	(output)
	(rect 1024 456 1200 472)
	(text "OUTPUT" (rect 1 0 39 10)(font "Arial" (font_size 6)))
	(text "PhUpDn[1..0]" (rect 90 0 157 12)(font "Arial" ))
	(pt 0 8)
	(drawing
		(line (pt 0 8)(pt 52 8)(line_width 1))
		(line (pt 52 4)(pt 78 4)(line_width 1))
		(line (pt 52 12)(pt 78 12)(line_width 1))
		(line (pt 52 12)(pt 52 4)(line_width 1))
		(line (pt 78 4)(pt 82 8)(line_width 1))
		(line (pt 82 8)(pt 78 12)(line_width 1))
		(line (pt 78 12)(pt 82 8)(line_width 1))
	)
)
(pin
	(output)
	(rect 1048 160 1224 176)
	(text "OUTPUT" (rect 1 0 39 10)(font "Arial" (font_size 6)))
	(text "PhUpDnLE" (rect 90 0 144 12)(font "Arial" ))
	(pt 0 8)
	(drawing
		(line (pt 0 8)(pt 52 8)(line_width 1))
		(line (pt 52 4)(pt 78 4)(line_width 1))
		(line (pt 52 12)(pt 78 12)(line_width 1))
		(line (pt 52 12)(pt 52 4)(line_width 1))
		(line (pt 78 4)(pt 82 8)(line_width 1))
		(line (pt 82 8)(pt 78 12)(line_width 1))
		(line (pt 78 12)(pt 82 8)(line_width 1))
	)
)
(pin
	(output)
	(rect 1048 88 1224 104)
	(text "OUTPUT" (rect 1 0 39 10)(font "Arial" (font_size 6)))
	(text "PhUpDnMT" (rect 90 0 145 12)(font "Arial" ))
	(pt 0 8)
	(drawing
		(line (pt 0 8)(pt 52 8)(line_width 1))
		(line (pt 52 4)(pt 78 4)(line_width 1))
		(line (pt 52 12)(pt 78 12)(line_width 1))
		(line (pt 52 12)(pt 52 4)(line_width 1))
		(line (pt 78 4)(pt 82 8)(line_width 1))
		(line (pt 82 8)(pt 78 12)(line_width 1))
		(line (pt 78 12)(pt 82 8)(line_width 1))
	)
)
(symbol
	(rect 328 128 392 208)
	(text "DFFE" (rect 1 0 25 10)(font "Arial" (font_size 6)))
	(text "inst23" (rect 3 68 32 80)(font "Arial" ))
	(port
		(pt 32 0)
		(input)
		(text "PRN" (rect 24 13 41 25)(font "Courier New" (bold)))
		(text "PRN" (rect 24 11 41 23)(font "Courier New" (bold)))
		(line (pt 32 4)(pt 32 0)(line_width 1))
	)
	(port
		(pt 32 80)
		(input)
		(text "CLRN" (rect 21 59 44 71)(font "Courier New" (bold)))
		(text "CLRN" (rect 21 58 44 70)(font "Courier New" (bold)))
		(line (pt 32 80)(pt 32 76)(line_width 1))
	)
	(port
		(pt 0 24)
		(input)
		(text "D" (rect 14 20 19 32)(font "Courier New" (bold)))
		(text "D" (rect 14 20 19 32)(font "Courier New" (bold)))
		(line (pt 0 24)(pt 12 24)(line_width 1))
	)
	(port
		(pt 0 40)
		(input)
		(text "CLK" (rect 2 28 19 40)(font "Courier New" (bold))(invisible))
		(text "CLK" (rect 2 28 19 40)(font "Courier New" (bold))(invisible))
		(line (pt 0 40)(pt 12 40)(line_width 1))
	)
	(port
		(pt 0 56)
		(input)
		(text "ENA" (rect 14 50 31 62)(font "Courier New" (bold)))
		(text "ENA" (rect 14 50 31 62)(font "Courier New" (bold)))
		(line (pt 0 56)(pt 12 56)(line_width 1))
	)
	(port
		(pt 64 24)
		(output)
		(text "Q" (rect 44 20 49 32)(font "Courier New" (bold)))
		(text "Q" (rect 44 20 49 32)(font "Courier New" (bold)))
		(line (pt 53 24)(pt 64 24)(line_width 1))
	)
	(drawing
		(line (pt 12 68)(pt 52 68)(line_width 1))
		(line (pt 12 12)(pt 52 12)(line_width 1))
		(line (pt 52 68)(pt 52 12)(line_width 1))
		(line (pt 12 68)(pt 12 12)(line_width 1))
		(line (pt 12 34)(pt 19 41)(line_width 1))
		(line (pt 18 41)(pt 12 47)(line_width 1))
		(circle (rect 28 4 36 12)(line_width 1))
		(circle (rect 28 68 36 76)(line_width 1))
	)
)
(symbol
	(rect 328 224 392 304)
	(text "DFFE" (rect 1 0 25 10)(font "Arial" (font_size 6)))
	(text "inst24" (rect 3 68 32 80)(font "Arial" ))
	(port
		(pt 32 0)
		(input)
		(text "PRN" (rect 24 13 41 25)(font "Courier New" (bold)))
		(text "PRN" (rect 24 11 41 23)(font "Courier New" (bold)))
		(line (pt 32 4)(pt 32 0)(line_width 1))
	)
	(port
		(pt 32 80)
		(input)
		(text "CLRN" (rect 21 59 44 71)(font "Courier New" (bold)))
		(text "CLRN" (rect 21 58 44 70)(font "Courier New" (bold)))
		(line (pt 32 80)(pt 32 76)(line_width 1))
	)
	(port
		(pt 0 24)
		(input)
		(text "D" (rect 14 20 19 32)(font "Courier New" (bold)))
		(text "D" (rect 14 20 19 32)(font "Courier New" (bold)))
		(line (pt 0 24)(pt 12 24)(line_width 1))
	)
	(port
		(pt 0 40)
		(input)
		(text "CLK" (rect 2 28 19 40)(font "Courier New" (bold))(invisible))
		(text "CLK" (rect 2 28 19 40)(font "Courier New" (bold))(invisible))
		(line (pt 0 40)(pt 12 40)(line_width 1))
	)
	(port
		(pt 0 56)
		(input)
		(text "ENA" (rect 14 50 31 62)(font "Courier New" (bold)))
		(text "ENA" (rect 14 50 31 62)(font "Courier New" (bold)))
		(line (pt 0 56)(pt 12 56)(line_width 1))
	)
	(port
		(pt 64 24)
		(output)
		(text "Q" (rect 44 20 49 32)(font "Courier New" (bold)))
		(text "Q" (rect 44 20 49 32)(font "Courier New" (bold)))
		(line (pt 53 24)(pt 64 24)(line_width 1))
	)
	(drawing
		(line (pt 12 68)(pt 52 68)(line_width 1))
		(line (pt 12 12)(pt 52 12)(line_width 1))
		(line (pt 52 68)(pt 52 12)(line_width 1))
		(line (pt 12 68)(pt 12 12)(line_width 1))
		(line (pt 12 34)(pt 19 41)(line_width 1))
		(line (pt 18 41)(pt 12 47)(line_width 1))
		(circle (rect 28 4 36 12)(line_width 1))
		(circle (rect 28 68 36 76)(line_width 1))
	)
)
(symbol
	(rect 120 552 152 584)
	(text "GND" (rect 6 8 16 29)(font "Arial" (font_size 6))(vertical))
	(text "inst29" (rect -1 3 11 32)(font "Arial" )(vertical)(invisible))
	(port
		(pt 32 16)
		(output)
		(text "1" (rect 18 0 23 12)(font "Courier New" (bold))(invisible))
		(text "1" (rect 20 18 32 23)(font "Courier New" (bold))(vertical)(invisible))
		(line (pt 24 16)(pt 32 16)(line_width 1))
	)
	(drawing
		(line (pt 24 8)(pt 16 16)(line_width 1))
		(line (pt 16 16)(pt 24 24)(line_width 1))
		(line (pt 24 8)(pt 24 24)(line_width 1))
	)
	(rotate270)
)
(symbol
	(rect 448 376 608 472)
	(text "lpm_add_sub0" (rect 38 1 137 17)(font "Arial" (font_size 10)))
	(text "inst" (rect 8 80 25 92)(font "Arial" ))
	(port
		(pt 0 40)
		(input)
		(text "dataa[9..0]" (rect 0 0 60 14)(font "Arial" (font_size 8)))
		(text "dataa[9..0]" (rect 4 27 64 41)(font "Arial" (font_size 8)))
		(line (pt 0 40)(pt 64 40)(line_width 3))
	)
	(port
		(pt 0 72)
		(input)
		(text "datab[9..0]" (rect 0 0 60 14)(font "Arial" (font_size 8)))
		(text "datab[9..0]" (rect 4 59 64 73)(font "Arial" (font_size 8)))
		(line (pt 0 72)(pt 64 72)(line_width 3))
	)
	(port
		(pt 0 56)
		(input)
		(text "clock" (rect 0 0 29 14)(font "Arial" (font_size 8)))
		(text "clock" (rect 4 43 33 57)(font "Arial" (font_size 8)))
		(line (pt 0 56)(pt 64 56)(line_width 1))
	)
	(port
		(pt 160 56)
		(output)
		(text "result[9..0]" (rect 0 0 60 14)(font "Arial" (font_size 8)))
		(text "result[9..0]" (rect 106 43 166 57)(font "Arial" (font_size 8)))
		(line (pt 160 56)(pt 96 56)(line_width 3))
	)
	(drawing
		(text "A" (rect 66 34 75 48)(font "Arial" (font_size 8)))
		(text "B" (rect 66 66 74 80)(font "Arial" (font_size 8)))
		(text "A+B" (rect 73 50 97 64)(font "Arial" (font_size 8)))
		(line (pt 64 32)(pt 96 40)(line_width 1))
		(line (pt 96 40)(pt 96 72)(line_width 1))
		(line (pt 96 72)(pt 64 80)(line_width 1))
		(line (pt 64 80)(pt 64 32)(line_width 1))
		(line (pt 64 50)(pt 70 56)(line_width 1))
		(line (pt 70 56)(pt 64 62)(line_width 1))
	)
)
(symbol
	(rect 760 112 888 208)
	(text "lpm_compare1" (rect 22 1 122 17)(font "Arial" (font_size 10)))
	(text "inst4" (rect 8 80 31 92)(font "Arial" ))
	(port
		(pt 0 48)
		(input)
		(text "dataa[8..0]" (rect 0 0 60 14)(font "Arial" (font_size 8)))
		(text "dataa[8..0]" (rect 20 42 80 56)(font "Arial" (font_size 8)))
		(line (pt 0 48)(pt 16 48)(line_width 3))
	)
	(port
		(pt 128 56)
		(output)
		(text "alb" (rect 0 0 16 14)(font "Arial" (font_size 8)))
		(text "alb" (rect 95 50 111 64)(font "Arial" (font_size 8)))
		(line (pt 128 56)(pt 112 56)(line_width 1))
	)
	(drawing
		(text "unsigned compare" (rect 36 17 125 29)(font "Arial" ))
		(text "datab[]=80" (rect 20 58 80 72)(font "Arial" (font_size 8)))
		(line (pt 16 16)(pt 112 16)(line_width 1))
		(line (pt 112 16)(pt 112 80)(line_width 1))
		(line (pt 112 80)(pt 16 80)(line_width 1))
		(line (pt 16 80)(pt 16 16)(line_width 1))
	)
)
(symbol
	(rect 760 272 888 368)
	(text "lpm_compare2" (rect 22 1 122 17)(font "Arial" (font_size 10)))
	(text "inst31" (rect 8 80 37 92)(font "Arial" ))
	(port
		(pt 0 48)
		(input)
		(text "dataa[9..0]" (rect 0 0 60 14)(font "Arial" (font_size 8)))
		(text "dataa[9..0]" (rect 20 42 80 56)(font "Arial" (font_size 8)))
		(line (pt 0 48)(pt 16 48)(line_width 3))
	)
	(port
		(pt 128 56)
		(output)
		(text "alb" (rect 0 0 16 14)(font "Arial" (font_size 8)))
		(text "alb" (rect 95 50 111 64)(font "Arial" (font_size 8)))
		(line (pt 128 56)(pt 112 56)(line_width 1))
	)
	(drawing
		(text "unsigned compare" (rect 36 17 125 29)(font "Arial" ))
		(text "datab[]=400" (rect 20 58 87 72)(font "Arial" (font_size 8)))
		(line (pt 16 16)(pt 112 16)(line_width 1))
		(line (pt 112 16)(pt 112 80)(line_width 1))
		(line (pt 112 80)(pt 16 80)(line_width 1))
		(line (pt 16 80)(pt 16 16)(line_width 1))
	)
)
(symbol
	(rect 968 144 1032 224)
	(text "DFF" (rect 1 0 19 10)(font "Arial" (font_size 6)))
	(text "inst5" (rect 3 68 26 80)(font "Arial" ))
	(port
		(pt 32 80)
		(input)
		(text "CLRN" (rect 21 59 44 71)(font "Courier New" (bold)))
		(text "CLRN" (rect 21 58 44 70)(font "Courier New" (bold)))
		(line (pt 32 80)(pt 32 76)(line_width 1))
	)
	(port
		(pt 0 40)
		(input)
		(text "CLK" (rect 3 29 20 41)(font "Courier New" (bold))(invisible))
		(text "CLK" (rect 3 29 20 41)(font "Courier New" (bold))(invisible))
		(line (pt 0 40)(pt 12 40)(line_width 1))
	)
	(port
		(pt 0 24)
		(input)
		(text "D" (rect 14 20 19 32)(font "Courier New" (bold)))
		(text "D" (rect 14 20 19 32)(font "Courier New" (bold)))
		(line (pt 0 24)(pt 12 24)(line_width 1))
	)
	(port
		(pt 32 0)
		(input)
		(text "PRN" (rect 24 13 41 25)(font "Courier New" (bold)))
		(text "PRN" (rect 24 11 41 23)(font "Courier New" (bold)))
		(line (pt 32 4)(pt 32 0)(line_width 1))
	)
	(port
		(pt 64 24)
		(output)
		(text "Q" (rect 45 20 50 32)(font "Courier New" (bold)))
		(text "Q" (rect 45 20 50 32)(font "Courier New" (bold)))
		(line (pt 52 24)(pt 64 24)(line_width 1))
	)
	(drawing
		(line (pt 12 12)(pt 52 12)(line_width 1))
		(line (pt 12 68)(pt 52 68)(line_width 1))
		(line (pt 52 68)(pt 52 12)(line_width 1))
		(line (pt 12 68)(pt 12 12)(line_width 1))
		(line (pt 19 40)(pt 12 47)(line_width 1))
		(line (pt 12 32)(pt 20 40)(line_width 1))
		(circle (rect 28 4 36 12)(line_width 1))
		(circle (rect 28 68 36 76)(line_width 1))
	)
)
(symbol
	(rect 968 304 1032 384)
	(text "DFF" (rect 1 0 19 10)(font "Arial" (font_size 6)))
	(text "inst6" (rect 3 68 26 80)(font "Arial" ))
	(port
		(pt 32 80)
		(input)
		(text "CLRN" (rect 21 59 44 71)(font "Courier New" (bold)))
		(text "CLRN" (rect 21 58 44 70)(font "Courier New" (bold)))
		(line (pt 32 80)(pt 32 76)(line_width 1))
	)
	(port
		(pt 0 40)
		(input)
		(text "CLK" (rect 3 29 20 41)(font "Courier New" (bold))(invisible))
		(text "CLK" (rect 3 29 20 41)(font "Courier New" (bold))(invisible))
		(line (pt 0 40)(pt 12 40)(line_width 1))
	)
	(port
		(pt 0 24)
		(input)
		(text "D" (rect 14 20 19 32)(font "Courier New" (bold)))
		(text "D" (rect 14 20 19 32)(font "Courier New" (bold)))
		(line (pt 0 24)(pt 12 24)(line_width 1))
	)
	(port
		(pt 32 0)
		(input)
		(text "PRN" (rect 24 13 41 25)(font "Courier New" (bold)))
		(text "PRN" (rect 24 11 41 23)(font "Courier New" (bold)))
		(line (pt 32 4)(pt 32 0)(line_width 1))
	)
	(port
		(pt 64 24)
		(output)
		(text "Q" (rect 45 20 50 32)(font "Courier New" (bold)))
		(text "Q" (rect 45 20 50 32)(font "Courier New" (bold)))
		(line (pt 52 24)(pt 64 24)(line_width 1))
	)
	(drawing
		(line (pt 12 12)(pt 52 12)(line_width 1))
		(line (pt 12 68)(pt 52 68)(line_width 1))
		(line (pt 52 68)(pt 52 12)(line_width 1))
		(line (pt 12 68)(pt 12 12)(line_width 1))
		(line (pt 19 40)(pt 12 47)(line_width 1))
		(line (pt 12 32)(pt 20 40)(line_width 1))
		(circle (rect 28 4 36 12)(line_width 1))
		(circle (rect 28 68 36 76)(line_width 1))
	)
)
(symbol
	(rect 960 448 1008 480)
	(text "WIRE" (rect 1 0 24 10)(font "Arial" (font_size 6)))
	(text "inst7" (rect 3 21 26 33)(font "Arial" ))
	(port
		(pt 0 16)
		(input)
		(text "IN" (rect 2 7 13 19)(font "Courier New" (bold))(invisible))
		(text "IN" (rect 2 7 13 19)(font "Courier New" (bold))(invisible))
		(line (pt 0 16)(pt 14 16)(line_width 1))
	)
	(port
		(pt 48 16)
		(output)
		(text "OUT" (rect 32 7 49 19)(font "Courier New" (bold))(invisible))
		(text "OUT" (rect 32 7 49 19)(font "Courier New" (bold))(invisible))
		(line (pt 32 16)(pt 48 16)(line_width 1))
	)
	(drawing
		(line (pt 14 7)(pt 32 16)(line_width 1))
		(line (pt 14 25)(pt 14 7)(line_width 1))
		(line (pt 14 25)(pt 32 16)(line_width 1))
	)
)
(connector
	(text "CK200" (rect 264 152 297 164)(font "Arial" ))
	(pt 256 168)
	(pt 328 168)
)
(connector
	(text "CK200" (rect 264 248 297 260)(font "Arial" ))
	(pt 256 264)
	(pt 328 264)
)
(connector
	(text "zzz[9],TP[8..0]" (rect 365 400 434 412)(font "Arial" ))
	(pt 336 416)
	(pt 448 416)
	(bus)
)
(connector
	(text "zzz[9],TN[8..0]" (rect 365 432 435 444)(font "Arial" ))
	(pt 336 448)
	(pt 448 448)
	(bus)
)
(connector
	(text "TM[9..0]" (rect 616 416 656 428)(font "Arial" ))
	(pt 608 432)
	(pt 680 432)
	(bus)
)
(connector
	(text "CK200" (rect 384 416 417 428)(font "Arial" ))
	(pt 376 432)
	(pt 448 432)
)
(connector
	(text "CK200" (rect 904 168 937 180)(font "Arial" ))
	(pt 896 184)
	(pt 968 184)
)
(connector
	(pt 888 168)
	(pt 968 168)
)
(connector
	(text "TM[9..0]" (rect 696 304 736 316)(font "Arial" ))
	(pt 688 320)
	(pt 760 320)
	(bus)
)
(connector
	(text "CK200" (rect 904 328 937 340)(font "Arial" ))
	(pt 896 344)
	(pt 968 344)
)
(connector
	(pt 888 328)
	(pt 968 328)
)
(connector
	(pt 1032 168)
	(pt 1048 168)
)
(connector
	(text "TP[8..0]" (rect 709 144 747 156)(font "Arial" ))
	(pt 696 160)
	(pt 760 160)
	(bus)
)
(connector
	(text "TP[8..0]" (rect 421 136 459 148)(font "Arial" ))
	(pt 472 152)
	(pt 392 152)
	(bus)
)
(connector
	(text "TN[8..0]" (rect 421 232 461 244)(font "Arial" ))
	(pt 472 248)
	(pt 392 248)
	(bus)
)
(connector
	(pt 1040 328)
	(pt 1040 96)
)
(connector
	(pt 1032 328)
	(pt 1040 328)
)
(connector
	(pt 1040 96)
	(pt 1048 96)
)
(connector
	(pt 1008 464)
	(pt 1024 464)
	(bus)
)
(connector
	(text "PhUpDnMT,PhUpDnLE" (rect 840 448 953 460)(font "Arial" ))
	(pt 960 464)
	(pt 832 464)
	(bus)
)
(connector
	(pt 232 184)
	(pt 328 184)
)
(connector
	(pt 328 280)
	(pt 232 280)
)
(connector
	(pt 232 88)
	(pt 216 88)
)
(connector
	(pt 232 88)
	(pt 232 184)
)
(connector
	(pt 232 184)
	(pt 232 280)
)
(connector
	(pt 328 152)
	(pt 216 152)
	(bus)
)
(connector
	(pt 328 248)
	(pt 216 248)
	(bus)
)
(connector
	(text "zzz[127..0]" (rect 171 552 222 564)(font "Arial" ))
	(pt 152 568)
	(pt 248 568)
	(bus)
)
(junction (pt 232 184))
