999
dxfrw 0.5.11
0
SECTION
2
HEADER
9
$ACADVER
1
AC1021
9
$HANDSEED
5
20000
9
$DWGCODEPAGE
3
ANSI_1252
9
$INSBASE
10
0
20
0
30
0
9
$EXTMIN
10
0.9470217551
20
0.1598494519
30
0
9
$EXTMAX
10
10.4125707834
20
7.8110373478
30
0
9
$LIMMIN
10
0
20
0
9
$LIMMAX
10
11.6929133858
20
8.2677165354
9
$ORTHOMODE
70
0
9
$LTSCALE
40
0.6431102362
9
$TEXTSTYLE
7
STANDARD
9
$CLAYER
8
SNOUT
9
$DIMASZ
40
0.1875
9
$DIMLFAC
40
1
9
$DIMSCALE
40
1
9
$DIMEXO
40
0.0730807
9
$DIMEXE
40
0.210472
9
$DIMTXT
40
0.15625
9
$DIMTSZ
40
0
9
$DIMAUNIT
70
0
9
$DIMADEC
70
2
9
$DIMLUNIT
70
2
9
$DIMSTYLE
2
Standard
9
$DIMGAP
40
0.625
9
$DIMTIH
70
0
9
$LUNITS
70
2
9
$LUPREC
70
4
9
$AUNITS
70
0
9
$AUPREC
70
2
9
$SPLINESEGS
70
8
9
$GRIDMODE
70
0
9
$SNAPSTYLE
70
0
9
$GRIDUNIT
10
0
20
0
9
$VIEWCTR
10
5.8464566929
20
4.1338582677
9
$PINSBASE
10
0
20
0
30
0
9
$PLIMMIN
10
0
20
0
9
$PLIMMAX
10
210
20
297
9
$INSUNITS
70
4
9
$PSVPSCALE
40
1
0
ENDSEC
0
SECTION
2
CLASSES
0
ENDSEC
0
SECTION
2
TABLES
0
TABLE
2
VPORT
5
8
330
0
100
AcDbSymbolTable
70
1
0
VPORT
5
31
330
2
100
AcDbSymbolTableRecord
100
AcDbViewportTableRecord
2
*ACTIVE
70
0
10
0
20
0
11
1
21
1
12
5.89150609188
22
3.94900020434
13
0
23
0
14
10
24
10
15
10
25
10
16
0
26
0
36
1
17
0
27
0
37
0
40
7.83401197943
41
1.55659276546
42
50
43
0
44
0
50
0
51
0
71
0
72
100
73
1
74
3
75
0
76
0
77
0
78
0
281
0
65
1
110
0
120
0
130
0
111
1
121
0
131
0
112
0
122
1
132
0
79
0
146
0
348
10020
60
7
61
5
292
1
282
1
141
0
142
0
63
250
421
3358443
0
ENDTAB
0
TABLE
2
LTYPE
5
5
330
0
100
AcDbSymbolTable
70
4
0
LTYPE
5
14
330
5
100
AcDbSymbolTableRecord
100
AcDbLinetypeTableRecord
2
ByBlock
70
0
3

72
65
73
0
40
0
0
LTYPE
5
15
330
5
100
AcDbSymbolTableRecord
100
AcDbLinetypeTableRecord
2
ByLayer
70
0
3

72
65
73
0
40
0
0
LTYPE
5
16
330
5
100
AcDbSymbolTableRecord
100
AcDbLinetypeTableRecord
2
Continuous
70
0
3
Solid line
72
65
73
0
40
0
0
LTYPE
5
32
330
5
100
AcDbSymbolTableRecord
100
AcDbLinetypeTableRecord
2
DOT
70
0
3
Dot . . . . . . . . . . . . . . . . . . . . . .
72
65
73
2
40
6.35
49
0
74
0
49
-6.35
74
0
0
LTYPE
5
33
330
5
100
AcDbSymbolTableRecord
100
AcDbLinetypeTableRecord
2
DOT2
70
0
3
Dot (.5x) .....................................
72
65
73
2
40
3.175
49
0
74
0
49
-3.175
74
0
0
LTYPE
5
34
330
5
100
AcDbSymbolTableRecord
100
AcDbLinetypeTableRecord
2
DOTX2
70
0
3
Dot (2x) .  .  .  .  .  .  .  .  .  .  .  .  .
72
65
73
2
40
12.7
49
0
74
0
49
-12.7
74
0
0
LTYPE
5
35
330
5
100
AcDbSymbolTableRecord
100
AcDbLinetypeTableRecord
2
DASHED
70
0
3
Dot . . . . . . . . . . . . . . . . . . . . . .
72
65
73
2
40
19.05
49
12.7
74
0
49
-6.35
74
0
0
LTYPE
5
36
330
5
100
AcDbSymbolTableRecord
100
AcDbLinetypeTableRecord
2
DASHED2
70
0
3
Dashed (.5x) _ _ _ _ _ _ _ _ _ _ _ _ _ _ _ _ _
72
65
73
2
40
9.525
49
6.35
74
0
49
-3.175
74
0
0
LTYPE
5
37
330
5
100
AcDbSymbolTableRecord
100
AcDbLinetypeTableRecord
2
DASHEDX2
70
0
3
Dashed (2x) ____  ____  ____  ____  ____  ___
72
65
73
2
40
38.1
49
25.4
74
0
49
-12.7
74
0
0
LTYPE
5
38
330
5
100
AcDbSymbolTableRecord
100
AcDbLinetypeTableRecord
2
DASHDOT
70
0
3
Dash dot __ . __ . __ . __ . __ . __ . __ . __
72
65
73
4
40
25.4
49
12.7
74
0
49
-6.35
74
0
49
0
74
0
49
-6.35
74
0
0
LTYPE
5
39
330
5
100
AcDbSymbolTableRecord
100
AcDbLinetypeTableRecord
2
DASHDOT2
70
0
3
Dash dot (.5x) _._._._._._._._._._._._._._._.
72
65
73
4
40
12.7
49
6.35
74
0
49
-3.175
74
0
49
0
74
0
49
-3.175
74
0
0
LTYPE
5
3A
330
5
100
AcDbSymbolTableRecord
100
AcDbLinetypeTableRecord
2
DASHDOTX2
70
0
3
Dash dot (2x) ____  .  ____  .  ____  .  ___
72
65
73
4
40
50.8
49
25.4
74
0
49
-12.7
74
0
49
0
74
0
49
-12.7
74
0
0
LTYPE
5
3B
330
5
100
AcDbSymbolTableRecord
100
AcDbLinetypeTableRecord
2
DIVIDE
70
0
3
Divide ____ . . ____ . . ____ . . ____ . . ____
72
65
73
6
40
31.75
49
12.7
74
0
49
-6.35
74
0
49
0
74
0
49
-6.35
74
0
49
0
74
0
49
-6.35
74
0
0
LTYPE
5
3C
330
5
100
AcDbSymbolTableRecord
100
AcDbLinetypeTableRecord
2
DIVIDE2
70
0
3
Divide (.5x) __..__..__..__..__..__..__..__.._
72
65
73
6
40
15.875
49
6.35
74
0
49
-3.175
74
0
49
0
74
0
49
-3.175
74
0
49
0
74
0
49
-3.175
74
0
0
LTYPE
5
3D
330
5
100
AcDbSymbolTableRecord
100
AcDbLinetypeTableRecord
2
DIVIDEX2
70
0
3
Divide (2x) ________  .  .  ________  .  .  _
72
65
73
6
40
63.5
49
25.4
74
0
49
-12.7
74
0
49
0
74
0
49
-12.7
74
0
49
0
74
0
49
-12.7
74
0
0
LTYPE
5
3E
330
5
100
AcDbSymbolTableRecord
100
AcDbLinetypeTableRecord
2
BORDER
70
0
3
Border __ __ . __ __ . __ __ . __ __ . __ __ .
72
65
73
6
40
44.45
49
12.7
74
0
49
-6.35
74
0
49
12.7
74
0
49
-6.35
74
0
49
0
74
0
49
-6.35
74
0
0
LTYPE
5
3F
330
5
100
AcDbSymbolTableRecord
100
AcDbLinetypeTableRecord
2
BORDER2
70
0
3
Border (.5x) __.__.__.__.__.__.__.__.__.__.__.
72
65
73
6
40
22.225
49
6.35
74
0
49
-3.175
74
0
49
6.35
74
0
49
-3.175
74
0
49
0
74
0
49
-3.175
74
0
0
LTYPE
5
40
330
5
100
AcDbSymbolTableRecord
100
AcDbLinetypeTableRecord
2
BORDERX2
70
0
3
Border (2x) ____  ____  .  ____  ____  .  ___
72
65
73
6
40
88.9
49
25.4
74
0
49
-12.7
74
0
49
25.4
74
0
49
-12.7
74
0
49
0
74
0
49
-12.7
74
0
0
LTYPE
5
41
330
5
100
AcDbSymbolTableRecord
100
AcDbLinetypeTableRecord
2
CENTER
70
0
3
Center ____ _ ____ _ ____ _ ____ _ ____ _ ____
72
65
73
4
40
50.8
49
31.75
74
0
49
-6.35
74
0
49
6.35
74
0
49
-6.35
74
0
0
LTYPE
5
42
330
5
100
AcDbSymbolTableRecord
100
AcDbLinetypeTableRecord
2
CENTER2
70
0
3
Center (.5x) ___ _ ___ _ ___ _ ___ _ ___ _ ___
72
65
73
4
40
28.575
49
19.05
74
0
49
-3.175
74
0
49
3.175
74
0
49
-3.175
74
0
0
LTYPE
5
43
330
5
100
AcDbSymbolTableRecord
100
AcDbLinetypeTableRecord
2
CENTERX2
70
0
3
Center (2x) ________  __  ________  __  _____
72
65
73
4
40
101.6
49
63.5
74
0
49
-12.7
74
0
49
12.7
74
0
49
-12.7
74
0
0
ENDTAB
0
TABLE
2
LAYER
5
2
330
0
100
AcDbSymbolTable
70
1
0
LAYER
5
10
330
2
100
AcDbSymbolTableRecord
100
AcDbLayerTableRecord
2
0
70
0
62
7
6
CONTINUOUS
370
-3
390
F
0
LAYER
5
44
330
2
100
AcDbSymbolTableRecord
100
AcDbLayerTableRecord
2
DEFAULT_3
70
0
62
7
6
CONTINUOUS
370
-3
390
F
0
LAYER
5
45
330
2
100
AcDbSymbolTableRecord
100
AcDbLayerTableRecord
2
SNOUT
70
0
62
7
6
CONTINUOUS
370
0
390
F
0
ENDTAB
0
TABLE
2
STYLE
5
3
330
0
100
AcDbSymbolTable
70
3
0
STYLE
5
46
330
2
100
AcDbSymbolTableRecord
100
AcDbTextStyleTableRecord
2
standard
70
0
40
0
41
1
50
0
71
0
42
1
3
standard
4

0
ENDTAB
0
TABLE
2
VIEW
5
6
330
0
100
AcDbSymbolTable
70
0
0
ENDTAB
0
TABLE
2
UCS
5
7
330
0
100
AcDbSymbolTable
70
0
0
ENDTAB
0
TABLE
2
APPID
5
9
330
0
100
AcDbSymbolTable
70
1
0
APPID
5
12
330
9
100
AcDbSymbolTableRecord
100
AcDbRegAppTableRecord
2
ACAD
70
0
0
ENDTAB
0
TABLE
2
DIMSTYLE
5
A
330
0
100
AcDbSymbolTable
70
1
100
AcDbDimStyleTable
71
1
0
DIMSTYLE
105
47
330
A
100
AcDbSymbolTableRecord
100
AcDbDimStyleTableRecord
2
Standard
70
0
40
1
41
0.1875
42
0.0730807
43
0.38
44
0.210472
45
0
46
0
47
0
48
0
140
0.15625
141
0.09
142
0
143
25.4
144
1
145
0
146
1
147
0.625
148
0
71
0
72
0
73
0
74
1
75
0
76
0
77
0
78
0
79
0
170
0
171
2
172
0
173
0
174
0
175
0
176
0
177
0
178
0
179
0
271
4
272
4
273
2
274
2
275
0
276
0
277
2
278
46
279
0
280
0
281
0
282
0
283
1
284
0
285
0
286
0
288
0
289
3
340
Standard
341

371
-2
372
-2
0
ENDTAB
0
TABLE
2
BLOCK_RECORD
5
1
330
0
100
AcDbSymbolTable
70
2
0
BLOCK_RECORD
5
1F
330
1
100
AcDbSymbolTableRecord
100
AcDbBlockTableRecord
2
*Model_Space
70
0
280
1
281
0
0
BLOCK_RECORD
5
1E
330
1
100
AcDbSymbolTableRecord
100
AcDbBlockTableRecord
2
*Paper_Space
70
0
280
1
281
0
0
BLOCK_RECORD
5
48
330
1
100
AcDbSymbolTableRecord
100
AcDbBlockTableRecord
2
*D1
70
0
280
1
281
0
0
BLOCK_RECORD
5
4B
330
1
100
AcDbSymbolTableRecord
100
AcDbBlockTableRecord
2
*D4
70
0
280
1
281
0
0
BLOCK_RECORD
5
4E
330
1
100
AcDbSymbolTableRecord
100
AcDbBlockTableRecord
2
*D3
70
0
280
1
281
0
0
BLOCK_RECORD
5
51
330
1
100
AcDbSymbolTableRecord
100
AcDbBlockTableRecord
2
*D2
70
0
280
1
281
0
0
BLOCK_RECORD
5
54
330
1
100
AcDbSymbolTableRecord
100
AcDbBlockTableRecord
2
_CLOSED
70
0
280
1
281
0
0
ENDTAB
0
ENDSEC
0
SECTION
2
BLOCKS
0
BLOCK
5
20
330
1F
100
AcDbEntity
8
0
100
AcDbBlockBegin
2
*Model_Space
70
0
10
0
20
0
30
0
3
*Model_Space
1

0
ENDBLK
5
21
330
1F
100
AcDbEntity
8
0
100
AcDbBlockEnd
0
BLOCK
5
1C
330
1B
100
AcDbEntity
8
0
100
AcDbBlockBegin
2
*Paper_Space
70
0
10
0
20
0
30
0
3
*Paper_Space
1

0
ENDBLK
5
1D
330
1F
100
AcDbEntity
8
0
100
AcDbBlockEnd
0
BLOCK
5
49
330
48
100
AcDbEntity
8
0
100
AcDbBlockBegin
2
*D1
70
1
10
0
20
0
3
*D1
1

0
LINE
5
57
100
AcDbEntity
8
0
6
CONTINUOUS
62
7
370
0
100
AcDbLine
10
1.0095217551
20
6.2243237606
11
1.0095217551
21
5.6396780913
0
SOLID
5
58
100
AcDbEntity
8
0
6
CONTINUOUS
62
7
370
0
100
AcDbTrace
10
1.0095217551
20
6.2243237606
30
0
11
1.04074310443
21
6.0368237606
31
0
12
0.978300405767
22
6.0368237606
32
0
13
0.978300405767
23
6.0368237606
33
0
0
ENDBLK
5
4A
330
48
100
AcDbEntity
8
0
100
AcDbBlockEnd
0
BLOCK
5
4C
330
4B
100
AcDbEntity
8
0
100
AcDbBlockBegin
2
*D4
70
1
10
0
20
0
3
*D4
1

0
LINE
5
59
100
AcDbEntity
8
0
6
CONTINUOUS
62
7
370
0
100
AcDbLine
10
2.8798019525
20
7.7329123478
11
3.2164554613
21
7.7329123478
0
SOLID
5
5A
100
AcDbEntity
8
0
6
CONTINUOUS
62
7
370
0
100
AcDbTrace
10
2.8798019525
20
7.7329123478
30
0
11
3.0673019525
21
7.76413369713
31
0
12
3.0673019525
22
7.70169099847
32
0
13
3.0673019525
23
7.70169099847
33
0
0
ENDBLK
5
4D
330
4B
100
AcDbEntity
8
0
100
AcDbBlockEnd
0
BLOCK
5
4F
330
4E
100
AcDbEntity
8
0
100
AcDbBlockBegin
2
*D3
70
1
10
0
20
0
3
*D3
1

0
LINE
5
5B
100
AcDbEntity
8
0
6
CONTINUOUS
62
7
370
0
100
AcDbLine
10
2.8798019525
20
3.5852324703
11
3.2164554613
21
3.5852324703
0
SOLID
5
5C
100
AcDbEntity
8
0
6
CONTINUOUS
62
7
370
0
100
AcDbTrace
10
2.8798019525
20
3.5852324703
30
0
11
3.0673019525
21
3.61645381963
31
0
12
3.0673019525
22
3.55401112097
32
0
13
3.0673019525
23
3.55401112097
33
0
0
ENDBLK
5
50
330
4E
100
AcDbEntity
8
0
100
AcDbBlockEnd
0
BLOCK
5
52
330
51
100
AcDbEntity
8
0
100
AcDbBlockBegin
2
*D2
70
1
10
0
20
0
3
*D2
1

0
LINE
5
5D
100
AcDbEntity
8
0
6
CONTINUOUS
62
7
370
0
100
AcDbLine
10
5.9352001911
20
6.2243237606
11
5.9352001911
21
5.6396780913
0
SOLID
5
5E
100
AcDbEntity
8
0
6
CONTINUOUS
62
7
370
0
100
AcDbTrace
10
5.9352001911
20
6.2243237606
30
0
11
5.96642154043
21
6.0368237606
31
0
12
5.90397884177
22
6.0368237606
32
0
13
5.90397884177
23
6.0368237606
33
0
0
ENDBLK
5
53
330
51
100
AcDbEntity
8
0
100
AcDbBlockEnd
0
BLOCK
5
55
330
54
100
AcDbEntity
8
0
100
AcDbBlockBegin
2
_CLOSED
70
0
10
0
20
0
3
_CLOSED
1

0
LINE
5
5F
100
AcDbEntity
8
0
6
ByBlock
62
0
370
-1
100
AcDbLine
10
0
20
0
11
-1
21
0.1666666667
0
LINE
5
60
100
AcDbEntity
8
0
6
ByBlock
62
0
370
-1
100
AcDbLine
10
-1
20
0.1666666667
11
-1
21
-0.1666666667
0
LINE
5
61
100
AcDbEntity
8
0
6
ByBlock
62
0
370
-1
100
AcDbLine
10
-1
20
-0.1666666667
11
0
21
0
0
LINE
5
62
100
AcDbEntity
8
0
6
ByBlock
62
0
370
-1
100
AcDbLine
10
-1
20
0
11
0
21
0
0
ENDBLK
5
56
330
54
100
AcDbEntity
8
0
100
AcDbBlockEnd
0
ENDSEC
0
SECTION
2
ENTITIES
0
HATCH
5
63
100
AcDbEntity
8
SNOUT
6
CONTINUOUS
62
2
370
-1
100
AcDbHatch
10
0
20
0
30
0
210
0
220
0
230
1
2
B
70
0
71
0
91
4
92
0
93
4
72
1
10
8.050366059
20
3.1017592374
11
8.1251692086
21
3.1017592374
72
1
10
8.1251692086
20
3.1017592374
11
8.1251692086
21
3.2986096311
72
1
10
8.1251692086
20
3.2986096311
11
8.050366059
21
3.2986096311
72
1
10
8.050366059
20
3.2986096311
11
8.050366059
21
3.1017592374
97
0
92
0
93
19
72
1
10
8.2905235393
20
3.1017592374
11
8.3653266889
21
3.1017592374
72
1
10
8.3653266889
20
3.1017592374
11
8.3653266889
21
2.3930978201
72
1
10
8.3653266889
20
2.3930978201
11
7.892885744
21
1.9206568752
72
1
10
7.892885744
20
1.9206568752
11
7.3417046416
21
1.9206568752
72
1
10
7.3417046416
20
1.9206568752
11
7.3417046416
21
1.2513655366
72
1
10
7.3417046416
20
1.2513655366
11
6.9480038542
21
1.2513655366
72
1
10
6.9480038542
20
1.2513655366
11
6.9480038542
21
1.0151450642
72
1
10
6.9480038542
20
1.0151450642
11
7.4598148779
21
1.0151450642
72
1
10
7.4598148779
20
1.0151450642
11
7.4598148779
21
1.802546639
72
1
10
7.4598148779
20
1.802546639
11
7.9716259015
21
1.802546639
72
1
10
7.9716259015
20
1.802546639
11
7.9716259015
21
1.9206568752
72
1
10
7.9716259015
20
1.9206568752
11
8.4440668464
21
2.3930978201
72
1
10
8.4440668464
20
2.3930978201
11
8.4440668464
21
3.2986096311
72
1
10
8.4440668464
20
3.2986096311
11
8.3850117283
21
3.2986096311
72
1
10
8.3850117283
20
3.2986096311
11
8.3850117283
21
3.2513655366
72
1
10
8.3850117283
20
3.2513655366
11
8.3062715708
21
3.2513655366
72
1
10
8.3062715708
20
3.2513655366
11
8.3062715708
21
3.2986096311
72
1
10
8.3062715708
20
3.2986096311
11
8.2905235393
21
3.2986096311
72
1
10
8.2905235393
20
3.2986096311
11
8.2905235393
21
3.1017592374
97
0
92
0
93
19
72
1
10
8.9952479487
20
3.1017592374
11
9.0700510983
21
3.1017592374
72
1
10
9.0700510983
20
3.1017592374
11
9.0700510983
21
3.2986096311
72
1
10
9.0700510983
20
3.2986096311
11
9.0543030668
21
3.2986096311
72
1
10
9.0543030668
20
3.2986096311
11
9.0543030668
21
3.2513655366
72
1
10
9.0543030668
20
3.2513655366
11
8.9755629094
21
3.2513655366
72
1
10
8.9755629094
20
3.2513655366
11
8.9755629094
21
3.2986096311
72
1
10
8.9755629094
20
3.2986096311
11
8.9165077913
21
3.2986096311
72
1
10
8.9165077913
20
3.2986096311
11
8.9165077913
21
2.3930978201
72
1
10
8.9165077913
20
2.3930978201
11
9.3889487361
21
1.9206568752
72
1
10
9.3889487361
20
1.9206568752
11
9.3889487361
21
1.802546639
72
1
10
9.3889487361
20
1.802546639
11
9.9007597598
21
1.802546639
72
1
10
9.9007597598
20
1.802546639
11
9.9007597598
21
1.0151450642
72
1
10
9.9007597598
20
1.0151450642
11
10.4125707834
21
1.0151450642
72
1
10
10.4125707834
20
1.0151450642
11
10.4125707834
21
1.2513655366
72
1
10
10.4125707834
20
1.2513655366
11
10.018869996
21
1.2513655366
72
1
10
10.018869996
20
1.2513655366
11
10.018869996
21
1.9206568752
72
1
10
10.018869996
20
1.9206568752
11
9.4676888936
21
1.9206568752
72
1
10
9.4676888936
20
1.9206568752
11
8.9952479487
21
2.3930978201
72
1
10
8.9952479487
20
2.3930978201
11
8.9952479487
21
3.1017592374
97
0
92
0
93
4
72
1
10
9.235405429
20
3.1017592374
11
9.3102085787
21
3.1017592374
72
1
10
9.3102085787
20
3.1017592374
11
9.3102085787
21
3.2986096311
72
1
10
9.3102085787
20
3.2986096311
11
9.235405429
21
3.2986096311
72
1
10
9.235405429
20
3.2986096311
11
9.235405429
21
3.1017592374
97
0
75
0
76
1
52
45
41
0.2462667469
77
0
78
0
98
0
0
HATCH
5
64
100
AcDbEntity
8
SNOUT
6
CONTINUOUS
62
2
370
-1
100
AcDbHatch
10
0
20
0
30
0
210
0
220
0
230
1
2
A
70
0
71
0
91
2
92
0
93
17
72
1
10
2.1140932566
20
3.1017592374
11
2.2912586109
21
3.1017592374
72
1
10
2.2912586109
20
3.1017592374
11
2.2912586109
21
2.3930978201
72
1
10
2.2912586109
20
2.3930978201
11
2.0550381385
21
1.9206568752
72
1
10
2.0550381385
20
1.9206568752
11
2.0156680597
21
1.9206568752
72
1
10
2.0156680597
20
1.9206568752
11
2.0156680597
21
1.2513655366
72
1
10
2.0156680597
20
1.2513655366
11
1.6219672723
21
1.2513655366
72
1
10
1.6219672723
20
1.2513655366
11
1.6219672723
21
1.0151450642
72
1
10
1.6219672723
20
1.0151450642
11
2.1337782959
21
1.0151450642
72
1
10
2.1337782959
20
1.0151450642
11
2.1337782959
21
1.9206568752
72
1
10
2.1337782959
20
1.9206568752
11
2.3699987684
21
2.3930978201
72
1
10
2.3699987684
20
2.3930978201
11
2.3699987684
21
3.2986096311
72
1
10
2.3699987684
20
3.2986096311
11
2.3109436503
21
3.2986096311
72
1
10
2.3109436503
20
3.2986096311
11
2.3109436503
21
3.2513655366
72
1
10
2.3109436503
20
3.2513655366
11
2.2322034928
21
3.2513655366
72
1
10
2.2322034928
20
3.2513655366
11
2.2322034928
21
3.2986096311
72
1
10
2.2322034928
20
3.2986096311
11
2.1140932566
21
3.2986096311
72
1
10
2.1140932566
20
3.2986096311
11
2.1140932566
21
3.1017592374
97
0
92
0
93
19
72
1
10
4.1416523117
20
3.1017592374
11
4.318817666
21
3.1017592374
72
1
10
4.318817666
20
3.1017592374
11
4.318817666
21
3.2986096311
72
1
10
4.318817666
20
3.2986096311
11
4.2007074298
21
3.2986096311
72
1
10
4.2007074298
20
3.2986096311
11
4.2007074298
21
3.2513655366
72
1
10
4.2007074298
20
3.2513655366
11
4.1219672723
21
3.2513655366
72
1
10
4.1219672723
20
3.2513655366
11
4.1219672723
21
3.2986096311
72
1
10
4.1219672723
20
3.2986096311
11
4.0629121542
21
3.2986096311
72
1
10
4.0629121542
20
3.2986096311
11
4.0629121542
21
2.3930978201
72
1
10
4.0629121542
20
2.3930978201
11
4.5156680597
21
1.9206568752
72
1
10
4.5156680597
20
1.9206568752
11
4.5156680597
21
1.802546639
72
1
10
4.5156680597
20
1.802546639
11
4.8109436503
21
1.802546639
72
1
10
4.8109436503
20
1.802546639
11
4.8109436503
21
1.0151450642
72
1
10
4.8109436503
20
1.0151450642
11
5.3227546739
21
1.0151450642
72
1
10
5.3227546739
20
1.0151450642
11
5.3227546739
21
1.2513655366
72
1
10
5.3227546739
20
1.2513655366
11
4.9290538865
21
1.2513655366
72
1
10
4.9290538865
20
1.2513655366
11
4.9290538865
21
1.9206568752
72
1
10
4.9290538865
20
1.9206568752
11
4.5944082172
21
1.9206568752
72
1
10
4.5944082172
20
1.9206568752
11
4.1416523117
21
2.3930978201
72
1
10
4.1416523117
20
2.3930978201
11
4.1416523117
21
3.1017592374
97
0
75
0
76
1
52
45
41
0.3019444462
77
0
78
0
98
0
0
MTEXT
5
65
100
AcDbEntity
8
0
6
CONTINUOUS
62
7
370
-1
100
AcDbMText
10
0.9470217551
20
6.4586987606
30
0
40
0.15625
41
0.104166666667
71
1
72
1
1
A
7
standard
210
0
220
0
230
1
50
0
73
1
44
0.9
0
LEADER
5
66
100
AcDbEntity
8
0
6
CONTINUOUS
62
7
370
-1
100
AcDbLeader
3
Standard
71
1
72
0
73
3
74
0
75
0
40
1
41
10
76
2
76
2
10
1.0095217551
20
6.2243237606
30
0
10
1.0095217551
20
5.6396780913
30
0
0
MTEXT
5
67
100
AcDbEntity
8
0
6
CONTINUOUS
62
7
370
-1
100
AcDbMText
10
5.8727001911
20
6.4586987606
30
0
40
0.15625
41
0.104166666667
71
1
72
1
1
A
7
standard
210
0
220
0
230
1
50
0
73
1
44
0.9
0
LEADER
5
68
100
AcDbEntity
8
0
6
CONTINUOUS
62
7
370
-1
100
AcDbLeader
3
Standard
71
1
72
0
73
3
74
0
75
0
40
1
41
10
76
2
76
2
10
5.9352001911
20
6.2243237606
30
0
10
5.9352001911
20
5.6396780913
30
0
0
MTEXT
5
69
100
AcDbEntity
8
0
6
CONTINUOUS
62
7
370
-1
100
AcDbMText
10
2.6923019525
20
3.6633574703
30
0
40
0.15625
41
0.0868055555556
71
1
72
1
1
B
7
standard
210
0
220
0
230
1
50
0
73
1
44
0.9
0
LEADER
5
6A
100
AcDbEntity
8
0
6
CONTINUOUS
62
7
370
-1
100
AcDbLeader
3
Standard
71
1
72
0
73
3
74
0
75
0
40
1
41
10
76
2
76
2
10
2.8798019525
20
3.5852324703
30
0
10
3.2164554613
20
3.5852324703
30
0
0
MTEXT
5
6B
100
AcDbEntity
8
0
6
CONTINUOUS
62
7
370
-1
100
AcDbMText
10
2.6923019525
20
7.8110373478
30
0
40
0.15625
41
0.0868055555556
71
1
72
1
1
B
7
standard
210
0
220
0
230
1
50
0
73
1
44
0.9
0
LEADER
5
6C
100
AcDbEntity
8
0
6
CONTINUOUS
62
7
370
-1
100
AcDbLeader
3
Standard
71
1
72
0
73
3
74
0
75
0
40
1
41
10
76
2
76
2
10
2.8798019525
20
7.7329123478
30
0
10
3.2164554613
20
7.7329123478
30
0
0
MTEXT
5
6D
100
AcDbEntity
8
0
6
CONTINUOUS
62
2
370
-1
100
AcDbMText
10
4.1448673408
20
0.4410896842
30
0
40
0.15625
41
1.46701385576
71
3
72
1
1
SECTION  A-A
7
standard
210
0
220
0
230
1
50
0
73
1
44
0.9
0
MTEXT
5
6E
100
AcDbEntity
8
0
6
CONTINUOUS
62
2
370
-1
100
AcDbMText
10
9.3885653018
20
0.3160994519
30
0
40
0.15625
41
1.43229163354
71
3
72
1
1
SECTION  B-B
7
standard
210
0
220
0
230
1
50
0
73
1
44
0.9
0
LINE
5
6F
100
AcDbEntity
8
DEFAULT_3
6
CONTINUOUS
62
7
370
-1
100
AcDbLine
10
3.2164554613
20
3.5852324703
11
3.2164554613
21
7.7329123478
0
LINE
5
70
100
AcDbEntity
8
DEFAULT_3
6
CONTINUOUS
62
7
370
-1
100
AcDbLine
10
1.0095217551
20
5.6396780913
11
5.9352001911
21
5.6396780913
0
LINE
5
71
100
AcDbEntity
8
SNOUT
6
CONTINUOUS
62
7
370
-1
100
AcDbLine
10
2.1140932566
20
3.1017592374
11
2.1140932566
21
3.2986096311
0
LINE
5
72
100
AcDbEntity
8
SNOUT
6
CONTINUOUS
62
7
370
-1
100
AcDbLine
10
2.2322034928
20
3.2986096311
11
2.2322034928
21
3.2513655366
0
LINE
5
73
100
AcDbEntity
8
SNOUT
6
CONTINUOUS
62
7
370
-1
100
AcDbLine
10
2.2912586109
20
3.1017592374
11
2.2912586109
21
2.3930978201
0
LINE
5
74
100
AcDbEntity
8
SNOUT
6
CONTINUOUS
62
7
370
-1
100
AcDbLine
10
2.3109436503
20
3.2513655366
11
2.3109436503
21
3.2986096311
0
LINE
5
75
100
AcDbEntity
8
SNOUT
6
CONTINUOUS
62
7
370
-1
100
AcDbLine
10
2.2912586109
20
2.3930978201
11
2.0550381385
21
1.9206568752
0
LINE
5
76
100
AcDbEntity
8
SNOUT
6
CONTINUOUS
62
7
370
-1
100
AcDbLine
10
2.3699987684
20
3.2986096311
11
2.3699987684
21
2.3930978201
0
LINE
5
77
100
AcDbEntity
8
SNOUT
6
CONTINUOUS
62
7
370
-1
100
AcDbLine
10
2.3699987684
20
2.3930978201
11
2.1337782959
21
1.9206568752
0
LINE
5
78
100
AcDbEntity
8
SNOUT
6
CONTINUOUS
62
7
370
-1
100
AcDbLine
10
2.1337782959
20
1.802546639
11
4.8109436503
21
1.802546639
0
LINE
5
79
100
AcDbEntity
8
SNOUT
6
CONTINUOUS
62
7
370
-1
100
AcDbLine
10
4.3581877448
20
1.9206568752
11
2.2912586109
21
1.9206568752
0
LINE
5
7A
100
AcDbEntity
8
SNOUT
6
CONTINUOUS
62
7
370
-1
100
AcDbLine
10
2.0156680597
20
1.9206568752
11
2.0550381385
21
1.9206568752
0
LINE
5
7B
100
AcDbEntity
8
SNOUT
6
CONTINUOUS
62
7
370
-1
100
AcDbLine
10
4.5944082172
20
1.9206568752
11
4.9290538865
21
1.9206568752
0
LINE
5
7C
100
AcDbEntity
8
SNOUT
6
CONTINUOUS
62
7
370
-1
100
AcDbLine
10
2.5274790833
20
2.3930978201
11
3.9054318393
21
2.3930978201
0
LINE
5
7D
100
AcDbEntity
8
SNOUT
6
CONTINUOUS
62
7
370
-1
100
AcDbLine
10
4.0629121542
20
3.2986096311
11
4.0629121542
21
2.3930978201
0
LINE
5
7E
100
AcDbEntity
8
SNOUT
6
CONTINUOUS
62
7
370
-1
100
AcDbLine
10
4.0580845841
20
2.3981352845
11
4.5156680597
21
1.9206568752
0
LINE
5
7F
100
AcDbEntity
8
SNOUT
6
CONTINUOUS
62
7
370
-1
100
AcDbLine
10
4.1219672723
20
3.2513655366
11
4.1219672723
21
3.2986096311
0
LINE
5
80
100
AcDbEntity
8
SNOUT
6
CONTINUOUS
62
7
370
-1
100
AcDbLine
10
4.1416523117
20
3.1017592374
11
4.1416523117
21
2.3930978201
0
LINE
5
81
100
AcDbEntity
8
SNOUT
6
CONTINUOUS
62
7
370
-1
100
AcDbLine
10
4.2007074298
20
3.2986096311
11
4.2007074298
21
3.2513655366
0
LINE
5
82
100
AcDbEntity
8
SNOUT
6
CONTINUOUS
62
7
370
-1
100
AcDbLine
10
4.1416523117
20
2.3930978201
11
4.5944082172
21
1.9206568752
0
LINE
5
83
100
AcDbEntity
8
SNOUT
6
CONTINUOUS
62
7
370
-1
100
AcDbLine
10
4.318817666
20
3.1017592374
11
4.318817666
21
3.2986096311
0
LINE
5
84
100
AcDbEntity
8
SNOUT
6
CONTINUOUS
62
7
370
-1
100
AcDbLine
10
2.1140932566
20
3.1017592374
11
2.2912586109
21
3.1017592374
0
LINE
5
85
100
AcDbEntity
8
SNOUT
6
CONTINUOUS
62
7
370
-1
100
AcDbLine
10
4.1416523117
20
3.1017592374
11
4.318817666
21
3.1017592374
0
LINE
5
86
100
AcDbEntity
8
SNOUT
6
CONTINUOUS
62
7
370
-1
100
AcDbLine
10
4.5156680597
20
1.9206568752
11
4.5156680597
21
1.802546639
0
LINE
5
87
100
AcDbEntity
8
SNOUT
6
CONTINUOUS
62
7
370
-1
100
AcDbLine
10
4.2007074298
20
3.2513655366
11
4.1219672723
21
3.2513655366
0
LINE
5
88
100
AcDbEntity
8
SNOUT
6
CONTINUOUS
62
7
370
-1
100
AcDbLine
10
2.3109436503
20
3.2513655366
11
2.2322034928
21
3.2513655366
0
LINE
5
89
100
AcDbEntity
8
SNOUT
6
CONTINUOUS
62
7
370
-1
100
AcDbLine
10
2.1140932566
20
3.2986096311
11
2.3055034828
21
3.2986096311
0
LINE
5
8A
100
AcDbEntity
8
SNOUT
6
CONTINUOUS
62
7
370
-1
100
AcDbLine
10
2.3109436503
20
3.2986096311
11
4.318817666
21
3.2986096311
0
LINE
5
8B
100
AcDbEntity
8
SNOUT
6
CONTINUOUS
62
7
370
-1
100
AcDbLine
10
1.6219672723
20
4.0648749417
11
1.6219672723
21
7.2144812409
0
LINE
5
8C
100
AcDbEntity
8
SNOUT
6
CONTINUOUS
62
7
370
-1
100
AcDbLine
10
5.1652743589
20
3.9073946267
11
1.7794475873
21
3.9073946267
0
LINE
5
8D
100
AcDbEntity
8
SNOUT
6
CONTINUOUS
62
7
370
-1
100
AcDbLine
10
2.0156680597
20
4.4585757291
11
2.0156680597
21
6.8207804535
0
LINE
5
8E
100
AcDbEntity
8
SNOUT
6
CONTINUOUS
62
7
370
-1
100
AcDbLine
10
2.0550381385
20
5.0807017055
11
2.0550381385
21
6.1986544771
0
LINE
5
8F
100
AcDbEntity
8
SNOUT
6
CONTINUOUS
62
7
370
-1
100
AcDbLine
10
2.1140932566
20
6.1514891149
11
2.1140932566
21
5.1278670677
0
LINE
5
90
100
AcDbEntity
8
SNOUT
6
CONTINUOUS
62
7
370
-1
100
AcDbLine
10
4.7715735715
20
4.3010954141
11
2.1731483747
21
4.3010954141
0
LINE
5
91
100
AcDbEntity
8
SNOUT
6
CONTINUOUS
62
7
370
-1
100
AcDbLine
10
2.2322034928
20
5.7184182488
11
2.2322034928
21
5.5609379338
0
LINE
5
92
100
AcDbEntity
8
SNOUT
6
CONTINUOUS
62
7
370
-1
100
AcDbLine
10
2.3109436503
20
5.7184182488
11
2.3109436503
21
5.5609379338
0
LINE
5
93
100
AcDbEntity
8
SNOUT
6
CONTINUOUS
62
7
370
-1
100
AcDbLine
10
2.3699987684
20
5.5609379338
11
2.3699987684
21
5.7184182488
0
LINE
5
94
100
AcDbEntity
8
SNOUT
6
CONTINUOUS
62
7
370
-1
100
AcDbLine
10
4.4273010882
20
4.8522765165
11
2.2356241065
21
4.8522765165
0
LINE
5
95
100
AcDbEntity
8
SNOUT
6
CONTINUOUS
62
7
370
-1
100
AcDbLine
10
2.2322034928
20
5.0097568315
11
4.2007074298
21
5.0097568315
0
LINE
5
96
100
AcDbEntity
8
SNOUT
6
CONTINUOUS
62
7
370
-1
100
AcDbLine
10
2.5274790833
20
5.2656623433
11
3.9054318393
21
5.2656623433
0
LINE
5
97
100
AcDbEntity
8
SNOUT
6
CONTINUOUS
62
7
370
-1
100
AcDbLine
10
2.5274790833
20
5.3444025008
11
3.9054318393
21
5.3444025008
0
LINE
5
98
100
AcDbEntity
8
SNOUT
6
CONTINUOUS
62
7
370
-1
100
AcDbLine
10
3.9054318393
20
5.4034576189
11
2.5274790833
21
5.4034576189
0
LINE
5
99
100
AcDbEntity
8
SNOUT
6
CONTINUOUS
62
7
370
-1
100
AcDbLine
10
2.5274790833
20
5.8758985638
11
3.9054318393
21
5.8758985638
0
LINE
5
9A
100
AcDbEntity
8
SNOUT
6
CONTINUOUS
62
7
370
-1
100
AcDbLine
10
3.9054318393
20
5.9349536819
11
2.5274790833
21
5.9349536819
0
LINE
5
9B
100
AcDbEntity
8
SNOUT
6
CONTINUOUS
62
7
370
-1
100
AcDbLine
10
3.9054318393
20
6.0136938393
11
2.5274790833
21
6.0136938393
0
LINE
5
9C
100
AcDbEntity
8
SNOUT
6
CONTINUOUS
62
7
370
-1
100
AcDbLine
10
4.0629121542
20
5.7184182488
11
4.0629121542
21
5.5609379338
0
LINE
5
9D
100
AcDbEntity
8
SNOUT
6
CONTINUOUS
62
7
370
-1
100
AcDbLine
10
4.1219672723
20
5.5609379338
11
4.1219672723
21
5.7184182488
0
LINE
5
9E
100
AcDbEntity
8
SNOUT
6
CONTINUOUS
62
7
370
-1
100
AcDbLine
10
4.2007074298
20
6.2695993512
11
2.2322034928
21
6.2695993512
0
LINE
5
9F
100
AcDbEntity
8
SNOUT
6
CONTINUOUS
62
7
370
-1
100
AcDbLine
10
4.2007074298
20
5.5609379338
11
4.2007074298
21
5.7184182488
0
LINE
5
A0
100
AcDbEntity
8
SNOUT
6
CONTINUOUS
62
7
370
-1
100
AcDbLine
10
4.318817666
20
5.1278670677
11
4.318817666
21
6.1514891149
0
LINE
5
A1
100
AcDbEntity
8
SNOUT
6
CONTINUOUS
62
7
370
-1
100
AcDbLine
10
2.2356241065
20
6.4270796661
11
4.4273010882
21
6.4270796661
0
LINE
5
A2
100
AcDbEntity
8
SNOUT
6
CONTINUOUS
62
7
370
-1
100
AcDbLine
10
4.5944082172
20
6.2564556821
11
4.5944082172
21
5.0229005006
0
LINE
5
A3
100
AcDbEntity
8
SNOUT
6
CONTINUOUS
62
7
370
-1
100
AcDbLine
10
2.1731483747
20
6.9782607685
11
4.7715735715
21
6.9782607685
0
LINE
5
A4
100
AcDbEntity
8
SNOUT
6
CONTINUOUS
62
7
370
-1
100
AcDbLine
10
4.9290538865
20
6.8207804535
11
4.9290538865
21
4.4585757291
0
LINE
5
A5
100
AcDbEntity
8
SNOUT
6
CONTINUOUS
62
7
370
-1
100
AcDbLine
10
5.3227546739
20
7.2144812409
11
5.3227546739
21
4.0648749417
0
LINE
5
A6
100
AcDbEntity
8
SNOUT
6
CONTINUOUS
62
7
370
-1
100
AcDbLine
10
1.7794475873
20
7.3719615559
11
5.1652743589
21
7.3719615559
0
LINE
5
A7
100
AcDbEntity
8
SNOUT
6
CONTINUOUS
62
7
370
-1
100
AcDbLine
10
7.9716259015
20
1.802546639
11
7.9716259015
21
1.9206568752
0
LINE
5
A8
100
AcDbEntity
8
SNOUT
6
CONTINUOUS
62
7
370
-1
100
AcDbLine
10
8.050366059
20
3.1017592374
11
8.050366059
21
3.2986096311
0
LINE
5
A9
100
AcDbEntity
8
SNOUT
6
CONTINUOUS
62
7
370
-1
100
AcDbLine
10
8.1251692086
20
3.1017592374
11
8.1251692086
21
3.2986096311
0
LINE
5
AA
100
AcDbEntity
8
SNOUT
6
CONTINUOUS
62
7
370
-1
100
AcDbLine
10
8.2905235393
20
3.1017592374
11
8.2905235393
21
3.2986096311
0
LINE
5
AB
100
AcDbEntity
8
SNOUT
6
CONTINUOUS
62
7
370
-1
100
AcDbLine
10
8.3062715708
20
3.2513655366
11
8.3062715708
21
3.2986096311
0
LINE
5
AC
100
AcDbEntity
8
SNOUT
6
CONTINUOUS
62
7
370
-1
100
AcDbLine
10
8.3653266889
20
2.3930978201
11
8.3653266889
21
3.1017592374
0
LINE
5
AD
100
AcDbEntity
8
SNOUT
6
CONTINUOUS
62
7
370
-1
100
AcDbLine
10
8.3850117283
20
3.2986096311
11
8.3850117283
21
3.2513655366
0
LINE
5
AE
100
AcDbEntity
8
SNOUT
6
CONTINUOUS
62
7
370
-1
100
AcDbLine
10
7.892885744
20
1.9206568752
11
8.3653266889
21
2.3930978201
0
LINE
5
AF
100
AcDbEntity
8
SNOUT
6
CONTINUOUS
62
7
370
-1
100
AcDbLine
10
7.9716259015
20
1.9206568752
11
8.4480301385
21
2.3970611122
0
LINE
5
B0
100
AcDbEntity
8
SNOUT
6
CONTINUOUS
62
7
370
-1
100
AcDbLine
10
7.4598148779
20
1.802546639
11
8.1291062164
21
1.802546639
0
LINE
5
B1
100
AcDbEntity
8
SNOUT
6
CONTINUOUS
62
7
370
-1
100
AcDbLine
10
9.2314684212
20
1.802546639
11
9.9007597598
21
1.802546639
0
LINE
5
B2
100
AcDbEntity
8
SNOUT
6
CONTINUOUS
62
7
370
-1
100
AcDbLine
10
8.4440668464
20
3.2986096311
11
8.4440668464
21
2.3930978201
0
LINE
5
B3
100
AcDbEntity
8
SNOUT
6
CONTINUOUS
62
7
370
-1
100
AcDbLine
10
9.2314684212
20
1.9206568752
11
8.1291062164
21
1.9206568752
0
LINE
5
B4
100
AcDbEntity
8
SNOUT
6
CONTINUOUS
62
7
370
-1
100
AcDbLine
10
7.3417046416
20
1.9206568752
11
7.892885744
21
1.9206568752
0
LINE
5
B5
100
AcDbEntity
8
SNOUT
6
CONTINUOUS
62
7
370
-1
100
AcDbLine
10
9.4676888936
20
1.9206568752
11
10.018869996
21
1.9206568752
0
LINE
5
B6
100
AcDbEntity
8
SNOUT
6
CONTINUOUS
62
7
370
-1
100
AcDbLine
10
8.9165077913
20
3.2986096311
11
8.9165077913
21
2.3930978201
0
LINE
5
B7
100
AcDbEntity
8
SNOUT
6
CONTINUOUS
62
7
370
-1
100
AcDbLine
10
8.6015471613
20
2.3930978201
11
8.7590274763
21
2.3930978201
0
LINE
5
B8
100
AcDbEntity
8
SNOUT
6
CONTINUOUS
62
7
370
-1
100
AcDbLine
10
8.9755629094
20
3.2986096311
11
8.9755629094
21
3.2513655366
0
LINE
5
B9
100
AcDbEntity
8
SNOUT
6
CONTINUOUS
62
7
370
-1
100
AcDbLine
10
8.9952479487
20
2.3930978201
11
8.9952479487
21
3.1017592374
0
LINE
5
BA
100
AcDbEntity
8
SNOUT
6
CONTINUOUS
62
7
370
-1
100
AcDbLine
10
9.0543030668
20
3.2513655366
11
9.0543030668
21
3.2986096311
0
LINE
5
BB
100
AcDbEntity
8
SNOUT
6
CONTINUOUS
62
7
370
-1
100
AcDbLine
10
9.0700510983
20
3.1017592374
11
9.0700510983
21
3.2986096311
0
LINE
5
BC
100
AcDbEntity
8
SNOUT
6
CONTINUOUS
62
7
370
-1
100
AcDbLine
10
9.3889487361
20
1.9206568752
11
8.9125444991
21
2.3970611122
0
LINE
5
BD
100
AcDbEntity
8
SNOUT
6
CONTINUOUS
62
7
370
-1
100
AcDbLine
10
9.4676888936
20
1.9206568752
11
8.9952479487
21
2.3930978201
0
LINE
5
BE
100
AcDbEntity
8
SNOUT
6
CONTINUOUS
62
7
370
-1
100
AcDbLine
10
9.235405429
20
3.1017592374
11
9.235405429
21
3.2986096311
0
LINE
5
BF
100
AcDbEntity
8
SNOUT
6
CONTINUOUS
62
7
370
-1
100
AcDbLine
10
9.3102085787
20
3.1017592374
11
9.3102085787
21
3.2986096311
0
LINE
5
C0
100
AcDbEntity
8
SNOUT
6
CONTINUOUS
62
7
370
-1
100
AcDbLine
10
9.3889487361
20
1.802546639
11
9.3889487361
21
1.9206568752
0
LINE
5
C1
100
AcDbEntity
8
SNOUT
6
CONTINUOUS
62
7
370
-1
100
AcDbLine
10
8.050366059
20
3.1017592374
11
8.3653266889
21
3.1017592374
0
LINE
5
C2
100
AcDbEntity
8
SNOUT
6
CONTINUOUS
62
7
370
-1
100
AcDbLine
10
8.9952479487
20
3.1017592374
11
9.3102085787
21
3.1017592374
0
LINE
5
C3
100
AcDbEntity
8
SNOUT
6
CONTINUOUS
62
7
370
-1
100
AcDbLine
10
9.0543030668
20
3.2513655366
11
8.9755629094
21
3.2513655366
0
LINE
5
C4
100
AcDbEntity
8
SNOUT
6
CONTINUOUS
62
7
370
-1
100
AcDbLine
10
8.3850117283
20
3.2513655366
11
8.3062715708
21
3.2513655366
0
LINE
5
C5
100
AcDbEntity
8
SNOUT
6
CONTINUOUS
62
7
370
-1
100
AcDbLine
10
8.050366059
20
3.2986096311
11
9.3102085787
21
3.2986096311
0
ARC
5
C6
100
AcDbEntity
8
SNOUT
6
CONTINUOUS
62
7
370
-1
100
AcDbCircle
10
2.5274790833
20
5.5609379338
40
0.2952755906
100
AcDbArc
50
180
51
270
0
ARC
5
C7
100
AcDbEntity
8
SNOUT
6
CONTINUOUS
62
7
370
-1
100
AcDbCircle
10
2.5274790833
20
5.5609379338
40
0.2165354331
100
AcDbArc
50
180
51
270
0
ARC
5
C8
100
AcDbEntity
8
SNOUT
6
CONTINUOUS
62
7
370
-1
100
AcDbCircle
10
2.5274790833
20
5.5609379338
40
0.157480315
100
AcDbArc
50
180
51
270
0
ARC
5
C9
100
AcDbEntity
8
SNOUT
6
CONTINUOUS
62
7
370
-1
100
AcDbCircle
10
1.7794475873
20
4.0648749417
40
0.157480315
100
AcDbArc
50
180
51
270
0
ARC
5
CA
100
AcDbEntity
8
SNOUT
6
CONTINUOUS
62
7
370
-1
100
AcDbCircle
10
2.1731483747
20
4.4585757291
40
0.157480315
100
AcDbArc
50
180
51
270
0
ARC
5
CB
100
AcDbEntity
8
SNOUT
6
CONTINUOUS
62
7
370
-1
100
AcDbCircle
10
2.2322034928
20
5.1278670677
40
0.1181102362
100
AcDbArc
50
180
51
270
0
CIRCLE
5
CC
100
AcDbEntity
8
SNOUT
6
CONTINUOUS
62
7
370
-1
100
AcDbCircle
10
1.7794475873
20
5.1278670677
40
0.0826771654
0
CIRCLE
5
CD
100
AcDbEntity
8
SNOUT
6
CONTINUOUS
62
7
370
-1
100
AcDbCircle
10
2.2715735715
20
5.1672371464
40
0.0826771654
0
CIRCLE
5
CE
100
AcDbEntity
8
SNOUT
6
CONTINUOUS
62
7
370
-1
100
AcDbCircle
10
3.2164554613
20
5.1672371464
40
0.0826771654
0
CIRCLE
5
CF
100
AcDbEntity
8
SNOUT
6
CONTINUOUS
62
7
370
-1
100
AcDbCircle
10
2.6259042802
20
4.1042450204
40
0.0826771654
0
CIRCLE
5
D0
100
AcDbEntity
8
SNOUT
6
CONTINUOUS
62
7
370
-1
100
AcDbCircle
10
1.7794475873
20
4.1042450204
40
0.0826771654
0
CIRCLE
5
D1
100
AcDbEntity
8
SNOUT
6
CONTINUOUS
62
7
370
-1
100
AcDbCircle
10
2.1928334141
20
4.1042450204
40
0.0826771654
0
ARC
5
D2
100
AcDbEntity
8
SNOUT
6
CONTINUOUS
62
7
370
-1
100
AcDbCircle
10
2.5274790833
20
5.7184182488
40
0.2952755906
100
AcDbArc
50
90
51
180
0
ARC
5
D3
100
AcDbEntity
8
SNOUT
6
CONTINUOUS
62
7
370
-1
100
AcDbCircle
10
2.5274790833
20
5.7184182488
40
0.2165354331
100
AcDbArc
50
90
51
180
0
ARC
5
D4
100
AcDbEntity
8
SNOUT
6
CONTINUOUS
62
7
370
-1
100
AcDbCircle
10
2.5274790833
20
5.7184182488
40
0.157480315
100
AcDbArc
50
90
51
180
0
ARC
5
D5
100
AcDbEntity
8
SNOUT
6
CONTINUOUS
62
7
370
-1
100
AcDbCircle
10
1.7794475873
20
7.2144812409
40
0.157480315
100
AcDbArc
50
90
51
180
0
ARC
5
D6
100
AcDbEntity
8
SNOUT
6
CONTINUOUS
62
7
370
-1
100
AcDbCircle
10
2.1731483747
20
6.8207804535
40
0.157480315
100
AcDbArc
50
90
51
180
0
ARC
5
D7
100
AcDbEntity
8
SNOUT
6
CONTINUOUS
62
7
370
-1
100
AcDbCircle
10
2.2322034928
20
6.1514891149
40
0.1181102362
100
AcDbArc
50
90
51
180
0
CIRCLE
5
D8
100
AcDbEntity
8
SNOUT
6
CONTINUOUS
62
7
370
-1
100
AcDbCircle
10
1.7794475873
20
6.1514891149
40
0.0826771654
0
CIRCLE
5
D9
100
AcDbEntity
8
SNOUT
6
CONTINUOUS
62
7
370
-1
100
AcDbCircle
10
2.6259042802
20
7.1751111622
40
0.0826771654
0
CIRCLE
5
DA
100
AcDbEntity
8
SNOUT
6
CONTINUOUS
62
7
370
-1
100
AcDbCircle
10
1.7794475873
20
7.1751111622
40
0.0826771654
0
CIRCLE
5
DB
100
AcDbEntity
8
SNOUT
6
CONTINUOUS
62
7
370
-1
100
AcDbCircle
10
2.2715735715
20
6.1121190362
40
0.0826771654
0
CIRCLE
5
DC
100
AcDbEntity
8
SNOUT
6
CONTINUOUS
62
7
370
-1
100
AcDbCircle
10
3.2164554613
20
6.1121190362
40
0.0826771654
0
CIRCLE
5
DD
100
AcDbEntity
8
SNOUT
6
CONTINUOUS
62
7
370
-1
100
AcDbCircle
10
2.1928334141
20
7.1751111622
40
0.0826771654
0
ARC
5
DE
100
AcDbEntity
8
SNOUT
6
CONTINUOUS
62
7
370
-1
100
AcDbCircle
10
3.9054318393
20
5.5609379338
40
0.2952755906
100
AcDbArc
50
270
51
360
0
ARC
5
DF
100
AcDbEntity
8
SNOUT
6
CONTINUOUS
62
7
370
-1
100
AcDbCircle
10
3.9054318393
20
5.5609379338
40
0.2165354331
100
AcDbArc
50
270
51
360
0
ARC
5
E0
100
AcDbEntity
8
SNOUT
6
CONTINUOUS
62
7
370
-1
100
AcDbCircle
10
3.9054318393
20
5.5609379338
40
0.157480315
100
AcDbArc
50
270
51
360
0
ARC
5
E1
100
AcDbEntity
8
SNOUT
6
CONTINUOUS
62
7
370
-1
100
AcDbCircle
10
5.1652743589
20
4.0648749417
40
0.157480315
100
AcDbArc
50
270
51
360
0
ARC
5
E2
100
AcDbEntity
8
SNOUT
6
CONTINUOUS
62
7
370
-1
100
AcDbCircle
10
4.7715735715
20
4.4585757291
40
0.157480315
100
AcDbArc
50
270
51
360
0
ARC
5
E3
100
AcDbEntity
8
SNOUT
6
CONTINUOUS
62
7
370
-1
100
AcDbCircle
10
4.2007074298
20
5.1278670677
40
0.1181102362
100
AcDbArc
50
270
51
360
0
CIRCLE
5
E4
100
AcDbEntity
8
SNOUT
6
CONTINUOUS
62
7
370
-1
100
AcDbCircle
10
5.1652743589
20
5.1278670677
40
0.0826771654
0
CIRCLE
5
E5
100
AcDbEntity
8
SNOUT
6
CONTINUOUS
62
7
370
-1
100
AcDbCircle
10
4.1613373511
20
5.1672371464
40
0.0826771654
0
CIRCLE
5
E6
100
AcDbEntity
8
SNOUT
6
CONTINUOUS
62
7
370
-1
100
AcDbCircle
10
5.1652743589
20
4.1042450204
40
0.0826771654
0
CIRCLE
5
E7
100
AcDbEntity
8
SNOUT
6
CONTINUOUS
62
7
370
-1
100
AcDbCircle
10
4.318817666
20
4.1042450204
40
0.0826771654
0
CIRCLE
5
E8
100
AcDbEntity
8
SNOUT
6
CONTINUOUS
62
7
370
-1
100
AcDbCircle
10
3.4723609731
20
4.1042450204
40
0.0826771654
0
CIRCLE
5
E9
100
AcDbEntity
8
SNOUT
6
CONTINUOUS
62
7
370
-1
100
AcDbCircle
10
4.7715735715
20
4.1042450204
40
0.0826771654
0
ARC
5
EA
100
AcDbEntity
8
SNOUT
6
CONTINUOUS
62
7
370
-1
100
AcDbCircle
10
3.9054318393
20
5.7184182488
40
0.2952755906
100
AcDbArc
50
0
51
90
0
ARC
5
EB
100
AcDbEntity
8
SNOUT
6
CONTINUOUS
62
7
370
-1
100
AcDbCircle
10
3.9054318393
20
5.7184182488
40
0.2165354331
100
AcDbArc
50
0
51
90
0
ARC
5
EC
100
AcDbEntity
8
SNOUT
6
CONTINUOUS
62
7
370
-1
100
AcDbCircle
10
3.9054318393
20
5.7184182488
40
0.157480315
100
AcDbArc
50
0
51
90
0
ARC
5
ED
100
AcDbEntity
8
SNOUT
6
CONTINUOUS
62
7
370
-1
100
AcDbCircle
10
5.1652743589
20
7.2144812409
40
0.157480315
100
AcDbArc
50
0
51
90
0
ARC
5
EE
100
AcDbEntity
8
SNOUT
6
CONTINUOUS
62
7
370
-1
100
AcDbCircle
10
4.7715735715
20
6.8207804535
40
0.157480315
100
AcDbArc
50
0
51
90
0
ARC
5
EF
100
AcDbEntity
8
SNOUT
6
CONTINUOUS
62
7
370
-1
100
AcDbCircle
10
4.2007074298
20
6.1514891149
40
0.1181102362
100
AcDbArc
50
0
51
90
0
CIRCLE
5
F0
100
AcDbEntity
8
SNOUT
6
CONTINUOUS
62
7
370
-1
100
AcDbCircle
10
5.1652743589
20
6.1514891149
40
0.0826771654
0
CIRCLE
5
F1
100
AcDbEntity
8
SNOUT
6
CONTINUOUS
62
7
370
-1
100
AcDbCircle
10
4.318817666
20
7.1751111622
40
0.0826771654
0
CIRCLE
5
F2
100
AcDbEntity
8
SNOUT
6
CONTINUOUS
62
7
370
-1
100
AcDbCircle
10
3.4723609731
20
7.1751111622
40
0.0826771654
0
CIRCLE
5
F3
100
AcDbEntity
8
SNOUT
6
CONTINUOUS
62
7
370
-1
100
AcDbCircle
10
4.1613373511
20
6.1121190362
40
0.0826771654
0
CIRCLE
5
F4
100
AcDbEntity
8
SNOUT
6
CONTINUOUS
62
7
370
-1
100
AcDbCircle
10
5.1652743589
20
7.1751111622
40
0.0826771654
0
CIRCLE
5
F5
100
AcDbEntity
8
SNOUT
6
CONTINUOUS
62
7
370
-1
100
AcDbCircle
10
4.7715735715
20
7.1751111622
40
0.0826771654
0
SPLINE
5
F6
100
AcDbEntity
8
SNOUT
6
CONTINUOUS
62
7
370
-1
100
AcDbSpline
210
0
220
0
230
1
70
8
71
3
72
14
73
10
74
0
42
1e-07
43
1e-07
40
0
40
0
40
0
40
0
40
0.142857142857
40
0.285714285714
40
0.428571428571
40
0.571428571429
40
0.714285714286
40
0.857142857143
40
1
40
1
40
1
40
1
10
4.0580845841
20
2.3981352845
30
0
10
4.0562657586
20
2.4000331894
30
0
10
4.0513960702
20
2.403447409
30
0
10
4.0422189073
20
2.4068271993
30
0
10
4.0306753998
20
2.4088959908
30
0
10
4.0169309892
20
2.4095831167
30
0
10
4.0012341096
20
2.408872807
30
0
10
3.9773080488
20
2.4059484238
30
0
10
3.958870165
20
2.4018735897
30
0
10
3.9463293237
20
2.3985010317
30
0
0
SPLINE
5
F7
100
AcDbEntity
8
SNOUT
6
CONTINUOUS
62
7
370
-1
100
AcDbSpline
210
0
220
0
230
1
70
8
71
3
72
13
73
9
74
0
42
1e-07
43
1e-07
40
0
40
0
40
0
40
0
40
0.166666666667
40
0.333333333333
40
0.5
40
0.666666666667
40
0.833333333333
40
1
40
1
40
1
40
1
10
4.5039586317
20
1.9306754547
30
0
10
4.5014900913
20
1.9319503578
30
0
10
4.4957683303
20
1.934093078
30
0
10
4.4860573173
20
1.9360609467
30
0
10
4.4746365359
20
1.9370041236
30
0
10
4.4564560194
20
1.9368401431
30
0
10
4.4308881277
20
1.9337182442
30
0
10
4.4100350666
20
1.9290047826
30
0
10
4.3990852292
20
1.9260600868
30
0
0
SPLINE
5
F8
100
AcDbEntity
8
SNOUT
6
CONTINUOUS
62
7
370
-1
100
AcDbSpline
210
0
220
0
230
1
70
8
71
3
72
17
73
13
74
0
42
1e-07
43
1e-07
40
0
40
0
40
0
40
0
40
0.1
40
0.2
40
0.3
40
0.4
40
0.5
40
0.6
40
0.7
40
0.8
40
0.9
40
1
40
1
40
1
40
1
10
2.4923710599
20
2.3970611122
30
0
10
2.4767742226
20
2.4006279748
30
0
10
2.4539785896
20
2.4042936973
30
0
10
2.4249595826
20
2.405565385
30
0
10
2.4069544175
20
2.4048351823
30
0
10
2.3939704099
20
2.4030290769
30
0
10
2.3854113062
20
2.4009635415
30
0
10
2.3803644354
20
2.3993602479
30
0
10
2.3763167966
20
2.3976838687
30
0
10
2.3732561234
20
2.396062705
30
0
10
2.371274776
20
2.3946236142
30
0
10
2.3702952112
20
2.3936907058
30
0
10
2.3700793042
20
2.3932588917
30
0
0
SPLINE
5
F9
100
AcDbEntity
8
SNOUT
6
CONTINUOUS
62
7
370
-1
100
AcDbSpline
210
0
220
0
230
1
70
8
71
3
72
17
73
13
74
0
42
1e-07
43
1e-07
40
0
40
0
40
0
40
0
40
0.1
40
0.2
40
0.3
40
0.4
40
0.5
40
0.6
40
0.7
40
0.8
40
0.9
40
1
40
1
40
1
40
1
10
2.2561505874
20
1.9246201674
30
0
10
2.2405537502
20
1.92818703
30
0
10
2.2177581171
20
1.9318527524
30
0
10
2.1887391102
20
1.9331244401
30
0
10
2.170733945
20
1.9323942374
30
0
10
2.1577499374
20
1.930588132
30
0
10
2.1491908337
20
1.9285225966
30
0
10
2.144143963
20
1.926919303
30
0
10
2.1400963242
20
1.9252429238
30
0
10
2.137035651
20
1.9236217602
30
0
10
2.1350543036
20
1.9221826693
30
0
10
2.1340747388
20
1.9212497609
30
0
10
2.1338588317
20
1.9208179468
30
0
0
SPLINE
5
FA
100
AcDbEntity
8
SNOUT
6
CONTINUOUS
62
7
370
-1
100
AcDbSpline
210
0
220
0
230
1
70
8
71
3
72
16
73
12
74
0
42
1e-07
43
1e-07
40
0
40
0
40
0
40
0
40
0.111111111111
40
0.222222222222
40
0.333333333333
40
0.444444444444
40
0.555555555556
40
0.666666666667
40
0.777777777778
40
0.888888888889
40
1
40
1
40
1
40
1
10
8.5965113773
20
2.3932588917
30
0
10
8.5879219364
20
2.3938085058
30
0
10
8.5710691435
20
2.3956754825
30
0
10
8.5465313089
20
2.3991394689
30
0
10
8.5234399322
20
2.4023074678
30
0
10
8.5023705742
20
2.4045808658
30
0
10
8.4839031797
20
2.4055423184
30
0
10
8.4703813109
20
2.4050241331
30
0
10
8.4613376177
20
2.4034986209
30
0
10
8.4546105787
20
2.4015745406
30
0
10
8.4501535962
20
2.3991845699
30
0
10
8.4480301385
20
2.3970611122
30
0
0
SPLINE
5
FB
100
AcDbEntity
8
SNOUT
6
CONTINUOUS
62
7
370
-1
100
AcDbSpline
210
0
220
0
230
1
70
8
71
3
72
16
73
12
74
0
42
1e-07
43
1e-07
40
0
40
0
40
0
40
0
40
0.111111111111
40
0.222222222222
40
0.333333333333
40
0.444444444444
40
0.555555555556
40
0.666666666667
40
0.777777777778
40
0.888888888889
40
1
40
1
40
1
40
1
10
8.9125444991
20
2.3970611122
30
0
10
8.910421041
20
2.3991845703
30
0
10
8.9059640567
20
2.4015745417
30
0
10
8.8992370145
20
2.4034986218
30
0
10
8.8901933157
20
2.4050241348
30
0
10
8.8766714398
20
2.405542318
30
0
10
8.8582040406
20
2.404580864
30
0
10
8.8371346835
20
2.4023074652
30
0
10
8.8140433138
20
2.399139467
30
0
10
8.7895054871
20
2.3956754821
30
0
10
8.7726526996
20
2.3938085057
30
0
10
8.7640632603
20
2.3932588917
30
0
0
SPLINE
5
FC
100
AcDbEntity
8
SNOUT
6
CONTINUOUS
62
7
370
-1
100
AcDbSpline
210
0
220
0
230
1
70
8
71
3
72
9
73
5
74
0
42
1e-07
43
1e-07
40
0
40
0
40
0
40
0
40
0.5
40
1
40
1
40
1
40
1
10
9.384985444
20
1.9246201674
30
0
10
9.3845014136
20
1.9251041977
30
0
10
9.382216536
20
1.9270914327
30
0
10
9.3794567337
20
1.928468607
30
0
10
9.3772724652
20
1.9292946941
30
0
0
SPLINE
5
FD
100
AcDbEntity
8
SNOUT
6
CONTINUOUS
62
7
370
-1
100
AcDbSpline
210
0
220
0
230
1
70
8
71
3
72
14
73
10
74
0
42
1e-07
43
1e-07
40
0
40
0
40
0
40
0
40
0.142857142857
40
0.285714285714
40
0.428571428571
40
0.571428571429
40
0.714285714286
40
0.857142857143
40
1
40
1
40
1
40
1
10
9.3772724652
20
1.9292946941
30
0
10
9.3740532033
20
1.9305122141
30
0
10
9.3664116716
20
1.9321868317
30
0
10
9.3535148825
20
1.9330417733
30
0
10
9.3381255833
20
1.9326365624
30
0
10
9.3135900131
20
1.9305253727
30
0
10
9.287031393
20
1.9267332629
30
0
10
9.2588520731
20
1.9228606316
30
0
10
9.2440288633
20
1.9212994284
30
0
10
9.2365042052
20
1.9208179468
30
0
0
SPLINE
5
FE
100
AcDbEntity
8
SNOUT
6
CONTINUOUS
62
7
370
-1
100
AcDbSpline
210
0
220
0
230
1
70
8
71
3
72
14
73
10
74
0
42
1e-07
43
1e-07
40
0
40
0
40
0
40
0
40
0.142857142857
40
0.285714285714
40
0.428571428571
40
0.571428571429
40
0.714285714286
40
0.857142857143
40
1
40
1
40
1
40
1
10
8.1240704324
20
1.9208179468
30
0
10
8.1165456865
20
1.9212994341
30
0
10
8.1017223055
20
1.9228606612
30
0
10
8.0735426906
20
1.9267333421
30
0
10
8.046983828
20
1.930525479
30
0
10
8.0224480888
20
1.9326366243
30
0
10
8.0070587672
20
1.9330417645
30
0
10
7.9941620333
20
1.9321867153
30
0
10
7.986520575
20
1.9305119833
30
0
10
7.9833013779
20
1.9292943936
30
0
0
SPLINE
5
FF
100
AcDbEntity
8
SNOUT
6
CONTINUOUS
62
7
370
-1
100
AcDbSpline
210
0
220
0
230
1
70
8
71
3
72
9
73
5
74
0
42
1e-07
43
1e-07
40
0
40
0
40
0
40
0
40
0.5
40
1
40
1
40
1
40
1
10
7.9833013779
20
1.9292943936
30
0
10
7.9825186003
20
1.9289983254
30
0
10
7.9797418904
20
1.9278278401
30
0
10
7.9771312879
20
1.9261622616
30
0
10
7.9755891937
20
1.9246201674
30
0
0
ELLIPSE
5
100
100
AcDbEntity
8
SNOUT
6
CONTINUOUS
62
7
370
-1
100
AcDbEllipse
10
4.3581877448
20
2.0781371901
30
0
11
0
21
0.157480315
31
0
40
1
41
-3.1415926536
42
-2.8788821307
0
ELLIPSE
5
101
100
AcDbEntity
8
SNOUT
6
CONTINUOUS
62
7
370
-1
100
AcDbEllipse
10
2.2912586109
20
2.0781371901
30
0
11
-0
21
0.157480315
31
0
40
1
41
-3.3664178377
42
-3.1415926536
0
ELLIPSE
5
102
100
AcDbEntity
8
SNOUT
6
CONTINUOUS
62
7
370
-1
100
AcDbEllipse
10
3.9054318393
20
2.550578135
30
0
11
0
21
0.157480315
31
0
40
1
41
-3.1415926536
42
-2.8788821307
0
ELLIPSE
5
103
100
AcDbEntity
8
SNOUT
6
CONTINUOUS
62
7
370
-1
100
AcDbEllipse
10
2.5274790833
20
2.550578135
30
0
11
0
21
0.157480315
31
0
40
1
41
-3.3664178377
42
-3.1415926536
0
ELLIPSE
5
104
100
AcDbEntity
8
SNOUT
6
CONTINUOUS
62
7
370
-1
100
AcDbEllipse
10
4.2672277027
20
5.1863427123
30
0
11
-0.2792137785
21
0.291353508
31
0
40
0.5853658537
41
-3.6528233659
42
-2.5932577514
0
ELLIPSE
5
105
100
AcDbEntity
8
SNOUT
6
CONTINUOUS
62
7
370
-1
100
AcDbEllipse
10
4.2672277027
20
6.0930134703
30
0
11
0.2792137785
21
0.291353508
31
0
40
0.5853658537
41
-0.5483349022
42
0.5112307123
0
ELLIPSE
5
106
100
AcDbEntity
8
SNOUT
6
CONTINUOUS
62
7
370
-1
100
AcDbEllipse
10
2.3191406555
20
6.0930134703
30
0
11
-0.1584615102
21
0.3169230204
31
0
40
0.6666666667
41
-0.3217505544
42
0.927295218
0
ELLIPSE
5
107
100
AcDbEntity
8
SNOUT
6
CONTINUOUS
62
7
370
-1
100
AcDbEllipse
10
2.3191406555
20
5.1863427123
30
0
11
0.1584615102
21
0.3169230204
31
0
40
0.6666666667
41
-4.0688878716
42
-2.8198420992
0
ELLIPSE
5
108
100
AcDbEntity
8
SNOUT
6
CONTINUOUS
62
7
370
-1
100
AcDbEllipse
10
8.6015471613
20
2.70805845
30
0
11
-0
21
0.3149606299
31
0
40
0.5
41
-3.1735753342
42
-3.1415926536
0
ELLIPSE
5
109
100
AcDbEntity
8
SNOUT
6
CONTINUOUS
62
7
370
-1
100
AcDbEllipse
10
8.7590274763
20
2.70805845
30
0
11
-0
21
0.3149606299
31
0
40
0.5
41
-3.1415926536
42
-3.1096099729
0
ELLIPSE
5
10A
100
AcDbEntity
8
SNOUT
6
CONTINUOUS
62
7
370
-1
100
AcDbEllipse
10
9.2314684212
20
2.2356175051
30
0
11
0
21
0.3149606299
31
0
40
0.5
41
-3.1415926536
42
-3.1096099729
0
ELLIPSE
5
10B
100
AcDbEntity
8
SNOUT
6
CONTINUOUS
62
7
370
-1
100
AcDbEllipse
10
8.1291062164
20
2.2356175051
30
0
11
0
21
0.3149606299
31
0
40
0.5
41
-3.1735753342
42
-3.1415926536
0
LINE
5
10C
100
AcDbEntity
8
SNOUT
6
CONTINUOUS
62
7
370
-1
100
AcDbLine
10
1.6219672723
20
1.0151445366
11
1.6219672723
21
0.7789240642
0
LINE
5
10D
100
AcDbEntity
8
SNOUT
6
CONTINUOUS
62
7
370
-1
100
AcDbLine
10
1.6219672723
20
0.7789240642
11
5.3227546739
21
0.7789240642
0
LINE
5
10E
100
AcDbEntity
8
SNOUT
6
CONTINUOUS
62
7
370
-1
100
AcDbLine
10
1.6219672723
20
1.0151445366
11
2.0156680597
21
1.0151445366
0
LINE
5
10F
100
AcDbEntity
8
SNOUT
6
CONTINUOUS
62
7
370
-1
100
AcDbLine
10
4.9290538865
20
1.0151445366
11
5.3227546739
21
1.0151445366
0
LINE
5
110
100
AcDbEntity
8
SNOUT
6
CONTINUOUS
62
7
370
-1
100
AcDbLine
10
5.3227546739
20
1.0151445366
11
5.3227546739
21
0.7789240642
0
LINE
5
111
100
AcDbEntity
8
SNOUT
6
CONTINUOUS
62
7
370
-1
100
AcDbLine
10
6.9480038542
20
0.7789240642
11
6.9480038542
21
1.0151445366
0
LINE
5
112
100
AcDbEntity
8
SNOUT
6
CONTINUOUS
62
7
370
-1
100
AcDbLine
10
6.9480038542
20
0.7789240642
11
10.4125707834
21
0.7789240642
0
LINE
5
113
100
AcDbEntity
8
SNOUT
6
CONTINUOUS
62
7
370
-1
100
AcDbLine
10
6.9480038542
20
1.0151445366
11
7.3417046416
21
1.0151445366
0
LINE
5
114
100
AcDbEntity
8
SNOUT
6
CONTINUOUS
62
7
370
-1
100
AcDbLine
10
10.018869996
20
1.0151445366
11
10.4125707834
21
1.0151445366
0
LINE
5
115
100
AcDbEntity
8
SNOUT
6
CONTINUOUS
62
7
370
-1
100
AcDbLine
10
10.4125707834
20
0.7789240642
11
10.4125707834
21
1.0151445366
0
LINE
5
116
100
AcDbEntity
8
SNOUT
6
CONTINUOUS
62
7
370
-1
100
AcDbLine
10
2.0156680597
20
1.9206568752
11
2.0156680597
21
1.0151445366
0
LINE
5
117
100
AcDbEntity
8
SNOUT
6
CONTINUOUS
62
7
370
-1
100
AcDbLine
10
4.9290538865
20
1.9206568752
11
4.9290538865
21
1.0151445366
0
LINE
5
118
100
AcDbEntity
8
SNOUT
6
CONTINUOUS
62
7
370
-1
100
AcDbLine
10
7.3417046416
20
1.0151445366
11
7.3417046416
21
1.9206568752
0
LINE
5
119
100
AcDbEntity
8
SNOUT
6
CONTINUOUS
62
7
370
-1
100
AcDbLine
10
10.018869996
20
1.0151445366
11
10.018869996
21
1.9206568752
0
LINE
5
11A
100
AcDbEntity
8
SNOUT
6
CONTINUOUS
62
7
370
-1
100
AcDbLine
10
9.9007597598
20
0.7789240642
11
9.9007597598
21
1.802546639
0
LINE
5
11B
100
AcDbEntity
8
SNOUT
6
CONTINUOUS
62
7
370
-1
100
AcDbLine
10
7.4598148779
20
0.7789240642
11
7.4598148779
21
1.802546639
0
LINE
5
11C
100
AcDbEntity
8
SNOUT
6
CONTINUOUS
62
7
370
-1
100
AcDbLine
10
4.8109436503
20
1.802546639
11
4.8109436503
21
0.7789240642
0
LINE
5
11D
100
AcDbEntity
8
SNOUT
6
CONTINUOUS
62
7
370
-1
100
AcDbLine
10
2.1337782959
20
1.9206568752
11
2.1337782959
21
0.7789240642
0
ENDSEC
0
SECTION
2
OBJECTS
0
DICTIONARY
5
C
330
0
100
AcDbDictionary
281
1
3
ACAD_GROUP
350
D
0
DICTIONARY
5
D
330
C
100
AcDbDictionary
281
1
0
ENDSEC
0
EOF
