999
dxfrw 0.5.11
0
SECTION
2
HEADER
9
$ACADVER
1
AC1021
9
$HANDSEED
5
20000
9
$DWGCODEPAGE
3
ANSI_1252
9
$INSBASE
10
0
20
0
30
0
9
$EXTMIN
10
89.1853039297
20
15.2227578841
30
0
9
$EXTMAX
10
356.157301981
20
387.06874556
30
0
9
$LIMMIN
10
0
20
0
9
$LIMMAX
10
22
20
17
9
$ORTHOMODE
70
0
9
$LTSCALE
40
1
9
$TEXTSTYLE
7
STANDARD
9
$CLAYER
8
FLOBBER_BACK
9
$DIMASZ
40
0.0708661417323
9
$DIMLFAC
40
1
9
$DIMSCALE
40
1
9
$DIMEXO
40
0.0625
9
$DIMEXE
40
0.18
9
$DIMTXT
40
0.0708661417323
9
$DIMTSZ
40
0
9
$DIMAUNIT
70
0
9
$DIMADEC
70
0
9
$DIMLUNIT
70
2
9
$DIMSTYLE
2
STANDARD
9
$DIMGAP
40
0.09
9
$DIMTIH
70
1
9
$LUNITS
70
2
9
$LUPREC
70
4
9
$AUNITS
70
0
9
$AUPREC
70
0
9
$SPLINESEGS
70
8
9
$GRIDMODE
70
0
9
$SNAPSTYLE
70
0
9
$PINSBASE
10
0
20
0
30
0
9
$PLIMMIN
10
0
20
0
9
$PLIMMAX
10
0
20
0
9
$INSUNITS
70
4
9
$PSVPSCALE
40
1
0
ENDSEC
0
SECTION
2
CLASSES
0
ENDSEC
0
SECTION
2
TABLES
0
TABLE
2
VPORT
5
8
330
0
100
AcDbSymbolTable
70
1
0
VPORT
5
31
330
2
100
AcDbSymbolTableRecord
100
AcDbViewportTableRecord
2
*ACTIVE
70
0
10
0
20
0
11
1
21
1
12
259.670226758
22
195.696723502
13
0
23
0
14
10
24
10
15
10
25
10
16
0
26
0
36
1
17
0
27
0
37
0
40
380.731196462
41
1.55659276546
42
50
43
0
44
0
50
0
51
0
71
0
72
100
73
1
74
3
75
0
76
0
77
0
78
0
281
0
65
1
110
0
120
0
130
0
111
1
121
0
131
0
112
0
122
1
132
0
79
0
146
0
348
10020
60
7
61
5
292
1
282
1
141
0
142
0
63
250
421
3358443
0
ENDTAB
0
TABLE
2
LTYPE
5
5
330
0
100
AcDbSymbolTable
70
4
0
LTYPE
5
14
330
5
100
AcDbSymbolTableRecord
100
AcDbLinetypeTableRecord
2
ByBlock
70
0
3

72
65
73
0
40
0
0
LTYPE
5
15
330
5
100
AcDbSymbolTableRecord
100
AcDbLinetypeTableRecord
2
ByLayer
70
0
3

72
65
73
0
40
0
0
LTYPE
5
16
330
5
100
AcDbSymbolTableRecord
100
AcDbLinetypeTableRecord
2
Continuous
70
0
3
Solid line
72
65
73
0
40
0
0
LTYPE
5
32
330
5
100
AcDbSymbolTableRecord
100
AcDbLinetypeTableRecord
2
DOT
70
0
3
Dot . . . . . . . . . . . . . . . . . . . . . .
72
65
73
2
40
6.35
49
0
74
0
49
-6.35
74
0
0
LTYPE
5
33
330
5
100
AcDbSymbolTableRecord
100
AcDbLinetypeTableRecord
2
DOT2
70
0
3
Dot (.5x) .....................................
72
65
73
2
40
3.175
49
0
74
0
49
-3.175
74
0
0
LTYPE
5
34
330
5
100
AcDbSymbolTableRecord
100
AcDbLinetypeTableRecord
2
DOTX2
70
0
3
Dot (2x) .  .  .  .  .  .  .  .  .  .  .  .  .
72
65
73
2
40
12.7
49
0
74
0
49
-12.7
74
0
0
LTYPE
5
35
330
5
100
AcDbSymbolTableRecord
100
AcDbLinetypeTableRecord
2
DASHED
70
0
3
Dot . . . . . . . . . . . . . . . . . . . . . .
72
65
73
2
40
19.05
49
12.7
74
0
49
-6.35
74
0
0
LTYPE
5
36
330
5
100
AcDbSymbolTableRecord
100
AcDbLinetypeTableRecord
2
DASHED2
70
0
3
Dashed (.5x) _ _ _ _ _ _ _ _ _ _ _ _ _ _ _ _ _
72
65
73
2
40
9.525
49
6.35
74
0
49
-3.175
74
0
0
LTYPE
5
37
330
5
100
AcDbSymbolTableRecord
100
AcDbLinetypeTableRecord
2
DASHEDX2
70
0
3
Dashed (2x) ____  ____  ____  ____  ____  ___
72
65
73
2
40
38.1
49
25.4
74
0
49
-12.7
74
0
0
LTYPE
5
38
330
5
100
AcDbSymbolTableRecord
100
AcDbLinetypeTableRecord
2
DASHDOT
70
0
3
Dash dot __ . __ . __ . __ . __ . __ . __ . __
72
65
73
4
40
25.4
49
12.7
74
0
49
-6.35
74
0
49
0
74
0
49
-6.35
74
0
0
LTYPE
5
39
330
5
100
AcDbSymbolTableRecord
100
AcDbLinetypeTableRecord
2
DASHDOT2
70
0
3
Dash dot (.5x) _._._._._._._._._._._._._._._.
72
65
73
4
40
12.7
49
6.35
74
0
49
-3.175
74
0
49
0
74
0
49
-3.175
74
0
0
LTYPE
5
3A
330
5
100
AcDbSymbolTableRecord
100
AcDbLinetypeTableRecord
2
DASHDOTX2
70
0
3
Dash dot (2x) ____  .  ____  .  ____  .  ___
72
65
73
4
40
50.8
49
25.4
74
0
49
-12.7
74
0
49
0
74
0
49
-12.7
74
0
0
LTYPE
5
3B
330
5
100
AcDbSymbolTableRecord
100
AcDbLinetypeTableRecord
2
DIVIDE
70
0
3
Divide ____ . . ____ . . ____ . . ____ . . ____
72
65
73
6
40
31.75
49
12.7
74
0
49
-6.35
74
0
49
0
74
0
49
-6.35
74
0
49
0
74
0
49
-6.35
74
0
0
LTYPE
5
3C
330
5
100
AcDbSymbolTableRecord
100
AcDbLinetypeTableRecord
2
DIVIDE2
70
0
3
Divide (.5x) __..__..__..__..__..__..__..__.._
72
65
73
6
40
15.875
49
6.35
74
0
49
-3.175
74
0
49
0
74
0
49
-3.175
74
0
49
0
74
0
49
-3.175
74
0
0
LTYPE
5
3D
330
5
100
AcDbSymbolTableRecord
100
AcDbLinetypeTableRecord
2
DIVIDEX2
70
0
3
Divide (2x) ________  .  .  ________  .  .  _
72
65
73
6
40
63.5
49
25.4
74
0
49
-12.7
74
0
49
0
74
0
49
-12.7
74
0
49
0
74
0
49
-12.7
74
0
0
LTYPE
5
3E
330
5
100
AcDbSymbolTableRecord
100
AcDbLinetypeTableRecord
2
BORDER
70
0
3
Border __ __ . __ __ . __ __ . __ __ . __ __ .
72
65
73
6
40
44.45
49
12.7
74
0
49
-6.35
74
0
49
12.7
74
0
49
-6.35
74
0
49
0
74
0
49
-6.35
74
0
0
LTYPE
5
3F
330
5
100
AcDbSymbolTableRecord
100
AcDbLinetypeTableRecord
2
BORDER2
70
0
3
Border (.5x) __.__.__.__.__.__.__.__.__.__.__.
72
65
73
6
40
22.225
49
6.35
74
0
49
-3.175
74
0
49
6.35
74
0
49
-3.175
74
0
49
0
74
0
49
-3.175
74
0
0
LTYPE
5
40
330
5
100
AcDbSymbolTableRecord
100
AcDbLinetypeTableRecord
2
BORDERX2
70
0
3
Border (2x) ____  ____  .  ____  ____  .  ___
72
65
73
6
40
88.9
49
25.4
74
0
49
-12.7
74
0
49
25.4
74
0
49
-12.7
74
0
49
0
74
0
49
-12.7
74
0
0
LTYPE
5
41
330
5
100
AcDbSymbolTableRecord
100
AcDbLinetypeTableRecord
2
CENTER
70
0
3
Center ____ _ ____ _ ____ _ ____ _ ____ _ ____
72
65
73
4
40
50.8
49
31.75
74
0
49
-6.35
74
0
49
6.35
74
0
49
-6.35
74
0
0
LTYPE
5
42
330
5
100
AcDbSymbolTableRecord
100
AcDbLinetypeTableRecord
2
CENTER2
70
0
3
Center (.5x) ___ _ ___ _ ___ _ ___ _ ___ _ ___
72
65
73
4
40
28.575
49
19.05
74
0
49
-3.175
74
0
49
3.175
74
0
49
-3.175
74
0
0
LTYPE
5
43
330
5
100
AcDbSymbolTableRecord
100
AcDbLinetypeTableRecord
2
CENTERX2
70
0
3
Center (2x) ________  __  ________  __  _____
72
65
73
4
40
101.6
49
63.5
74
0
49
-12.7
74
0
49
12.7
74
0
49
-12.7
74
0
0
ENDTAB
0
TABLE
2
LAYER
5
2
330
0
100
AcDbSymbolTable
70
1
0
LAYER
5
10
330
2
100
AcDbSymbolTableRecord
100
AcDbLayerTableRecord
2
0
70
0
62
7
6
CONTINUOUS
370
-3
390
F
0
LAYER
5
44
330
2
100
AcDbSymbolTableRecord
100
AcDbLayerTableRecord
2
FLOBBER_BACK
70
0
62
7
6
CONTINUOUS
370
-3
390
F
0
ENDTAB
0
TABLE
2
STYLE
5
3
330
0
100
AcDbSymbolTable
70
3
0
STYLE
5
45
330
2
100
AcDbSymbolTableRecord
100
AcDbTextStyleTableRecord
2
Standard
70
0
40
0
41
1
50
0
71
0
42
1
3
txt
4

0
ENDTAB
0
TABLE
2
VIEW
5
6
330
0
100
AcDbSymbolTable
70
0
0
ENDTAB
0
TABLE
2
UCS
5
7
330
0
100
AcDbSymbolTable
70
0
0
ENDTAB
0
TABLE
2
APPID
5
9
330
0
100
AcDbSymbolTable
70
1
0
APPID
5
12
330
9
100
AcDbSymbolTableRecord
100
AcDbRegAppTableRecord
2
ACAD
70
0
0
ENDTAB
0
TABLE
2
DIMSTYLE
5
A
330
0
100
AcDbSymbolTable
70
1
100
AcDbDimStyleTable
71
1
0
DIMSTYLE
105
46
330
A
100
AcDbSymbolTableRecord
100
AcDbDimStyleTableRecord
2
Standard
70
0
40
1
41
0.0708661417323
42
0.0625
43
0.38
44
0.18
45
0
46
0
47
0
48
0
140
0.0708661417323
141
0.09
142
0
143
25.4
144
1
145
0
146
1
147
0.09
148
0
71
0
72
0
73
0
74
1
75
0
76
0
77
0
78
0
79
0
170
0
171
2
172
0
173
0
174
0
175
0
176
0
177
0
178
0
179
0
271
4
272
4
273
2
274
2
275
0
276
0
277
2
278
46
279
0
280
0
281
0
282
0
283
1
284
0
285
0
286
0
288
0
289
3
340
Standard
341

371
-2
372
-2
0
ENDTAB
0
TABLE
2
BLOCK_RECORD
5
1
330
0
100
AcDbSymbolTable
70
2
0
BLOCK_RECORD
5
1F
330
1
100
AcDbSymbolTableRecord
100
AcDbBlockTableRecord
2
*Model_Space
70
0
280
1
281
0
0
BLOCK_RECORD
5
1E
330
1
100
AcDbSymbolTableRecord
100
AcDbBlockTableRecord
2
*Paper_Space
70
0
280
1
281
0
0
ENDTAB
0
ENDSEC
0
SECTION
2
BLOCKS
0
BLOCK
5
20
330
1F
100
AcDbEntity
8
0
100
AcDbBlockBegin
2
*Model_Space
70
0
10
0
20
0
30
0
3
*Model_Space
1

0
ENDBLK
5
21
330
1F
100
AcDbEntity
8
0
100
AcDbBlockEnd
0
BLOCK
5
1C
330
1B
100
AcDbEntity
8
0
100
AcDbBlockBegin
2
*Paper_Space
70
0
10
0
20
0
30
0
3
*Paper_Space
1

0
ENDBLK
5
1D
330
1F
100
AcDbEntity
8
0
100
AcDbBlockEnd
0
ENDSEC
0
SECTION
2
ENTITIES
0
ARC
5
47
100
AcDbEntity
8
FLOBBER_BACK
6
ByLayer
62
256
370
-1
100
AcDbCircle
10
246.15730198
20
321.294749613
40
4.00000000001
100
AcDbArc
50
0
51
90
0
LINE
5
48
100
AcDbEntity
8
FLOBBER_BACK
6
ByLayer
62
256
370
-1
100
AcDbLine
10
250.157301981
20
235.294749613
11
250.157301981
21
321.294749613
0
ARC
5
49
100
AcDbEntity
8
FLOBBER_BACK
6
ByLayer
62
256
370
-1
100
AcDbCircle
10
246.15730198
20
235.294749613
40
4.00000000001
100
AcDbArc
50
270
51
0
0
LINE
5
4A
100
AcDbEntity
8
FLOBBER_BACK
6
ByLayer
62
256
370
-1
100
AcDbLine
10
166.15730198
20
231.294749613
11
246.15730198
21
231.294749613
0
ARC
5
4B
100
AcDbEntity
8
FLOBBER_BACK
6
ByLayer
62
256
370
-1
100
AcDbCircle
10
166.15730198
20
235.294749613
40
4.00000000001
100
AcDbArc
50
180
51
270
0
LINE
5
4C
100
AcDbEntity
8
FLOBBER_BACK
6
ByLayer
62
256
370
-1
100
AcDbLine
10
162.15730198
20
321.294749613
11
162.15730198
21
235.294749613
0
ARC
5
4D
100
AcDbEntity
8
FLOBBER_BACK
6
ByLayer
62
256
370
-1
100
AcDbCircle
10
166.15730198
20
321.294749613
40
4.00000000001
100
AcDbArc
50
90
51
180
0
LINE
5
4E
100
AcDbEntity
8
FLOBBER_BACK
6
ByLayer
62
256
370
-1
100
AcDbLine
10
246.15730198
20
325.294749611
11
166.15730198
21
325.294749611
0
ARC
5
4F
100
AcDbEntity
8
FLOBBER_BACK
6
ByLayer
62
256
370
-1
100
AcDbCircle
10
350.15730198
20
321.294749613
40
4.00000000001
100
AcDbArc
50
0
51
90
0
LINE
5
50
100
AcDbEntity
8
FLOBBER_BACK
6
ByLayer
62
256
370
-1
100
AcDbLine
10
354.157301979
20
235.294749613
11
354.157301979
21
321.294749613
0
ARC
5
51
100
AcDbEntity
8
FLOBBER_BACK
6
ByLayer
62
256
370
-1
100
AcDbCircle
10
350.15730198
20
235.294749613
40
4.00000000001
100
AcDbArc
50
270
51
0
0
LINE
5
52
100
AcDbEntity
8
FLOBBER_BACK
6
ByLayer
62
256
370
-1
100
AcDbLine
10
270.157301981
20
231.294749613
11
350.15730198
21
231.294749613
0
ARC
5
53
100
AcDbEntity
8
FLOBBER_BACK
6
ByLayer
62
256
370
-1
100
AcDbCircle
10
270.157301981
20
235.294749613
40
4.00000000001
100
AcDbArc
50
180
51
270
0
LINE
5
54
100
AcDbEntity
8
FLOBBER_BACK
6
ByLayer
62
256
370
-1
100
AcDbLine
10
266.15730198
20
321.294749613
11
266.15730198
21
235.294749613
0
ARC
5
55
100
AcDbEntity
8
FLOBBER_BACK
6
ByLayer
62
256
370
-1
100
AcDbCircle
10
270.157301981
20
321.294749613
40
4.00000000001
100
AcDbArc
50
90
51
180
0
LINE
5
56
100
AcDbEntity
8
FLOBBER_BACK
6
ByLayer
62
256
370
-1
100
AcDbLine
10
350.15730198
20
325.294749611
11
270.157301981
21
325.294749611
0
CIRCLE
5
57
100
AcDbEntity
8
FLOBBER_BACK
6
ByLayer
62
256
370
-1
100
AcDbCircle
10
258.15730198
20
236.294749613
40
5.00000000001
0
CIRCLE
5
58
100
AcDbEntity
8
FLOBBER_BACK
6
ByLayer
62
256
370
-1
100
AcDbCircle
10
258.15730198
20
320.294749611
40
5.00000000001
0
LINE
5
59
100
AcDbEntity
8
FLOBBER_BACK
6
ByLayer
62
256
370
-1
100
AcDbLine
10
164.15730198
20
327.294749612
11
352.157301981
21
327.294749612
0
ARC
5
5A
100
AcDbEntity
8
FLOBBER_BACK
6
ByLayer
62
256
370
-1
100
AcDbCircle
10
164.15730198
20
323.294749613
40
4.00000000001
100
AcDbArc
50
90
51
180
0
LINE
5
5B
100
AcDbEntity
8
FLOBBER_BACK
6
ByLayer
62
256
370
-1
100
AcDbLine
10
160.15730198
20
233.294749613
11
160.15730198
21
323.294749613
0
ARC
5
5C
100
AcDbEntity
8
FLOBBER_BACK
6
ByLayer
62
256
370
-1
100
AcDbCircle
10
164.15730198
20
233.294749613
40
4.00000000001
100
AcDbArc
50
180
51
270
0
LINE
5
5D
100
AcDbEntity
8
FLOBBER_BACK
6
ByLayer
62
256
370
-1
100
AcDbLine
10
352.157301981
20
229.294749613
11
164.15730198
21
229.294749613
0
ARC
5
5E
100
AcDbEntity
8
FLOBBER_BACK
6
ByLayer
62
256
370
-1
100
AcDbCircle
10
352.157301981
20
233.294749613
40
4.00000000001
100
AcDbArc
50
270
51
0
0
LINE
5
5F
100
AcDbEntity
8
FLOBBER_BACK
6
ByLayer
62
256
370
-1
100
AcDbLine
10
356.157301979
20
323.294749613
11
356.157301979
21
233.294749613
0
ARC
5
60
100
AcDbEntity
8
FLOBBER_BACK
6
ByLayer
62
256
370
-1
100
AcDbCircle
10
352.157301981
20
323.294749613
40
4.00000000001
100
AcDbArc
50
0
51
90
0
CIRCLE
5
61
100
AcDbEntity
8
FLOBBER_BACK
6
ByLayer
62
256
370
-1
100
AcDbCircle
10
258.15730198
20
236.294749613
40
2.15
0
CIRCLE
5
62
100
AcDbEntity
8
FLOBBER_BACK
6
ByLayer
62
256
370
-1
100
AcDbCircle
10
258.15730198
20
320.294749611
40
2.15
0
CIRCLE
5
63
100
AcDbEntity
8
FLOBBER_BACK
6
ByLayer
62
256
370
-1
100
AcDbCircle
10
176.15730198
20
320.294749611
40
5.00000000001
0
CIRCLE
5
64
100
AcDbEntity
8
FLOBBER_BACK
6
ByLayer
62
256
370
-1
100
AcDbCircle
10
176.15730198
20
320.294749611
40
2.15
0
CIRCLE
5
65
100
AcDbEntity
8
FLOBBER_BACK
6
ByLayer
62
256
370
-1
100
AcDbCircle
10
176.15730198
20
236.294749613
40
5.00000000001
0
CIRCLE
5
66
100
AcDbEntity
8
FLOBBER_BACK
6
ByLayer
62
256
370
-1
100
AcDbCircle
10
176.15730198
20
236.294749613
40
2.15
0
CIRCLE
5
67
100
AcDbEntity
8
FLOBBER_BACK
6
ByLayer
62
256
370
-1
100
AcDbCircle
10
340.15730198
20
320.294749611
40
5.00000000001
0
CIRCLE
5
68
100
AcDbEntity
8
FLOBBER_BACK
6
ByLayer
62
256
370
-1
100
AcDbCircle
10
340.15730198
20
320.294749611
40
2.15
0
CIRCLE
5
69
100
AcDbEntity
8
FLOBBER_BACK
6
ByLayer
62
256
370
-1
100
AcDbCircle
10
340.15730198
20
236.294749613
40
5.00000000001
0
CIRCLE
5
6A
100
AcDbEntity
8
FLOBBER_BACK
6
ByLayer
62
256
370
-1
100
AcDbCircle
10
340.15730198
20
236.294749613
40
2.15
0
CIRCLE
5
6B
100
AcDbEntity
8
FLOBBER_BACK
6
ByLayer
62
256
370
-1
100
AcDbCircle
10
167.15730198
20
256.794749612
40
4.00000000001
0
CIRCLE
5
6C
100
AcDbEntity
8
FLOBBER_BACK
6
ByLayer
62
256
370
-1
100
AcDbCircle
10
167.15730198
20
278.294749612
40
4.00000000001
0
CIRCLE
5
6D
100
AcDbEntity
8
FLOBBER_BACK
6
ByLayer
62
256
370
-1
100
AcDbCircle
10
167.15730198
20
299.794749613
40
4.00000000001
0
CIRCLE
5
6E
100
AcDbEntity
8
FLOBBER_BACK
6
ByLayer
62
256
370
-1
100
AcDbCircle
10
245.157301981
20
256.794749612
40
4.00000000001
0
CIRCLE
5
6F
100
AcDbEntity
8
FLOBBER_BACK
6
ByLayer
62
256
370
-1
100
AcDbCircle
10
245.157301981
20
278.294749612
40
4.00000000001
0
CIRCLE
5
70
100
AcDbEntity
8
FLOBBER_BACK
6
ByLayer
62
256
370
-1
100
AcDbCircle
10
245.157301981
20
299.794749613
40
4.00000000001
0
CIRCLE
5
71
100
AcDbEntity
8
FLOBBER_BACK
6
ByLayer
62
256
370
-1
100
AcDbCircle
10
167.15730198
20
235.294749613
40
4.00000000001
0
CIRCLE
5
72
100
AcDbEntity
8
FLOBBER_BACK
6
ByLayer
62
256
370
-1
100
AcDbCircle
10
193.15730198
20
235.294749613
40
4.00000000001
0
CIRCLE
5
73
100
AcDbEntity
8
FLOBBER_BACK
6
ByLayer
62
256
370
-1
100
AcDbCircle
10
219.15730198
20
235.294749613
40
4.00000000001
0
CIRCLE
5
74
100
AcDbEntity
8
FLOBBER_BACK
6
ByLayer
62
256
370
-1
100
AcDbCircle
10
245.157301981
20
235.294749613
40
4.00000000001
0
CIRCLE
5
75
100
AcDbEntity
8
FLOBBER_BACK
6
ByLayer
62
256
370
-1
100
AcDbCircle
10
245.157301981
20
321.294749613
40
4.00000000001
0
CIRCLE
5
76
100
AcDbEntity
8
FLOBBER_BACK
6
ByLayer
62
256
370
-1
100
AcDbCircle
10
219.15730198
20
321.294749613
40
4.00000000001
0
CIRCLE
5
77
100
AcDbEntity
8
FLOBBER_BACK
6
ByLayer
62
256
370
-1
100
AcDbCircle
10
193.15730198
20
321.294749613
40
4.00000000001
0
CIRCLE
5
78
100
AcDbEntity
8
FLOBBER_BACK
6
ByLayer
62
256
370
-1
100
AcDbCircle
10
167.15730198
20
321.294749613
40
4.00000000001
0
CIRCLE
5
79
100
AcDbEntity
8
FLOBBER_BACK
6
ByLayer
62
256
370
-1
100
AcDbCircle
10
271.15730198
20
256.794749612
40
4.00000000001
0
CIRCLE
5
7A
100
AcDbEntity
8
FLOBBER_BACK
6
ByLayer
62
256
370
-1
100
AcDbCircle
10
271.15730198
20
278.294749612
40
4.00000000001
0
CIRCLE
5
7B
100
AcDbEntity
8
FLOBBER_BACK
6
ByLayer
62
256
370
-1
100
AcDbCircle
10
271.15730198
20
299.794749613
40
4.00000000001
0
CIRCLE
5
7C
100
AcDbEntity
8
FLOBBER_BACK
6
ByLayer
62
256
370
-1
100
AcDbCircle
10
349.157301979
20
256.794749612
40
4.00000000001
0
CIRCLE
5
7D
100
AcDbEntity
8
FLOBBER_BACK
6
ByLayer
62
256
370
-1
100
AcDbCircle
10
349.157301979
20
278.294749612
40
4.00000000001
0
CIRCLE
5
7E
100
AcDbEntity
8
FLOBBER_BACK
6
ByLayer
62
256
370
-1
100
AcDbCircle
10
349.157301979
20
299.794749613
40
4.00000000001
0
CIRCLE
5
7F
100
AcDbEntity
8
FLOBBER_BACK
6
ByLayer
62
256
370
-1
100
AcDbCircle
10
271.15730198
20
235.294749613
40
4.00000000001
0
CIRCLE
5
80
100
AcDbEntity
8
FLOBBER_BACK
6
ByLayer
62
256
370
-1
100
AcDbCircle
10
297.157301981
20
235.294749613
40
4.00000000001
0
CIRCLE
5
81
100
AcDbEntity
8
FLOBBER_BACK
6
ByLayer
62
256
370
-1
100
AcDbCircle
10
323.15730198
20
235.294749613
40
4.00000000001
0
CIRCLE
5
82
100
AcDbEntity
8
FLOBBER_BACK
6
ByLayer
62
256
370
-1
100
AcDbCircle
10
349.157301979
20
235.294749613
40
4.00000000001
0
CIRCLE
5
83
100
AcDbEntity
8
FLOBBER_BACK
6
ByLayer
62
256
370
-1
100
AcDbCircle
10
349.157301979
20
321.294749613
40
4.00000000001
0
CIRCLE
5
84
100
AcDbEntity
8
FLOBBER_BACK
6
ByLayer
62
256
370
-1
100
AcDbCircle
10
323.15730198
20
321.294749613
40
4.00000000001
0
CIRCLE
5
85
100
AcDbEntity
8
FLOBBER_BACK
6
ByLayer
62
256
370
-1
100
AcDbCircle
10
297.157301981
20
321.294749613
40
4.00000000001
0
CIRCLE
5
86
100
AcDbEntity
8
FLOBBER_BACK
6
ByLayer
62
256
370
-1
100
AcDbCircle
10
271.15730198
20
321.294749613
40
4.00000000001
0
LINE
5
87
100
AcDbEntity
8
FLOBBER_BACK
6
ByLayer
62
256
370
-1
100
AcDbLine
10
237.15730198
20
311.294749613
11
237.15730198
21
245.294749612
0
LINE
5
88
100
AcDbEntity
8
FLOBBER_BACK
6
ByLayer
62
256
370
-1
100
AcDbLine
10
233.15730198
20
241.294749613
11
179.15730198
21
241.294749613
0
LINE
5
89
100
AcDbEntity
8
FLOBBER_BACK
6
ByLayer
62
256
370
-1
100
AcDbLine
10
175.15730198
20
245.294749612
11
175.15730198
21
311.294749613
0
LINE
5
8A
100
AcDbEntity
8
FLOBBER_BACK
6
ByLayer
62
256
370
-1
100
AcDbLine
10
179.15730198
20
315.294749611
11
233.15730198
21
315.294749611
0
LINE
5
8B
100
AcDbEntity
8
FLOBBER_BACK
6
ByLayer
62
256
370
-1
100
AcDbLine
10
341.157301979
20
311.294749613
11
341.157301979
21
245.294749612
0
LINE
5
8C
100
AcDbEntity
8
FLOBBER_BACK
6
ByLayer
62
256
370
-1
100
AcDbLine
10
337.157301981
20
241.294749613
11
283.15730198
21
241.294749613
0
LINE
5
8D
100
AcDbEntity
8
FLOBBER_BACK
6
ByLayer
62
256
370
-1
100
AcDbLine
10
279.157301979
20
245.294749612
11
279.157301979
21
311.294749613
0
LINE
5
8E
100
AcDbEntity
8
FLOBBER_BACK
6
ByLayer
62
256
370
-1
100
AcDbLine
10
283.15730198
20
315.294749611
11
337.157301981
21
315.294749611
0
ARC
5
8F
100
AcDbEntity
8
FLOBBER_BACK
6
ByLayer
62
256
370
-1
100
AcDbCircle
10
233.15730198
20
245.294749612
40
4.00000000001
100
AcDbArc
50
270
51
0
0
ARC
5
90
100
AcDbEntity
8
FLOBBER_BACK
6
ByLayer
62
256
370
-1
100
AcDbCircle
10
179.15730198
20
245.294749612
40
4.00000000001
100
AcDbArc
50
180
51
270
0
ARC
5
91
100
AcDbEntity
8
FLOBBER_BACK
6
ByLayer
62
256
370
-1
100
AcDbCircle
10
179.15730198
20
311.294749613
40
4.00000000001
100
AcDbArc
50
90
51
180
0
ARC
5
92
100
AcDbEntity
8
FLOBBER_BACK
6
ByLayer
62
256
370
-1
100
AcDbCircle
10
233.15730198
20
311.294749613
40
4.00000000001
100
AcDbArc
50
0
51
90
0
ARC
5
93
100
AcDbEntity
8
FLOBBER_BACK
6
ByLayer
62
256
370
-1
100
AcDbCircle
10
337.157301981
20
245.294749612
40
4.00000000001
100
AcDbArc
50
270
51
0
0
ARC
5
94
100
AcDbEntity
8
FLOBBER_BACK
6
ByLayer
62
256
370
-1
100
AcDbCircle
10
283.15730198
20
245.294749612
40
4.00000000001
100
AcDbArc
50
180
51
270
0
ARC
5
95
100
AcDbEntity
8
FLOBBER_BACK
6
ByLayer
62
256
370
-1
100
AcDbCircle
10
283.15730198
20
311.294749613
40
4.00000000001
100
AcDbArc
50
90
51
180
0
ARC
5
96
100
AcDbEntity
8
FLOBBER_BACK
6
ByLayer
62
256
370
-1
100
AcDbCircle
10
337.157301981
20
311.294749613
40
4.00000000001
100
AcDbArc
50
0
51
90
0
CIRCLE
5
97
100
AcDbEntity
8
FLOBBER_BACK
6
ByLayer
62
256
370
-1
100
AcDbCircle
10
244.65730198
20
310.294749611
40
2.1
0
CIRCLE
5
98
100
AcDbEntity
8
FLOBBER_BACK
6
ByLayer
62
256
370
-1
100
AcDbCircle
10
244.65730198
20
246.294749612
40
2.1
0
CIRCLE
5
99
100
AcDbEntity
8
FLOBBER_BACK
6
ByLayer
62
256
370
-1
100
AcDbCircle
10
167.65730198
20
310.294749611
40
2.1
0
CIRCLE
5
9A
100
AcDbEntity
8
FLOBBER_BACK
6
ByLayer
62
256
370
-1
100
AcDbCircle
10
167.65730198
20
246.294749612
40
2.1
0
CIRCLE
5
9B
100
AcDbEntity
8
FLOBBER_BACK
6
ByLayer
62
256
370
-1
100
AcDbCircle
10
348.657301981
20
310.294749611
40
2.1
0
CIRCLE
5
9C
100
AcDbEntity
8
FLOBBER_BACK
6
ByLayer
62
256
370
-1
100
AcDbCircle
10
348.657301981
20
246.294749612
40
2.1
0
CIRCLE
5
9D
100
AcDbEntity
8
FLOBBER_BACK
6
ByLayer
62
256
370
-1
100
AcDbCircle
10
271.65730198
20
246.294749612
40
2.1
0
CIRCLE
5
9E
100
AcDbEntity
8
FLOBBER_BACK
6
ByLayer
62
256
370
-1
100
AcDbCircle
10
271.65730198
20
310.294749611
40
2.1
0
LINE
5
9F
100
AcDbEntity
8
FLOBBER_BACK
6
ByLayer
62
256
370
-1
100
AcDbLine
10
279.157301979
20
176.258753748
11
279.157301979
21
182.758753748
0
LINE
5
A0
100
AcDbEntity
8
FLOBBER_BACK
6
ByLayer
62
256
370
-1
100
AcDbLine
10
175.15730198
20
176.258753748
11
175.15730198
21
182.758753748
0
LINE
5
A1
100
AcDbEntity
8
FLOBBER_BACK
6
ByLayer
62
256
370
-1
100
AcDbLine
10
237.15730198
20
182.758753748
11
237.15730198
21
176.258753748
0
LINE
5
A2
100
AcDbEntity
8
FLOBBER_BACK
6
ByLayer
62
256
370
-1
100
AcDbLine
10
356.157301979
20
171.258753748
11
356.157301979
21
190.258753748
0
LINE
5
A3
100
AcDbEntity
8
FLOBBER_BACK
6
ByLayer
62
256
370
-1
100
AcDbLine
10
354.157301979
20
190.258753748
11
354.157301979
21
182.758753748
0
LINE
5
A4
100
AcDbEntity
8
FLOBBER_BACK
6
ByLayer
62
256
370
-1
100
AcDbLine
10
354.157301979
20
176.258753748
11
354.157301979
21
171.258753748
0
LINE
5
A5
100
AcDbEntity
8
FLOBBER_BACK
6
ByLayer
62
256
370
-1
100
AcDbLine
10
162.15730198
20
182.758753748
11
162.15730198
21
190.258753748
0
LINE
5
A6
100
AcDbEntity
8
FLOBBER_BACK
6
ByLayer
62
256
370
-1
100
AcDbLine
10
160.15730198
20
190.258753748
11
160.15730198
21
171.258753748
0
LINE
5
A7
100
AcDbEntity
8
FLOBBER_BACK
6
ByLayer
62
256
370
-1
100
AcDbLine
10
266.15730198
20
182.758753748
11
266.15730198
21
190.258753748
0
LINE
5
A8
100
AcDbEntity
8
FLOBBER_BACK
6
ByLayer
62
256
370
-1
100
AcDbLine
10
250.157301981
20
190.258753748
11
250.157301981
21
182.758753748
0
LINE
5
A9
100
AcDbEntity
8
FLOBBER_BACK
6
ByLayer
62
256
370
-1
100
AcDbLine
10
89.1853039297
20
229.294749613
11
108.18530393
21
229.294749613
0
LINE
5
AA
100
AcDbEntity
8
FLOBBER_BACK
6
ByLayer
62
256
370
-1
100
AcDbLine
10
160.15730198
20
387.06874556
11
160.15730198
21
368.068745559
0
LINE
5
AB
100
AcDbEntity
8
FLOBBER_BACK
6
ByLayer
62
256
370
-1
100
AcDbLine
10
356.157301979
20
368.068745559
11
356.157301979
21
387.06874556
0
LINE
5
AC
100
AcDbEntity
8
FLOBBER_BACK
6
ByLayer
62
256
370
-1
100
AcDbLine
10
108.18530393
20
327.294749612
11
89.1853039297
21
327.294749612
0
LINE
5
AD
100
AcDbEntity
8
FLOBBER_BACK
6
ByLayer
62
256
370
-1
100
AcDbLine
10
108.18530393
20
229.294749613
11
108.18530393
21
327.294749612
0
LINE
5
AE
100
AcDbEntity
8
FLOBBER_BACK
6
ByLayer
62
256
370
-1
100
AcDbLine
10
89.1853039297
20
327.294749612
11
89.1853039297
21
229.294749613
0
LINE
5
AF
100
AcDbEntity
8
FLOBBER_BACK
6
ByLayer
62
256
370
-1
100
AcDbLine
10
356.157301979
20
387.06874556
11
160.15730198
21
387.06874556
0
LINE
5
B0
100
AcDbEntity
8
FLOBBER_BACK
6
ByLayer
62
256
370
-1
100
AcDbLine
10
160.15730198
20
368.068745559
11
356.157301979
21
368.068745559
0
LINE
5
B1
100
AcDbEntity
8
FLOBBER_BACK
6
ByLayer
62
256
370
-1
100
AcDbLine
10
250.157301981
20
190.258753748
11
266.15730198
21
190.258753748
0
LINE
5
B2
100
AcDbEntity
8
FLOBBER_BACK
6
ByLayer
62
256
370
-1
100
AcDbLine
10
160.15730198
20
171.258753748
11
356.157301979
21
171.258753748
0
LINE
5
B3
100
AcDbEntity
8
FLOBBER_BACK
6
ByLayer
62
256
370
-1
100
AcDbLine
10
356.157301979
20
190.258753748
11
160.15730198
21
190.258753748
0
LINE
5
B4
100
AcDbEntity
8
FLOBBER_BACK
6
ByLayer
62
256
370
-1
100
AcDbLine
10
341.157301979
20
176.258753748
11
354.157301979
21
176.258753748
0
LINE
5
B5
100
AcDbEntity
8
FLOBBER_BACK
6
ByLayer
62
256
370
-1
100
AcDbLine
10
354.157301979
20
182.758753748
11
341.157301979
21
182.758753748
0
LINE
5
B6
100
AcDbEntity
8
FLOBBER_BACK
6
ByLayer
62
256
370
-1
100
AcDbLine
10
341.157301979
20
182.758753748
11
341.157301979
21
176.258753748
0
LINE
5
B7
100
AcDbEntity
8
FLOBBER_BACK
6
ByLayer
62
256
370
-1
100
AcDbLine
10
266.15730198
20
182.758753748
11
279.157301979
21
182.758753748
0
LINE
5
B8
100
AcDbEntity
8
FLOBBER_BACK
6
ByLayer
62
256
370
-1
100
AcDbLine
10
279.157301979
20
176.258753748
11
237.15730198
21
176.258753748
0
LINE
5
B9
100
AcDbEntity
8
FLOBBER_BACK
6
ByLayer
62
256
370
-1
100
AcDbLine
10
237.15730198
20
182.758753748
11
250.157301981
21
182.758753748
0
LINE
5
BA
100
AcDbEntity
8
FLOBBER_BACK
6
ByLayer
62
256
370
-1
100
AcDbLine
10
162.15730198
20
171.258753748
11
162.15730198
21
176.258753748
0
LINE
5
BB
100
AcDbEntity
8
FLOBBER_BACK
6
ByLayer
62
256
370
-1
100
AcDbLine
10
162.15730198
20
176.258753748
11
175.15730198
21
176.258753748
0
LINE
5
BC
100
AcDbEntity
8
FLOBBER_BACK
6
ByLayer
62
256
370
-1
100
AcDbLine
10
175.15730198
20
182.758753748
11
162.15730198
21
182.758753748
0
ARC
5
BD
100
AcDbEntity
8
FLOBBER_BACK
6
ByLayer
62
256
370
-1
100
AcDbCircle
10
166.15730198
20
107.222757884
40
4.00000000001
100
AcDbArc
50
90
51
180
0
LINE
5
BE
100
AcDbEntity
8
FLOBBER_BACK
6
ByLayer
62
256
370
-1
100
AcDbLine
10
162.15730198
20
21.2227578841
11
162.15730198
21
107.222757884
0
ARC
5
BF
100
AcDbEntity
8
FLOBBER_BACK
6
ByLayer
62
256
370
-1
100
AcDbCircle
10
166.15730198
20
21.2227578841
40
4.00000000001
100
AcDbArc
50
180
51
270
0
ARC
5
C0
100
AcDbEntity
8
FLOBBER_BACK
6
ByLayer
62
256
370
-1
100
AcDbCircle
10
350.15730198
20
21.2227578841
40
4.00000000001
100
AcDbArc
50
270
51
0
0
LINE
5
C1
100
AcDbEntity
8
FLOBBER_BACK
6
ByLayer
62
256
370
-1
100
AcDbLine
10
354.157301979
20
107.222757884
11
354.157301979
21
21.2227578841
0
ARC
5
C2
100
AcDbEntity
8
FLOBBER_BACK
6
ByLayer
62
256
370
-1
100
AcDbCircle
10
350.15730198
20
107.222757884
40
4.00000000001
100
AcDbArc
50
0
51
90
0
LINE
5
C3
100
AcDbEntity
8
FLOBBER_BACK
6
ByLayer
62
256
370
-1
100
AcDbLine
10
164.15730198
20
15.2227578841
11
352.157301981
21
15.2227578841
0
ARC
5
C4
100
AcDbEntity
8
FLOBBER_BACK
6
ByLayer
62
256
370
-1
100
AcDbCircle
10
164.15730198
20
19.2227578841
40
4.00000000001
100
AcDbArc
50
180
51
270
0
LINE
5
C5
100
AcDbEntity
8
FLOBBER_BACK
6
ByLayer
62
256
370
-1
100
AcDbLine
10
160.15730198
20
109.222757884
11
160.15730198
21
19.2227578841
0
ARC
5
C6
100
AcDbEntity
8
FLOBBER_BACK
6
ByLayer
62
256
370
-1
100
AcDbCircle
10
164.15730198
20
109.222757884
40
4.00000000001
100
AcDbArc
50
90
51
180
0
LINE
5
C7
100
AcDbEntity
8
FLOBBER_BACK
6
ByLayer
62
256
370
-1
100
AcDbLine
10
352.157301981
20
113.222757884
11
164.15730198
21
113.222757884
0
ARC
5
C8
100
AcDbEntity
8
FLOBBER_BACK
6
ByLayer
62
256
370
-1
100
AcDbCircle
10
352.157301981
20
109.222757884
40
4.00000000001
100
AcDbArc
50
0
51
90
0
LINE
5
C9
100
AcDbEntity
8
FLOBBER_BACK
6
ByLayer
62
256
370
-1
100
AcDbLine
10
356.157301979
20
19.2227578841
11
356.157301979
21
109.222757884
0
ARC
5
CA
100
AcDbEntity
8
FLOBBER_BACK
6
ByLayer
62
256
370
-1
100
AcDbCircle
10
352.157301981
20
19.2227578841
40
4.00000000001
100
AcDbArc
50
270
51
0
0
CIRCLE
5
CB
100
AcDbEntity
8
FLOBBER_BACK
6
ByLayer
62
256
370
-1
100
AcDbCircle
10
258.15730198
20
106.222757884
40
2.15
0
CIRCLE
5
CC
100
AcDbEntity
8
FLOBBER_BACK
6
ByLayer
62
256
370
-1
100
AcDbCircle
10
258.15730198
20
22.2227578841
40
2.15
0
CIRCLE
5
CD
100
AcDbEntity
8
FLOBBER_BACK
6
ByLayer
62
256
370
-1
100
AcDbCircle
10
176.15730198
20
22.2227578841
40
2.15
0
CIRCLE
5
CE
100
AcDbEntity
8
FLOBBER_BACK
6
ByLayer
62
256
370
-1
100
AcDbCircle
10
176.15730198
20
106.222757884
40
2.15
0
CIRCLE
5
CF
100
AcDbEntity
8
FLOBBER_BACK
6
ByLayer
62
256
370
-1
100
AcDbCircle
10
340.15730198
20
22.2227578841
40
2.15
0
CIRCLE
5
D0
100
AcDbEntity
8
FLOBBER_BACK
6
ByLayer
62
256
370
-1
100
AcDbCircle
10
340.15730198
20
106.222757884
40
2.15
0
CIRCLE
5
D1
100
AcDbEntity
8
FLOBBER_BACK
6
ByLayer
62
256
370
-1
100
AcDbCircle
10
167.15730198
20
85.7227578841
40
4.00000000001
0
CIRCLE
5
D2
100
AcDbEntity
8
FLOBBER_BACK
6
ByLayer
62
256
370
-1
100
AcDbCircle
10
167.15730198
20
64.2227578841
40
4.00000000001
0
CIRCLE
5
D3
100
AcDbEntity
8
FLOBBER_BACK
6
ByLayer
62
256
370
-1
100
AcDbCircle
10
167.15730198
20
42.7227578841
40
4.00000000001
0
CIRCLE
5
D4
100
AcDbEntity
8
FLOBBER_BACK
6
ByLayer
62
256
370
-1
100
AcDbCircle
10
245.157301981
20
85.7227578841
40
4.00000000001
0
CIRCLE
5
D5
100
AcDbEntity
8
FLOBBER_BACK
6
ByLayer
62
256
370
-1
100
AcDbCircle
10
245.157301981
20
64.2227578841
40
4.00000000001
0
CIRCLE
5
D6
100
AcDbEntity
8
FLOBBER_BACK
6
ByLayer
62
256
370
-1
100
AcDbCircle
10
245.157301981
20
42.7227578841
40
4.00000000001
0
CIRCLE
5
D7
100
AcDbEntity
8
FLOBBER_BACK
6
ByLayer
62
256
370
-1
100
AcDbCircle
10
167.15730198
20
107.222757884
40
4.00000000001
0
CIRCLE
5
D8
100
AcDbEntity
8
FLOBBER_BACK
6
ByLayer
62
256
370
-1
100
AcDbCircle
10
193.15730198
20
107.222757884
40
4.00000000001
0
CIRCLE
5
D9
100
AcDbEntity
8
FLOBBER_BACK
6
ByLayer
62
256
370
-1
100
AcDbCircle
10
219.15730198
20
107.222757884
40
4.00000000001
0
CIRCLE
5
DA
100
AcDbEntity
8
FLOBBER_BACK
6
ByLayer
62
256
370
-1
100
AcDbCircle
10
245.157301981
20
107.222757884
40
4.00000000001
0
CIRCLE
5
DB
100
AcDbEntity
8
FLOBBER_BACK
6
ByLayer
62
256
370
-1
100
AcDbCircle
10
245.157301981
20
21.2227578841
40
4.00000000001
0
CIRCLE
5
DC
100
AcDbEntity
8
FLOBBER_BACK
6
ByLayer
62
256
370
-1
100
AcDbCircle
10
219.15730198
20
21.2227578841
40
4.00000000001
0
CIRCLE
5
DD
100
AcDbEntity
8
FLOBBER_BACK
6
ByLayer
62
256
370
-1
100
AcDbCircle
10
193.15730198
20
21.2227578841
40
4.00000000001
0
CIRCLE
5
DE
100
AcDbEntity
8
FLOBBER_BACK
6
ByLayer
62
256
370
-1
100
AcDbCircle
10
167.15730198
20
21.2227578841
40
4.00000000001
0
CIRCLE
5
DF
100
AcDbEntity
8
FLOBBER_BACK
6
ByLayer
62
256
370
-1
100
AcDbCircle
10
271.15730198
20
85.7227578841
40
4.00000000001
0
CIRCLE
5
E0
100
AcDbEntity
8
FLOBBER_BACK
6
ByLayer
62
256
370
-1
100
AcDbCircle
10
271.15730198
20
64.2227578841
40
4.00000000001
0
CIRCLE
5
E1
100
AcDbEntity
8
FLOBBER_BACK
6
ByLayer
62
256
370
-1
100
AcDbCircle
10
271.15730198
20
42.7227578841
40
4.00000000001
0
CIRCLE
5
E2
100
AcDbEntity
8
FLOBBER_BACK
6
ByLayer
62
256
370
-1
100
AcDbCircle
10
349.157301979
20
85.7227578841
40
4.00000000001
0
CIRCLE
5
E3
100
AcDbEntity
8
FLOBBER_BACK
6
ByLayer
62
256
370
-1
100
AcDbCircle
10
349.157301979
20
64.2227578841
40
4.00000000001
0
CIRCLE
5
E4
100
AcDbEntity
8
FLOBBER_BACK
6
ByLayer
62
256
370
-1
100
AcDbCircle
10
349.157301979
20
42.7227578841
40
4.00000000001
0
CIRCLE
5
E5
100
AcDbEntity
8
FLOBBER_BACK
6
ByLayer
62
256
370
-1
100
AcDbCircle
10
271.15730198
20
107.222757884
40
4.00000000001
0
CIRCLE
5
E6
100
AcDbEntity
8
FLOBBER_BACK
6
ByLayer
62
256
370
-1
100
AcDbCircle
10
297.157301981
20
107.222757884
40
4.00000000001
0
CIRCLE
5
E7
100
AcDbEntity
8
FLOBBER_BACK
6
ByLayer
62
256
370
-1
100
AcDbCircle
10
323.15730198
20
107.222757884
40
4.00000000001
0
CIRCLE
5
E8
100
AcDbEntity
8
FLOBBER_BACK
6
ByLayer
62
256
370
-1
100
AcDbCircle
10
349.157301979
20
107.222757884
40
4.00000000001
0
CIRCLE
5
E9
100
AcDbEntity
8
FLOBBER_BACK
6
ByLayer
62
256
370
-1
100
AcDbCircle
10
349.157301979
20
21.2227578841
40
4.00000000001
0
CIRCLE
5
EA
100
AcDbEntity
8
FLOBBER_BACK
6
ByLayer
62
256
370
-1
100
AcDbCircle
10
323.15730198
20
21.2227578841
40
4.00000000001
0
CIRCLE
5
EB
100
AcDbEntity
8
FLOBBER_BACK
6
ByLayer
62
256
370
-1
100
AcDbCircle
10
297.157301981
20
21.2227578841
40
4.00000000001
0
CIRCLE
5
EC
100
AcDbEntity
8
FLOBBER_BACK
6
ByLayer
62
256
370
-1
100
AcDbCircle
10
271.15730198
20
21.2227578841
40
4.00000000001
0
LINE
5
ED
100
AcDbEntity
8
FLOBBER_BACK
6
ByLayer
62
256
370
-1
100
AcDbLine
10
237.15730198
20
31.2227578841
11
237.15730198
21
97.2227578841
0
LINE
5
EE
100
AcDbEntity
8
FLOBBER_BACK
6
ByLayer
62
256
370
-1
100
AcDbLine
10
233.15730198
20
101.222757884
11
179.15730198
21
101.222757884
0
LINE
5
EF
100
AcDbEntity
8
FLOBBER_BACK
6
ByLayer
62
256
370
-1
100
AcDbLine
10
175.15730198
20
97.2227578841
11
175.15730198
21
31.2227578841
0
LINE
5
F0
100
AcDbEntity
8
FLOBBER_BACK
6
ByLayer
62
256
370
-1
100
AcDbLine
10
179.15730198
20
27.2227578841
11
233.15730198
21
27.2227578841
0
LINE
5
F1
100
AcDbEntity
8
FLOBBER_BACK
6
ByLayer
62
256
370
-1
100
AcDbLine
10
341.157301979
20
31.2227578841
11
341.157301979
21
97.2227578841
0
LINE
5
F2
100
AcDbEntity
8
FLOBBER_BACK
6
ByLayer
62
256
370
-1
100
AcDbLine
10
337.157301981
20
101.222757884
11
283.15730198
21
101.222757884
0
LINE
5
F3
100
AcDbEntity
8
FLOBBER_BACK
6
ByLayer
62
256
370
-1
100
AcDbLine
10
279.157301979
20
97.2227578841
11
279.157301979
21
31.2227578841
0
LINE
5
F4
100
AcDbEntity
8
FLOBBER_BACK
6
ByLayer
62
256
370
-1
100
AcDbLine
10
283.15730198
20
27.2227578841
11
337.157301981
21
27.2227578841
0
ARC
5
F5
100
AcDbEntity
8
FLOBBER_BACK
6
ByLayer
62
256
370
-1
100
AcDbCircle
10
233.15730198
20
97.2227578841
40
4.00000000001
100
AcDbArc
50
0
51
90
0
ARC
5
F6
100
AcDbEntity
8
FLOBBER_BACK
6
ByLayer
62
256
370
-1
100
AcDbCircle
10
179.15730198
20
97.2227578841
40
4.00000000001
100
AcDbArc
50
90
51
180
0
ARC
5
F7
100
AcDbEntity
8
FLOBBER_BACK
6
ByLayer
62
256
370
-1
100
AcDbCircle
10
179.15730198
20
31.2227578841
40
4.00000000001
100
AcDbArc
50
180
51
270
0
ARC
5
F8
100
AcDbEntity
8
FLOBBER_BACK
6
ByLayer
62
256
370
-1
100
AcDbCircle
10
233.15730198
20
31.2227578841
40
4.00000000001
100
AcDbArc
50
270
51
0
0
ARC
5
F9
100
AcDbEntity
8
FLOBBER_BACK
6
ByLayer
62
256
370
-1
100
AcDbCircle
10
337.157301981
20
97.2227578841
40
4.00000000001
100
AcDbArc
50
0
51
90
0
ARC
5
FA
100
AcDbEntity
8
FLOBBER_BACK
6
ByLayer
62
256
370
-1
100
AcDbCircle
10
283.15730198
20
97.2227578841
40
4.00000000001
100
AcDbArc
50
90
51
180
0
ARC
5
FB
100
AcDbEntity
8
FLOBBER_BACK
6
ByLayer
62
256
370
-1
100
AcDbCircle
10
283.15730198
20
31.2227578841
40
4.00000000001
100
AcDbArc
50
180
51
270
0
ARC
5
FC
100
AcDbEntity
8
FLOBBER_BACK
6
ByLayer
62
256
370
-1
100
AcDbCircle
10
337.157301981
20
31.2227578841
40
4.00000000001
100
AcDbArc
50
270
51
0
0
CIRCLE
5
FD
100
AcDbEntity
8
FLOBBER_BACK
6
ByLayer
62
256
370
-1
100
AcDbCircle
10
244.65730198
20
32.2227578841
40
2.1
0
CIRCLE
5
FE
100
AcDbEntity
8
FLOBBER_BACK
6
ByLayer
62
256
370
-1
100
AcDbCircle
10
244.65730198
20
96.2227578841
40
2.1
0
CIRCLE
5
FF
100
AcDbEntity
8
FLOBBER_BACK
6
ByLayer
62
256
370
-1
100
AcDbCircle
10
167.65730198
20
32.2227578841
40
2.1
0
CIRCLE
5
100
100
AcDbEntity
8
FLOBBER_BACK
6
ByLayer
62
256
370
-1
100
AcDbCircle
10
167.65730198
20
96.2227578841
40
2.1
0
CIRCLE
5
101
100
AcDbEntity
8
FLOBBER_BACK
6
ByLayer
62
256
370
-1
100
AcDbCircle
10
348.657301981
20
32.2227578841
40
2.1
0
CIRCLE
5
102
100
AcDbEntity
8
FLOBBER_BACK
6
ByLayer
62
256
370
-1
100
AcDbCircle
10
348.657301981
20
96.2227578841
40
2.1
0
CIRCLE
5
103
100
AcDbEntity
8
FLOBBER_BACK
6
ByLayer
62
256
370
-1
100
AcDbCircle
10
271.65730198
20
96.2227578841
40
2.1
0
CIRCLE
5
104
100
AcDbEntity
8
FLOBBER_BACK
6
ByLayer
62
256
370
-1
100
AcDbCircle
10
271.65730198
20
32.2227578841
40
2.1
0
LINE
5
105
100
AcDbEntity
8
FLOBBER_BACK
6
ByLayer
62
256
370
-1
100
AcDbLine
10
350.15730198
20
17.2227578841
11
166.15730198
21
17.2227578841
0
LINE
5
106
100
AcDbEntity
8
FLOBBER_BACK
6
ByLayer
62
256
370
-1
100
AcDbLine
10
166.15730198
20
111.222757884
11
350.15730198
21
111.222757884
0
ENDSEC
0
SECTION
2
OBJECTS
0
DICTIONARY
5
C
330
0
100
AcDbDictionary
281
1
3
ACAD_GROUP
350
D
0
DICTIONARY
5
D
330
C
100
AcDbDictionary
281
1
0
ENDSEC
0
EOF
