EESchema Schematic File Version 2
LIBS:sn74hc05d
LIBS:power
LIBS:pspice
LIBS:tps73501drbt
LIBS:tps78630kttt
LIBS:ina202a
LIBS:ad7998
LIBS:opa703
LIBS:bav99
LIBS:lt3015eq
LIBS:mcp23017-qfn
LIBS:2x14_conn
LIBS:ds18b20u
LIBS:LogicBoard_DB-cache
EELAYER 24 0
EELAYER END
$Descr A4 11693 8268
encoding utf-8
Sheet 3 15
Title ""
Date ""
Rev ""
Comp ""
Comment1 ""
Comment2 ""
Comment3 ""
Comment4 ""
$EndDescr
$Comp
L GND #PWR050
U 1 1 54766EDD
P 2950 6000
F 0 "#PWR050" H 2950 6000 30  0001 C CNN
F 1 "GND" H 2950 5930 30  0001 C CNN
F 2 "" H 2950 6000 60  0001 C CNN
F 3 "" H 2950 6000 60  0001 C CNN
	1    2950 6000
	1    0    0    -1  
$EndComp
$Comp
L R R14
U 1 1 54766EE3
P 2950 5700
F 0 "R14" V 3030 5700 50  0000 C CNN
F 1 "DNP" V 2950 5700 50  0000 C CNN
F 2 "" H 2950 5700 60  0001 C CNN
F 3 "" H 2950 5700 60  0001 C CNN
	1    2950 5700
	1    0    0    -1  
$EndComp
$Comp
L R R13
U 1 1 54766EE9
P 2700 5700
F 0 "R13" V 2780 5700 50  0000 C CNN
F 1 "DNP" V 2700 5700 50  0000 C CNN
F 2 "" H 2700 5700 60  0001 C CNN
F 3 "" H 2700 5700 60  0001 C CNN
	1    2700 5700
	1    0    0    -1  
$EndComp
$Comp
L GND #PWR051
U 1 1 54766EEF
P 2700 6000
F 0 "#PWR051" H 2700 6000 30  0001 C CNN
F 1 "GND" H 2700 5930 30  0001 C CNN
F 2 "" H 2700 6000 60  0001 C CNN
F 3 "" H 2700 6000 60  0001 C CNN
	1    2700 6000
	1    0    0    -1  
$EndComp
$Comp
L GND #PWR052
U 1 1 54766EF5
P 2850 3550
F 0 "#PWR052" H 2850 3550 30  0001 C CNN
F 1 "GND" H 2850 3480 30  0001 C CNN
F 2 "" H 2850 3550 60  0001 C CNN
F 3 "" H 2850 3550 60  0001 C CNN
	1    2850 3550
	1    0    0    -1  
$EndComp
$Comp
L R R9
U 1 1 54766EFB
P 2850 3250
F 0 "R9" V 2930 3250 50  0000 C CNN
F 1 "DNP" V 2850 3250 50  0000 C CNN
F 2 "" H 2850 3250 60  0001 C CNN
F 3 "" H 2850 3250 60  0001 C CNN
	1    2850 3250
	1    0    0    -1  
$EndComp
$Comp
L R R7
U 1 1 54766F07
P 2850 2650
F 0 "R7" V 2930 2650 50  0000 C CNN
F 1 "4.7k" V 2850 2650 50  0000 C CNN
F 2 "" H 2850 2650 60  0001 C CNN
F 3 "" H 2850 2650 60  0001 C CNN
	1    2850 2650
	1    0    0    -1  
$EndComp
$Comp
L R R10
U 1 1 54766F0D
P 2700 4400
F 0 "R10" V 2780 4400 50  0000 C CNN
F 1 "4.7k" V 2700 4400 50  0000 C CNN
F 2 "" H 2700 4400 60  0001 C CNN
F 3 "" H 2700 4400 60  0001 C CNN
	1    2700 4400
	1    0    0    -1  
$EndComp
$Comp
L R R11
U 1 1 54766F1F
P 2950 4400
F 0 "R11" V 3030 4400 50  0000 C CNN
F 1 "4.7k" V 2950 4400 50  0000 C CNN
F 2 "" H 2950 4400 60  0001 C CNN
F 3 "" H 2950 4400 60  0001 C CNN
	1    2950 4400
	1    0    0    -1  
$EndComp
$Sheet
S 6700 1750 1250 800 
U 54513844
F0 "Postive ASDQ power" 50
F1 "sch/Power_pos.sch" 50
F2 "EN3V" I L 6700 1850 60 
F3 "EN1V4" I L 6700 2050 60 
F4 "3V_V[3..0]" O R 7950 1850 60 
F5 "Reset3V" I L 6700 2250 60 
F6 "3V_I[3..0]" O R 7950 1950 60 
F7 "3V_OC[3..0]" O R 7950 2050 60 
F8 "Reset1V4" I L 6700 2350 60 
F9 "1V4_V" O R 7950 2250 60 
F10 "1V4_I" O R 7950 2350 60 
F11 "1V4_OC" O R 7950 2450 60 
$EndSheet
$Comp
L SN74HC05D U6
U 1 1 54766F52
P 4400 2450
F 0 "U6" H 4600 1700 60  0000 C CNN
F 1 "SN74HC05D" V 4400 2400 60  0000 C CNN
F 2 "" H 4400 2450 60  0001 C CNN
F 3 "" H 4400 2450 60  0001 C CNN
	1    4400 2450
	1    0    0    -1  
$EndComp
$Comp
L SN74HC05D U7
U 1 1 54766F58
P 4400 5300
F 0 "U7" H 4600 4550 60  0000 C CNN
F 1 "SN74HC05D" V 4400 5250 60  0000 C CNN
F 2 "" H 4400 5300 60  0001 C CNN
F 3 "" H 4400 5300 60  0001 C CNN
	1    4400 5300
	1    0    0    -1  
$EndComp
Text Label 3450 1950 0    60   ~ 0
3V_OC0
Text Label 3450 2550 0    60   ~ 0
3V_OC1
Text Label 3450 2350 0    60   ~ 0
3V_OC2
Text Label 3450 2150 0    60   ~ 0
3V_OC3
Entry Wire Line
	3350 1850 3450 1950
Entry Wire Line
	3350 2050 3450 2150
Entry Wire Line
	3350 2250 3450 2350
Entry Wire Line
	3350 2450 3450 2550
Text HLabel 2700 2950 0    60   Input ~ 0
_EN_3V
$Comp
L R R6
U 1 1 54766F67
P 5500 1450
F 0 "R6" V 5580 1450 50  0000 C CNN
F 1 "4.7k" V 5500 1450 50  0000 C CNN
F 2 "" H 5500 1450 60  0001 C CNN
F 3 "" H 5500 1450 60  0001 C CNN
	1    5500 1450
	1    0    0    -1  
$EndComp
$Comp
L C C15
U 1 1 54766F79
P 4700 4300
F 0 "C15" V 4800 4450 50  0000 C CNN
F 1 "0.1uF" V 4800 4150 50  0000 C CNN
F 2 "" H 4700 4300 60  0001 C CNN
F 3 "" H 4700 4300 60  0001 C CNN
	1    4700 4300
	0    1    1    0   
$EndComp
$Comp
L GND #PWR053
U 1 1 54766F7F
P 5050 4400
F 0 "#PWR053" H 5050 4400 30  0001 C CNN
F 1 "GND" H 5050 4330 30  0001 C CNN
F 2 "" H 5050 4400 60  0001 C CNN
F 3 "" H 5050 4400 60  0001 C CNN
	1    5050 4400
	1    0    0    -1  
$EndComp
$Comp
L GND #PWR054
U 1 1 54766F85
P 4400 3450
F 0 "#PWR054" H 4400 3450 30  0001 C CNN
F 1 "GND" H 4400 3380 30  0001 C CNN
F 2 "" H 4400 3450 60  0001 C CNN
F 3 "" H 4400 3450 60  0001 C CNN
	1    4400 3450
	1    0    0    -1  
$EndComp
$Comp
L GND #PWR055
U 1 1 54766F8B
P 4400 6300
F 0 "#PWR055" H 4400 6300 30  0001 C CNN
F 1 "GND" H 4400 6230 30  0001 C CNN
F 2 "" H 4400 6300 60  0001 C CNN
F 3 "" H 4400 6300 60  0001 C CNN
	1    4400 6300
	1    0    0    -1  
$EndComp
$Comp
L C C14
U 1 1 54766F97
P 4700 1450
F 0 "C14" V 4800 1600 50  0000 C CNN
F 1 "0.1uF" V 4800 1300 50  0000 C CNN
F 2 "" H 4700 1450 60  0001 C CNN
F 3 "" H 4700 1450 60  0001 C CNN
	1    4700 1450
	0    1    1    0   
$EndComp
$Comp
L GND #PWR056
U 1 1 54766F9D
P 5050 1550
F 0 "#PWR056" H 5050 1550 30  0001 C CNN
F 1 "GND" H 5050 1480 30  0001 C CNN
F 2 "" H 5050 1550 60  0001 C CNN
F 3 "" H 5050 1550 60  0001 C CNN
	1    5050 1550
	1    0    0    -1  
$EndComp
$Comp
L R R8
U 1 1 54766FA3
P 5800 1450
F 0 "R8" V 5880 1450 50  0000 C CNN
F 1 "4.7k" V 5800 1450 50  0000 C CNN
F 2 "" H 5800 1450 60  0001 C CNN
F 3 "" H 5800 1450 60  0001 C CNN
	1    5800 1450
	1    0    0    -1  
$EndComp
Text HLabel 2500 5200 0    60   Input ~ 0
_EN_1V4
Text HLabel 6400 2250 0    60   Input ~ 0
Reset3V
Text HLabel 6400 2350 0    60   Input ~ 0
Reset1V4
Text HLabel 8100 1950 2    60   Output ~ 0
3V_I[3..0]
Text HLabel 8100 1850 2    60   Output ~ 0
3V_V[3..0]
$Sheet
S 6700 4800 1250 500 
U 545184E8
F0 "Negative ASDQ power" 50
F1 "sch/Power_neg.sch" 50
F2 "EN-3V" I L 6700 4900 60 
F3 "-3V_V[3..0]" O R 7950 4900 60 
F4 "Reset-3V" I L 6700 5200 60 
F5 "-3V_I[3..0]" O R 7950 5000 60 
F6 "-3V_OC[3..0]" O R 7950 5100 60 
$EndSheet
Text HLabel 2500 4800 0    60   Input ~ 0
_EN_-3V
Text Label 3450 5600 0    60   ~ 0
-3V_OC0
Text Label 3450 5800 0    60   ~ 0
-3V_OC1
Text Label 3450 5000 0    60   ~ 0
-3V_OC2
Text Label 3450 5400 0    60   ~ 0
-3V_OC3
Entry Wire Line
	3350 5500 3450 5400
Entry Wire Line
	3350 5100 3450 5000
Entry Wire Line
	3350 5700 3450 5600
Entry Wire Line
	3350 5900 3450 5800
$Comp
L R R12
U 1 1 54766FD8
P 5650 4350
F 0 "R12" V 5730 4350 50  0000 C CNN
F 1 "4.7k" V 5650 4350 50  0000 C CNN
F 2 "" H 5650 4350 60  0001 C CNN
F 3 "" H 5650 4350 60  0001 C CNN
	1    5650 4350
	1    0    0    -1  
$EndComp
Text HLabel 6400 5200 0    60   Input ~ 0
Reset-3V
Text Notes 6650 1200 0    60   ~ 0
Wire or for enable\nOnly on if no trip & _EN is 0
Text HLabel 8100 5000 2    60   Output ~ 0
-3V_I[3..0]
Text HLabel 8100 4900 2    60   Output ~ 0
-3V_V[3..0]
Text HLabel 8100 2350 2    60   Output ~ 0
1V4_I
Text HLabel 8100 2250 2    60   Output ~ 0
1V4_V
Text HLabel 8800 2050 2    60   Output ~ 0
3V_OC[3..0]
Text HLabel 8800 5100 2    60   Output ~ 0
-3V_OC[3..0]
Text HLabel 8800 2450 2    60   Output ~ 0
1V4_OC
Text Notes 5800 4200 0    60   ~ 0
Wire or for enable\nOnly on if no trip & _EN is 0
Text Notes 3300 3650 0    60   ~ 12
Note: \n1.6V and 1.4V supplies use the 3V supply\n-1.6V supply uses the -3V supply\nEnable accordingly 
Text Notes 3100 800  0    60   ~ 12
ASDQ (+/-)  powers
$Comp
L +3.3V #PWR057
U 1 1 547B9A4E
P 5650 4050
F 0 "#PWR057" H 5650 4010 30  0001 C CNN
F 1 "+3.3V" H 5650 4160 30  0000 C CNN
F 2 "" H 5650 4050 60  0000 C CNN
F 3 "" H 5650 4050 60  0000 C CNN
	1    5650 4050
	1    0    0    -1  
$EndComp
$Comp
L +3.3V #PWR058
U 1 1 547B9ABC
P 4400 4250
F 0 "#PWR058" H 4400 4210 30  0001 C CNN
F 1 "+3.3V" H 4400 4360 30  0000 C CNN
F 2 "" H 4400 4250 60  0000 C CNN
F 3 "" H 4400 4250 60  0000 C CNN
	1    4400 4250
	1    0    0    -1  
$EndComp
$Comp
L +3.3V #PWR059
U 1 1 547B9CEC
P 2700 4100
F 0 "#PWR059" H 2700 4060 30  0001 C CNN
F 1 "+3.3V" H 2700 4210 30  0000 C CNN
F 2 "" H 2700 4100 60  0000 C CNN
F 3 "" H 2700 4100 60  0000 C CNN
	1    2700 4100
	1    0    0    -1  
$EndComp
$Comp
L +3.3V #PWR060
U 1 1 547B9D2D
P 2950 4100
F 0 "#PWR060" H 2950 4060 30  0001 C CNN
F 1 "+3.3V" H 2950 4210 30  0000 C CNN
F 2 "" H 2950 4100 60  0000 C CNN
F 3 "" H 2950 4100 60  0000 C CNN
	1    2950 4100
	1    0    0    -1  
$EndComp
$Comp
L +3.3V #PWR061
U 1 1 547B9FB7
P 2850 2350
F 0 "#PWR061" H 2850 2310 30  0001 C CNN
F 1 "+3.3V" H 2850 2460 30  0000 C CNN
F 2 "" H 2850 2350 60  0000 C CNN
F 3 "" H 2850 2350 60  0000 C CNN
	1    2850 2350
	1    0    0    -1  
$EndComp
$Comp
L +3.3V #PWR062
U 1 1 547BA937
P 5800 1100
F 0 "#PWR062" H 5800 1060 30  0001 C CNN
F 1 "+3.3V" H 5800 1210 30  0000 C CNN
F 2 "" H 5800 1100 60  0000 C CNN
F 3 "" H 5800 1100 60  0000 C CNN
	1    5800 1100
	1    0    0    -1  
$EndComp
$Comp
L +3.3V #PWR063
U 1 1 547BABEE
P 5500 1100
F 0 "#PWR063" H 5500 1060 30  0001 C CNN
F 1 "+3.3V" H 5500 1210 30  0000 C CNN
F 2 "" H 5500 1100 60  0000 C CNN
F 3 "" H 5500 1100 60  0000 C CNN
	1    5500 1100
	1    0    0    -1  
$EndComp
$Comp
L +3.3V #PWR064
U 1 1 547BB30A
P 4400 1400
F 0 "#PWR064" H 4400 1360 30  0001 C CNN
F 1 "+3.3V" H 4400 1510 30  0000 C CNN
F 2 "" H 4400 1400 60  0000 C CNN
F 3 "" H 4400 1400 60  0000 C CNN
	1    4400 1400
	1    0    0    -1  
$EndComp
Wire Wire Line
	2950 5950 2950 6000
Wire Wire Line
	2700 5950 2700 6000
Wire Wire Line
	2850 3500 2850 3550
Wire Wire Line
	2850 2400 2850 2350
Wire Wire Line
	2700 4150 2700 4100
Connection ~ 2850 2950
Wire Wire Line
	3800 1950 3450 1950
Wire Wire Line
	3450 2150 3800 2150
Wire Wire Line
	3800 2350 3450 2350
Wire Wire Line
	3450 2550 3800 2550
Wire Wire Line
	2700 2950 3800 2950
Wire Wire Line
	5500 1950 5000 1950
Wire Wire Line
	5500 1700 5500 2950
Wire Wire Line
	5500 2150 5000 2150
Connection ~ 5500 1950
Wire Wire Line
	5500 2350 5000 2350
Connection ~ 5500 2150
Wire Wire Line
	5000 2550 5500 2550
Connection ~ 5500 2350
Connection ~ 5500 2550
Wire Wire Line
	5500 1200 5500 1100
Wire Wire Line
	4400 4250 4400 4350
Wire Wire Line
	4400 3400 4400 3450
Wire Wire Line
	4450 4300 4400 4300
Connection ~ 4400 4300
Wire Wire Line
	4950 4300 5050 4300
Wire Wire Line
	5050 4300 5050 4400
Wire Wire Line
	4400 6250 4400 6300
Wire Wire Line
	4400 1400 4400 1500
Wire Wire Line
	4450 1450 4400 1450
Connection ~ 4400 1450
Wire Wire Line
	4950 1450 5050 1450
Wire Wire Line
	5050 1450 5050 1550
Wire Wire Line
	5800 1200 5800 1100
Wire Wire Line
	6700 2250 6400 2250
Wire Wire Line
	6700 2350 6400 2350
Connection ~ 5500 1850
Wire Bus Line
	7950 2050 8800 2050
Wire Bus Line
	8700 2050 8700 950 
Wire Bus Line
	7950 1950 8100 1950
Wire Bus Line
	7950 1850 8100 1850
Wire Bus Line
	8700 950  3350 950 
Wire Wire Line
	5800 1700 5800 3250
Wire Wire Line
	5800 2050 6700 2050
Wire Wire Line
	5500 1850 6700 1850
Wire Wire Line
	3450 3550 8150 3550
Wire Wire Line
	8150 3550 8150 2450
Wire Wire Line
	7950 2450 8800 2450
Wire Bus Line
	7950 5100 8800 5100
Wire Bus Line
	8150 5100 8150 6450
Wire Bus Line
	8150 6450 3350 6450
Wire Wire Line
	3800 5000 3450 5000
Wire Wire Line
	3450 5400 3800 5400
Wire Wire Line
	3800 5600 3450 5600
Wire Wire Line
	3450 5800 3800 5800
Wire Wire Line
	5650 4100 5650 4050
Wire Wire Line
	5650 4600 5650 5800
Wire Wire Line
	5650 5400 5000 5400
Connection ~ 5650 5400
Connection ~ 5650 5200
Wire Wire Line
	6700 4900 5650 4900
Connection ~ 5650 4900
Wire Wire Line
	6700 5200 6400 5200
Wire Bus Line
	7950 5000 8100 5000
Wire Bus Line
	7950 4900 8100 4900
Wire Wire Line
	7950 2250 8100 2250
Wire Wire Line
	7950 2350 8100 2350
Connection ~ 8150 2450
Wire Wire Line
	2950 4150 2950 4100
Wire Wire Line
	2850 2900 2850 3000
Wire Wire Line
	2500 4800 3800 4800
Wire Wire Line
	2700 4650 2700 5450
Wire Wire Line
	2950 4650 2950 5450
Wire Wire Line
	2500 5200 3800 5200
Wire Wire Line
	5650 5600 5000 5600
Connection ~ 5800 2050
Wire Wire Line
	5800 3250 5250 3250
Connection ~ 5250 3250
Wire Bus Line
	3350 950  3350 2450
Wire Bus Line
	3350 6450 3350 5100
Connection ~ 2950 4800
Wire Wire Line
	5650 5800 5000 5800
Connection ~ 5650 5600
Wire Wire Line
	5000 4800 5650 4800
Connection ~ 5650 4800
Connection ~ 2700 5200
Wire Wire Line
	5250 5200 5000 5200
Wire Wire Line
	5000 5000 5650 5000
Connection ~ 5650 5000
Wire Wire Line
	3800 2750 3450 2750
Wire Wire Line
	3450 2750 3450 3550
Wire Wire Line
	5500 2950 5000 2950
Wire Wire Line
	5000 2750 5250 2750
Wire Wire Line
	5250 2750 5250 5200
$EndSCHEMATC
