EESchema Schematic File Version 2
LIBS:2x14_conn
LIBS:ad7998
LIBS:bav99
LIBS:ds18b20u
LIBS:ina202a
LIBS:lt3015eq
LIBS:mcp23017-qfn
LIBS:opa703
LIBS:power
LIBS:pspice
LIBS:sn74hc05d
LIBS:tps73501drbt
LIBS:tps78630kttt
EELAYER 24 0
EELAYER END
$Descr A4 11693 8268
encoding utf-8
Sheet 4 15
Title ""
Date "18 nov 2014"
Rev ""
Comp ""
Comment1 ""
Comment2 ""
Comment3 ""
Comment4 ""
$EndDescr
Text Notes 6750 5200 0    60   ~ 0
2.5V nominal
Connection ~ 4950 5300
Wire Wire Line
	4850 5300 4950 5300
Wire Wire Line
	8700 1900 8550 1900
Wire Wire Line
	8700 1900 8700 1700
Wire Wire Line
	8700 1700 8850 1700
Wire Wire Line
	8550 1400 8550 1350
Wire Wire Line
	8850 1600 8700 1600
Wire Wire Line
	8700 1600 8700 1400
Wire Wire Line
	8700 1400 8550 1400
Wire Wire Line
	8550 1900 8550 2650
Wire Wire Line
	7500 1900 7350 1900
Wire Wire Line
	7500 1900 7500 1700
Wire Wire Line
	7500 1700 7650 1700
Wire Wire Line
	7350 1350 7350 1400
Wire Wire Line
	7650 1600 7500 1600
Wire Wire Line
	7500 1600 7500 1400
Wire Wire Line
	7500 1400 7350 1400
Wire Wire Line
	7350 1900 7350 2650
Wire Wire Line
	6300 1900 6150 1900
Wire Wire Line
	6300 1900 6300 1700
Wire Wire Line
	6300 1700 6450 1700
Wire Wire Line
	6150 1350 6150 1400
Wire Wire Line
	6450 1600 6300 1600
Wire Wire Line
	6300 1600 6300 1400
Wire Wire Line
	6300 1400 6150 1400
Wire Wire Line
	6150 1900 6150 2650
Wire Wire Line
	4950 2650 4950 1900
Wire Wire Line
	5100 1400 4950 1400
Wire Wire Line
	5100 1400 5100 1600
Wire Wire Line
	5100 1600 5250 1600
Connection ~ 3900 1350
Connection ~ 3650 1350
Wire Wire Line
	3500 1650 3500 1850
Connection ~ 4400 1350
Wire Wire Line
	4400 1300 4400 1350
Wire Wire Line
	3200 5200 3350 5200
Wire Wire Line
	3350 5200 3350 5300
Wire Wire Line
	3350 5300 3550 5300
Wire Wire Line
	2600 5850 2600 5600
Wire Wire Line
	2600 5800 3950 5800
Connection ~ 2600 5800
Connection ~ 3550 4800
Wire Wire Line
	3950 5800 3950 5550
Connection ~ 3550 5800
Wire Wire Line
	3950 4800 3950 5050
Wire Wire Line
	1850 1700 1850 1600
Wire Wire Line
	1850 1650 2000 1650
Wire Wire Line
	1850 2200 1850 2300
Connection ~ 1850 1650
Wire Bus Line
	9700 2750 5050 2750
Connection ~ 4950 1350
Connection ~ 6150 1350
Connection ~ 7350 1350
Wire Wire Line
	4900 2100 8800 2100
Wire Wire Line
	5200 2100 5200 1900
Wire Wire Line
	5200 1900 5250 1900
Wire Wire Line
	6400 2100 6400 1900
Wire Wire Line
	6400 1900 6450 1900
Connection ~ 5200 2100
Wire Wire Line
	7600 2100 7600 1900
Wire Wire Line
	7600 1900 7650 1900
Connection ~ 6400 2100
Wire Wire Line
	8800 2100 8800 1900
Wire Wire Line
	8800 1900 8850 1900
Connection ~ 7600 2100
Wire Wire Line
	5800 1650 5850 1650
Wire Wire Line
	7000 1650 7050 1650
Wire Wire Line
	8200 1650 8250 1650
Wire Wire Line
	9400 1650 9450 1650
Wire Wire Line
	5850 1650 5850 650 
Wire Wire Line
	7050 1650 7050 650 
Wire Wire Line
	8250 1650 8250 650 
Wire Wire Line
	9450 1650 9450 650 
Wire Bus Line
	10150 550  5950 550 
Wire Bus Line
	10150 750  6100 750 
Wire Wire Line
	5800 1750 6000 1750
Wire Wire Line
	6000 1750 6000 850 
Wire Wire Line
	7000 1750 7200 1750
Wire Wire Line
	7200 1750 7200 850 
Wire Wire Line
	8200 1750 8400 1750
Wire Wire Line
	8400 1750 8400 850 
Wire Wire Line
	9400 1750 9600 1750
Wire Wire Line
	9600 1750 9600 850 
Wire Wire Line
	2000 1350 1400 1350
Wire Wire Line
	850  1350 900  1350
Wire Wire Line
	900  4800 1000 4800
Connection ~ 3950 4800
Wire Wire Line
	1850 5100 1850 5200
Wire Wire Line
	1850 5200 2000 5200
Wire Wire Line
	1850 5700 1850 5800
Wire Wire Line
	1500 4800 2000 4800
Wire Wire Line
	4800 5400 5250 5400
Wire Wire Line
	5250 5200 4950 5200
Wire Wire Line
	4950 5200 4950 5900
Wire Wire Line
	4950 5900 6350 5900
Wire Wire Line
	5800 5150 6350 5150
Wire Wire Line
	5800 5250 6350 5250
Wire Wire Line
	2700 2250 2700 2150
Wire Wire Line
	2700 2150 2800 2150
Wire Wire Line
	4350 2050 4350 2000
Wire Wire Line
	3650 2450 3650 2350
Wire Wire Line
	4350 1500 4350 1350
Connection ~ 4350 1350
Wire Wire Line
	3500 1850 3900 1850
Connection ~ 3650 1850
Wire Wire Line
	2550 5600 2650 5600
Connection ~ 2600 5600
Wire Wire Line
	4150 4750 4150 4800
Connection ~ 4150 4800
Wire Wire Line
	4950 1400 4950 1350
Wire Wire Line
	5250 1700 5100 1700
Wire Wire Line
	5100 1700 5100 1900
Wire Wire Line
	5100 1900 4950 1900
Wire Wire Line
	3200 4800 5050 4800
Wire Wire Line
	5050 4800 5050 5100
Wire Wire Line
	5050 5100 5250 5100
Connection ~ 4850 4800
$Comp
L R R26
U 1 1 546AC535
P 4850 5050
F 0 "R26" V 4930 5050 50  0000 C CNN
F 1 "0.1" V 4850 5050 50  0000 C CNN
F 2 "" H 4850 5050 60  0001 C CNN
F 3 "" H 4850 5050 60  0001 C CNN
	1    4850 5050
	1    0    0    -1  
$EndComp
Text Notes 10700 600  0    60   ~ 0
1.25V nominal
$Comp
L R R21
U 1 1 546AC476
P 8550 1650
F 0 "R21" V 8630 1650 50  0000 C CNN
F 1 "0.1" V 8550 1650 50  0000 C CNN
F 2 "" H 8550 1650 60  0001 C CNN
F 3 "" H 8550 1650 60  0001 C CNN
	1    8550 1650
	1    0    0    -1  
$EndComp
$Comp
L R R20
U 1 1 546AC46C
P 7350 1650
F 0 "R20" V 7430 1650 50  0000 C CNN
F 1 "0.1" V 7350 1650 50  0000 C CNN
F 2 "" H 7350 1650 60  0001 C CNN
F 3 "" H 7350 1650 60  0001 C CNN
	1    7350 1650
	1    0    0    -1  
$EndComp
$Comp
L R R19
U 1 1 546AC457
P 6150 1650
F 0 "R19" V 6230 1650 50  0000 C CNN
F 1 "0.1" V 6150 1650 50  0000 C CNN
F 2 "" H 6150 1650 60  0001 C CNN
F 3 "" H 6150 1650 60  0001 C CNN
	1    6150 1650
	1    0    0    -1  
$EndComp
Text Notes 5050 2500 1    60   ~ 0
125mA
$Comp
L R R18
U 1 1 546AC398
P 4950 1650
F 0 "R18" V 5030 1650 50  0000 C CNN
F 1 "0.1" V 4950 1650 50  0000 C CNN
F 2 "" H 4950 1650 60  0001 C CNN
F 3 "" H 4950 1650 60  0001 C CNN
	1    4950 1650
	1    0    0    -1  
$EndComp
$Comp
L +1.4V #PWR065
U 1 1 54697D0E
P 4150 4750
F 0 "#PWR065" H 4150 4890 20  0001 C CNN
F 1 "+1.4V" H 4150 4860 30  0000 C CNN
F 2 "" H 4150 4750 60  0001 C CNN
F 3 "" H 4150 4750 60  0001 C CNN
	1    4150 4750
	1    0    0    -1  
$EndComp
$Comp
L +3.3V #PWR066
U 1 1 54513FFF
P 1400 850
F 0 "#PWR066" H 1400 810 30  0001 C CNN
F 1 "+3.3V" H 1400 960 30  0000 C CNN
F 2 "" H 1400 850 60  0001 C CNN
F 3 "" H 1400 850 60  0001 C CNN
	1    1400 850 
	1    0    0    -1  
$EndComp
$Comp
L GND #PWR067
U 1 1 545142F6
P 2700 2250
F 0 "#PWR067" H 2700 2250 30  0001 C CNN
F 1 "GND" H 2700 2180 30  0001 C CNN
F 2 "" H 2700 2250 60  0001 C CNN
F 3 "" H 2700 2250 60  0001 C CNN
	1    2700 2250
	1    0    0    -1  
$EndComp
Text Notes 1550 700  0    60   ~ 0
3V Regulator\nMax  1.5 A\nTotal: 850 mA\nArea: huge...\nASDQ: 500mA\n1.6V: 75mA\n1.4V: 275mA\n
Text HLabel 850  1350 0    60   Input ~ 0
EN3V
$Comp
L C C17
U 1 1 54514321
P 4350 1750
F 0 "C17" V 4450 1900 50  0000 C CNN
F 1 "2.2uF" V 4450 1600 50  0000 C CNN
F 2 "" H 4350 1750 60  0001 C CNN
F 3 "" H 4350 1750 60  0001 C CNN
	1    4350 1750
	1    0    0    -1  
$EndComp
$Comp
L R R25
U 1 1 54514333
P 3550 5050
F 0 "R25" V 3630 5050 50  0000 C CNN
F 1 "331k" V 3550 5050 50  0000 C CNN
F 2 "" H 3550 5050 60  0001 C CNN
F 3 "" H 3550 5050 60  0001 C CNN
	1    3550 5050
	1    0    0    -1  
$EndComp
$Comp
L R R27
U 1 1 54514339
P 3550 5550
F 0 "R27" V 3630 5550 50  0000 C CNN
F 1 "1M" V 3550 5550 50  0000 C CNN
F 2 "" H 3550 5550 60  0001 C CNN
F 3 "" H 3550 5550 60  0001 C CNN
	1    3550 5550
	1    0    0    -1  
$EndComp
$Comp
L GND #PWR068
U 1 1 54514344
P 2600 5850
F 0 "#PWR068" H 2600 5850 30  0001 C CNN
F 1 "GND" H 2600 5780 30  0001 C CNN
F 2 "" H 2600 5850 60  0001 C CNN
F 3 "" H 2600 5850 60  0001 C CNN
	1    2600 5850
	1    0    0    -1  
$EndComp
Text Notes 1900 4150 0    60   ~ 0
1.4V Regulator\nMax 500 mA\nTotal: 256 mA\n
Text HLabel 900  4800 0    60   Input ~ 0
EN1V4
$Comp
L C C19
U 1 1 5451436F
P 3950 5300
F 0 "C19" V 4050 5450 50  0000 C CNN
F 1 "1000pF" V 4050 5150 50  0000 C CNN
F 2 "" H 3950 5300 60  0001 C CNN
F 3 "" H 3950 5300 60  0001 C CNN
	1    3950 5300
	1    0    0    -1  
$EndComp
$Comp
L TPS78630KTTT U8
U 1 1 5451462B
P 2750 1500
F 0 "U8" H 3100 1000 60  0000 C CNN
F 1 "TPS78601KTTT" H 2750 1500 60  0000 C CNN
F 2 "" H 2750 1500 60  0001 C CNN
F 3 "" H 2750 1500 60  0001 C CNN
	1    2750 1500
	1    0    0    -1  
$EndComp
$Comp
L C C16
U 1 1 545146A1
P 3900 1600
F 0 "C16" V 4000 1750 50  0000 C CNN
F 1 "15pF" V 4000 1450 50  0000 C CNN
F 2 "" H 3900 1600 60  0001 C CNN
F 3 "" H 3900 1600 60  0001 C CNN
	1    3900 1600
	1    0    0    -1  
$EndComp
$Comp
L C C18
U 1 1 545146C9
P 1850 1950
F 0 "C18" V 1950 2100 50  0000 C CNN
F 1 "2.2uF" V 1950 1800 50  0000 C CNN
F 2 "" H 1850 1950 60  0001 C CNN
F 3 "" H 1850 1950 60  0001 C CNN
	1    1850 1950
	1    0    0    -1  
$EndComp
$Comp
L GND #PWR069
U 1 1 545147AF
P 1850 2300
F 0 "#PWR069" H 1850 2300 30  0001 C CNN
F 1 "GND" H 1850 2230 30  0001 C CNN
F 2 "" H 1850 2300 60  0001 C CNN
F 3 "" H 1850 2300 60  0001 C CNN
	1    1850 2300
	1    0    0    -1  
$EndComp
$Comp
L GND #PWR070
U 1 1 545147C3
P 3650 2450
F 0 "#PWR070" H 3650 2450 30  0001 C CNN
F 1 "GND" H 3650 2380 30  0001 C CNN
F 2 "" H 3650 2450 60  0001 C CNN
F 3 "" H 3650 2450 60  0001 C CNN
	1    3650 2450
	1    0    0    -1  
$EndComp
$Comp
L TPS73501DRBT U9
U 1 1 54525DA3
P 2600 5000
F 0 "U9" H 2950 4550 60  0000 C CNN
F 1 "TPS73501DRBT" H 3100 5400 60  0000 C CNN
F 2 "" H 2600 5000 60  0001 C CNN
F 3 "" H 2600 5000 60  0001 C CNN
	1    2600 5000
	1    0    0    -1  
$EndComp
Text Label 7350 2400 3    60   ~ 0
3V_V0
Text Label 8550 2650 1    60   ~ 0
3V_V1
Text Label 6150 2650 1    60   ~ 0
3V_V2
Text Label 4950 2650 1    60   ~ 0
3V_V3
Text HLabel 9700 2750 2    60   Output ~ 0
3V_V[3..0]
$Comp
L GND #PWR071
U 1 1 5453F4A9
P 4350 2050
F 0 "#PWR071" H 4350 2050 30  0001 C CNN
F 1 "GND" H 4350 1980 30  0001 C CNN
F 2 "" H 4350 2050 60  0001 C CNN
F 3 "" H 4350 2050 60  0001 C CNN
	1    4350 2050
	1    0    0    -1  
$EndComp
$Comp
L +5V #PWR072
U 1 1 5453F98E
P 1850 1600
F 0 "#PWR072" H 1850 1690 20  0001 C CNN
F 1 "+5V" H 1850 1690 30  0000 C CNN
F 2 "" H 1850 1600 60  0001 C CNN
F 3 "" H 1850 1600 60  0001 C CNN
	1    1850 1600
	1    0    0    -1  
$EndComp
$Sheet
S 5250 1550 550  400 
U 546954C9
F0 "ASDQ3V0 sense" 50
F1 "sch/Current_sense.sch" 50
F2 "_Reset" I L 5250 1900 60 
F3 "-" I L 5250 1700 60 
F4 "+" I L 5250 1600 60 
F5 "V_I" O R 5800 1650 60 
F6 "OC" O R 5800 1750 60 
$EndSheet
$Sheet
S 6450 1550 550  400 
U 546954CA
F0 "ASDQ3V1 sense" 50
F1 "sch/Current_sense.sch" 50
F2 "_Reset" I L 6450 1900 60 
F3 "-" I L 6450 1700 60 
F4 "+" I L 6450 1600 60 
F5 "V_I" O R 7000 1650 60 
F6 "OC" O R 7000 1750 60 
$EndSheet
$Sheet
S 7650 1550 550  400 
U 5457F106
F0 "ASDQ3V2 sense" 50
F1 "sch/Current_sense.sch" 50
F2 "_Reset" I L 7650 1900 60 
F3 "-" I L 7650 1700 60 
F4 "+" I L 7650 1600 60 
F5 "V_I" O R 8200 1650 60 
F6 "OC" O R 8200 1750 60 
$EndSheet
Entry Wire Line
	4950 2650 5050 2750
Entry Wire Line
	6150 2650 6250 2750
Entry Wire Line
	7350 2650 7450 2750
Entry Wire Line
	8550 2650 8650 2750
Text HLabel 4900 2100 0    60   Input ~ 0
Reset3V
Text Label 8250 1000 3    60   ~ 0
3V_I0
Text Label 9450 1000 3    60   ~ 0
3V_I1
Text Label 7050 1000 3    60   ~ 0
3V_I2
Text Label 5850 1000 3    60   ~ 0
3V_I3
Entry Wire Line
	5850 650  5950 550 
Entry Wire Line
	7050 650  7150 550 
Entry Wire Line
	8250 650  8350 550 
Entry Wire Line
	9450 650  9550 550 
Text HLabel 10150 550  2    60   Output ~ 0
3V_I[3..0]
Text Label 8400 900  3    60   ~ 0
3V_OC0
Text Label 9600 900  3    60   ~ 0
3V_OC1
Text Label 7200 900  3    60   ~ 0
3V_OC2
Text Label 6000 900  3    60   ~ 0
3V_OC3
Entry Wire Line
	6000 850  6100 750 
Entry Wire Line
	7200 850  7300 750 
Entry Wire Line
	8400 850  8500 750 
Entry Wire Line
	9600 850  9700 750 
Text HLabel 10150 750  2    60   Output ~ 0
3V_OC[3..0]
$Sheet
S 8850 1550 550  400 
U 5457F10D
F0 "ASDQ3V3 sense" 50
F1 "sch/Current_sense.sch" 50
F2 "_Reset" I L 8850 1900 60 
F3 "-" I L 8850 1700 60 
F4 "+" I L 8850 1600 60 
F5 "V_I" O R 9400 1650 60 
F6 "OC" O R 9400 1750 60 
$EndSheet
$Comp
L R R16
U 1 1 5458CDCE
P 1150 1350
F 0 "R16" V 1230 1350 50  0000 C CNN
F 1 "0" V 1150 1350 50  0000 C CNN
F 2 "" H 1150 1350 60  0001 C CNN
F 3 "" H 1150 1350 60  0001 C CNN
	1    1150 1350
	0    -1   -1   0   
$EndComp
$Comp
L R R15
U 1 1 54513FF9
P 1400 1100
F 0 "R15" V 1480 1100 50  0000 C CNN
F 1 "DNP" V 1400 1100 50  0000 C CNN
F 2 "" H 1400 1100 60  0001 C CNN
F 3 "" H 1400 1100 60  0001 C CNN
	1    1400 1100
	1    0    0    -1  
$EndComp
$Comp
L +3V #PWR073
U 1 1 545806EC
P 4400 1300
F 0 "#PWR073" H 4400 1440 20  0001 C CNN
F 1 "+3V" H 4400 1410 30  0000 C CNN
F 2 "" H 4400 1300 60  0001 C CNN
F 3 "" H 4400 1300 60  0001 C CNN
	1    4400 1300
	1    0    0    -1  
$EndComp
$Comp
L +3.3V #PWR074
U 1 1 5458383C
P 1500 4300
F 0 "#PWR074" H 1500 4260 30  0001 C CNN
F 1 "+3.3V" H 1500 4410 30  0000 C CNN
F 2 "" H 1500 4300 60  0001 C CNN
F 3 "" H 1500 4300 60  0001 C CNN
	1    1500 4300
	1    0    0    -1  
$EndComp
$Comp
L R R24
U 1 1 5458384F
P 1250 4800
F 0 "R24" V 1330 4800 50  0000 C CNN
F 1 "0" V 1250 4800 50  0000 C CNN
F 2 "" H 1250 4800 60  0001 C CNN
F 3 "" H 1250 4800 60  0001 C CNN
	1    1250 4800
	0    -1   -1   0   
$EndComp
$Comp
L R R23
U 1 1 54583855
P 1500 4550
F 0 "R23" V 1580 4550 50  0000 C CNN
F 1 "DNP" V 1500 4550 50  0000 C CNN
F 2 "" H 1500 4550 60  0001 C CNN
F 3 "" H 1500 4550 60  0001 C CNN
	1    1500 4550
	1    0    0    -1  
$EndComp
Text Notes 9700 2500 0    60   ~ 0
Separate monitored supply lines \nfor each ASDQ's 3V
Text Notes 9550 700  0    60   ~ 0
For current monitoring and tripping
$Sheet
S 5250 5050 550  400 
U 54584D89
F0 "ASDQ1V4 sense" 50
F1 "sch/Current_sense.sch" 50
F2 "_Reset" I L 5250 5400 60 
F3 "-" I L 5250 5200 60 
F4 "+" I L 5250 5100 60 
F5 "V_I" O R 5800 5150 60 
F6 "OC" O R 5800 5250 60 
$EndSheet
$Comp
L +3V #PWR075
U 1 1 5458124D
P 1850 5100
F 0 "#PWR075" H 1850 5240 20  0001 C CNN
F 1 "+3V" H 1850 5210 30  0000 C CNN
F 2 "" H 1850 5100 60  0001 C CNN
F 3 "" H 1850 5100 60  0001 C CNN
	1    1850 5100
	1    0    0    -1  
$EndComp
$Comp
L C C20
U 1 1 54581255
P 1850 5450
F 0 "C20" V 1950 5600 50  0000 C CNN
F 1 "0.1uF" V 1950 5300 50  0000 C CNN
F 2 "" H 1850 5450 60  0001 C CNN
F 3 "" H 1850 5450 60  0001 C CNN
	1    1850 5450
	1    0    0    -1  
$EndComp
$Comp
L GND #PWR076
U 1 1 5458125B
P 1850 5800
F 0 "#PWR076" H 1850 5800 30  0001 C CNN
F 1 "GND" H 1850 5730 30  0001 C CNN
F 2 "" H 1850 5800 60  0001 C CNN
F 3 "" H 1850 5800 60  0001 C CNN
	1    1850 5800
	1    0    0    -1  
$EndComp
Text HLabel 4800 5400 0    60   Input ~ 0
Reset1V4
Text HLabel 6350 5900 2    60   Output ~ 0
1V4_V
Text HLabel 6350 5150 2    60   Output ~ 0
1V4_I
Text HLabel 6350 5250 2    60   Output ~ 0
1V4_OC
Text Notes 6350 5800 0    60   ~ 0
1.4V monitored supply line
Text Notes 6350 5050 0    60   ~ 0
1.4V current monitor and OC
$Comp
L R R17
U 1 1 5459A003
P 3650 1600
F 0 "R17" V 3730 1600 50  0000 C CNN
F 1 "44.4k" V 3650 1600 50  0000 C CNN
F 2 "" H 3650 1600 60  0001 C CNN
F 3 "" H 3650 1600 60  0001 C CNN
	1    3650 1600
	1    0    0    -1  
$EndComp
$Comp
L R R22
U 1 1 5459A062
P 3650 2100
F 0 "R22" V 3730 2100 50  0000 C CNN
F 1 "30.6k" V 3650 2100 50  0000 C CNN
F 2 "" H 3650 2100 60  0001 C CNN
F 3 "" H 3650 2100 60  0001 C CNN
	1    3650 2100
	1    0    0    -1  
$EndComp
Wire Wire Line
	8550 1350 3500 1350
Text Notes 5100 2250 0    60   ~ 0
Using R30 = 1k, R29 =2k\n
$EndSCHEMATC
