PCBNEW-LibModule-V1  Fri 28 Nov 2014 05:58:52 PM EST
# encoding utf-8
Units mm
$INDEX
TTSOP-20
$EndINDEX
$MODULE TTSOP-20
Po 0 0 0 15 5478FE21 00000000 ~~
Li TTSOP-20
Sc 0
AR 
Op 0 0 0
T0 0 -4.191 1 1 0 0.15 N V 21 N "TTSOP-20"
T1 0 5.3594 1 1 0 0.15 N V 21 N "VAL**"
DC -1.651 -2.7686 -1.905 -2.9718 0.15 21
DS -2.775 -3.25 2.775 -3.25 0.15 21
DS -2.775 3.25 2.775 3.25 0.15 21
$PAD
Sh "16" R 1.05 0.45 0 0 0
Dr 0 0 0
At SMD N 00888000
Ne 0 ""
Po 2.775 -0.325
$EndPAD
$PAD
Sh "20" R 1.05 0.45 0 0 0
Dr 0 0 0
At SMD N 00888000
Ne 0 ""
Po 2.775 -2.925
$EndPAD
$PAD
Sh "19" R 1.05 0.45 0 0 0
Dr 0 0 0
At SMD N 00888000
Ne 0 ""
Po 2.775 -2.275
$EndPAD
$PAD
Sh "3" R 1.05 0.45 0 0 0
Dr 0 0 0
At SMD N 00888000
Ne 0 ""
Po -2.775 -1.625
$EndPAD
$PAD
Sh "17" R 1.05 0.45 0 0 0
Dr 0 0 0
At SMD N 00888000
Ne 0 ""
Po 2.775 -0.975
$EndPAD
$PAD
Sh "14" R 1.05 0.45 0 0 0
Dr 0 0 0
At SMD N 00888000
Ne 0 ""
Po 2.775 0.975
$EndPAD
$PAD
Sh "13" R 1.05 0.45 0 0 0
Dr 0 0 0
At SMD N 00888000
Ne 0 ""
Po 2.775 1.625
$EndPAD
$PAD
Sh "12" R 1.05 0.45 0 0 0
Dr 0 0 0
At SMD N 00888000
Ne 0 ""
Po 2.775 2.275
$EndPAD
$PAD
Sh "11" R 1.05 0.45 0 0 0
Dr 0 0 0
At SMD N 00888000
Ne 0 ""
Po 2.775 2.925
$EndPAD
$PAD
Sh "15" R 1.05 0.45 0 0 0
Dr 0 0 0
At SMD N 00888000
Ne 0 ""
Po 2.775 0.325
$EndPAD
$PAD
Sh "6" R 1.05 0.45 0 0 0
Dr 0 0 0
At SMD N 00888000
Ne 0 ""
Po -2.775 0.325
$EndPAD
$PAD
Sh "10" R 1.05 0.45 0 0 0
Dr 0 0 0
At SMD N 00888000
Ne 0 ""
Po -2.775 2.925
$EndPAD
$PAD
Sh "9" R 1.05 0.45 0 0 0
Dr 0 0 0
At SMD N 00888000
Ne 0 ""
Po -2.775 2.275
$EndPAD
$PAD
Sh "8" R 1.05 0.45 0 0 0
Dr 0 0 0
At SMD N 00888000
Ne 0 ""
Po -2.775 1.625
$EndPAD
$PAD
Sh "7" R 1.05 0.45 0 0 0
Dr 0 0 0
At SMD N 00888000
Ne 0 ""
Po -2.775 0.975
$EndPAD
$PAD
Sh "4" R 1.05 0.45 0 0 0
Dr 0 0 0
At SMD N 00888000
Ne 0 ""
Po -2.775 -0.975
$EndPAD
$PAD
Sh "18" R 1.05 0.45 0 0 0
Dr 0 0 0
At SMD N 00888000
Ne 0 ""
Po 2.775 -1.625
$EndPAD
$PAD
Sh "2" R 1.05 0.45 0 0 0
Dr 0 0 0
At SMD N 00888000
Ne 0 ""
Po -2.775 -2.275
$EndPAD
$PAD
Sh "1" R 1.05 0.45 0 0 0
Dr 0 0 0
At SMD N 00888000
Ne 0 ""
Po -2.775 -2.925
$EndPAD
$PAD
Sh "5" R 1.05 0.45 0 0 0
Dr 0 0 0
At SMD N 00888000
Ne 0 ""
Po -2.775 -0.325
$EndPAD
$EndMODULE TTSOP-20
$EndLIBRARY
