EESchema Schematic File Version 2
LIBS:2x14_conn
LIBS:ad7998
LIBS:bav99
LIBS:ds18b20u
LIBS:ina202a
LIBS:lt3015eq
LIBS:mcp23017-qfn
LIBS:opa703
LIBS:power
LIBS:pspice
LIBS:sn74hc05d
LIBS:tps73501drbt
LIBS:tps78630kttt
LIBS:LogicBoard_DB-cache
EELAYER 24 0
EELAYER END
$Descr A4 11693 8268
encoding utf-8
Sheet 4 15
Title ""
Date "18 nov 2014"
Rev ""
Comp ""
Comment1 ""
Comment2 ""
Comment3 ""
Comment4 ""
$EndDescr
Text Notes 6750 5250 0    60   ~ 0
2.5V nominal
Connection ~ 4950 5300
Wire Wire Line
	4850 5300 4950 5300
Wire Wire Line
	8850 1900 8850 3000
Wire Wire Line
	7650 1900 7500 1900
Wire Wire Line
	7650 1900 7650 1700
Wire Wire Line
	7650 1600 7650 1400
Wire Wire Line
	7650 1400 7500 1400
Wire Wire Line
	7500 1900 7500 3000
Wire Wire Line
	6150 1350 6150 1400
Wire Wire Line
	6150 1900 6150 3000
Connection ~ 3350 1350
Connection ~ 3100 1350
Wire Wire Line
	2950 1650 2950 1850
Connection ~ 3850 1350
Wire Wire Line
	3850 1350 3850 1300
Wire Wire Line
	3200 5200 3300 5200
Wire Wire Line
	3300 5200 3300 5300
Wire Wire Line
	3300 5300 3750 5300
Wire Wire Line
	2600 5600 2600 5850
Wire Wire Line
	2600 5800 4150 5800
Connection ~ 2600 5800
Connection ~ 3400 4800
Wire Wire Line
	1300 1600 1300 1700
Wire Wire Line
	1300 1650 1450 1650
Wire Wire Line
	1300 2200 1300 2300
Connection ~ 1300 1650
Wire Bus Line
	4900 3100 9900 3100
Connection ~ 6150 1350
Wire Wire Line
	4500 2100 9050 2100
Wire Wire Line
	9850 650  9850 1700
Wire Bus Line
	5900 550  10150 550 
Wire Bus Line
	5750 750  10150 750 
Wire Wire Line
	1450 1350 1350 1350
Wire Wire Line
	800  1350 850  1350
Wire Wire Line
	900  4800 1000 4800
Wire Wire Line
	1850 5100 1850 5200
Wire Wire Line
	1850 5200 2000 5200
Wire Wire Line
	1850 5700 1850 5800
Wire Wire Line
	1500 4800 2000 4800
Wire Wire Line
	4800 5400 5250 5400
Wire Wire Line
	5250 5200 4950 5200
Wire Wire Line
	4950 6400 6350 6400
Wire Wire Line
	2150 2250 2150 2150
Wire Wire Line
	2150 2150 2250 2150
Wire Wire Line
	3800 2050 3800 2000
Wire Wire Line
	3100 2450 3100 2350
Wire Wire Line
	3800 1350 3800 1500
Connection ~ 3800 1350
Wire Wire Line
	2950 1850 3350 1850
Connection ~ 3100 1850
Wire Wire Line
	2550 5600 2650 5600
Connection ~ 2600 5600
Wire Wire Line
	4350 4800 4350 4750
Wire Wire Line
	3200 4800 5050 4800
Wire Wire Line
	5050 4800 5050 5100
Wire Wire Line
	5050 5100 5250 5100
Connection ~ 4850 4800
$Comp
L R R26
U 1 1 546AC535
P 4850 5050
F 0 "R26" V 4930 5050 50  0000 C CNN
F 1 "0.05" V 4850 5050 50  0000 C CNN
F 2 "" H 4850 5050 60  0001 C CNN
F 3 "" H 4850 5050 60  0001 C CNN
	1    4850 5050
	1    0    0    -1  
$EndComp
Text Notes 10700 600  0    60   ~ 0
1.25V nominal
$Comp
L R R21
U 1 1 546AC476
P 8850 1650
F 0 "R21" V 8930 1650 50  0000 C CNN
F 1 "0.1" V 8850 1650 50  0000 C CNN
F 2 "" H 8850 1650 60  0001 C CNN
F 3 "" H 8850 1650 60  0001 C CNN
	1    8850 1650
	1    0    0    -1  
$EndComp
$Comp
L R R20
U 1 1 546AC46C
P 7500 1650
F 0 "R20" V 7580 1650 50  0000 C CNN
F 1 "0.1" V 7500 1650 50  0000 C CNN
F 2 "" H 7500 1650 60  0001 C CNN
F 3 "" H 7500 1650 60  0001 C CNN
	1    7500 1650
	1    0    0    -1  
$EndComp
$Comp
L R R19
U 1 1 546AC457
P 6150 1650
F 0 "R19" V 6230 1650 50  0000 C CNN
F 1 "0.1" V 6150 1650 50  0000 C CNN
F 2 "" H 6150 1650 60  0001 C CNN
F 3 "" H 6150 1650 60  0001 C CNN
	1    6150 1650
	1    0    0    -1  
$EndComp
Text Notes 4900 2600 1    60   ~ 0
125mA
$Comp
L R R18
U 1 1 546AC398
P 4800 1650
F 0 "R18" V 4880 1650 50  0000 C CNN
F 1 "0.1" V 4800 1650 50  0000 C CNN
F 2 "" H 4800 1650 60  0001 C CNN
F 3 "" H 4800 1650 60  0001 C CNN
	1    4800 1650
	1    0    0    -1  
$EndComp
$Comp
L +1.4V #PWR066
U 1 1 54697D0E
P 4350 4750
F 0 "#PWR066" H 4350 4890 20  0001 C CNN
F 1 "+1.4V" H 4350 4860 30  0000 C CNN
F 2 "" H 4350 4750 60  0001 C CNN
F 3 "" H 4350 4750 60  0001 C CNN
	1    4350 4750
	1    0    0    -1  
$EndComp
$Comp
L +3.3V #PWR067
U 1 1 54513FFF
P 1350 850
F 0 "#PWR067" H 1350 810 30  0001 C CNN
F 1 "+3.3V" H 1350 960 30  0000 C CNN
F 2 "" H 1350 850 60  0001 C CNN
F 3 "" H 1350 850 60  0001 C CNN
	1    1350 850 
	1    0    0    -1  
$EndComp
$Comp
L GND #PWR068
U 1 1 545142F6
P 2150 2250
F 0 "#PWR068" H 2150 2250 30  0001 C CNN
F 1 "GND" H 2150 2180 30  0001 C CNN
F 2 "" H 2150 2250 60  0001 C CNN
F 3 "" H 2150 2250 60  0001 C CNN
	1    2150 2250
	1    0    0    -1  
$EndComp
Text Notes 1500 700  0    60   ~ 0
3V Regulator\nMax  1.5 A\nTotal: 850 mA\nArea: huge...\nASDQ: 500mA\n1.6V: 75mA\n1.4V: 275mA\n
Text HLabel 800  1350 0    60   Input ~ 0
EN3V
$Comp
L C C17
U 1 1 54514321
P 3800 1750
F 0 "C17" V 3900 1900 50  0000 C CNN
F 1 "2.2uF" V 3900 1600 50  0000 C CNN
F 2 "" H 3800 1750 60  0001 C CNN
F 3 "" H 3800 1750 60  0001 C CNN
	1    3800 1750
	1    0    0    -1  
$EndComp
$Comp
L R R25
U 1 1 54514333
P 3400 5050
F 0 "R25" V 3480 5050 50  0000 C CNN
F 1 "300k" V 3400 5050 50  0000 C CNN
F 2 "" H 3400 5050 60  0001 C CNN
F 3 "" H 3400 5050 60  0001 C CNN
	1    3400 5050
	1    0    0    -1  
$EndComp
$Comp
L R R27
U 1 1 54514339
P 3400 5550
F 0 "R27" V 3480 5550 50  0000 C CNN
F 1 "1.79M" V 3400 5550 50  0000 C CNN
F 2 "" H 3400 5550 60  0001 C CNN
F 3 "" H 3400 5550 60  0001 C CNN
	1    3400 5550
	1    0    0    -1  
$EndComp
$Comp
L GND #PWR069
U 1 1 54514344
P 2600 5850
F 0 "#PWR069" H 2600 5850 30  0001 C CNN
F 1 "GND" H 2600 5780 30  0001 C CNN
F 2 "" H 2600 5850 60  0001 C CNN
F 3 "" H 2600 5850 60  0001 C CNN
	1    2600 5850
	1    0    0    -1  
$EndComp
Text Notes 1900 4150 0    60   ~ 0
1.4V Regulator\nMax 500 mA\nTotal: 256 mA\n
Text HLabel 900  4800 0    60   Input ~ 0
EN1V4
$Comp
L C C19
U 1 1 5451436F
P 4150 5300
F 0 "C19" V 4250 5450 50  0000 C CNN
F 1 "1000pF" V 4250 5150 50  0000 C CNN
F 2 "" H 4150 5300 60  0001 C CNN
F 3 "" H 4150 5300 60  0001 C CNN
	1    4150 5300
	1    0    0    -1  
$EndComp
$Comp
L TPS78630KTTT U8
U 1 1 5451462B
P 2200 1500
F 0 "U8" H 2550 1000 60  0000 C CNN
F 1 "TPS78601KTTT" H 2200 1500 60  0000 C CNN
F 2 "" H 2200 1500 60  0001 C CNN
F 3 "" H 2200 1500 60  0001 C CNN
F 4 "296-27089-1-ND" H 2200 1500 60  0001 C CNN "Field1"
F 5 "Digi-key" H 2200 1500 60  0001 C CNN "Field2"
	1    2200 1500
	1    0    0    -1  
$EndComp
$Comp
L C C16
U 1 1 545146A1
P 3350 1600
F 0 "C16" V 3450 1750 50  0000 C CNN
F 1 "15pF" V 3450 1450 50  0000 C CNN
F 2 "" H 3350 1600 60  0001 C CNN
F 3 "" H 3350 1600 60  0001 C CNN
	1    3350 1600
	1    0    0    -1  
$EndComp
$Comp
L C C18
U 1 1 545146C9
P 1300 1950
F 0 "C18" V 1400 2100 50  0000 C CNN
F 1 "2.2uF" V 1400 1800 50  0000 C CNN
F 2 "" H 1300 1950 60  0001 C CNN
F 3 "" H 1300 1950 60  0001 C CNN
	1    1300 1950
	1    0    0    -1  
$EndComp
$Comp
L GND #PWR070
U 1 1 545147AF
P 1300 2300
F 0 "#PWR070" H 1300 2300 30  0001 C CNN
F 1 "GND" H 1300 2230 30  0001 C CNN
F 2 "" H 1300 2300 60  0001 C CNN
F 3 "" H 1300 2300 60  0001 C CNN
	1    1300 2300
	1    0    0    -1  
$EndComp
$Comp
L GND #PWR071
U 1 1 545147C3
P 3100 2450
F 0 "#PWR071" H 3100 2450 30  0001 C CNN
F 1 "GND" H 3100 2380 30  0001 C CNN
F 2 "" H 3100 2450 60  0001 C CNN
F 3 "" H 3100 2450 60  0001 C CNN
	1    3100 2450
	1    0    0    -1  
$EndComp
$Comp
L TPS73501DRBT U9
U 1 1 54525DA3
P 2600 5000
F 0 "U9" H 2950 4550 60  0000 C CNN
F 1 "TPS73501DRBT" H 3100 5400 60  0000 C CNN
F 2 "" H 2600 5000 60  0001 C CNN
F 3 "" H 2600 5000 60  0001 C CNN
F 4 "296-24873-1-ND" H 2600 5000 60  0001 C CNN "Field1"
F 5 "Digi-key" H 2600 5000 60  0001 C CNN "Field2"
	1    2600 5000
	1    0    0    -1  
$EndComp
Text Label 7500 2750 3    60   ~ 0
3V_V0
Text Label 8850 3000 1    60   ~ 0
3V_V1
Text Label 6150 3000 1    60   ~ 0
3V_V2
Text Label 4800 3000 1    60   ~ 0
3V_V3
Text HLabel 9900 3100 2    60   Output ~ 0
3V_V[3..0]
$Comp
L GND #PWR072
U 1 1 5453F4A9
P 3800 2050
F 0 "#PWR072" H 3800 2050 30  0001 C CNN
F 1 "GND" H 3800 1980 30  0001 C CNN
F 2 "" H 3800 2050 60  0001 C CNN
F 3 "" H 3800 2050 60  0001 C CNN
	1    3800 2050
	1    0    0    -1  
$EndComp
$Comp
L +5V #PWR073
U 1 1 5453F98E
P 1300 1600
F 0 "#PWR073" H 1300 1690 20  0001 C CNN
F 1 "+5V" H 1300 1690 30  0000 C CNN
F 2 "" H 1300 1600 60  0001 C CNN
F 3 "" H 1300 1600 60  0001 C CNN
	1    1300 1600
	1    0    0    -1  
$EndComp
Entry Wire Line
	4800 3000 4900 3100
Entry Wire Line
	6150 3000 6250 3100
Entry Wire Line
	7500 3000 7600 3100
Entry Wire Line
	8850 3000 8950 3100
Text HLabel 4500 2100 0    60   Input ~ 0
_Reset3V
Text Label 8500 1000 3    60   ~ 0
3V_I0
Text Label 9850 1000 3    60   ~ 0
3V_I1
Text Label 7150 1000 3    60   ~ 0
3V_I2
Text Label 5800 1000 3    60   ~ 0
3V_I3
Entry Wire Line
	5800 650  5900 550 
Entry Wire Line
	7150 650  7250 550 
Entry Wire Line
	8500 650  8600 550 
Entry Wire Line
	9850 650  9950 550 
Text HLabel 10150 550  2    60   Output ~ 0
3V_I[3..0]
Text Label 8350 900  3    60   ~ 0
3V_OC0
Text Label 9700 900  3    60   ~ 0
3V_OC1
Text Label 7000 900  3    60   ~ 0
3V_OC2
Text Label 5650 900  3    60   ~ 0
3V_OC3
Entry Wire Line
	5650 850  5750 750 
Entry Wire Line
	7000 850  7100 750 
Entry Wire Line
	8350 850  8450 750 
Entry Wire Line
	9700 850  9800 750 
Text HLabel 10150 750  2    60   Output ~ 0
3V_OC[3..0]
$Comp
L R R16
U 1 1 5458CDCE
P 1100 1350
F 0 "R16" V 1180 1350 50  0000 C CNN
F 1 "0" V 1100 1350 50  0000 C CNN
F 2 "" H 1100 1350 60  0001 C CNN
F 3 "" H 1100 1350 60  0001 C CNN
	1    1100 1350
	0    -1   -1   0   
$EndComp
$Comp
L R R15
U 1 1 54513FF9
P 1350 1100
F 0 "R15" V 1430 1100 50  0000 C CNN
F 1 "DNP" V 1350 1100 50  0000 C CNN
F 2 "" H 1350 1100 60  0001 C CNN
F 3 "" H 1350 1100 60  0001 C CNN
	1    1350 1100
	1    0    0    -1  
$EndComp
$Comp
L +3V #PWR074
U 1 1 545806EC
P 3850 1300
F 0 "#PWR074" H 3850 1440 20  0001 C CNN
F 1 "+3V" H 3850 1410 30  0000 C CNN
F 2 "" H 3850 1300 60  0001 C CNN
F 3 "" H 3850 1300 60  0001 C CNN
	1    3850 1300
	1    0    0    -1  
$EndComp
$Comp
L +3.3V #PWR075
U 1 1 5458383C
P 1500 4300
F 0 "#PWR075" H 1500 4260 30  0001 C CNN
F 1 "+3.3V" H 1500 4410 30  0000 C CNN
F 2 "" H 1500 4300 60  0001 C CNN
F 3 "" H 1500 4300 60  0001 C CNN
	1    1500 4300
	1    0    0    -1  
$EndComp
$Comp
L R R24
U 1 1 5458384F
P 1250 4800
F 0 "R24" V 1330 4800 50  0000 C CNN
F 1 "0" V 1250 4800 50  0000 C CNN
F 2 "" H 1250 4800 60  0001 C CNN
F 3 "" H 1250 4800 60  0001 C CNN
	1    1250 4800
	0    -1   -1   0   
$EndComp
$Comp
L R R23
U 1 1 54583855
P 1500 4550
F 0 "R23" V 1580 4550 50  0000 C CNN
F 1 "DNP" V 1500 4550 50  0000 C CNN
F 2 "" H 1500 4550 60  0001 C CNN
F 3 "" H 1500 4550 60  0001 C CNN
	1    1500 4550
	1    0    0    -1  
$EndComp
Text Notes 9900 2850 0    60   ~ 0
Separate monitored supply lines \nfor each ASDQ's 3V
Text Notes 10050 900  0    60   ~ 0
For current monitoring
$Comp
L +3V #PWR076
U 1 1 5458124D
P 1850 5100
F 0 "#PWR076" H 1850 5240 20  0001 C CNN
F 1 "+3V" H 1850 5210 30  0000 C CNN
F 2 "" H 1850 5100 60  0001 C CNN
F 3 "" H 1850 5100 60  0001 C CNN
	1    1850 5100
	1    0    0    -1  
$EndComp
$Comp
L C C20
U 1 1 54581255
P 1850 5450
F 0 "C20" V 1950 5600 50  0000 C CNN
F 1 "0.1uF" V 1950 5300 50  0000 C CNN
F 2 "" H 1850 5450 60  0001 C CNN
F 3 "" H 1850 5450 60  0001 C CNN
	1    1850 5450
	1    0    0    -1  
$EndComp
$Comp
L GND #PWR077
U 1 1 5458125B
P 1850 5800
F 0 "#PWR077" H 1850 5800 30  0001 C CNN
F 1 "GND" H 1850 5730 30  0001 C CNN
F 2 "" H 1850 5800 60  0001 C CNN
F 3 "" H 1850 5800 60  0001 C CNN
	1    1850 5800
	1    0    0    -1  
$EndComp
Text HLabel 4800 5400 0    60   Input ~ 0
_Reset1V4
Text HLabel 6350 6400 2    60   Output ~ 0
1V4_V
Text HLabel 6350 5200 2    60   Output ~ 0
1V4_I
Text HLabel 6350 5100 2    60   Output ~ 0
1V4_OC
Text Notes 6350 6300 0    60   ~ 0
1.4V monitored supply line
Text Notes 6350 5350 0    60   ~ 0
1.4V current monitor and OC
$Comp
L R R17
U 1 1 5459A003
P 3100 1600
F 0 "R17" V 3180 1600 50  0000 C CNN
F 1 "44.4k" V 3100 1600 50  0000 C CNN
F 2 "" H 3100 1600 60  0001 C CNN
F 3 "" H 3100 1600 60  0001 C CNN
	1    3100 1600
	1    0    0    -1  
$EndComp
$Comp
L R R22
U 1 1 5459A062
P 3100 2100
F 0 "R22" V 3180 2100 50  0000 C CNN
F 1 "30.6k" V 3100 2100 50  0000 C CNN
F 2 "" H 3100 2100 60  0001 C CNN
F 3 "" H 3100 2100 60  0001 C CNN
	1    3100 2100
	1    0    0    -1  
$EndComp
Wire Wire Line
	2950 1350 8850 1350
Wire Wire Line
	9850 2700 9850 2750
$Comp
L R R38
U 1 1 56391B7B
P 9850 1950
F 0 "R38" V 9950 1850 50  0000 C CNN
F 1 "2k" V 9850 1950 50  0000 C CNN
F 2 "" H 9850 1950 60  0001 C CNN
F 3 "" H 9850 1950 60  0001 C CNN
	1    9850 1950
	-1   0    0    1   
$EndComp
$Comp
L R R39
U 1 1 56391B81
P 9850 2450
F 0 "R39" V 9930 2450 50  0000 C CNN
F 1 "1k" V 9850 2450 50  0000 C CNN
F 2 "" H 9850 2450 60  0001 C CNN
F 3 "" H 9850 2450 60  0001 C CNN
	1    9850 2450
	-1   0    0    1   
$EndComp
$Comp
L GND #PWR078
U 1 1 56391B87
P 9850 2750
F 0 "#PWR078" H 9850 2750 30  0001 C CNN
F 1 "GND" H 9850 2680 30  0001 C CNN
F 2 "" H 9850 2750 60  0001 C CNN
F 3 "" H 9850 2750 60  0001 C CNN
	1    9850 2750
	1    0    0    -1  
$EndComp
$Comp
L C C36
U 1 1 56391B8D
P 9550 2450
F 0 "C36" V 9650 2600 50  0000 C CNN
F 1 "1uF" V 9650 2300 50  0000 C CNN
F 2 "" H 9550 2450 60  0000 C CNN
F 3 "" H 9550 2450 60  0000 C CNN
	1    9550 2450
	1    0    0    -1  
$EndComp
$Sheet
S 9100 1550 550  400 
U 5457F10D
F0 "ASDQ3V3 sense" 50
F1 "sch/Current_sense.sch" 50
F2 "_Reset" I L 9100 1900 60 
F3 "-" I L 9100 1700 60 
F4 "+" I L 9100 1600 60 
F5 "V_I" O R 9650 1700 60 
F6 "OC" O R 9650 1600 60 
F7 "CMPin" I R 9650 1800 60 
$EndSheet
Wire Wire Line
	9700 1600 9650 1600
Wire Wire Line
	9700 850  9700 1600
Wire Wire Line
	9850 1700 9650 1700
Wire Wire Line
	9550 2200 9850 2200
Wire Wire Line
	9850 2700 9550 2700
Wire Wire Line
	9650 1800 9700 1800
Wire Wire Line
	9700 1800 9700 2200
Connection ~ 9700 2200
Wire Wire Line
	8850 1400 9000 1400
Wire Wire Line
	9000 1400 9000 1600
Wire Wire Line
	9000 1600 9100 1600
Wire Wire Line
	8850 1900 9000 1900
Wire Wire Line
	9000 1900 9000 1700
Wire Wire Line
	9000 1700 9100 1700
Wire Wire Line
	9050 2100 9050 1900
Wire Wire Line
	9050 1900 9100 1900
Wire Wire Line
	8500 650  8500 1700
Wire Wire Line
	8500 2700 8500 2750
$Comp
L R R35
U 1 1 563A0342
P 8500 1950
F 0 "R35" V 8600 1850 50  0000 C CNN
F 1 "2k" V 8500 1950 50  0000 C CNN
F 2 "" H 8500 1950 60  0001 C CNN
F 3 "" H 8500 1950 60  0001 C CNN
	1    8500 1950
	-1   0    0    1   
$EndComp
$Comp
L R R36
U 1 1 563A0348
P 8500 2450
F 0 "R36" V 8580 2450 50  0000 C CNN
F 1 "1k" V 8500 2450 50  0000 C CNN
F 2 "" H 8500 2450 60  0001 C CNN
F 3 "" H 8500 2450 60  0001 C CNN
	1    8500 2450
	-1   0    0    1   
$EndComp
$Comp
L GND #PWR079
U 1 1 563A034E
P 8500 2750
F 0 "#PWR079" H 8500 2750 30  0001 C CNN
F 1 "GND" H 8500 2680 30  0001 C CNN
F 2 "" H 8500 2750 60  0001 C CNN
F 3 "" H 8500 2750 60  0001 C CNN
	1    8500 2750
	1    0    0    -1  
$EndComp
$Comp
L C C35
U 1 1 563A0354
P 8200 2450
F 0 "C35" V 8300 2600 50  0000 C CNN
F 1 "1uF" V 8300 2300 50  0000 C CNN
F 2 "" H 8200 2450 60  0000 C CNN
F 3 "" H 8200 2450 60  0000 C CNN
	1    8200 2450
	1    0    0    -1  
$EndComp
$Sheet
S 7750 1550 550  400 
U 563A035C
F0 "ASDQ3V2 sense" 50
F1 "sch/Current_sense.sch" 50
F2 "_Reset" I L 7750 1900 60 
F3 "-" I L 7750 1700 60 
F4 "+" I L 7750 1600 60 
F5 "V_I" O R 8300 1700 60 
F6 "OC" O R 8300 1600 60 
F7 "CMPin" I R 8300 1800 60 
$EndSheet
Wire Wire Line
	8350 1600 8300 1600
Wire Wire Line
	8350 850  8350 1600
Wire Wire Line
	8500 1700 8300 1700
Wire Wire Line
	8200 2200 8500 2200
Wire Wire Line
	8500 2700 8200 2700
Wire Wire Line
	8300 1800 8350 1800
Wire Wire Line
	8350 1800 8350 2200
Connection ~ 8350 2200
Wire Wire Line
	7650 1600 7750 1600
Wire Wire Line
	7650 1700 7750 1700
Wire Wire Line
	7700 2100 7700 1900
Wire Wire Line
	7700 1900 7750 1900
Wire Wire Line
	7150 650  7150 1700
Wire Wire Line
	7150 2700 7150 2750
$Comp
L R R32
U 1 1 563A3887
P 7150 1950
F 0 "R32" V 7250 1850 50  0000 C CNN
F 1 "2k" V 7150 1950 50  0000 C CNN
F 2 "" H 7150 1950 60  0001 C CNN
F 3 "" H 7150 1950 60  0001 C CNN
	1    7150 1950
	-1   0    0    1   
$EndComp
$Comp
L R R33
U 1 1 563A388D
P 7150 2450
F 0 "R33" V 7230 2450 50  0000 C CNN
F 1 "1k" V 7150 2450 50  0000 C CNN
F 2 "" H 7150 2450 60  0001 C CNN
F 3 "" H 7150 2450 60  0001 C CNN
	1    7150 2450
	-1   0    0    1   
$EndComp
$Comp
L GND #PWR080
U 1 1 563A3893
P 7150 2750
F 0 "#PWR080" H 7150 2750 30  0001 C CNN
F 1 "GND" H 7150 2680 30  0001 C CNN
F 2 "" H 7150 2750 60  0001 C CNN
F 3 "" H 7150 2750 60  0001 C CNN
	1    7150 2750
	1    0    0    -1  
$EndComp
$Comp
L C C34
U 1 1 563A3899
P 6850 2450
F 0 "C34" V 6950 2600 50  0000 C CNN
F 1 "1uF" V 6950 2300 50  0000 C CNN
F 2 "" H 6850 2450 60  0000 C CNN
F 3 "" H 6850 2450 60  0000 C CNN
	1    6850 2450
	1    0    0    -1  
$EndComp
$Sheet
S 6400 1550 550  400 
U 563A38A1
F0 "ASDQ3V1 sense" 50
F1 "sch/Current_sense.sch" 50
F2 "_Reset" I L 6400 1900 60 
F3 "-" I L 6400 1700 60 
F4 "+" I L 6400 1600 60 
F5 "V_I" O R 6950 1700 60 
F6 "OC" O R 6950 1600 60 
F7 "CMPin" I R 6950 1800 60 
$EndSheet
Wire Wire Line
	7000 1600 6950 1600
Wire Wire Line
	7000 850  7000 1600
Wire Wire Line
	7150 1700 6950 1700
Wire Wire Line
	6850 2200 7150 2200
Wire Wire Line
	7150 2700 6850 2700
Wire Wire Line
	6950 1800 7000 1800
Wire Wire Line
	7000 1800 7000 2200
Connection ~ 7000 2200
Wire Wire Line
	6150 1400 6300 1400
Wire Wire Line
	6300 1400 6300 1600
Wire Wire Line
	6300 1600 6400 1600
Wire Wire Line
	6150 1900 6300 1900
Wire Wire Line
	6300 1900 6300 1700
Wire Wire Line
	6300 1700 6400 1700
Wire Wire Line
	6350 2100 6350 1900
Wire Wire Line
	6350 1900 6400 1900
Wire Wire Line
	5800 650  5800 1700
Wire Wire Line
	5800 2700 5800 2750
$Comp
L R R29
U 1 1 563A529B
P 5800 1950
F 0 "R29" V 5900 1850 50  0000 C CNN
F 1 "2k" V 5800 1950 50  0000 C CNN
F 2 "" H 5800 1950 60  0001 C CNN
F 3 "" H 5800 1950 60  0001 C CNN
	1    5800 1950
	-1   0    0    1   
$EndComp
$Comp
L R R30
U 1 1 563A52A1
P 5800 2450
F 0 "R30" V 5880 2450 50  0000 C CNN
F 1 "1k" V 5800 2450 50  0000 C CNN
F 2 "" H 5800 2450 60  0001 C CNN
F 3 "" H 5800 2450 60  0001 C CNN
	1    5800 2450
	-1   0    0    1   
$EndComp
$Comp
L GND #PWR081
U 1 1 563A52A7
P 5800 2750
F 0 "#PWR081" H 5800 2750 30  0001 C CNN
F 1 "GND" H 5800 2680 30  0001 C CNN
F 2 "" H 5800 2750 60  0001 C CNN
F 3 "" H 5800 2750 60  0001 C CNN
	1    5800 2750
	1    0    0    -1  
$EndComp
$Comp
L C C33
U 1 1 563A52AD
P 5500 2450
F 0 "C33" V 5600 2600 50  0000 C CNN
F 1 "1uF" V 5600 2300 50  0000 C CNN
F 2 "" H 5500 2450 60  0000 C CNN
F 3 "" H 5500 2450 60  0000 C CNN
	1    5500 2450
	1    0    0    -1  
$EndComp
$Sheet
S 5050 1550 550  400 
U 563A52B5
F0 "ASDQ3V0 sense" 50
F1 "sch/Current_sense.sch" 50
F2 "_Reset" I L 5050 1900 60 
F3 "-" I L 5050 1700 60 
F4 "+" I L 5050 1600 60 
F5 "V_I" O R 5600 1700 60 
F6 "OC" O R 5600 1600 60 
F7 "CMPin" I R 5600 1800 60 
$EndSheet
Wire Wire Line
	5650 1600 5600 1600
Wire Wire Line
	5650 850  5650 1600
Wire Wire Line
	5800 1700 5600 1700
Wire Wire Line
	5500 2200 5800 2200
Wire Wire Line
	5800 2700 5500 2700
Wire Wire Line
	5600 1800 5650 1800
Wire Wire Line
	5650 1800 5650 2200
Connection ~ 5650 2200
Wire Wire Line
	4800 1400 4950 1400
Wire Wire Line
	4950 1600 5050 1600
Wire Wire Line
	4800 1900 4950 1900
Wire Wire Line
	4950 1900 4950 1700
Wire Wire Line
	4950 1700 5050 1700
Wire Wire Line
	5000 1900 5050 1900
Connection ~ 6350 2100
Connection ~ 7700 2100
Connection ~ 5000 2100
Wire Wire Line
	4800 1900 4800 3000
Wire Wire Line
	5000 1900 5000 2100
Wire Wire Line
	8850 1350 8850 1400
Wire Wire Line
	7500 1400 7500 1350
Connection ~ 7500 1350
Wire Wire Line
	6000 6200 6000 6250
$Comp
L R R41
U 1 1 563AEB9B
P 6000 5450
F 0 "R41" V 6100 5350 50  0000 C CNN
F 1 "3k" V 6000 5450 50  0000 C CNN
F 2 "" H 6000 5450 60  0001 C CNN
F 3 "" H 6000 5450 60  0001 C CNN
	1    6000 5450
	-1   0    0    1   
$EndComp
$Comp
L R R42
U 1 1 563AEBA1
P 6000 5950
F 0 "R42" V 6080 5950 50  0000 C CNN
F 1 "1k" V 6000 5950 50  0000 C CNN
F 2 "" H 6000 5950 60  0001 C CNN
F 3 "" H 6000 5950 60  0001 C CNN
	1    6000 5950
	-1   0    0    1   
$EndComp
$Comp
L GND #PWR082
U 1 1 563AEBA7
P 6000 6250
F 0 "#PWR082" H 6000 6250 30  0001 C CNN
F 1 "GND" H 6000 6180 30  0001 C CNN
F 2 "" H 6000 6250 60  0001 C CNN
F 3 "" H 6000 6250 60  0001 C CNN
	1    6000 6250
	1    0    0    -1  
$EndComp
$Comp
L C C37
U 1 1 563AEBAD
P 5700 5950
F 0 "C37" V 5800 6100 50  0000 C CNN
F 1 "1uF" V 5800 5800 50  0000 C CNN
F 2 "" H 5700 5950 60  0000 C CNN
F 3 "" H 5700 5950 60  0000 C CNN
	1    5700 5950
	1    0    0    -1  
$EndComp
$Sheet
S 5250 5050 550  400 
U 563AEBB5
F0 "ASDQ1V4 sense" 50
F1 "sch/Current_sense.sch" 50
F2 "_Reset" I L 5250 5400 60 
F3 "-" I L 5250 5200 60 
F4 "+" I L 5250 5100 60 
F5 "V_I" O R 5800 5200 60 
F6 "OC" O R 5800 5100 60 
F7 "CMPin" I R 5800 5300 60 
$EndSheet
Wire Wire Line
	5800 5100 6350 5100
Wire Wire Line
	5800 5200 6350 5200
Wire Wire Line
	5700 5700 6000 5700
Wire Wire Line
	6000 6200 5700 6200
Wire Wire Line
	5800 5300 5850 5300
Wire Wire Line
	5850 5300 5850 5700
Connection ~ 5850 5700
Connection ~ 6000 5200
Wire Wire Line
	4950 5200 4950 6400
Wire Wire Line
	4800 1400 4800 1350
Connection ~ 4800 1350
Wire Wire Line
	4950 1400 4950 1600
Wire Wire Line
	4150 5050 4150 4800
Connection ~ 4150 4800
Connection ~ 4350 4800
Wire Wire Line
	4150 5800 4150 5550
$Comp
L C C44
U 1 1 56397E9A
P 3750 5050
F 0 "C44" V 3850 5200 50  0000 C CNN
F 1 "15pF" V 3850 4900 50  0000 C CNN
F 2 "" H 3750 5050 60  0000 C CNN
F 3 "" H 3750 5050 60  0000 C CNN
	1    3750 5050
	1    0    0    -1  
$EndComp
Connection ~ 3400 5300
Wire Wire Line
	4150 4800 3750 4800
Connection ~ 3750 4800
Connection ~ 3400 5800
$EndSCHEMATC
