EESchema Schematic File Version 2
LIBS:2x14_conn
LIBS:ad7998
LIBS:bav99
LIBS:ds18b20u
LIBS:ina202a
LIBS:lt3015eq
LIBS:mcp23017-qfn
LIBS:opa703
LIBS:power
LIBS:pspice
LIBS:sn74hc05d
LIBS:tps73501drbt
LIBS:tps78630kttt
LIBS:LogicBoard_DB-cache
EELAYER 24 0
EELAYER END
$Descr A4 11693 8268
encoding utf-8
Sheet 5 15
Title ""
Date "18 nov 2014"
Rev ""
Comp ""
Comment1 ""
Comment2 ""
Comment3 ""
Comment4 ""
$EndDescr
Text Notes 4800 1900 0    60   ~ 0
V_I is 100x dV from + and -
Wire Wire Line
	4250 1300 4250 1250
Connection ~ 4250 2400
Wire Wire Line
	4150 2400 4350 2400
Wire Wire Line
	4250 1800 4250 2400
Wire Wire Line
	4600 2200 4150 2200
Wire Wire Line
	4150 2000 5100 2000
Wire Wire Line
	2300 2400 2750 2400
Wire Wire Line
	2300 2200 2750 2200
Connection ~ 2450 1700
Wire Wire Line
	3150 1750 3150 1800
Connection ~ 3450 1250
Wire Wire Line
	3450 1200 3450 1600
Wire Wire Line
	4250 1250 3150 1250
Connection ~ 2450 2200
Wire Wire Line
	2300 1700 2750 1700
Wire Wire Line
	2750 1700 2750 2000
$Comp
L INA202A U10
U 1 1 5457D1D1
P 3450 2200
AR Path="/547650A6/54513844/546954C9/5457D1D1" Ref="U10"  Part="1" 
AR Path="/547650A6/54513844/546954CA/5457D1D1" Ref="U11"  Part="1" 
AR Path="/547650A6/54513844/5457F106/5457D1D1" Ref="U12"  Part="1" 
AR Path="/547650A6/54513844/5457F10D/5457D1D1" Ref="U13"  Part="1" 
AR Path="/547650A6/54513844/54584D89/5457D1D1" Ref="U14"  Part="1" 
AR Path="/547650A6/545184E8/5457D178/5457D1D1" Ref="U16"  Part="1" 
AR Path="/547650A6/545184E8/546954CB/5457D1D1" Ref="U17"  Part="1" 
AR Path="/547650A6/545184E8/546954CC/5457D1D1" Ref="U18"  Part="1" 
AR Path="/547650A6/545184E8/5457E1FF/5457D1D1" Ref="U19"  Part="1" 
AR Path="/546954CD/5457D1D1" Ref="U20"  Part="1" 
AR Path="/547650A6/54513844/5639A140/5457D1D1" Ref="U13"  Part="1" 
AR Path="/547650A6/54513844/563A035C/5457D1D1" Ref="U12"  Part="1" 
AR Path="/547650A6/54513844/563A38A1/5457D1D1" Ref="U11"  Part="1" 
AR Path="/547650A6/54513844/563A52B5/5457D1D1" Ref="U10"  Part="1" 
AR Path="/547650A6/54513844/563AEBB5/5457D1D1" Ref="U14"  Part="1" 
AR Path="/547650A6/545184E8/5457F10D/5457D1D1" Ref="U16"  Part="1" 
AR Path="/547650A6/545184E8/563BEC5E/5457D1D1" Ref="U19"  Part="1" 
AR Path="/547650A6/545184E8/563BF0D7/5457D1D1" Ref="U17"  Part="1" 
AR Path="/547650A6/545184E8/563BF8B4/5457D1D1" Ref="U18"  Part="1" 
AR Path="/5457F10D/5457D1D1" Ref="U20"  Part="1" 
AR Path="/547650A6/545184E8/56399EBC/5457D1D1" Ref="U16"  Part="1" 
AR Path="/56399EBD/5457D1D1" Ref="U20"  Part="1" 
F 0 "U13" H 3750 1800 60  0000 C CNN
F 1 "INA202A" H 3650 2550 60  0000 C CNN
F 2 "" H 3450 2200 60  0001 C CNN
F 3 "" H 3450 2200 60  0001 C CNN
F 4 "296-21333-1-ND" H 3450 2200 60  0001 C CNN "Field1"
F 5 "Digi-key" H 3450 2200 60  0001 C CNN "Field2"
	1    3450 2200
	1    0    0    -1  
$EndComp
$Comp
L GND #PWR077
U 1 1 5457D1DC
P 3450 2800
AR Path="/547650A6/54513844/546954C9/5457D1DC" Ref="#PWR077"  Part="1" 
AR Path="/547650A6/54513844/546954CA/5457D1DC" Ref="#PWR081"  Part="1" 
AR Path="/547650A6/54513844/5457F106/5457D1DC" Ref="#PWR085"  Part="1" 
AR Path="/547650A6/54513844/5457F10D/5457D1DC" Ref="#PWR083"  Part="1" 
AR Path="/547650A6/54513844/54584D89/5457D1DC" Ref="#PWR093"  Part="1" 
AR Path="/547650A6/545184E8/5457D178/5457D1DC" Ref="#PWR0102"  Part="1" 
AR Path="/547650A6/545184E8/546954CB/5457D1DC" Ref="#PWR0106"  Part="1" 
AR Path="/547650A6/545184E8/546954CC/5457D1DC" Ref="#PWR0110"  Part="1" 
AR Path="/547650A6/545184E8/5457E1FF/5457D1DC" Ref="#PWR0114"  Part="1" 
AR Path="/546954CD/5457D1DC" Ref="#PWR0118"  Part="1" 
AR Path="/547650A6/54513844/5639A140/5457D1DC" Ref="#PWR089"  Part="1" 
AR Path="/547650A6/54513844/563A035C/5457D1DC" Ref="#PWR086"  Part="1" 
AR Path="/547650A6/54513844/563A38A1/5457D1DC" Ref="#PWR089"  Part="1" 
AR Path="/547650A6/54513844/563A52B5/5457D1DC" Ref="#PWR092"  Part="1" 
AR Path="/547650A6/54513844/563AEBB5/5457D1DC" Ref="#PWR095"  Part="1" 
AR Path="/547650A6/545184E8/5457F10D/5457D1DC" Ref="#PWR0111"  Part="1" 
AR Path="/547650A6/545184E8/563BEC5E/5457D1DC" Ref="#PWR0114"  Part="1" 
AR Path="/547650A6/545184E8/563BF0D7/5457D1DC" Ref="#PWR0117"  Part="1" 
AR Path="/547650A6/545184E8/563BF8B4/5457D1DC" Ref="#PWR0120"  Part="1" 
AR Path="/5457F10D/5457D1DC" Ref="#PWR0123"  Part="1" 
AR Path="/547650A6/545184E8/56399EBC/5457D1DC" Ref="#PWR0111"  Part="1" 
AR Path="/56399EBD/5457D1DC" Ref="#PWR0123"  Part="1" 
F 0 "#PWR0123" H 3450 2800 30  0001 C CNN
F 1 "GND" H 3450 2730 30  0001 C CNN
F 2 "" H 3450 2800 60  0001 C CNN
F 3 "" H 3450 2800 60  0001 C CNN
	1    3450 2800
	1    0    0    -1  
$EndComp
$Comp
L C C21
U 1 1 5457D1E8
P 3150 1500
AR Path="/547650A6/54513844/546954C9/5457D1E8" Ref="C21"  Part="1" 
AR Path="/547650A6/54513844/546954CA/5457D1E8" Ref="C22"  Part="1" 
AR Path="/547650A6/54513844/5457F106/5457D1E8" Ref="C23"  Part="1" 
AR Path="/547650A6/54513844/5457F10D/5457D1E8" Ref="C24"  Part="1" 
AR Path="/547650A6/54513844/54584D89/5457D1E8" Ref="C25"  Part="1" 
AR Path="/547650A6/545184E8/5457D178/5457D1E8" Ref="C28"  Part="1" 
AR Path="/547650A6/545184E8/546954CB/5457D1E8" Ref="C29"  Part="1" 
AR Path="/547650A6/545184E8/546954CC/5457D1E8" Ref="C30"  Part="1" 
AR Path="/547650A6/545184E8/5457E1FF/5457D1E8" Ref="C31"  Part="1" 
AR Path="/546954CD/5457D1E8" Ref="C32"  Part="1" 
AR Path="/547650A6/54513844/5639A140/5457D1E8" Ref="C24"  Part="1" 
AR Path="/547650A6/54513844/563A035C/5457D1E8" Ref="C23"  Part="1" 
AR Path="/547650A6/54513844/563A38A1/5457D1E8" Ref="C22"  Part="1" 
AR Path="/547650A6/54513844/563A52B5/5457D1E8" Ref="C21"  Part="1" 
AR Path="/547650A6/54513844/563AEBB5/5457D1E8" Ref="C25"  Part="1" 
AR Path="/547650A6/545184E8/5457F10D/5457D1E8" Ref="C28"  Part="1" 
AR Path="/547650A6/545184E8/563BEC5E/5457D1E8" Ref="C31"  Part="1" 
AR Path="/547650A6/545184E8/563BF0D7/5457D1E8" Ref="C29"  Part="1" 
AR Path="/547650A6/545184E8/563BF8B4/5457D1E8" Ref="C30"  Part="1" 
AR Path="/5457F10D/5457D1E8" Ref="C32"  Part="1" 
AR Path="/547650A6/545184E8/56399EBC/5457D1E8" Ref="C28"  Part="1" 
AR Path="/56399EBD/5457D1E8" Ref="C32"  Part="1" 
F 0 "C24" V 3250 1650 50  0000 C CNN
F 1 "0.01uF" V 3250 1350 50  0000 C CNN
F 2 "" H 3150 1500 60  0001 C CNN
F 3 "" H 3150 1500 60  0001 C CNN
	1    3150 1500
	1    0    0    -1  
$EndComp
$Comp
L GND #PWR078
U 1 1 5457D1F1
P 3150 1800
AR Path="/547650A6/54513844/546954C9/5457D1F1" Ref="#PWR078"  Part="1" 
AR Path="/547650A6/54513844/546954CA/5457D1F1" Ref="#PWR082"  Part="1" 
AR Path="/547650A6/54513844/5457F106/5457D1F1" Ref="#PWR086"  Part="1" 
AR Path="/547650A6/54513844/5457F10D/5457D1F1" Ref="#PWR084"  Part="1" 
AR Path="/547650A6/54513844/54584D89/5457D1F1" Ref="#PWR094"  Part="1" 
AR Path="/547650A6/545184E8/5457D178/5457D1F1" Ref="#PWR0103"  Part="1" 
AR Path="/547650A6/545184E8/546954CB/5457D1F1" Ref="#PWR0107"  Part="1" 
AR Path="/547650A6/545184E8/546954CC/5457D1F1" Ref="#PWR0111"  Part="1" 
AR Path="/547650A6/545184E8/5457E1FF/5457D1F1" Ref="#PWR0115"  Part="1" 
AR Path="/546954CD/5457D1F1" Ref="#PWR0119"  Part="1" 
AR Path="/547650A6/54513844/5639A140/5457D1F1" Ref="#PWR090"  Part="1" 
AR Path="/547650A6/54513844/563A035C/5457D1F1" Ref="#PWR087"  Part="1" 
AR Path="/547650A6/54513844/563A38A1/5457D1F1" Ref="#PWR090"  Part="1" 
AR Path="/547650A6/54513844/563A52B5/5457D1F1" Ref="#PWR093"  Part="1" 
AR Path="/547650A6/54513844/563AEBB5/5457D1F1" Ref="#PWR096"  Part="1" 
AR Path="/547650A6/545184E8/5457F10D/5457D1F1" Ref="#PWR0112"  Part="1" 
AR Path="/547650A6/545184E8/563BEC5E/5457D1F1" Ref="#PWR0115"  Part="1" 
AR Path="/547650A6/545184E8/563BF0D7/5457D1F1" Ref="#PWR0118"  Part="1" 
AR Path="/547650A6/545184E8/563BF8B4/5457D1F1" Ref="#PWR0121"  Part="1" 
AR Path="/5457F10D/5457D1F1" Ref="#PWR0124"  Part="1" 
AR Path="/547650A6/545184E8/56399EBC/5457D1F1" Ref="#PWR0112"  Part="1" 
AR Path="/56399EBD/5457D1F1" Ref="#PWR0124"  Part="1" 
F 0 "#PWR0124" H 3150 1800 30  0001 C CNN
F 1 "GND" H 3150 1730 30  0001 C CNN
F 2 "" H 3150 1800 60  0001 C CNN
F 3 "" H 3150 1800 60  0001 C CNN
	1    3150 1800
	1    0    0    -1  
$EndComp
Text HLabel 2300 2400 0    60   Input ~ 0
_Reset
Text HLabel 2300 2200 0    60   Input ~ 0
-
Text HLabel 2300 1700 0    60   Input ~ 0
+
Text HLabel 5100 2000 2    60   Output ~ 0
V_I
Text HLabel 4350 2400 2    60   Output ~ 0
OC
$Comp
L R R28
U 1 1 5457D2B6
P 4250 1550
AR Path="/547650A6/54513844/546954C9/5457D2B6" Ref="R28"  Part="1" 
AR Path="/547650A6/54513844/546954CA/5457D2B6" Ref="R31"  Part="1" 
AR Path="/547650A6/54513844/5457F106/5457D2B6" Ref="R34"  Part="1" 
AR Path="/547650A6/54513844/5457F10D/5457D2B6" Ref="R37"  Part="1" 
AR Path="/547650A6/54513844/54584D89/5457D2B6" Ref="R40"  Part="1" 
AR Path="/547650A6/545184E8/5457D178/5457D2B6" Ref="R51"  Part="1" 
AR Path="/547650A6/545184E8/546954CB/5457D2B6" Ref="R54"  Part="1" 
AR Path="/547650A6/545184E8/546954CC/5457D2B6" Ref="R57"  Part="1" 
AR Path="/547650A6/545184E8/5457E1FF/5457D2B6" Ref="R60"  Part="1" 
AR Path="/546954CD/5457D2B6" Ref="R63"  Part="1" 
AR Path="/547650A6/54513844/5639A140/5457D2B6" Ref="R37"  Part="1" 
AR Path="/547650A6/54513844/563A035C/5457D2B6" Ref="R34"  Part="1" 
AR Path="/547650A6/54513844/563A38A1/5457D2B6" Ref="R31"  Part="1" 
AR Path="/547650A6/54513844/563A52B5/5457D2B6" Ref="R28"  Part="1" 
AR Path="/547650A6/54513844/563AEBB5/5457D2B6" Ref="R40"  Part="1" 
AR Path="/547650A6/545184E8/5457F10D/5457D2B6" Ref="R51"  Part="1" 
AR Path="/547650A6/545184E8/563BEC5E/5457D2B6" Ref="R60"  Part="1" 
AR Path="/547650A6/545184E8/563BF0D7/5457D2B6" Ref="R54"  Part="1" 
AR Path="/547650A6/545184E8/563BF8B4/5457D2B6" Ref="R57"  Part="1" 
AR Path="/5457F10D/5457D2B6" Ref="R63"  Part="1" 
AR Path="/547650A6/545184E8/56399EBC/5457D2B6" Ref="R51"  Part="1" 
AR Path="/56399EBD/5457D2B6" Ref="R63"  Part="1" 
F 0 "R37" V 4330 1550 50  0000 C CNN
F 1 "4.7k" V 4250 1550 50  0000 C CNN
F 2 "" H 4250 1550 60  0001 C CNN
F 3 "" H 4250 1550 60  0001 C CNN
	1    4250 1550
	1    0    0    -1  
$EndComp
$Comp
L +3.3V #PWR080
U 1 1 547BD69D
P 3450 1200
AR Path="/547650A6/54513844/546954C9/547BD69D" Ref="#PWR080"  Part="1" 
AR Path="/547650A6/54513844/546954CA/547BD69D" Ref="#PWR084"  Part="1" 
AR Path="/547650A6/54513844/5457F106/547BD69D" Ref="#PWR088"  Part="1" 
AR Path="/547650A6/54513844/5457F10D/547BD69D" Ref="#PWR085"  Part="1" 
AR Path="/547650A6/54513844/54584D89/547BD69D" Ref="#PWR096"  Part="1" 
AR Path="/547650A6/545184E8/5457D178/547BD69D" Ref="#PWR0105"  Part="1" 
AR Path="/547650A6/545184E8/546954CB/547BD69D" Ref="#PWR0109"  Part="1" 
AR Path="/547650A6/545184E8/546954CC/547BD69D" Ref="#PWR0113"  Part="1" 
AR Path="/547650A6/545184E8/5457E1FF/547BD69D" Ref="#PWR0117"  Part="1" 
AR Path="/546954CD/547BD69D" Ref="#PWR0121"  Part="1" 
AR Path="/547650A6/54513844/5639A140/547BD69D" Ref="#PWR092"  Part="1" 
AR Path="/547650A6/54513844/563A035C/547BD69D" Ref="#PWR088"  Part="1" 
AR Path="/547650A6/54513844/563A38A1/547BD69D" Ref="#PWR091"  Part="1" 
AR Path="/547650A6/54513844/563A52B5/547BD69D" Ref="#PWR094"  Part="1" 
AR Path="/547650A6/54513844/563AEBB5/547BD69D" Ref="#PWR097"  Part="1" 
AR Path="/547650A6/545184E8/5457F10D/547BD69D" Ref="#PWR0113"  Part="1" 
AR Path="/547650A6/545184E8/563BEC5E/547BD69D" Ref="#PWR0116"  Part="1" 
AR Path="/547650A6/545184E8/563BF0D7/547BD69D" Ref="#PWR0119"  Part="1" 
AR Path="/547650A6/545184E8/563BF8B4/547BD69D" Ref="#PWR0122"  Part="1" 
AR Path="/5457F10D/547BD69D" Ref="#PWR0125"  Part="1" 
AR Path="/547650A6/545184E8/56399EBC/547BD69D" Ref="#PWR0113"  Part="1" 
AR Path="/56399EBD/547BD69D" Ref="#PWR0125"  Part="1" 
F 0 "#PWR0125" H 3450 1160 30  0001 C CNN
F 1 "+3.3V" H 3450 1310 30  0000 C CNN
F 2 "" H 3450 1200 60  0000 C CNN
F 3 "" H 3450 1200 60  0000 C CNN
	1    3450 1200
	1    0    0    -1  
$EndComp
Text HLabel 4600 2200 2    60   Input ~ 0
CMPin
$EndSCHEMATC
