PCBNEW-LibModule-V1  Fri 28 Nov 2014 06:05:29 PM EST
# encoding utf-8
Units mm
$INDEX
MCP23017
$EndINDEX
$MODULE MCP23017
Po 0 0 0 15 5478FFB2 00000000 ~~
Li MCP23017
Sc 0
AR 
Op 0 0 0
T0 0.0254 -4.4196 1 1 0 0.15 N I 21 N "MCP23017"
T1 0.0254 4.5974 1 1 0 0.15 N V 21 N "VAL**"
DS -2.85 -2.25 -2.25 -2.85 0.15 21
DS 2.85 -2.25 2.85 -2.85 0.15 21
DS 2.85 -2.85 2.25 -2.85 0.15 21
DS 2.85 2.85 2.25 2.85 0.15 21
DS 2.85 2.25 2.85 2.85 0.15 21
DS -2.85 2.25 -2.85 2.85 0.15 21
DS -2.85 2.85 -2.25 2.85 0.15 21
$PAD
Sh "27" R 0.37 1 0 0 0
Dr 0 0 0
At SMD N 00888000
Ne 0 ""
Po -1.3 -2.85
$EndPAD
$PAD
Sh "28" R 0.37 1 0 0 0
Dr 0 0 0
At SMD N 00888000
Ne 0 ""
Po -1.95 -2.85
$EndPAD
$PAD
Sh "26" R 0.37 1 0 0 0
Dr 0 0 0
At SMD N 00888000
Ne 0 ""
Po -0.65 -2.85
$EndPAD
$PAD
Sh "25" R 0.37 1 0 0 0
Dr 0 0 0
At SMD N 00888000
Ne 0 ""
Po 0 -2.85
$EndPAD
$PAD
Sh "24" R 0.37 1 0 0 0
Dr 0 0 0
At SMD N 00888000
Ne 0 ""
Po 0.65 -2.85
$EndPAD
$PAD
Sh "22" R 0.37 1 0 0 0
Dr 0 0 0
At SMD N 00888000
Ne 0 ""
Po 1.95 -2.85
$EndPAD
$PAD
Sh "23" R 0.37 1 0 0 0
Dr 0 0 0
At SMD N 00888000
Ne 0 ""
Po 1.3 -2.85
$EndPAD
$PAD
Sh "13" R 0.37 1 0 0 0
Dr 0 0 0
At SMD N 00888000
Ne 0 ""
Po 1.3 2.85
$EndPAD
$PAD
Sh "14" R 0.37 1 0 0 0
Dr 0 0 0
At SMD N 00888000
Ne 0 ""
Po 1.95 2.85
$EndPAD
$PAD
Sh "12" R 0.37 1 0 0 0
Dr 0 0 0
At SMD N 00888000
Ne 0 ""
Po 0.65 2.85
$EndPAD
$PAD
Sh "11" R 0.37 1 0 0 0
Dr 0 0 0
At SMD N 00888000
Ne 0 ""
Po 0 2.85
$EndPAD
$PAD
Sh "10" R 0.37 1 0 0 0
Dr 0 0 0
At SMD N 00888000
Ne 0 ""
Po -0.65 2.85
$EndPAD
$PAD
Sh "8" R 0.37 1 0 0 0
Dr 0 0 0
At SMD N 00888000
Ne 0 ""
Po -1.95 2.85
$EndPAD
$PAD
Sh "9" R 0.37 1 0 0 0
Dr 0 0 0
At SMD N 00888000
Ne 0 ""
Po -1.3 2.85
$EndPAD
$PAD
Sh "21" R 1 0.37 0 0 0
Dr 0 0 0
At SMD N 00888000
Ne 0 ""
Po 2.85 -1.95
$EndPAD
$PAD
Sh "20" R 1 0.37 0 0 0
Dr 0 0 0
At SMD N 00888000
Ne 0 ""
Po 2.85 -1.3
$EndPAD
$PAD
Sh "19" R 1 0.37 0 0 0
Dr 0 0 0
At SMD N 00888000
Ne 0 ""
Po 2.85 -0.65
$EndPAD
$PAD
Sh "18" R 1 0.37 0 0 0
Dr 0 0 0
At SMD N 00888000
Ne 0 ""
Po 2.85 0
$EndPAD
$PAD
Sh "17" R 1 0.37 0 0 0
Dr 0 0 0
At SMD N 00888000
Ne 0 ""
Po 2.85 0.65
$EndPAD
$PAD
Sh "16" R 1 0.37 0 0 0
Dr 0 0 0
At SMD N 00888000
Ne 0 ""
Po 2.85 1.3
$EndPAD
$PAD
Sh "15" R 1 0.37 0 0 0
Dr 0 0 0
At SMD N 00888000
Ne 0 ""
Po 2.85 1.95
$EndPAD
$PAD
Sh "7" R 1 0.37 0 0 0
Dr 0 0 0
At SMD N 00888000
Ne 0 ""
Po -2.85 1.95
$EndPAD
$PAD
Sh "6" R 1 0.37 0 0 0
Dr 0 0 0
At SMD N 00888000
Ne 0 ""
Po -2.85 1.3
$EndPAD
$PAD
Sh "5" R 1 0.37 0 0 0
Dr 0 0 0
At SMD N 00888000
Ne 0 ""
Po -2.85 0.65
$EndPAD
$PAD
Sh "4" R 1 0.37 0 0 0
Dr 0 0 0
At SMD N 00888000
Ne 0 ""
Po -2.85 0
$EndPAD
$PAD
Sh "3" R 1 0.37 0 0 0
Dr 0 0 0
At SMD N 00888000
Ne 0 ""
Po -2.85 -0.65
$EndPAD
$PAD
Sh "2" R 1 0.37 0 0 0
Dr 0 0 0
At SMD N 00888000
Ne 0 ""
Po -2.85 -1.3
$EndPAD
$PAD
Sh "1" R 1 0.37 0 0 0
Dr 0 0 0
At SMD N 00888000
Ne 0 ""
Po -2.85 -1.95
$EndPAD
$EndMODULE MCP23017
$EndLIBRARY
