PCBNEW-LibModule-V1  Sat 22 Nov 2014 01:41:34 PM EST
# encoding utf-8
Units mm
$INDEX
DRB
$EndINDEX
$MODULE DRB
Po 0 0 0 15 5470D871 00000000 ~~
Li DRB
Sc 0
AR 
Op 0 0 0
T0 -8.2804 -2.0574 1 1 0 0.15 N V 21 N "DRB"
T1 0 3.3528 1 1 0 0.15 N V 21 N "VAL**"
DS 1.575 -1.25 1.575 1.575 0.15 21
DS -1.25 1.575 -1.575 1.575 0.15 21
DS 1.575 -1.25 1.25 -1.575 0.15 21
DS 1.25 1.575 1.575 1.575 0.15 21
DS -1.25 -1.575 -1.575 -1.575 0.15 21
DS -1.575 -1.575 -1.575 1.575 0.15 21
$PAD
Sh "6" R 0.35 0.85 0 0 0
Dr 0 0 0
At SMD N 00888000
Ne 0 ""
Po -0.325 1.475
$EndPAD
$PAD
Sh "5" R 0.35 0.85 0 0 0
Dr 0 0 0
At SMD N 00888000
Ne 0 ""
Po -0.975 1.475
$EndPAD
$PAD
Sh "8" R 0.35 0.85 0 0 0
Dr 0 0 0
At SMD N 00888000
Ne 0 ""
Po 0.975 1.475
$EndPAD
$PAD
Sh "7" R 0.35 0.85 0 0 0
Dr 0 0 0
At SMD N 00888000
Ne 0 ""
Po 0.325 1.475
$EndPAD
$PAD
Sh "3" R 0.35 0.85 0 0 0
Dr 0 0 0
At SMD N 00888000
Ne 0 ""
Po -0.325 -1.475
$EndPAD
$PAD
Sh "4" R 0.35 0.85 0 0 0
Dr 0 0 0
At SMD N 00888000
Ne 0 ""
Po -0.975 -1.475
$EndPAD
$PAD
Sh "1" R 0.35 0.85 0 0 0
Dr 0 0 0
At SMD N 00888000
Ne 0 ""
Po 0.975 -1.475
$EndPAD
$PAD
Sh "2" R 0.35 0.85 0 0 0
Dr 0 0 0
At SMD N 00888000
Ne 0 ""
Po 0.325 -1.475
$EndPAD
$PAD
Sh "pad" R 1.75 1.5 0 0 0
Dr 0 0 0
At SMD N 00888000
Ne 0 ""
Po 0 0
$EndPAD
$EndMODULE DRB
$EndLIBRARY
