EESchema Schematic File Version 2
LIBS:2x14_conn
LIBS:ad7998
LIBS:bav99
LIBS:ds18b20u
LIBS:ina202a
LIBS:lt3015eq
LIBS:mcp23017-qfn
LIBS:opa703
LIBS:power
LIBS:pspice
LIBS:sn74hc05d
LIBS:tps73501drbt
LIBS:tps78630kttt
LIBS:LogicBoard_DB-cache
EELAYER 24 0
EELAYER END
$Descr A4 11693 8268
encoding utf-8
Sheet 10 15
Title ""
Date "18 nov 2014"
Rev ""
Comp ""
Comment1 ""
Comment2 ""
Comment3 ""
Comment4 ""
$EndDescr
Text Notes 9050 4200 0    60   ~ 0
Nominal: 1.65V each
Wire Wire Line
	2850 1550 2700 1550
Wire Wire Line
	2700 1550 2700 1750
Wire Wire Line
	2700 1750 2550 1750
Wire Wire Line
	2850 1450 2700 1450
Wire Wire Line
	2700 1450 2700 1250
Wire Wire Line
	2700 1250 2550 1250
Wire Wire Line
	6050 1450 5900 1450
Wire Wire Line
	5900 1450 5900 1250
Wire Wire Line
	5900 1250 5750 1250
Wire Wire Line
	5750 1250 5750 900 
Wire Wire Line
	6050 1550 5900 1550
Wire Wire Line
	5900 1550 5900 1750
Wire Wire Line
	5900 1750 5750 1750
Wire Wire Line
	4450 1450 4300 1450
Wire Wire Line
	4300 1450 4300 1250
Wire Wire Line
	4300 1250 4150 1250
Wire Wire Line
	4150 1250 4150 900 
Wire Wire Line
	4450 1550 4300 1550
Wire Wire Line
	4300 1550 4300 1750
Wire Wire Line
	4300 1750 4150 1750
Wire Wire Line
	7500 1750 7350 1750
Wire Wire Line
	7500 1750 7500 1550
Wire Wire Line
	7500 1550 7650 1550
Wire Wire Line
	2150 5900 2150 5700
Wire Wire Line
	2350 5900 2350 5700
Wire Wire Line
	2950 6300 3000 6300
Wire Wire Line
	3000 6300 3000 6200
Wire Wire Line
	3000 6200 3400 6200
Wire Wire Line
	2150 5700 3700 5700
Connection ~ 2350 5700
Wire Wire Line
	3700 6700 3700 6450
Wire Wire Line
	3700 5700 3700 5950
Connection ~ 3100 5700
Wire Wire Line
	1150 6300 1000 6300
Connection ~ 3700 6700
Wire Wire Line
	1550 6650 1550 6750
Wire Wire Line
	1750 6700 1550 6700
Connection ~ 1550 6700
Wire Bus Line
	2650 800  7900 800 
Wire Bus Line
	3950 3950 9050 3950
Wire Bus Line
	3800 4300 9050 4300
Wire Wire Line
	1550 7300 1550 7250
Wire Wire Line
	3900 6700 3900 6600
Connection ~ 3900 6700
Wire Wire Line
	7350 900  7350 1250
Wire Wire Line
	7350 1250 7500 1250
Wire Wire Line
	7500 1250 7500 1450
Wire Wire Line
	7500 1450 7650 1450
Wire Wire Line
	2550 1250 2550 900 
$Comp
L R R45
U 1 1 546B5C70
P 2550 1500
F 0 "R45" V 2630 1500 50  0000 C CNN
F 1 "0.1" V 2550 1500 50  0000 C CNN
F 2 "" H 2550 1500 60  0001 C CNN
F 3 "" H 2550 1500 60  0001 C CNN
	1    2550 1500
	1    0    0    -1  
$EndComp
$Comp
L R R47
U 1 1 546AC69E
P 5750 1500
F 0 "R47" V 5830 1500 50  0000 C CNN
F 1 "0.1" V 5750 1500 50  0000 C CNN
F 2 "" H 5750 1500 60  0001 C CNN
F 3 "" H 5750 1500 60  0001 C CNN
	1    5750 1500
	1    0    0    -1  
$EndComp
$Comp
L R R46
U 1 1 546AC689
P 4150 1500
F 0 "R46" V 4230 1500 50  0000 C CNN
F 1 "0.1" V 4150 1500 50  0000 C CNN
F 2 "" H 4150 1500 60  0001 C CNN
F 3 "" H 4150 1500 60  0001 C CNN
	1    4150 1500
	1    0    0    -1  
$EndComp
$Comp
L R R48
U 1 1 546AC633
P 7350 1500
F 0 "R48" V 7430 1500 50  0000 C CNN
F 1 "0.1" V 7350 1500 50  0000 C CNN
F 2 "" H 7350 1500 60  0001 C CNN
F 3 "" H 7350 1500 60  0001 C CNN
	1    7350 1500
	1    0    0    -1  
$EndComp
Text Notes 1850 5500 0    60   ~ 0
-3V Regulator\nmax: 1.5A\nTotal: 730mA
Text HLabel 1000 6300 0    60   Input ~ 0
EN-3V
$Comp
L GND #PWR098
U 1 1 54503AF1
P 2150 5900
F 0 "#PWR098" H 2150 5900 30  0001 C CNN
F 1 "GND" H 2150 5830 30  0001 C CNN
F 2 "" H 2150 5900 60  0001 C CNN
F 3 "" H 2150 5900 60  0001 C CNN
	1    2150 5900
	1    0    0    -1  
$EndComp
$Comp
L R R50
U 1 1 54503AF7
P 3100 6450
F 0 "R50" V 3180 6450 50  0000 C CNN
F 1 "17.8k" V 3100 6450 50  0000 C CNN
F 2 "" H 3100 6450 60  0001 C CNN
F 3 "" H 3100 6450 60  0001 C CNN
	1    3100 6450
	1    0    0    -1  
$EndComp
$Comp
L R R43
U 1 1 54503AFD
P 3100 5950
F 0 "R43" V 3180 5950 50  0000 C CNN
F 1 "12.1k" V 3100 5950 50  0000 C CNN
F 2 "" H 3100 5950 60  0001 C CNN
F 3 "" H 3100 5950 60  0001 C CNN
	1    3100 5950
	1    0    0    -1  
$EndComp
$Comp
L R R44
U 1 1 54503B03
P 1650 6050
F 0 "R44" V 1730 6050 50  0000 C CNN
F 1 "DNP" V 1650 6050 50  0000 C CNN
F 2 "" H 1650 6050 60  0001 C CNN
F 3 "" H 1650 6050 60  0001 C CNN
	1    1650 6050
	1    0    0    -1  
$EndComp
$Comp
L +3.3V #PWR099
U 1 1 54503B09
P 1650 5800
F 0 "#PWR099" H 1650 5760 30  0001 C CNN
F 1 "+3.3V" H 1650 5910 30  0000 C CNN
F 2 "" H 1650 5800 60  0001 C CNN
F 3 "" H 1650 5800 60  0001 C CNN
	1    1650 5800
	1    0    0    -1  
$EndComp
$Comp
L C C26
U 1 1 54503B0F
P 3700 6200
F 0 "C26" V 3800 6350 50  0000 C CNN
F 1 "10uF" V 3800 6050 50  0000 C CNN
F 2 "" H 3700 6200 60  0001 C CNN
F 3 "" H 3700 6200 60  0001 C CNN
	1    3700 6200
	1    0    0    -1  
$EndComp
$Comp
L R R49
U 1 1 54503B15
P 1400 6300
F 0 "R49" V 1480 6300 50  0000 C CNN
F 1 "0" V 1400 6300 50  0000 C CNN
F 2 "" H 1400 6300 60  0001 C CNN
F 3 "" H 1400 6300 60  0001 C CNN
	1    1400 6300
	0    -1   -1   0   
$EndComp
Text Notes 1950 6900 0    60   ~ 0
LT3015EQ#PBF
$Comp
L LT3015EQ U15
U 1 1 5453C80F
P 2350 6500
F 0 "U15" H 2700 6050 60  0000 C CNN
F 1 "LT3015EQ" H 2350 6450 60  0000 C CNN
F 2 "" H 2350 6500 60  0001 C CNN
F 3 "" H 2350 6500 60  0001 C CNN
F 4 "LT3015EQ#PBF-ND" H 2350 6500 60  0001 C CNN "Field1"
F 5 "Digi-key" H 2350 6500 60  0001 C CNN "Field2"
	1    2350 6500
	1    0    0    -1  
$EndComp
$Comp
L -5V #PWR0100
U 1 1 5453CA71
P 1550 6650
F 0 "#PWR0100" H 1550 6790 20  0001 C CNN
F 1 "-5V" H 1550 6760 30  0000 C CNN
F 2 "" H 1550 6650 60  0001 C CNN
F 3 "" H 1550 6650 60  0001 C CNN
	1    1550 6650
	1    0    0    -1  
$EndComp
$Comp
L C C27
U 1 1 5453CA85
P 1550 7000
F 0 "C27" V 1650 7150 50  0000 C CNN
F 1 "10uF" V 1650 6850 50  0000 C CNN
F 2 "" H 1550 7000 60  0001 C CNN
F 3 "" H 1550 7000 60  0001 C CNN
	1    1550 7000
	1    0    0    -1  
$EndComp
$Comp
L -3V #PWR0101
U 1 1 5453CF17
P 3900 6600
F 0 "#PWR0101" H 3900 6740 20  0001 C CNN
F 1 "-3V" H 3900 6710 30  0000 C CNN
F 2 "" H 3900 6600 60  0001 C CNN
F 3 "" H 3900 6600 60  0001 C CNN
	1    3900 6600
	1    0    0    -1  
$EndComp
Text Label 7350 950  3    60   ~ 0
-3V_V0
Text Label 4150 900  3    60   ~ 0
-3V_V1
Text Label 2550 950  3    60   ~ 0
-3V_V2
Text Label 5750 950  3    60   ~ 0
-3V_V3
Text HLabel 7900 800  2    60   Output ~ 0
-3V_V[3..0]
Entry Wire Line
	2550 900  2650 800 
Entry Wire Line
	4150 900  4250 800 
Entry Wire Line
	5750 900  5850 800 
Entry Wire Line
	7350 900  7450 800 
Text HLabel 1850 2100 0    60   Input ~ 0
_Reset-3V
Text Label 8500 3750 1    60   ~ 0
-3V_I0
Text Label 6900 3750 1    60   ~ 0
-3V_I1
Text Label 3700 3750 1    60   ~ 0
-3V_I2
Text Label 5300 3750 1    60   ~ 0
-3V_I3
Entry Wire Line
	3850 3850 3950 3950
Entry Wire Line
	5450 3850 5550 3950
Entry Wire Line
	7050 3850 7150 3950
Entry Wire Line
	8650 3850 8750 3950
Text HLabel 9050 4300 2    60   Output ~ 0
-3V_I[3..0]
Text Label 8650 3750 1    60   ~ 0
-3V_OC0
Text Label 7050 3750 1    60   ~ 0
-3V_OC1
Text Label 3850 3750 1    60   ~ 0
-3V_OC2
Text Label 5450 3750 1    60   ~ 0
-3V_OC3
Entry Wire Line
	3700 4200 3800 4300
Entry Wire Line
	5300 4200 5400 4300
Entry Wire Line
	6900 4200 7000 4300
Entry Wire Line
	8500 4200 8600 4300
Text HLabel 9050 3950 2    60   Output ~ 0
-3V_OC[3..0]
Text Notes 7450 950  0    60   ~ 0
Separate monitored supply lines \nfor each ASDQ's 3V
Text Notes 9050 3850 0    60   ~ 0
For current monitoring and tripping
$Comp
L GND #PWR0102
U 1 1 5459E564
P 1550 7300
F 0 "#PWR0102" H 1550 7300 30  0001 C CNN
F 1 "GND" H 1550 7230 30  0001 C CNN
F 2 "" H 1550 7300 60  0001 C CNN
F 3 "" H 1550 7300 60  0001 C CNN
	1    1550 7300
	1    0    0    -1  
$EndComp
Wire Wire Line
	1750 6600 1750 6700
$Comp
L C C43
U 1 1 56394C8C
P 3400 6450
F 0 "C43" V 3500 6600 50  0000 C CNN
F 1 "10nF" V 3500 6300 50  0000 C CNN
F 2 "" H 3400 6450 60  0000 C CNN
F 3 "" H 3400 6450 60  0000 C CNN
	1    3400 6450
	1    0    0    -1  
$EndComp
Connection ~ 3100 6200
Connection ~ 3100 6700
Connection ~ 3400 6700
Wire Wire Line
	1650 6300 1750 6300
Wire Wire Line
	3600 3150 3600 3200
$Comp
L R R52
U 1 1 563BB3B9
P 3600 2400
F 0 "R52" V 3700 2300 50  0000 C CNN
F 1 "3k" V 3600 2400 50  0000 C CNN
F 2 "" H 3600 2400 60  0001 C CNN
F 3 "" H 3600 2400 60  0001 C CNN
	1    3600 2400
	-1   0    0    1   
$EndComp
$Comp
L R R53
U 1 1 563BB3BF
P 3600 2900
F 0 "R53" V 3680 2900 50  0000 C CNN
F 1 "1k" V 3600 2900 50  0000 C CNN
F 2 "" H 3600 2900 60  0001 C CNN
F 3 "" H 3600 2900 60  0001 C CNN
	1    3600 2900
	-1   0    0    1   
$EndComp
$Comp
L GND #PWR0103
U 1 1 563BB3C5
P 3600 3200
F 0 "#PWR0103" H 3600 3200 30  0001 C CNN
F 1 "GND" H 3600 3130 30  0001 C CNN
F 2 "" H 3600 3200 60  0001 C CNN
F 3 "" H 3600 3200 60  0001 C CNN
	1    3600 3200
	1    0    0    -1  
$EndComp
$Comp
L C C38
U 1 1 563BB3CB
P 3300 2900
F 0 "C38" V 3400 3050 50  0000 C CNN
F 1 "1uF" V 3400 2750 50  0000 C CNN
F 2 "" H 3300 2900 60  0000 C CNN
F 3 "" H 3300 2900 60  0000 C CNN
	1    3300 2900
	1    0    0    -1  
$EndComp
$Sheet
S 2850 1400 550  400 
U 56399EBC
F0 "ASDQ3V0 sense" 50
F1 "sch/Current_sense.sch" 50
F2 "_Reset" I L 2850 1750 60 
F3 "-" I L 2850 1550 60 
F4 "+" I L 2850 1450 60 
F5 "V_I" O R 3400 1550 60 
F6 "OC" O R 3400 1450 60 
F7 "CMPin" I R 3400 1650 60 
$EndSheet
Wire Wire Line
	3400 1450 3850 1450
Wire Wire Line
	3600 1550 3400 1550
Wire Wire Line
	3300 2650 3600 2650
Wire Wire Line
	3600 3150 3300 3150
Wire Wire Line
	3400 1650 3450 1650
Wire Wire Line
	3450 1650 3450 2650
Connection ~ 3450 2650
Wire Wire Line
	3600 1550 3600 2150
Wire Wire Line
	3850 1450 3850 3850
Wire Wire Line
	5200 3150 5200 3200
$Comp
L R R61
U 1 1 563BEC44
P 5200 2400
F 0 "R61" V 5300 2300 50  0000 C CNN
F 1 "3k" V 5200 2400 50  0000 C CNN
F 2 "" H 5200 2400 60  0001 C CNN
F 3 "" H 5200 2400 60  0001 C CNN
	1    5200 2400
	-1   0    0    1   
$EndComp
$Comp
L R R62
U 1 1 563BEC4A
P 5200 2900
F 0 "R62" V 5280 2900 50  0000 C CNN
F 1 "1k" V 5200 2900 50  0000 C CNN
F 2 "" H 5200 2900 60  0001 C CNN
F 3 "" H 5200 2900 60  0001 C CNN
	1    5200 2900
	-1   0    0    1   
$EndComp
$Comp
L GND #PWR0104
U 1 1 563BEC50
P 5200 3200
F 0 "#PWR0104" H 5200 3200 30  0001 C CNN
F 1 "GND" H 5200 3130 30  0001 C CNN
F 2 "" H 5200 3200 60  0001 C CNN
F 3 "" H 5200 3200 60  0001 C CNN
	1    5200 3200
	1    0    0    -1  
$EndComp
$Comp
L C C41
U 1 1 563BEC56
P 4900 2900
F 0 "C41" V 5000 3050 50  0000 C CNN
F 1 "1uF" V 5000 2750 50  0000 C CNN
F 2 "" H 4900 2900 60  0000 C CNN
F 3 "" H 4900 2900 60  0000 C CNN
	1    4900 2900
	1    0    0    -1  
$EndComp
$Sheet
S 4450 1400 550  400 
U 563BEC5E
F0 "ASDQ3V1 sense" 50
F1 "sch/Current_sense.sch" 50
F2 "_Reset" I L 4450 1750 60 
F3 "-" I L 4450 1550 60 
F4 "+" I L 4450 1450 60 
F5 "V_I" O R 5000 1550 60 
F6 "OC" O R 5000 1450 60 
F7 "CMPin" I R 5000 1650 60 
$EndSheet
Wire Wire Line
	5000 1450 5450 1450
Wire Wire Line
	5200 1550 5000 1550
Wire Wire Line
	4900 2650 5200 2650
Wire Wire Line
	5200 3150 4900 3150
Wire Wire Line
	5000 1650 5050 1650
Wire Wire Line
	5050 1650 5050 2650
Connection ~ 5050 2650
Wire Wire Line
	5200 1550 5200 2150
Wire Wire Line
	5450 1450 5450 3850
Wire Wire Line
	6800 3150 6800 3200
$Comp
L R R55
U 1 1 563BF0BD
P 6800 2400
F 0 "R55" V 6900 2300 50  0000 C CNN
F 1 "3k" V 6800 2400 50  0000 C CNN
F 2 "" H 6800 2400 60  0001 C CNN
F 3 "" H 6800 2400 60  0001 C CNN
	1    6800 2400
	-1   0    0    1   
$EndComp
$Comp
L R R56
U 1 1 563BF0C3
P 6800 2900
F 0 "R56" V 6880 2900 50  0000 C CNN
F 1 "1k" V 6800 2900 50  0000 C CNN
F 2 "" H 6800 2900 60  0001 C CNN
F 3 "" H 6800 2900 60  0001 C CNN
	1    6800 2900
	-1   0    0    1   
$EndComp
$Comp
L GND #PWR0105
U 1 1 563BF0C9
P 6800 3200
F 0 "#PWR0105" H 6800 3200 30  0001 C CNN
F 1 "GND" H 6800 3130 30  0001 C CNN
F 2 "" H 6800 3200 60  0001 C CNN
F 3 "" H 6800 3200 60  0001 C CNN
	1    6800 3200
	1    0    0    -1  
$EndComp
$Comp
L C C39
U 1 1 563BF0CF
P 6500 2900
F 0 "C39" V 6600 3050 50  0000 C CNN
F 1 "1uF" V 6600 2750 50  0000 C CNN
F 2 "" H 6500 2900 60  0000 C CNN
F 3 "" H 6500 2900 60  0000 C CNN
	1    6500 2900
	1    0    0    -1  
$EndComp
$Sheet
S 6050 1400 550  400 
U 563BF0D7
F0 "ASDQ3V2 sense" 50
F1 "sch/Current_sense.sch" 50
F2 "_Reset" I L 6050 1750 60 
F3 "-" I L 6050 1550 60 
F4 "+" I L 6050 1450 60 
F5 "V_I" O R 6600 1550 60 
F6 "OC" O R 6600 1450 60 
F7 "CMPin" I R 6600 1650 60 
$EndSheet
Wire Wire Line
	6600 1450 7050 1450
Wire Wire Line
	6800 1550 6600 1550
Wire Wire Line
	6500 2650 6800 2650
Wire Wire Line
	6800 3150 6500 3150
Wire Wire Line
	6600 1650 6650 1650
Wire Wire Line
	6650 1650 6650 2650
Connection ~ 6650 2650
Wire Wire Line
	6800 1550 6800 2150
Wire Wire Line
	7050 1450 7050 3850
Wire Wire Line
	8400 3150 8400 3200
$Comp
L R R58
U 1 1 563BF89A
P 8400 2400
F 0 "R58" V 8500 2300 50  0000 C CNN
F 1 "3k" V 8400 2400 50  0000 C CNN
F 2 "" H 8400 2400 60  0001 C CNN
F 3 "" H 8400 2400 60  0001 C CNN
	1    8400 2400
	-1   0    0    1   
$EndComp
$Comp
L R R59
U 1 1 563BF8A0
P 8400 2900
F 0 "R59" V 8480 2900 50  0000 C CNN
F 1 "1k" V 8400 2900 50  0000 C CNN
F 2 "" H 8400 2900 60  0001 C CNN
F 3 "" H 8400 2900 60  0001 C CNN
	1    8400 2900
	-1   0    0    1   
$EndComp
$Comp
L GND #PWR0106
U 1 1 563BF8A6
P 8400 3200
F 0 "#PWR0106" H 8400 3200 30  0001 C CNN
F 1 "GND" H 8400 3130 30  0001 C CNN
F 2 "" H 8400 3200 60  0001 C CNN
F 3 "" H 8400 3200 60  0001 C CNN
	1    8400 3200
	1    0    0    -1  
$EndComp
$Comp
L C C40
U 1 1 563BF8AC
P 8100 2900
F 0 "C40" V 8200 3050 50  0000 C CNN
F 1 "1uF" V 8200 2750 50  0000 C CNN
F 2 "" H 8100 2900 60  0000 C CNN
F 3 "" H 8100 2900 60  0000 C CNN
	1    8100 2900
	1    0    0    -1  
$EndComp
$Sheet
S 7650 1400 550  400 
U 563BF8B4
F0 "ASDQ3V3 sense" 50
F1 "sch/Current_sense.sch" 50
F2 "_Reset" I L 7650 1750 60 
F3 "-" I L 7650 1550 60 
F4 "+" I L 7650 1450 60 
F5 "V_I" O R 8200 1550 60 
F6 "OC" O R 8200 1450 60 
F7 "CMPin" I R 8200 1650 60 
$EndSheet
Wire Wire Line
	8200 1450 8650 1450
Wire Wire Line
	8400 1550 8200 1550
Wire Wire Line
	8100 2650 8400 2650
Wire Wire Line
	8400 3150 8100 3150
Wire Wire Line
	8200 1650 8250 1650
Wire Wire Line
	8250 1650 8250 2650
Connection ~ 8250 2650
Wire Wire Line
	8400 1550 8400 2150
Wire Wire Line
	8650 1450 8650 3850
Wire Wire Line
	3600 2000 3700 2000
Wire Wire Line
	3700 2000 3700 4200
Connection ~ 3600 2000
Wire Wire Line
	5200 2000 5300 2000
Wire Wire Line
	5300 2000 5300 4200
Connection ~ 5200 2000
Wire Wire Line
	6800 2000 6900 2000
Wire Wire Line
	6900 2000 6900 4200
Connection ~ 6800 2000
Wire Wire Line
	8400 2000 8500 2000
Wire Wire Line
	8500 2000 8500 4200
Connection ~ 8400 2000
Wire Wire Line
	2950 6700 3900 6700
$Comp
L -3V #PWR0107
U 1 1 563C725D
P 2400 1850
F 0 "#PWR0107" H 2400 1990 20  0001 C CNN
F 1 "-3V" H 2400 1960 30  0000 C CNN
F 2 "" H 2400 1850 60  0001 C CNN
F 3 "" H 2400 1850 60  0001 C CNN
	1    2400 1850
	1    0    0    -1  
$EndComp
Wire Wire Line
	2550 1750 2550 1900
Wire Wire Line
	2550 1900 2400 1900
Wire Wire Line
	2400 1900 2400 1850
$Comp
L -3V #PWR0108
U 1 1 563C7E4B
P 4000 1850
F 0 "#PWR0108" H 4000 1990 20  0001 C CNN
F 1 "-3V" H 4000 1960 30  0000 C CNN
F 2 "" H 4000 1850 60  0001 C CNN
F 3 "" H 4000 1850 60  0001 C CNN
	1    4000 1850
	1    0    0    -1  
$EndComp
Wire Wire Line
	4150 1750 4150 1900
Wire Wire Line
	4150 1900 4000 1900
Wire Wire Line
	4000 1900 4000 1850
$Comp
L -3V #PWR0109
U 1 1 563C81B4
P 5600 1850
F 0 "#PWR0109" H 5600 1990 20  0001 C CNN
F 1 "-3V" H 5600 1960 30  0000 C CNN
F 2 "" H 5600 1850 60  0001 C CNN
F 3 "" H 5600 1850 60  0001 C CNN
	1    5600 1850
	1    0    0    -1  
$EndComp
Wire Wire Line
	5750 1750 5750 1900
Wire Wire Line
	5750 1900 5600 1900
Wire Wire Line
	5600 1900 5600 1850
$Comp
L -3V #PWR0110
U 1 1 563C848D
P 7200 1850
F 0 "#PWR0110" H 7200 1990 20  0001 C CNN
F 1 "-3V" H 7200 1960 30  0000 C CNN
F 2 "" H 7200 1850 60  0001 C CNN
F 3 "" H 7200 1850 60  0001 C CNN
	1    7200 1850
	1    0    0    -1  
$EndComp
Wire Wire Line
	7350 1750 7350 1900
Wire Wire Line
	7350 1900 7200 1900
Wire Wire Line
	7200 1900 7200 1850
Wire Wire Line
	1850 2100 7600 2100
Wire Wire Line
	2800 2100 2800 1750
Wire Wire Line
	2800 1750 2850 1750
Wire Wire Line
	4400 2100 4400 1750
Wire Wire Line
	4400 1750 4450 1750
Connection ~ 2800 2100
Wire Wire Line
	6000 2100 6000 1750
Wire Wire Line
	6000 1750 6050 1750
Connection ~ 4400 2100
Wire Wire Line
	7600 2100 7600 1750
Wire Wire Line
	7600 1750 7650 1750
Connection ~ 6000 2100
$EndSCHEMATC
