EESchema Schematic File Version 2
LIBS:sn74hc05d
LIBS:power
LIBS:pspice
LIBS:tps73501drbt
LIBS:tps78630kttt
LIBS:ina202a
LIBS:ad7998
LIBS:opa703
LIBS:bav99
LIBS:lt3015eq
LIBS:mcp23017-qfn
LIBS:2x14_conn
LIBS:ds18b20u
LIBS:LogicBoard_DB-cache
EELAYER 24 0
EELAYER END
$Descr A4 11693 8268
encoding utf-8
Sheet 10 15
Title ""
Date "18 nov 2014"
Rev ""
Comp ""
Comment1 ""
Comment2 ""
Comment3 ""
Comment4 ""
$EndDescr
Text Notes 9700 2600 0    60   ~ 0
Nominal: 1.65V each
Wire Wire Line
	5050 1550 4900 1550
Wire Wire Line
	4900 1550 4900 1750
Wire Wire Line
	4900 1750 4750 1750
Wire Wire Line
	5050 1450 4900 1450
Wire Wire Line
	4900 1450 4900 1250
Wire Wire Line
	4900 1250 4750 1250
Wire Wire Line
	7450 1450 7300 1450
Wire Wire Line
	7300 1450 7300 1250
Wire Wire Line
	7300 1250 7150 1250
Wire Wire Line
	7150 1250 7150 900 
Wire Wire Line
	7150 1950 7150 1750
Wire Wire Line
	7450 1550 7300 1550
Wire Wire Line
	7300 1550 7300 1750
Wire Wire Line
	7300 1750 7150 1750
Wire Wire Line
	6250 1450 6100 1450
Wire Wire Line
	6100 1450 6100 1250
Wire Wire Line
	6100 1250 5950 1250
Wire Wire Line
	5950 1250 5950 900 
Wire Wire Line
	5950 1950 5950 1750
Wire Wire Line
	6250 1550 6100 1550
Wire Wire Line
	6100 1550 6100 1750
Wire Wire Line
	6100 1750 5950 1750
Wire Wire Line
	8500 1750 8350 1750
Wire Wire Line
	8500 1750 8500 1550
Wire Wire Line
	8500 1550 8650 1550
Wire Wire Line
	8350 1750 8350 1950
Wire Wire Line
	2600 1150 2600 950 
Wire Wire Line
	2800 1150 2800 950 
Wire Wire Line
	3400 1550 3550 1550
Wire Wire Line
	3550 1550 3550 1450
Wire Wire Line
	3550 1450 3750 1450
Wire Wire Line
	2600 950  4150 950 
Connection ~ 2800 950 
Wire Wire Line
	4150 1950 4150 1700
Connection ~ 3750 1950
Wire Wire Line
	4150 950  4150 1200
Connection ~ 3750 950 
Wire Wire Line
	1600 1550 2200 1550
Wire Wire Line
	1100 1550 950  1550
Connection ~ 4150 1950
Wire Wire Line
	8350 1950 3400 1950
Wire Wire Line
	2000 2000 2000 1900
Wire Wire Line
	2200 1950 2000 1950
Connection ~ 2000 1950
Wire Bus Line
	9700 800  4850 800 
Wire Wire Line
	4700 2100 8600 2100
Wire Wire Line
	5000 2100 5000 1750
Wire Wire Line
	5000 1750 5050 1750
Wire Wire Line
	6200 2100 6200 1750
Wire Wire Line
	6200 1750 6250 1750
Connection ~ 5000 2100
Wire Wire Line
	7400 2100 7400 1750
Wire Wire Line
	7400 1750 7450 1750
Connection ~ 6200 2100
Wire Wire Line
	8600 2100 8600 1750
Wire Wire Line
	8600 1750 8650 1750
Connection ~ 7400 2100
Wire Bus Line
	9700 2900 5800 2900
Wire Bus Line
	9700 2700 5950 2700
Wire Wire Line
	2000 2550 2000 2500
Wire Wire Line
	4350 1950 4350 1850
Connection ~ 4750 1950
Connection ~ 5950 1950
Connection ~ 7150 1950
Connection ~ 4350 1950
Wire Wire Line
	5700 2800 5700 1600
Wire Wire Line
	5700 1600 5600 1600
Wire Wire Line
	5850 2600 5850 1500
Wire Wire Line
	5850 1500 5600 1500
Wire Wire Line
	6900 2800 6900 1600
Wire Wire Line
	6900 1600 6800 1600
Wire Wire Line
	6800 1500 7050 1500
Wire Wire Line
	7050 1500 7050 2600
Wire Wire Line
	8000 1600 8100 1600
Wire Wire Line
	8100 1600 8100 2800
Wire Wire Line
	8000 1500 8250 1500
Wire Wire Line
	8250 1500 8250 2600
Wire Wire Line
	9300 2800 9300 1600
Wire Wire Line
	9300 1600 9200 1600
Wire Wire Line
	9200 1500 9450 1500
Wire Wire Line
	9450 1500 9450 2600
Wire Wire Line
	8350 900  8350 1250
Wire Wire Line
	8350 1250 8500 1250
Wire Wire Line
	8500 1250 8500 1450
Wire Wire Line
	8500 1450 8650 1450
Wire Wire Line
	4750 1250 4750 900 
Wire Wire Line
	4750 1750 4750 1950
$Comp
L R R45
U 1 1 546B5C70
P 4750 1500
F 0 "R45" V 4830 1500 50  0000 C CNN
F 1 "0.1" V 4750 1500 50  0000 C CNN
F 2 "" H 4750 1500 60  0001 C CNN
F 3 "" H 4750 1500 60  0001 C CNN
	1    4750 1500
	1    0    0    -1  
$EndComp
$Comp
L R R47
U 1 1 546AC69E
P 7150 1500
F 0 "R47" V 7230 1500 50  0000 C CNN
F 1 "0.1" V 7150 1500 50  0000 C CNN
F 2 "" H 7150 1500 60  0001 C CNN
F 3 "" H 7150 1500 60  0001 C CNN
	1    7150 1500
	1    0    0    -1  
$EndComp
$Comp
L R R46
U 1 1 546AC689
P 5950 1500
F 0 "R46" V 6030 1500 50  0000 C CNN
F 1 "0.1" V 5950 1500 50  0000 C CNN
F 2 "" H 5950 1500 60  0001 C CNN
F 3 "" H 5950 1500 60  0001 C CNN
	1    5950 1500
	1    0    0    -1  
$EndComp
$Comp
L R R48
U 1 1 546AC633
P 8350 1500
F 0 "R48" V 8430 1500 50  0000 C CNN
F 1 "0.1" V 8350 1500 50  0000 C CNN
F 2 "" H 8350 1500 60  0001 C CNN
F 3 "" H 8350 1500 60  0001 C CNN
	1    8350 1500
	1    0    0    -1  
$EndComp
Text Notes 1800 750  0    60   ~ 0
-3V Regulator\nmax: 1.5A\nTotal: 730mA
Text HLabel 950  1550 0    60   Input ~ 0
EN-3V
$Comp
L GND #PWR097
U 1 1 54503AF1
P 2600 1150
F 0 "#PWR097" H 2600 1150 30  0001 C CNN
F 1 "GND" H 2600 1080 30  0001 C CNN
F 2 "" H 2600 1150 60  0001 C CNN
F 3 "" H 2600 1150 60  0001 C CNN
	1    2600 1150
	1    0    0    -1  
$EndComp
$Comp
L R R50
U 1 1 54503AF7
P 3750 1700
F 0 "R50" V 3830 1700 50  0000 C CNN
F 1 "17.8k" V 3750 1700 50  0000 C CNN
F 2 "" H 3750 1700 60  0001 C CNN
F 3 "" H 3750 1700 60  0001 C CNN
	1    3750 1700
	1    0    0    -1  
$EndComp
$Comp
L R R43
U 1 1 54503AFD
P 3750 1200
F 0 "R43" V 3830 1200 50  0000 C CNN
F 1 "12.1k" V 3750 1200 50  0000 C CNN
F 2 "" H 3750 1200 60  0001 C CNN
F 3 "" H 3750 1200 60  0001 C CNN
	1    3750 1200
	1    0    0    -1  
$EndComp
$Comp
L R R44
U 1 1 54503B03
P 1600 1300
F 0 "R44" V 1680 1300 50  0000 C CNN
F 1 "DNP" V 1600 1300 50  0000 C CNN
F 2 "" H 1600 1300 60  0001 C CNN
F 3 "" H 1600 1300 60  0001 C CNN
	1    1600 1300
	1    0    0    -1  
$EndComp
$Comp
L +3.3V #PWR098
U 1 1 54503B09
P 1600 1050
F 0 "#PWR098" H 1600 1010 30  0001 C CNN
F 1 "+3.3V" H 1600 1160 30  0000 C CNN
F 2 "" H 1600 1050 60  0001 C CNN
F 3 "" H 1600 1050 60  0001 C CNN
	1    1600 1050
	1    0    0    -1  
$EndComp
$Comp
L C C26
U 1 1 54503B0F
P 4150 1450
F 0 "C26" V 4250 1600 50  0000 C CNN
F 1 "10uF" V 4250 1300 50  0000 C CNN
F 2 "" H 4150 1450 60  0001 C CNN
F 3 "" H 4150 1450 60  0001 C CNN
	1    4150 1450
	1    0    0    -1  
$EndComp
$Comp
L R R49
U 1 1 54503B15
P 1350 1550
F 0 "R49" V 1430 1550 50  0000 C CNN
F 1 "0" V 1350 1550 50  0000 C CNN
F 2 "" H 1350 1550 60  0001 C CNN
F 3 "" H 1350 1550 60  0001 C CNN
	1    1350 1550
	0    -1   -1   0   
$EndComp
Text Notes 2000 1350 0    60   ~ 0
LT3015EQ#PBF
$Comp
L LT3015EQ U15
U 1 1 5453C80F
P 2800 1750
F 0 "U15" H 3150 1300 60  0000 C CNN
F 1 "LT3015EQ" H 2800 1700 60  0000 C CNN
F 2 "" H 2800 1750 60  0001 C CNN
F 3 "" H 2800 1750 60  0001 C CNN
	1    2800 1750
	1    0    0    -1  
$EndComp
$Comp
L -5V #PWR099
U 1 1 5453CA71
P 2000 1900
F 0 "#PWR099" H 2000 2040 20  0001 C CNN
F 1 "-5V" H 2000 2010 30  0000 C CNN
F 2 "" H 2000 1900 60  0001 C CNN
F 3 "" H 2000 1900 60  0001 C CNN
	1    2000 1900
	1    0    0    -1  
$EndComp
$Comp
L C C27
U 1 1 5453CA85
P 2000 2250
F 0 "C27" V 2100 2400 50  0000 C CNN
F 1 "10uF" V 2100 2100 50  0000 C CNN
F 2 "" H 2000 2250 60  0001 C CNN
F 3 "" H 2000 2250 60  0001 C CNN
	1    2000 2250
	1    0    0    -1  
$EndComp
$Comp
L -3V #PWR0100
U 1 1 5453CF17
P 4350 1850
F 0 "#PWR0100" H 4350 1990 20  0001 C CNN
F 1 "-3V" H 4350 1960 30  0000 C CNN
F 2 "" H 4350 1850 60  0001 C CNN
F 3 "" H 4350 1850 60  0001 C CNN
	1    4350 1850
	1    0    0    -1  
$EndComp
Text Label 8350 950  3    60   ~ 0
-3V_V0
Text Label 5950 900  3    60   ~ 0
-3V_V1
Text Label 4750 950  3    60   ~ 0
-3V_V2
Text Label 7150 950  3    60   ~ 0
-3V_V3
Text HLabel 9700 800  2    60   Output ~ 0
-3V_V[3..0]
$Sheet
S 5050 1400 550  400 
U 5457D178
F0 "ASDQ3V0 sense" 50
F1 "sch/Current_sense.sch" 50
F2 "_Reset" I L 5050 1750 60 
F3 "-" I L 5050 1550 60 
F4 "+" I L 5050 1450 60 
F5 "V_I" I R 5600 1500 60 
F6 "OC" I R 5600 1600 60 
$EndSheet
$Sheet
S 7450 1400 550  400 
U 546954CB
F0 "ASDQ3V2 sense" 50
F1 "sch/Current_sense.sch" 50
F2 "_Reset" I L 7450 1750 60 
F3 "-" I L 7450 1550 60 
F4 "+" I L 7450 1450 60 
F5 "V_I" I R 8000 1500 60 
F6 "OC" I R 8000 1600 60 
$EndSheet
Entry Wire Line
	4750 900  4850 800 
Entry Wire Line
	5950 900  6050 800 
Entry Wire Line
	7150 900  7250 800 
Entry Wire Line
	8350 900  8450 800 
Text HLabel 4700 2100 0    60   Input ~ 0
Reset-3V
Text Label 9450 2550 1    60   ~ 0
-3V_I0
Text Label 8250 2550 1    60   ~ 0
-3V_I1
Text Label 5850 2550 1    60   ~ 0
-3V_I2
Text Label 7050 2550 1    60   ~ 0
-3V_I3
Entry Wire Line
	5700 2800 5800 2900
Entry Wire Line
	6900 2800 7000 2900
Entry Wire Line
	8100 2800 8200 2900
Entry Wire Line
	9300 2800 9400 2900
Text HLabel 9700 2700 2    60   Output ~ 0
-3V_I[3..0]
Text Label 9300 2550 1    60   ~ 0
-3V_OC0
Text Label 8100 2550 1    60   ~ 0
-3V_OC1
Text Label 5700 2550 1    60   ~ 0
-3V_OC2
Text Label 6900 2550 1    60   ~ 0
-3V_OC3
Entry Wire Line
	5850 2600 5950 2700
Entry Wire Line
	7050 2600 7150 2700
Entry Wire Line
	8250 2600 8350 2700
Entry Wire Line
	9450 2600 9550 2700
Text HLabel 9700 2900 2    60   Output ~ 0
-3V_OC[3..0]
$Sheet
S 8650 1400 550  400 
U 546954CC
F0 "ASDQ3V3 sense" 50
F1 "sch/Current_sense.sch" 50
F2 "_Reset" I L 8650 1750 60 
F3 "-" I L 8650 1550 60 
F4 "+" I L 8650 1450 60 
F5 "V_I" I R 9200 1500 60 
F6 "OC" I R 9200 1600 60 
$EndSheet
Text Notes 9650 950  0    60   ~ 0
Separate monitored supply lines \nfor each ASDQ's 3V
Text Notes 9500 3050 0    60   ~ 0
For current monitoring and tripping
$Comp
L GND #PWR0101
U 1 1 5459E564
P 2000 2550
F 0 "#PWR0101" H 2000 2550 30  0001 C CNN
F 1 "GND" H 2000 2480 30  0001 C CNN
F 2 "" H 2000 2550 60  0001 C CNN
F 3 "" H 2000 2550 60  0001 C CNN
	1    2000 2550
	1    0    0    -1  
$EndComp
$Sheet
S 6250 1400 550  400 
U 5457E1FF
F0 "ASDQ3V1 sense" 50
F1 "sch/Current_sense.sch" 50
F2 "_Reset" I L 6250 1750 60 
F3 "-" I L 6250 1550 60 
F4 "+" I L 6250 1450 60 
F5 "V_I" I R 6800 1500 60 
F6 "OC" I R 6800 1600 60 
$EndSheet
Wire Wire Line
	2200 1850 2200 1950
$EndSCHEMATC
