EESchema Schematic File Version 2
LIBS:2x14_conn
LIBS:ad7998
LIBS:bav99
LIBS:ds18b20u
LIBS:ina202a
LIBS:lt3015eq
LIBS:mcp23017-qfn
LIBS:opa703
LIBS:power
LIBS:pspice
LIBS:sn74hc05d
LIBS:tps73501drbt
LIBS:tps78630kttt
EELAYER 24 0
EELAYER END
$Descr A4 11693 8268
encoding utf-8
Sheet 2 15
Title ""
Date ""
Rev ""
Comp ""
Comment1 ""
Comment2 ""
Comment3 ""
Comment4 ""
$EndDescr
Connection ~ 5500 1250
Wire Wire Line
	8850 2700 8900 2700
Wire Wire Line
	1050 2850 1050 2900
Wire Wire Line
	1050 2900 1100 2900
Wire Wire Line
	2350 2400 2650 2400
Wire Wire Line
	2650 2300 2650 3000
Wire Wire Line
	1850 2400 1650 2400
Wire Wire Line
	1700 3100 1650 3100
Wire Wire Line
	1650 3100 1650 3150
Connection ~ 1650 2900
Wire Wire Line
	1650 2400 1650 2900
Wire Wire Line
	1600 2900 1700 2900
Wire Wire Line
	950  2050 1300 2050
Connection ~ 1300 2600
Wire Wire Line
	950  2550 950  2600
Wire Wire Line
	2150 3400 2250 3400
Wire Wire Line
	1300 2050 1300 1950
Wire Wire Line
	950  2600 1500 2600
Wire Wire Line
	1300 2550 1300 2600
Wire Wire Line
	8300 2300 8900 2300
Wire Wire Line
	8900 2600 8300 2600
Wire Wire Line
	3550 3000 3950 3000
Wire Wire Line
	3550 2400 3950 2400
Wire Wire Line
	3550 2600 3950 2600
Wire Wire Line
	3550 2800 3950 2800
Wire Wire Line
	3550 2700 3950 2700
Wire Wire Line
	3550 2900 3950 2900
Wire Wire Line
	8500 3000 8900 3000
Wire Wire Line
	3550 2500 3950 2500
Wire Wire Line
	5950 1250 5950 1750
Wire Wire Line
	5950 2250 5950 2300
Wire Wire Line
	5950 2300 5550 2300
Connection ~ 10450 1250
Wire Wire Line
	10900 1250 10900 1750
Wire Wire Line
	10900 2250 10900 2300
Wire Wire Line
	10900 2300 10500 2300
Wire Wire Line
	10600 2450 10600 2400
Wire Wire Line
	10600 2400 10500 2400
Wire Wire Line
	5750 2450 5750 2400
Wire Wire Line
	5750 2400 5550 2400
Connection ~ 9150 1800
Wire Wire Line
	9350 1800 9350 1750
Wire Wire Line
	9150 1800 9150 1850
Wire Wire Line
	8950 1800 9350 1800
Wire Wire Line
	8950 1800 8950 1750
Connection ~ 10250 1800
Wire Wire Line
	10050 1750 10050 1800
Wire Wire Line
	10250 1800 10250 1850
Wire Wire Line
	10050 1800 10450 1800
Wire Wire Line
	10450 1800 10450 1750
Wire Wire Line
	10500 3950 10500 2900
Wire Wire Line
	10600 3850 10600 2800
Wire Wire Line
	10500 2700 10600 2700
Wire Wire Line
	8900 2200 8550 2200
Connection ~ 9750 3550
Wire Wire Line
	9850 3550 9850 3450
Connection ~ 9700 3550
Wire Wire Line
	9750 3550 9750 3450
Connection ~ 9650 3550
Wire Wire Line
	9650 3450 9650 3550
Wire Wire Line
	9700 3550 9700 3650
Wire Wire Line
	9550 3550 9850 3550
Wire Wire Line
	9550 3550 9550 3450
Wire Wire Line
	8550 2200 8550 1250
Connection ~ 9150 1250
Wire Wire Line
	9150 1250 9150 1150
Connection ~ 8950 1250
Wire Wire Line
	8550 1250 9350 1250
Connection ~ 10250 1250
Wire Wire Line
	10250 1250 10250 1150
Connection ~ 9750 1250
Wire Wire Line
	9650 1750 9650 1250
Connection ~ 10050 1250
Wire Wire Line
	9650 1250 10900 1250
Wire Wire Line
	9750 1750 9750 1250
Connection ~ 5700 3850
Wire Wire Line
	5700 3850 5700 2800
Wire Wire Line
	5700 2800 5550 2800
Connection ~ 5550 3950
Wire Wire Line
	5550 2900 5550 3950
Wire Wire Line
	3950 3950 10500 3950
Wire Wire Line
	10600 2800 10500 2800
Wire Wire Line
	3950 3850 10600 3850
Wire Wire Line
	5750 2600 5750 2550
Wire Wire Line
	5750 2550 5550 2550
Wire Wire Line
	5550 2550 5550 2700
Connection ~ 4200 1800
Wire Wire Line
	4000 1750 4000 1800
Wire Wire Line
	4200 1800 4200 1900
Wire Wire Line
	4000 1800 4400 1800
Wire Wire Line
	4400 1800 4400 1750
Wire Wire Line
	3950 2200 3600 2200
Wire Wire Line
	3600 2200 3600 1250
Connection ~ 4200 1250
Wire Wire Line
	4200 1250 4200 1150
Connection ~ 4000 1250
Wire Wire Line
	3600 1250 4400 1250
Connection ~ 4800 3550
Wire Wire Line
	4900 3550 4900 3450
Connection ~ 4750 3550
Wire Wire Line
	4800 3550 4800 3450
Connection ~ 4700 3550
Wire Wire Line
	4700 3450 4700 3550
Wire Wire Line
	4750 3550 4750 3650
Wire Wire Line
	4600 3550 4900 3550
Wire Wire Line
	4600 3550 4600 3450
Connection ~ 5300 1250
Wire Wire Line
	5300 1250 5300 1150
Connection ~ 5300 1800
Wire Wire Line
	5500 1800 5500 1750
Wire Wire Line
	5300 1800 5300 1900
Wire Wire Line
	5100 1800 5500 1800
Wire Wire Line
	5100 1800 5100 1750
Connection ~ 4800 1250
Wire Wire Line
	4700 1750 4700 1250
Connection ~ 5100 1250
Wire Wire Line
	4700 1250 5950 1250
Wire Wire Line
	4800 1750 4800 1250
Text HLabel 8850 2700 0    60   Input ~ 0
TDC_I
$Comp
L AD7998 U3
U 1 1 5476995F
P 4750 2600
F 0 "U3" H 5150 1950 60  0000 C CNN
F 1 "AD7998" H 4750 2600 60  0000 C CNN
F 2 "" H 4750 2600 60  0001 C CNN
F 3 "" H 4750 2600 60  0001 C CNN
	1    4750 2600
	1    0    0    -1  
$EndComp
$Comp
L AD7998 U4
U 1 1 54769965
P 9700 2600
F 0 "U4" H 10100 1950 60  0000 C CNN
F 1 "AD7998" H 9700 2600 60  0000 C CNN
F 2 "" H 9700 2600 60  0001 C CNN
F 3 "" H 9700 2600 60  0001 C CNN
	1    9700 2600
	1    0    0    -1  
$EndComp
$Comp
L C C4
U 1 1 5476996B
P 5100 1500
F 0 "C4" V 5200 1650 50  0000 C CNN
F 1 "10uF" V 5200 1350 50  0000 C CNN
F 2 "" H 5100 1500 60  0001 C CNN
F 3 "" H 5100 1500 60  0001 C CNN
	1    5100 1500
	1    0    0    -1  
$EndComp
$Comp
L C C5
U 1 1 54769971
P 5500 1500
F 0 "C5" V 5600 1650 50  0000 C CNN
F 1 "0.1uF" V 5600 1350 50  0000 C CNN
F 2 "" H 5500 1500 60  0001 C CNN
F 3 "" H 5500 1500 60  0001 C CNN
	1    5500 1500
	1    0    0    -1  
$EndComp
$Comp
L GND #PWR024
U 1 1 54769977
P 5300 1900
F 0 "#PWR024" H 5300 1900 30  0001 C CNN
F 1 "GND" H 5300 1830 30  0001 C CNN
F 2 "" H 5300 1900 60  0001 C CNN
F 3 "" H 5300 1900 60  0001 C CNN
	1    5300 1900
	1    0    0    -1  
$EndComp
$Comp
L GND #PWR025
U 1 1 5476997D
P 4750 3650
F 0 "#PWR025" H 4750 3650 30  0001 C CNN
F 1 "GND" H 4750 3580 30  0001 C CNN
F 2 "" H 4750 3650 60  0001 C CNN
F 3 "" H 4750 3650 60  0001 C CNN
	1    4750 3650
	1    0    0    -1  
$EndComp
$Comp
L C C2
U 1 1 54769983
P 4000 1500
F 0 "C2" V 4100 1650 50  0000 C CNN
F 1 "1uF" V 4100 1350 50  0000 C CNN
F 2 "" H 4000 1500 60  0001 C CNN
F 3 "" H 4000 1500 60  0001 C CNN
	1    4000 1500
	1    0    0    -1  
$EndComp
$Comp
L C C3
U 1 1 54769989
P 4400 1500
F 0 "C3" V 4500 1650 50  0000 C CNN
F 1 "0.1uF" V 4500 1350 50  0000 C CNN
F 2 "" H 4400 1500 60  0001 C CNN
F 3 "" H 4400 1500 60  0001 C CNN
	1    4400 1500
	1    0    0    -1  
$EndComp
$Comp
L GND #PWR026
U 1 1 5476998F
P 4200 1900
F 0 "#PWR026" H 4200 1900 30  0001 C CNN
F 1 "GND" H 4200 1830 30  0001 C CNN
F 2 "" H 4200 1900 60  0001 C CNN
F 3 "" H 4200 1900 60  0001 C CNN
	1    4200 1900
	1    0    0    -1  
$EndComp
$Comp
L GND #PWR027
U 1 1 54769995
P 5750 2600
F 0 "#PWR027" H 5750 2600 30  0001 C CNN
F 1 "GND" H 5750 2530 30  0001 C CNN
F 2 "" H 5750 2600 60  0001 C CNN
F 3 "" H 5750 2600 60  0001 C CNN
	1    5750 2600
	1    0    0    -1  
$EndComp
Text HLabel 3950 3850 0    60   BiDi ~ 0
SDA
Text HLabel 3950 3950 0    60   Input ~ 0
SCL
$Comp
L C C8
U 1 1 5476999D
P 10050 1500
F 0 "C8" V 10150 1650 50  0000 C CNN
F 1 "10uF" V 10150 1350 50  0000 C CNN
F 2 "" H 10050 1500 60  0001 C CNN
F 3 "" H 10050 1500 60  0001 C CNN
	1    10050 1500
	1    0    0    -1  
$EndComp
$Comp
L C C9
U 1 1 547699A3
P 10450 1500
F 0 "C9" V 10550 1650 50  0000 C CNN
F 1 "0.1uF" V 10550 1350 50  0000 C CNN
F 2 "" H 10450 1500 60  0001 C CNN
F 3 "" H 10450 1500 60  0001 C CNN
	1    10450 1500
	1    0    0    -1  
$EndComp
$Comp
L C C6
U 1 1 547699A9
P 8950 1500
F 0 "C6" V 9050 1650 50  0000 C CNN
F 1 "1uF" V 9050 1350 50  0000 C CNN
F 2 "" H 8950 1500 60  0001 C CNN
F 3 "" H 8950 1500 60  0001 C CNN
	1    8950 1500
	1    0    0    -1  
$EndComp
$Comp
L C C7
U 1 1 547699AF
P 9350 1500
F 0 "C7" V 9450 1650 50  0000 C CNN
F 1 "0.1uF" V 9450 1350 50  0000 C CNN
F 2 "" H 9350 1500 60  0001 C CNN
F 3 "" H 9350 1500 60  0001 C CNN
	1    9350 1500
	1    0    0    -1  
$EndComp
$Comp
L GND #PWR028
U 1 1 547699B5
P 9700 3650
F 0 "#PWR028" H 9700 3650 30  0001 C CNN
F 1 "GND" H 9700 3580 30  0001 C CNN
F 2 "" H 9700 3650 60  0001 C CNN
F 3 "" H 9700 3650 60  0001 C CNN
	1    9700 3650
	1    0    0    -1  
$EndComp
$Comp
L GND #PWR029
U 1 1 547699C1
P 9150 1850
F 0 "#PWR029" H 9150 1850 30  0001 C CNN
F 1 "GND" H 9150 1780 30  0001 C CNN
F 2 "" H 9150 1850 60  0001 C CNN
F 3 "" H 9150 1850 60  0001 C CNN
	1    9150 1850
	1    0    0    -1  
$EndComp
$Comp
L GND #PWR030
U 1 1 547699C7
P 10250 1850
F 0 "#PWR030" H 10250 1850 30  0001 C CNN
F 1 "GND" H 10250 1780 30  0001 C CNN
F 2 "" H 10250 1850 60  0001 C CNN
F 3 "" H 10250 1850 60  0001 C CNN
	1    10250 1850
	1    0    0    -1  
$EndComp
$Comp
L GND #PWR031
U 1 1 547699CD
P 5750 2450
F 0 "#PWR031" H 5750 2450 30  0001 C CNN
F 1 "GND" H 5750 2380 30  0001 C CNN
F 2 "" H 5750 2450 60  0001 C CNN
F 3 "" H 5750 2450 60  0001 C CNN
	1    5750 2450
	1    0    0    -1  
$EndComp
$Comp
L GND #PWR032
U 1 1 547699D3
P 10600 2450
F 0 "#PWR032" H 10600 2450 30  0001 C CNN
F 1 "GND" H 10600 2380 30  0001 C CNN
F 2 "" H 10600 2450 60  0001 C CNN
F 3 "" H 10600 2450 60  0001 C CNN
	1    10600 2450
	1    0    0    -1  
$EndComp
$Comp
L R R2
U 1 1 547699D9
P 10900 2000
F 0 "R2" V 10980 2000 50  0000 C CNN
F 1 "4.7k" V 10900 2000 50  0000 C CNN
F 2 "" H 10900 2000 60  0001 C CNN
F 3 "" H 10900 2000 60  0001 C CNN
	1    10900 2000
	1    0    0    -1  
$EndComp
$Comp
L R R1
U 1 1 547699DF
P 5950 2000
F 0 "R1" V 6030 2000 50  0000 C CNN
F 1 "4.7k" V 5950 2000 50  0000 C CNN
F 2 "" H 5950 2000 60  0001 C CNN
F 3 "" H 5950 2000 60  0001 C CNN
	1    5950 2000
	1    0    0    -1  
$EndComp
Text HLabel 8000 2300 0    60   Input ~ 0
3V_I[3..0]
Text Label 3600 2500 0    60   ~ 0
3V_I0
Text Label 8550 3000 0    60   ~ 0
3V_I1
Text Label 3600 2900 0    60   ~ 0
3V_I2
Text Label 3600 2700 0    60   ~ 0
3V_I3
Text HLabel 3250 2000 0    60   Input ~ 0
-3V_I[3..0]
Text Label 3600 2800 0    60   ~ 0
-3V_I0
Text Label 3600 2600 0    60   ~ 0
-3V_I1
Text Label 3600 2400 0    60   ~ 0
-3V_I2
Text Label 3600 3000 0    60   ~ 0
-3V_I3
$Comp
L +3V #PWR033
U 1 1 547699F7
P 8300 2600
F 0 "#PWR033" H 8300 2740 20  0001 C CNN
F 1 "+3V" H 8300 2710 30  0000 C CNN
F 2 "" H 8300 2600 60  0001 C CNN
F 3 "" H 8300 2600 60  0001 C CNN
	1    8300 2600
	1    0    0    -1  
$EndComp
$Comp
L +1.4V #PWR034
U 1 1 547699FD
P 8300 2300
F 0 "#PWR034" H 8300 2440 20  0001 C CNN
F 1 "+1.4V" H 8300 2410 30  0000 C CNN
F 2 "" H 8300 2300 60  0001 C CNN
F 3 "" H 8300 2300 60  0001 C CNN
	1    8300 2300
	1    0    0    -1  
$EndComp
Text HLabel 8800 2500 0    60   Input ~ 0
1V4_I
Text Notes 2400 750  0    60   ~ 12
Current and Voltage Monitors
$Comp
L -5V #PWR035
U 1 1 54769A05
P 2250 3400
F 0 "#PWR035" H 2250 3540 20  0001 C CNN
F 1 "-5V" H 2250 3510 30  0000 C CNN
F 2 "" H 2250 3400 60  0001 C CNN
F 3 "" H 2250 3400 60  0001 C CNN
	1    2250 3400
	1    0    0    -1  
$EndComp
$Comp
L C C11
U 1 1 54769A0B
P 1300 2300
F 0 "C11" V 1400 2450 50  0000 C CNN
F 1 "1000pF" V 1400 2150 50  0000 C CNN
F 2 "" H 1300 2300 60  0001 C CNN
F 3 "" H 1300 2300 60  0001 C CNN
	1    1300 2300
	1    0    0    -1  
$EndComp
$Comp
L +5V #PWR036
U 1 1 54769A11
P 1300 1950
F 0 "#PWR036" H 1300 2040 20  0001 C CNN
F 1 "+5V" H 1300 2040 30  0000 C CNN
F 2 "" H 1300 1950 60  0001 C CNN
F 3 "" H 1300 1950 60  0001 C CNN
	1    1300 1950
	1    0    0    -1  
$EndComp
$Comp
L C C10
U 1 1 54769A17
P 950 2300
F 0 "C10" V 1050 2450 50  0000 C CNN
F 1 "1uF" V 1050 2150 50  0000 C CNN
F 2 "" H 950 2300 60  0001 C CNN
F 3 "" H 950 2300 60  0001 C CNN
	1    950  2300
	1    0    0    -1  
$EndComp
$Comp
L +5V #PWR037
U 1 1 54769A1D
P 2150 2600
F 0 "#PWR037" H 2150 2690 20  0001 C CNN
F 1 "+5V" H 2150 2690 30  0000 C CNN
F 2 "" H 2150 2600 60  0001 C CNN
F 3 "" H 2150 2600 60  0001 C CNN
	1    2150 2600
	1    0    0    -1  
$EndComp
$Comp
L R R3
U 1 1 54769A23
P 2100 2400
F 0 "R3" V 2180 2400 50  0000 C CNN
F 1 "10k" V 2100 2400 50  0000 C CNN
F 2 "" H 2100 2400 60  0001 C CNN
F 3 "" H 2100 2400 60  0001 C CNN
	1    2100 2400
	0    -1   -1   0   
$EndComp
$Comp
L R R4
U 1 1 54769A29
P 1350 2900
F 0 "R4" V 1430 2900 50  0000 C CNN
F 1 "10k" V 1350 2900 50  0000 C CNN
F 2 "" H 1350 2900 60  0001 C CNN
F 3 "" H 1350 2900 60  0001 C CNN
	1    1350 2900
	0    -1   -1   0   
$EndComp
$Comp
L GND #PWR038
U 1 1 54769A2F
P 1650 3150
F 0 "#PWR038" H 1650 3150 30  0001 C CNN
F 1 "GND" H 1650 3080 30  0001 C CNN
F 2 "" H 1650 3150 60  0001 C CNN
F 3 "" H 1650 3150 60  0001 C CNN
	1    1650 3150
	1    0    0    -1  
$EndComp
$Comp
L OPA703 U5
U 1 1 54769A35
P 2150 3000
F 0 "U5" H 2300 2850 60  0000 C CNN
F 1 "OPA703" H 2150 3000 30  0000 C CNN
F 2 "" H 2150 3000 60  0001 C CNN
F 3 "" H 2150 3000 60  0001 C CNN
	1    2150 3000
	1    0    0    -1  
$EndComp
$Comp
L -3V #PWR039
U 1 1 54769A3B
P 1050 2850
F 0 "#PWR039" H 1050 2990 20  0001 C CNN
F 1 "-3V" H 1050 2960 30  0000 C CNN
F 2 "" H 1050 2850 60  0001 C CNN
F 3 "" H 1050 2850 60  0001 C CNN
	1    1050 2850
	1    0    0    -1  
$EndComp
Wire Wire Line
	1300 3250 950  3250
Connection ~ 1300 3800
Wire Wire Line
	950  3750 950  3800
Wire Wire Line
	1300 3100 1300 3250
Wire Wire Line
	1500 3800 1500 3750
Wire Wire Line
	950  3800 1500 3800
Wire Wire Line
	1300 3750 1300 3800
$Comp
L C C13
U 1 1 54769A48
P 1300 3500
F 0 "C13" V 1400 3650 50  0000 C CNN
F 1 "1000pF" V 1400 3350 50  0000 C CNN
F 2 "" H 1300 3500 60  0001 C CNN
F 3 "" H 1300 3500 60  0001 C CNN
	1    1300 3500
	1    0    0    -1  
$EndComp
$Comp
L -5V #PWR040
U 1 1 54769A4E
P 1500 3750
F 0 "#PWR040" H 1500 3890 20  0001 C CNN
F 1 "-5V" H 1500 3860 30  0000 C CNN
F 2 "" H 1500 3750 60  0001 C CNN
F 3 "" H 1500 3750 60  0001 C CNN
	1    1500 3750
	1    0    0    -1  
$EndComp
$Comp
L C C12
U 1 1 54769A54
P 950 3500
F 0 "C12" V 1050 3650 50  0000 C CNN
F 1 "1uF" V 1050 3350 50  0000 C CNN
F 2 "" H 950 3500 60  0001 C CNN
F 3 "" H 950 3500 60  0001 C CNN
	1    950  3500
	1    0    0    -1  
$EndComp
$Comp
L GND #PWR041
U 1 1 54769A5A
P 1500 2650
F 0 "#PWR041" H 1500 2650 30  0001 C CNN
F 1 "GND" H 1500 2580 30  0001 C CNN
F 2 "" H 1500 2650 60  0000 C CNN
F 3 "" H 1500 2650 60  0000 C CNN
	1    1500 2650
	1    0    0    -1  
$EndComp
Wire Wire Line
	1500 2600 1500 2650
$Comp
L GND #PWR042
U 1 1 54769A61
P 1400 3150
F 0 "#PWR042" H 1400 3150 30  0001 C CNN
F 1 "GND" H 1400 3080 30  0001 C CNN
F 2 "" H 1400 3150 60  0000 C CNN
F 3 "" H 1400 3150 60  0000 C CNN
	1    1400 3150
	1    0    0    -1  
$EndComp
Wire Wire Line
	1300 3100 1400 3100
Wire Wire Line
	1400 3100 1400 3150
$Comp
L R R5
U 1 1 54769A69
P 3250 2300
F 0 "R5" V 3150 2300 50  0000 C CNN
F 1 "1k" V 3250 2300 50  0000 C CNN
F 2 "" H 3250 2300 60  0000 C CNN
F 3 "" H 3250 2300 60  0000 C CNN
	1    3250 2300
	0    -1   -1   0   
$EndComp
Wire Wire Line
	2650 3000 2900 3000
$Comp
L GND #PWR043
U 1 1 54769A71
P 3250 3850
F 0 "#PWR043" H 3250 3850 30  0001 C CNN
F 1 "GND" H 3250 3780 30  0001 C CNN
F 2 "" H 3250 3850 60  0000 C CNN
F 3 "" H 3250 3850 60  0000 C CNN
	1    3250 3850
	1    0    0    -1  
$EndComp
Wire Wire Line
	3250 3800 3250 3850
Wire Wire Line
	3100 3550 2900 3550
Wire Wire Line
	2900 3550 2900 3000
Connection ~ 2900 3000
$Comp
L +3.3V #PWR044
U 1 1 54769A7B
P 3250 3250
F 0 "#PWR044" H 3250 3210 30  0001 C CNN
F 1 "+3.3V" H 3250 3360 30  0000 C CNN
F 2 "" H 3250 3250 60  0000 C CNN
F 3 "" H 3250 3250 60  0000 C CNN
	1    3250 3250
	1    0    0    -1  
$EndComp
Wire Wire Line
	3250 3250 3250 3300
$Comp
L +3.3V #PWR045
U 1 1 54769A82
P 5300 1150
F 0 "#PWR045" H 5300 1110 30  0001 C CNN
F 1 "+3.3V" H 5300 1260 30  0000 C CNN
F 2 "" H 5300 1150 60  0000 C CNN
F 3 "" H 5300 1150 60  0000 C CNN
	1    5300 1150
	1    0    0    -1  
$EndComp
$Comp
L +3.3V #PWR046
U 1 1 54769A88
P 4200 1150
F 0 "#PWR046" H 4200 1110 30  0001 C CNN
F 1 "+3.3V" H 4200 1260 30  0000 C CNN
F 2 "" H 4200 1150 60  0000 C CNN
F 3 "" H 4200 1150 60  0000 C CNN
	1    4200 1150
	1    0    0    -1  
$EndComp
$Comp
L +3.3V #PWR047
U 1 1 54769A8E
P 10250 1150
F 0 "#PWR047" H 10250 1110 30  0001 C CNN
F 1 "+3.3V" H 10250 1260 30  0000 C CNN
F 2 "" H 10250 1150 60  0000 C CNN
F 3 "" H 10250 1150 60  0000 C CNN
	1    10250 1150
	1    0    0    -1  
$EndComp
$Comp
L +3.3V #PWR048
U 1 1 54769A94
P 9150 1150
F 0 "#PWR048" H 9150 1110 30  0001 C CNN
F 1 "+3.3V" H 9150 1260 30  0000 C CNN
F 2 "" H 9150 1150 60  0000 C CNN
F 3 "" H 9150 1150 60  0000 C CNN
	1    9150 1150
	1    0    0    -1  
$EndComp
$Comp
L BAV99DW D1
U 1 1 54769A9A
P 3250 3550
F 0 "D1" H 3550 3150 60  0000 C CNN
F 1 "BAV99DW" V 3350 3550 60  0000 C CNN
F 2 "" H 3250 3550 60  0000 C CNN
F 3 "" H 3250 3550 60  0000 C CNN
	1    3250 3550
	1    0    0    -1  
$EndComp
NoConn ~ 3500 3300
NoConn ~ 3650 3550
NoConn ~ 3500 3800
Wire Wire Line
	2650 2300 3000 2300
Connection ~ 2650 2400
Wire Wire Line
	3500 2300 3950 2300
Wire Wire Line
	8900 2500 8800 2500
$Comp
L +3.3V #PWR049
U 1 1 5493C97E
P 10600 2700
F 0 "#PWR049" H 10600 2660 30  0001 C CNN
F 1 "+3.3V" H 10600 2810 30  0000 C CNN
F 2 "" H 10600 2700 60  0000 C CNN
F 3 "" H 10600 2700 60  0000 C CNN
	1    10600 2700
	1    0    0    -1  
$EndComp
NoConn ~ 8900 2400
NoConn ~ 8900 2800
NoConn ~ 8900 2900
$EndSCHEMATC
