PCBNEW-LibModule-V1  19/03/2012 21:11:53
# encoding utf-8
Units mm
$INDEX
SO8W
$EndINDEX
$MODULE SO8W
Po 0 0 0 15 53908903 00000000 ~~
Li SO8W
Cd Module CMS SOJ 8 pins large
Kw CMS SOJ
Sc 0
AR 
Op 0 0 0
At SMD
T0 0 -1.27 1.143 1.016 0 0.127 N V 21 N "SO8W"
T1 0 1.27 1.016 1.016 0 0.127 N V 21 N "VAL*"
DS -2.54 -2.75 2.54 -2.75 0.127 21
DS 2.54 -2.75 2.54 2.75 0.127 21
DS 2.54 2.75 -2.54 2.75 0.127 21
DS -2.54 2.75 -2.54 -2.75 0.127 21
DS -2.54 -0.762 -2.032 -0.762 0.127 21
DS -2.032 -0.762 -2.032 0.508 0.127 21
DS -2.032 0.508 -2.54 0.508 0.127 21
$PAD
Sh "8" R 0.508 1.143 0 0 0
Dr 0 0 0
At SMD N 00888000
Ne 0 ""
Po -1.905 -3.75
$EndPAD
$PAD
Sh "7" R 0.508 1.143 0 0 0
Dr 0 0 0
At SMD N 00888000
Ne 0 ""
Po -0.635 -3.75
$EndPAD
$PAD
Sh "6" R 0.508 1.143 0 0 0
Dr 0 0 0
At SMD N 00888000
Ne 0 ""
Po 0.635 -3.75
$EndPAD
$PAD
Sh "5" R 0.508 1.143 0 0 0
Dr 0 0 0
At SMD N 00888000
Ne 0 ""
Po 1.905 -3.75
$EndPAD
$PAD
Sh "4" R 0.508 1.143 0 0 0
Dr 0 0 0
At SMD N 00888000
Ne 0 ""
Po 1.905 3.75
$EndPAD
$PAD
Sh "3" R 0.508 1.143 0 0 0
Dr 0 0 0
At SMD N 00888000
Ne 0 ""
Po 0.635 3.75
$EndPAD
$PAD
Sh "2" R 0.508 1.143 0 0 0
Dr 0 0 0
At SMD N 00888000
Ne 0 ""
Po -0.635 3.75
$EndPAD
$PAD
Sh "1" R 0.508 1.143 0 0 0
Dr 0 0 0
At SMD N 00888000
Ne 0 ""
Po -1.905 3.75
$EndPAD
$SHAPE3D
Na "smd/cms_so8.wrl"
Sc 0.5 0.38 0.5
Of 0 0 0
Ro 0 0 0
$EndSHAPE3D
$EndMODULE SO8W
$EndLIBRARY
