EESchema Schematic File Version 2
LIBS:sn65hvd3083edgsr
LIBS:conn
LIBS:power
LIBS:pspice
LIBS:zl40216
LIBS:sfp
LIBS:FIN1108
LIBS:sn65lvds389
LIBS:max5825baup
LIBS:tps72301dbvr
LIBS:ina195a
LIBS:tps78630kttt
LIBS:tps73501drbt
LIBS:lt3015eq
LIBS:lt1086cm-3
LIBS:tps72012drvt
LIBS:ina202a
LIBS:transistors
LIBS:2sk3019
LIBS:sn74hc05d
LIBS:ad7998
LIBS:ao3401a
LIBS:opa703
LIBS:6slx45fgg484pkg
LIBS:ERM8-RA
LIBS:cdclvd1204
LIBS:sy89835u
LIBS:zl40212
LIBS:opa4703ea
LIBS:tps73201qdbvrq1
LIBS:m25p32
LIBS:bav99
LIBS:si590
LIBS:iso7242c
LIBS:lmk00304
LIBS:pins_14x2
LIBS:ds18b20u
LIBS:2x14_conn
LIBS:led
LIBS:LogicBoard-cache
EELAYER 24 0
EELAYER END
$Descr A4 11693 8268
encoding utf-8
Sheet 3 23
Title ""
Date "1 dec 2015"
Rev ""
Comp ""
Comment1 ""
Comment2 ""
Comment3 ""
Comment4 ""
$EndDescr
Connection ~ 5750 6100
Wire Wire Line
	4150 6100 6000 6100
Wire Wire Line
	5750 6100 5750 5850
Connection ~ 5750 5150
Wire Wire Line
	5750 5100 5750 5350
Connection ~ 2750 6100
Wire Wire Line
	1150 6100 3000 6100
Wire Wire Line
	2750 6100 2750 5850
Connection ~ 2750 5150
Wire Wire Line
	2750 5100 2750 5350
Text Label 5850 6100 0    60   ~ 0
TEMP_OUT1
Text Label 2850 6100 0    60   ~ 0
TEMP_OUT0
Text HLabel 1450 5050 0    60   BiDi ~ 0
TEMP_OUT[1..0]
Text HLabel 1450 4950 0    60   BiDi ~ 0
TEMP[1..0]
Text Label 4250 6100 0    60   ~ 0
TEMP1
Text Label 1200 6100 0    60   ~ 0
TEMP0
$Comp
L R R3
U 1 1 545DD39E
P 2750 5600
F 0 "R3" V 2830 5600 50  0000 C CNN
F 1 "4.7k" V 2750 5600 50  0000 C CNN
F 2 "SM0402" H 2750 5600 60  0001 C CNN
F 3 "" H 2750 5600 60  0001 C CNN
	1    2750 5600
	1    0    0    -1  
$EndComp
$Comp
L +3.3V #PWR017
U 1 1 545DD3DA
P 2750 5100
F 0 "#PWR017" H 2750 5060 30  0001 C CNN
F 1 "+3.3V" H 2750 5210 30  0000 C CNN
F 2 "" H 2750 5100 60  0001 C CNN
F 3 "" H 2750 5100 60  0001 C CNN
	1    2750 5100
	1    0    0    -1  
$EndComp
$Comp
L R R4
U 1 1 545DD792
P 5750 5600
F 0 "R4" V 5830 5600 50  0000 C CNN
F 1 "4.7k" V 5750 5600 50  0000 C CNN
F 2 "SM0402" H 5750 5600 60  0001 C CNN
F 3 "" H 5750 5600 60  0001 C CNN
	1    5750 5600
	1    0    0    -1  
$EndComp
$Comp
L +3.3V #PWR018
U 1 1 545DD798
P 5750 5100
F 0 "#PWR018" H 5750 5060 30  0001 C CNN
F 1 "+3.3V" H 5750 5210 30  0000 C CNN
F 2 "" H 5750 5100 60  0001 C CNN
F 3 "" H 5750 5100 60  0001 C CNN
	1    5750 5100
	1    0    0    -1  
$EndComp
Text Notes 950  4750 0    60   ~ 12
Temperature Monitors
$Comp
L DS18B20U U2
U 1 1 546BADFC
P 2950 7350
F 0 "U2" H 3100 7400 60  0000 C CNN
F 1 "DS18B20U" V 3050 7700 60  0000 C CNN
F 2 "SSOP8" H 2950 7350 60  0001 C CNN
F 3 "" H 2950 7350 60  0000 C CNN
	1    2950 7350
	1    0    0    -1  
$EndComp
Wire Wire Line
	2500 7000 2350 7000
Wire Wire Line
	2350 7000 2350 6100
Connection ~ 2350 6100
$Comp
L GND #PWR019
U 1 1 546BAEA4
P 3350 7650
F 0 "#PWR019" H 3350 7650 30  0001 C CNN
F 1 "GND" H 3350 7580 30  0001 C CNN
F 2 "" H 3350 7650 60  0000 C CNN
F 3 "" H 3350 7650 60  0000 C CNN
	1    3350 7650
	1    0    0    -1  
$EndComp
Wire Wire Line
	2950 7550 2950 7600
Wire Wire Line
	2950 7600 3350 7600
Wire Wire Line
	3350 6450 3350 7650
Wire Wire Line
	3350 6450 2950 6450
Connection ~ 3350 7600
Text Notes 2700 7150 2    60   ~ 0
Local temp
$EndSCHEMATC
