EESchema Schematic File Version 2
LIBS:sn65hvd3083edgsr
LIBS:conn
LIBS:power
LIBS:pspice
LIBS:zl40216
LIBS:sfp
LIBS:FIN1108
LIBS:sn65lvds389
LIBS:max5825baup
LIBS:tps72301dbvr
LIBS:ina195a
LIBS:tps78630kttt
LIBS:tps73501drbt
LIBS:lt3015eq
LIBS:lt1086cm-3
LIBS:tps72012drvt
LIBS:ina202a
LIBS:transistors
LIBS:2sk3019
LIBS:sn74hc05d
LIBS:ad7998
LIBS:ao3401a
LIBS:opa703
LIBS:6slx45fgg484pkg
LIBS:ERM8-RA
LIBS:cdclvd1204
LIBS:sy89835u
LIBS:zl40212
LIBS:opa4703ea
LIBS:tps73201qdbvrq1
LIBS:m25p32
LIBS:bav99
LIBS:si590
LIBS:iso7242c
LIBS:lmk00304
LIBS:pins_14x2
LIBS:ds18b20u
LIBS:2x14_conn
LIBS:led
EELAYER 27 0
EELAYER END
$Descr A4 11693 8268
encoding utf-8
Sheet 23 23
Title ""
Date "17 mar 2015"
Rev ""
Comp ""
Comment1 ""
Comment2 ""
Comment3 ""
Comment4 ""
$EndDescr
$Comp
L LED D8
U 1 1 54B85159
P 3250 2700
F 0 "D8" H 3250 2900 70  0000 C CNN
F 1 "LED" H 3265 2465 70  0000 C CNN
F 2 "" H 3250 2700 60  0000 C CNN
F 3 "" H 3250 2700 60  0000 C CNN
	1    3250 2700
	0    1    1    0   
$EndComp
$Comp
L LED D7
U 1 1 54B8516B
P 2600 2700
F 0 "D7" H 2600 2900 70  0000 C CNN
F 1 "LED" H 2615 2465 70  0000 C CNN
F 2 "" H 2600 2700 60  0000 C CNN
F 3 "" H 2600 2700 60  0000 C CNN
	1    2600 2700
	0    1    1    0   
$EndComp
$Comp
L LED D10
U 1 1 54B8517B
P 4550 2700
F 0 "D10" H 4550 2900 70  0000 C CNN
F 1 "LED" H 4565 2465 70  0000 C CNN
F 2 "" H 4550 2700 60  0000 C CNN
F 3 "" H 4550 2700 60  0000 C CNN
	1    4550 2700
	0    1    1    0   
$EndComp
$Comp
L LED D9
U 1 1 54B85181
P 3900 2700
F 0 "D9" H 3900 2900 70  0000 C CNN
F 1 "LED" H 3915 2465 70  0000 C CNN
F 2 "" H 3900 2700 60  0000 C CNN
F 3 "" H 3900 2700 60  0000 C CNN
	1    3900 2700
	0    1    1    0   
$EndComp
$Comp
L R R50
U 1 1 54B84765
P 2600 3250
F 0 "R50" V 2680 3250 50  0000 C CNN
F 1 "63" V 2600 3250 50  0000 C CNN
F 2 "" H 2600 3250 60  0000 C CNN
F 3 "" H 2600 3250 60  0000 C CNN
	1    2600 3250
	1    0    0    -1  
$EndComp
$Comp
L R R51
U 1 1 54B84779
P 3250 3250
F 0 "R51" V 3330 3250 50  0000 C CNN
F 1 "63" V 3250 3250 50  0000 C CNN
F 2 "" H 3250 3250 60  0000 C CNN
F 3 "" H 3250 3250 60  0000 C CNN
	1    3250 3250
	1    0    0    -1  
$EndComp
$Comp
L R R52
U 1 1 54B8478D
P 3900 3250
F 0 "R52" V 3980 3250 50  0000 C CNN
F 1 "63" V 3900 3250 50  0000 C CNN
F 2 "" H 3900 3250 60  0000 C CNN
F 3 "" H 3900 3250 60  0000 C CNN
	1    3900 3250
	1    0    0    -1  
$EndComp
$Comp
L R R53
U 1 1 54B847A1
P 4550 3250
F 0 "R53" V 4630 3250 50  0000 C CNN
F 1 "63" V 4550 3250 50  0000 C CNN
F 2 "" H 4550 3250 60  0000 C CNN
F 3 "" H 4550 3250 60  0000 C CNN
	1    4550 3250
	1    0    0    -1  
$EndComp
$Comp
L GND #PWR0139
U 1 1 54B847B5
P 4550 3600
F 0 "#PWR0139" H 4550 3600 30  0001 C CNN
F 1 "GND" H 4550 3530 30  0001 C CNN
F 2 "" H 4550 3600 60  0000 C CNN
F 3 "" H 4550 3600 60  0000 C CNN
	1    4550 3600
	1    0    0    -1  
$EndComp
$Comp
L GND #PWR0140
U 1 1 54B847C9
P 3900 3600
F 0 "#PWR0140" H 3900 3600 30  0001 C CNN
F 1 "GND" H 3900 3530 30  0001 C CNN
F 2 "" H 3900 3600 60  0000 C CNN
F 3 "" H 3900 3600 60  0000 C CNN
	1    3900 3600
	1    0    0    -1  
$EndComp
$Comp
L GND #PWR0141
U 1 1 54B847DD
P 3250 3600
F 0 "#PWR0141" H 3250 3600 30  0001 C CNN
F 1 "GND" H 3250 3530 30  0001 C CNN
F 2 "" H 3250 3600 60  0000 C CNN
F 3 "" H 3250 3600 60  0000 C CNN
	1    3250 3600
	1    0    0    -1  
$EndComp
$Comp
L GND #PWR0142
U 1 1 54B847F1
P 2600 3600
F 0 "#PWR0142" H 2600 3600 30  0001 C CNN
F 1 "GND" H 2600 3530 30  0001 C CNN
F 2 "" H 2600 3600 60  0000 C CNN
F 3 "" H 2600 3600 60  0000 C CNN
	1    2600 3600
	1    0    0    -1  
$EndComp
Wire Wire Line
	2600 3600 2600 3500
Wire Wire Line
	2600 3000 2600 2900
Wire Wire Line
	3250 2900 3250 3000
Wire Wire Line
	3250 3500 3250 3600
Wire Wire Line
	3900 3600 3900 3500
Wire Wire Line
	3900 3000 3900 2900
Wire Wire Line
	4550 2900 4550 3000
Wire Wire Line
	4550 3500 4550 3600
Text HLabel 2100 2050 0    60   Input ~ 0
LED[3..0]
Entry Wire Line
	2500 2050 2600 2150
Entry Wire Line
	3150 2050 3250 2150
Entry Wire Line
	3800 2050 3900 2150
Entry Wire Line
	4450 2050 4550 2150
Wire Wire Line
	4550 2500 4550 2150
Wire Wire Line
	3900 2500 3900 2150
Wire Wire Line
	3250 2500 3250 2150
Wire Wire Line
	2600 2500 2600 2150
Wire Bus Line
	2100 2050 4450 2050
Text Label 2600 2450 1    60   ~ 0
LED3
Text Label 3250 2450 1    60   ~ 0
LED2
Text Label 3900 2450 1    60   ~ 0
LED1
Text Label 4550 2450 1    60   ~ 0
LED0
$EndSCHEMATC
