EESchema Schematic File Version 2
LIBS:sn65hvd3083edgsr
LIBS:conn
LIBS:power
LIBS:pspice
LIBS:iso7221a
LIBS:zl40216
LIBS:sfp
LIBS:si590
LIBS:FIN1108
LIBS:bav99
LIBS:sn65lvds389
LIBS:max5825baup
LIBS:opa4703ea
LIBS:tps73201qdbvrq1
LIBS:tps72301dbvr
LIBS:ina195a
LIBS:tps78630kttt
LIBS:tps73501drbt
LIBS:lt3015eq
LIBS:lt1086cm-3
LIBS:tps72012drvt
LIBS:ina202a
LIBS:transistors
LIBS:2sk3019
LIBS:sn74hc05d
LIBS:LogicBoard-cache
EELAYER 24 0
EELAYER END
$Descr A4 11693 8268
encoding utf-8
Sheet 9 25
Title ""
Date ""
Rev ""
Comp ""
Comment1 ""
Comment2 ""
Comment3 ""
Comment4 ""
$EndDescr
Text Notes 1700 900  0    60   ~ 0
+3.3V Regulator
Text Notes 1750 4150 0    60   ~ 0
+1.2V Regulator
$Comp
L LT1086CM-3.3 U?
U 1 1 5453DA2F
P 2350 1600
F 0 "U?" H 2700 1100 60  0000 C CNN
F 1 "LT1086CM-3.3" H 2350 1750 60  0000 C CNN
F 2 "" H 2350 1600 60  0000 C CNN
F 3 "" H 2350 1600 60  0000 C CNN
	1    2350 1600
	1    0    0    -1  
$EndComp
$Comp
L C C?
U 1 1 5453DA4D
P 1450 2000
F 0 "C?" V 1550 2150 50  0000 C CNN
F 1 "10uF" V 1550 1850 50  0000 C CNN
F 2 "" H 1450 2000 60  0000 C CNN
F 3 "" H 1450 2000 60  0000 C CNN
	1    1450 2000
	1    0    0    -1  
$EndComp
$Comp
L C C?
U 1 1 5453DA61
P 3200 2000
F 0 "C?" V 3300 2150 50  0000 C CNN
F 1 "10uF" V 3300 1850 50  0000 C CNN
F 2 "" H 3200 2000 60  0000 C CNN
F 3 "" H 3200 2000 60  0000 C CNN
	1    3200 2000
	1    0    0    -1  
$EndComp
$Comp
L +5V #PWR?
U 1 1 5453DA9A
P 1450 1600
F 0 "#PWR?" H 1450 1690 20  0001 C CNN
F 1 "+5V" H 1450 1690 30  0000 C CNN
F 2 "" H 1450 1600 60  0000 C CNN
F 3 "" H 1450 1600 60  0000 C CNN
	1    1450 1600
	1    0    0    -1  
$EndComp
$Comp
L +3.3V #PWR?
U 1 1 5453DAAE
P 3800 1600
F 0 "#PWR?" H 3800 1560 30  0001 C CNN
F 1 "+3.3V" H 3800 1710 30  0000 C CNN
F 2 "" H 3800 1600 60  0000 C CNN
F 3 "" H 3800 1600 60  0000 C CNN
	1    3800 1600
	1    0    0    -1  
$EndComp
Wire Wire Line
	3100 1650 3300 1650
Wire Wire Line
	3800 1600 3800 1650
Wire Wire Line
	3200 1650 3200 1750
Connection ~ 3200 1650
Wire Wire Line
	1450 1600 1450 1750
Wire Wire Line
	1600 1650 1450 1650
Connection ~ 1450 1650
Wire Wire Line
	1450 2250 1450 2300
Wire Wire Line
	1450 2300 3200 2300
Wire Wire Line
	2300 2300 2300 2250
Wire Wire Line
	2400 2300 2400 2250
Connection ~ 2300 2300
Wire Wire Line
	3200 2300 3200 2250
Connection ~ 2400 2300
$Comp
L GND #PWR?
U 1 1 5453DB0B
P 2350 2400
F 0 "#PWR?" H 2350 2400 30  0001 C CNN
F 1 "GND" H 2350 2330 30  0001 C CNN
F 2 "" H 2350 2400 60  0000 C CNN
F 3 "" H 2350 2400 60  0000 C CNN
	1    2350 2400
	1    0    0    -1  
$EndComp
Wire Wire Line
	2350 2300 2350 2400
Connection ~ 2350 2300
$Comp
L R R?
U 1 1 5453DB39
P 3550 1650
F 0 "R?" V 3630 1650 50  0000 C CNN
F 1 "0.1" V 3550 1650 50  0000 C CNN
F 2 "" H 3550 1650 60  0000 C CNN
F 3 "" H 3550 1650 60  0000 C CNN
	1    3550 1650
	0    -1   -1   0   
$EndComp
$Comp
L TPS72012DRVT U?
U 1 1 5453DC0E
P 2400 4850
F 0 "U?" H 2750 4350 60  0000 C CNN
F 1 "TPS72012DRVT" H 2400 4900 60  0000 C CNN
F 2 "" H 2400 4850 60  0000 C CNN
F 3 "" H 2400 4850 60  0000 C CNN
	1    2400 4850
	1    0    0    -1  
$EndComp
$Comp
L C C?
U 1 1 5453DC20
P 3250 5050
F 0 "C?" V 3350 5200 50  0000 C CNN
F 1 "2.2uF" V 3350 4900 50  0000 C CNN
F 2 "" H 3250 5050 60  0000 C CNN
F 3 "" H 3250 5050 60  0000 C CNN
	1    3250 5050
	1    0    0    -1  
$EndComp
$Comp
L +3.3V #PWR?
U 1 1 5453DC26
P 1150 4600
F 0 "#PWR?" H 1150 4560 30  0001 C CNN
F 1 "+3.3V" H 1150 4710 30  0000 C CNN
F 2 "" H 1150 4600 60  0000 C CNN
F 3 "" H 1150 4600 60  0000 C CNN
	1    1150 4600
	1    0    0    -1  
$EndComp
Wire Wire Line
	3150 4700 3350 4700
Wire Wire Line
	1150 4600 1150 4750
Wire Wire Line
	3250 4700 3250 4800
Connection ~ 3250 4700
$Comp
L R R?
U 1 1 5453DC30
P 3600 4700
F 0 "R?" V 3680 4700 50  0000 C CNN
F 1 "0.1" V 3600 4700 50  0000 C CNN
F 2 "" H 3600 4700 60  0000 C CNN
F 3 "" H 3600 4700 60  0000 C CNN
	1    3600 4700
	0    -1   -1   0   
$EndComp
$Comp
L C C?
U 1 1 5453DC3D
P 1150 5000
F 0 "C?" V 1250 5150 50  0000 C CNN
F 1 "10uF" V 1250 4850 50  0000 C CNN
F 2 "" H 1150 5000 60  0000 C CNN
F 3 "" H 1150 5000 60  0000 C CNN
	1    1150 5000
	1    0    0    -1  
$EndComp
Wire Wire Line
	1650 5100 1550 5100
Wire Wire Line
	1550 5100 1550 4700
Wire Wire Line
	1150 4700 1650 4700
Connection ~ 1150 4700
Connection ~ 1550 4700
Wire Wire Line
	1550 4900 1650 4900
Connection ~ 1550 4900
Wire Wire Line
	1150 5250 1150 5550
Wire Wire Line
	1150 5550 3250 5550
Wire Wire Line
	3250 5550 3250 5300
Wire Wire Line
	2400 5500 2400 5550
Connection ~ 2400 5550
$Comp
L GND #PWR?
U 1 1 5453DD08
P 2350 5650
F 0 "#PWR?" H 2350 5650 30  0001 C CNN
F 1 "GND" H 2350 5580 30  0001 C CNN
F 2 "" H 2350 5650 60  0000 C CNN
F 3 "" H 2350 5650 60  0000 C CNN
	1    2350 5650
	1    0    0    -1  
$EndComp
Wire Wire Line
	2350 5650 2350 5550
Connection ~ 2350 5550
$Comp
L +1.2V #PWR?
U 1 1 5453DD3F
P 3950 4600
F 0 "#PWR?" H 3950 4740 20  0001 C CNN
F 1 "+1.2V" H 3950 4710 30  0000 C CNN
F 2 "" H 3950 4600 60  0000 C CNN
F 3 "" H 3950 4600 60  0000 C CNN
	1    3950 4600
	1    0    0    -1  
$EndComp
Wire Wire Line
	3950 4600 3950 4700
Wire Wire Line
	3950 4700 3850 4700
$EndSCHEMATC
