PCBNEW-LibModule-V1  Fri 19 Dec 2014 10:14:35 AM EST
# encoding utf-8
Units mm
$INDEX
CONN_2x14
$EndINDEX
$MODULE CONN_2x14
Po 0 0 0 15 549440BB 00000000 ~~
Li CONN_2x14
Sc 0
AR 
Op 0 0 0
T0 -3.81 0 1 1 900 0.15 N I 21 N "CONN_2x14"
T1 3.6322 0 1 1 900 0.15 N V 21 N "VAL**"
DS -3.81 -17.78 -2.54 -19.05 0.15 21
DS 3.81 16.51 3.81 19.05 0.15 21
DS 3.81 19.05 -3.81 19.05 0.15 21
DS -3.81 19.05 -3.81 16.51 0.15 21
DS -3.81 -16.51 -3.81 -19.05 0.15 21
DS -3.81 -19.05 3.81 -19.05 0.15 21
DS 3.81 -19.05 3.81 -16.51 0.15 21
$PAD
Sh "27" C 1.778 1.778 0 0 0
Dr 1.0922 0 0
At STD N 00E0FFFF
Ne 0 ""
Po -1.27 16.51
$EndPAD
$PAD
Sh "28" C 1.778 1.778 0 0 0
Dr 1.0922 0 0
At STD N 00E0FFFF
Ne 0 ""
Po 1.27 16.51
$EndPAD
$PAD
Sh "26" C 1.778 1.778 0 0 0
Dr 1.0922 0 0
At STD N 00E0FFFF
Ne 0 ""
Po 1.27 13.97
$EndPAD
$PAD
Sh "25" C 1.778 1.778 0 0 0
Dr 1.0922 0 0
At STD N 00E0FFFF
Ne 0 ""
Po -1.27 13.97
$EndPAD
$PAD
Sh "23" C 1.778 1.778 0 0 0
Dr 1.0922 0 0
At STD N 00E0FFFF
Ne 0 ""
Po -1.27 11.43
$EndPAD
$PAD
Sh "24" C 1.778 1.778 0 0 0
Dr 1.0922 0 0
At STD N 00E0FFFF
Ne 0 ""
Po 1.27 11.43
$EndPAD
$PAD
Sh "22" C 1.778 1.778 0 0 0
Dr 1.0922 0 0
At STD N 00E0FFFF
Ne 0 ""
Po 1.27 8.89
$EndPAD
$PAD
Sh "21" C 1.778 1.778 0 0 0
Dr 1.0922 0 0
At STD N 00E0FFFF
Ne 0 ""
Po -1.27 8.89
$EndPAD
$PAD
Sh "19" C 1.778 1.778 0 0 0
Dr 1.0922 0 0
At STD N 00E0FFFF
Ne 0 ""
Po -1.27 6.35
$EndPAD
$PAD
Sh "20" C 1.778 1.778 0 0 0
Dr 1.0922 0 0
At STD N 00E0FFFF
Ne 0 ""
Po 1.27 6.35
$EndPAD
$PAD
Sh "18" C 1.778 1.778 0 0 0
Dr 1.0922 0 0
At STD N 00E0FFFF
Ne 0 ""
Po 1.27 3.81
$EndPAD
$PAD
Sh "17" C 1.778 1.778 0 0 0
Dr 1.0922 0 0
At STD N 00E0FFFF
Ne 0 ""
Po -1.27 3.81
$EndPAD
$PAD
Sh "15" C 1.778 1.778 0 0 0
Dr 1.0922 0 0
At STD N 00E0FFFF
Ne 0 ""
Po -1.27 1.27
$EndPAD
$PAD
Sh "16" C 1.778 1.778 0 0 0
Dr 1.0922 0 0
At STD N 00E0FFFF
Ne 0 ""
Po 1.27 1.27
$EndPAD
$PAD
Sh "14" C 1.778 1.778 0 0 0
Dr 1.0922 0 0
At STD N 00E0FFFF
Ne 0 ""
Po 1.27 -1.27
$EndPAD
$PAD
Sh "13" C 1.778 1.778 0 0 0
Dr 1.0922 0 0
At STD N 00E0FFFF
Ne 0 ""
Po -1.27 -1.27
$EndPAD
$PAD
Sh "11" C 1.778 1.778 0 0 0
Dr 1.0922 0 0
At STD N 00E0FFFF
Ne 0 ""
Po -1.27 -3.81
$EndPAD
$PAD
Sh "12" C 1.778 1.778 0 0 0
Dr 1.0922 0 0
At STD N 00E0FFFF
Ne 0 ""
Po 1.27 -3.81
$EndPAD
$PAD
Sh "10" C 1.778 1.778 0 0 0
Dr 1.0922 0 0
At STD N 00E0FFFF
Ne 0 ""
Po 1.27 -6.35
$EndPAD
$PAD
Sh "9" C 1.778 1.778 0 0 0
Dr 1.0922 0 0
At STD N 00E0FFFF
Ne 0 ""
Po -1.27 -6.35
$EndPAD
$PAD
Sh "7" C 1.778 1.778 0 0 0
Dr 1.0922 0 0
At STD N 00E0FFFF
Ne 0 ""
Po -1.27 -8.89
$EndPAD
$PAD
Sh "8" C 1.778 1.778 0 0 0
Dr 1.0922 0 0
At STD N 00E0FFFF
Ne 0 ""
Po 1.27 -8.89
$EndPAD
$PAD
Sh "6" C 1.778 1.778 0 0 0
Dr 1.0922 0 0
At STD N 00E0FFFF
Ne 0 ""
Po 1.27 -11.43
$EndPAD
$PAD
Sh "5" C 1.778 1.778 0 0 0
Dr 1.0922 0 0
At STD N 00E0FFFF
Ne 0 ""
Po -1.27 -11.43
$EndPAD
$PAD
Sh "3" C 1.778 1.778 0 0 0
Dr 1.0922 0 0
At STD N 00E0FFFF
Ne 0 ""
Po -1.27 -13.97
$EndPAD
$PAD
Sh "4" C 1.778 1.778 0 0 0
Dr 1.0922 0 0
At STD N 00E0FFFF
Ne 0 ""
Po 1.27 -13.97
$EndPAD
$PAD
Sh "2" C 1.778 1.778 0 0 0
Dr 1.0922 0 0
At STD N 00E0FFFF
Ne 0 ""
Po 1.27 -16.51
$EndPAD
$PAD
Sh "1" C 1.778 1.778 0 0 0
Dr 1.0922 0 0
At STD N 00E0FFFF
Ne 0 ""
Po -1.27 -16.51
$EndPAD
$EndMODULE CONN_2x14
$EndLIBRARY
