EESchema Schematic File Version 2
LIBS:sn65hvd3083edgsr
LIBS:conn
LIBS:power
LIBS:pspice
LIBS:zl40216
LIBS:sfp
LIBS:FIN1108
LIBS:sn65lvds389
LIBS:max5825baup
LIBS:tps72301dbvr
LIBS:ina195a
LIBS:tps78630kttt
LIBS:tps73501drbt
LIBS:lt3015eq
LIBS:lt1086cm-3
LIBS:tps72012drvt
LIBS:ina202a
LIBS:transistors
LIBS:2sk3019
LIBS:sn74hc05d
LIBS:ad7998
LIBS:ao3401a
LIBS:opa703
LIBS:6slx45fgg484pkg
LIBS:ERM8-RA
LIBS:cdclvd1204
LIBS:sy89835u
LIBS:zl40212
LIBS:opa4703ea
LIBS:tps73201qdbvrq1
LIBS:m25p32
LIBS:bav99
LIBS:si590
LIBS:iso7242c
LIBS:lmk00304
LIBS:pins_14x2
LIBS:ds18b20u
LIBS:2x14_conn
LIBS:led
EELAYER 27 0
EELAYER END
$Descr A4 11693 8268
encoding utf-8
Sheet 6 23
Title ""
Date "17 mar 2015"
Rev ""
Comp ""
Comment1 ""
Comment2 ""
Comment3 ""
Comment4 ""
$EndDescr
Wire Wire Line
	7850 1200 8750 1200
Wire Wire Line
	7850 1200 7850 1500
Wire Wire Line
	4700 3200 5550 3200
Wire Wire Line
	4700 2050 5550 2050
Wire Wire Line
	4700 5750 5550 5750
Wire Wire Line
	4700 4600 5550 4600
Wire Wire Line
	5350 5650 5550 5650
Wire Wire Line
	5350 5300 5550 5300
Wire Wire Line
	5350 5200 5550 5200
Wire Wire Line
	5350 4700 5550 4700
Wire Wire Line
	5350 2750 5550 2750
Wire Wire Line
	5550 2650 5350 2650
Wire Wire Line
	5550 2150 5350 2150
Wire Wire Line
	5550 3100 5350 3100
Wire Wire Line
	7850 4050 7850 3800
Wire Wire Line
	7850 3800 8750 3800
Wire Wire Line
	8750 4350 8750 4300
Wire Bus Line
	10200 1450 9700 1450
Wire Bus Line
	10200 1350 9400 1350
Wire Bus Line
	9700 1350 9700 5400
Wire Bus Line
	9700 2400 9700 2550
Wire Bus Line
	9400 1250 9400 5300
Wire Bus Line
	9400 2300 9400 2450
Wire Wire Line
	8750 1800 8750 1700
Wire Wire Line
	8700 5400 9300 5400
Wire Wire Line
	8700 5500 9600 5500
Wire Wire Line
	8700 5100 9300 5100
Wire Wire Line
	8700 5200 9600 5200
Wire Wire Line
	8700 4800 9300 4800
Wire Wire Line
	8700 4900 9600 4900
Wire Wire Line
	8700 4500 9300 4500
Wire Wire Line
	8700 4600 9600 4600
Wire Wire Line
	8700 1950 9300 1950
Wire Wire Line
	8700 2050 9600 2050
Wire Wire Line
	8700 2250 9300 2250
Wire Wire Line
	8700 2350 9600 2350
Wire Wire Line
	8700 2850 9300 2850
Wire Wire Line
	8700 2950 9600 2950
Wire Wire Line
	8700 2550 9300 2550
Wire Wire Line
	8700 2650 9600 2650
Text Label 8700 4500 0    60   ~ 0
TP_P2
Text Label 8700 4600 0    60   ~ 0
TP_N2
Text Label 8700 4800 0    60   ~ 0
TP_P3
Text Label 8700 4900 0    60   ~ 0
TP_N3
Text Label 8700 5100 0    60   ~ 0
TP_P6
Text Label 8700 5200 0    60   ~ 0
TP_N6
Text Label 8700 5400 0    60   ~ 0
TP_P7
Text Label 8700 5500 0    60   ~ 0
TP_N7
Text Label 8700 2550 0    60   ~ 0
TP_P0
Text Label 8700 2650 0    60   ~ 0
TP_N0
Text Label 8700 2850 0    60   ~ 0
TP_P1
Text Label 8700 2950 0    60   ~ 0
TP_N1
Text Label 8700 2250 0    60   ~ 0
TP_P5
Text Label 8700 2350 0    60   ~ 0
TP_N5
Text Label 8700 1950 0    60   ~ 0
TP_P4
Text Label 8700 2050 0    60   ~ 0
TP_N4
Text HLabel 10200 1350 2    60   Output ~ 0
TP_P[7..0]
Text HLabel 10200 1450 2    60   Output ~ 0
TP_N[7..0]
$Comp
L C C20
U 1 1 5446EA1A
P 8750 1450
F 0 "C20" V 8850 1600 50  0000 C CNN
F 1 "0.1uF" V 8850 1300 50  0000 C CNN
F 2 "" H 8750 1450 60  0001 C CNN
F 3 "" H 8750 1450 60  0001 C CNN
	1    8750 1450
	1    0    0    -1  
$EndComp
Text Notes 9400 1100 0    60   ~ 0
No term resistors pads on Logic board.\nHigh-Z via en signals when unused.\n
Text Notes 7350 6700 0    100  ~ 20
*** THIS SHEET LIVES BETWEEN -1.6V AND 1.6V
$Comp
L +1.6V #PWR041
U 1 1 54494AC7
P 7850 1200
F 0 "#PWR041" H 7850 1340 20  0001 C CNN
F 1 "+1.6V" H 7850 1310 30  0000 C CNN
F 2 "" H 7850 1200 60  0001 C CNN
F 3 "" H 7850 1200 60  0001 C CNN
	1    7850 1200
	1    0    0    -1  
$EndComp
$Comp
L -1.6V #PWR042
U 1 1 5449525B
P 7950 3600
F 0 "#PWR042" H 7950 3740 20  0001 C CNN
F 1 "-1.6V" H 7950 3710 30  0000 C CNN
F 2 "" H 7950 3600 60  0001 C CNN
F 3 "" H 7950 3600 60  0001 C CNN
	1    7950 3600
	1    0    0    -1  
$EndComp
Entry Wire Line
	9300 1950 9400 1850
Entry Wire Line
	9600 2050 9700 1950
Entry Wire Line
	9300 2250 9400 2150
Entry Wire Line
	9600 2350 9700 2250
Entry Wire Line
	9300 2550 9400 2450
Entry Wire Line
	9600 2650 9700 2550
Entry Wire Line
	9600 5500 9700 5400
Entry Wire Line
	9300 5400 9400 5300
Entry Wire Line
	9300 5100 9400 5000
Entry Wire Line
	9600 5200 9700 5100
Entry Wire Line
	9300 4800 9400 4700
Entry Wire Line
	9600 4900 9700 4800
Entry Wire Line
	9600 4600 9700 4500
Entry Wire Line
	9300 4500 9400 4400
Entry Wire Line
	9300 2850 9400 2750
Entry Wire Line
	9600 2950 9700 2850
$Comp
L SN65LVDS389 U9
U 1 1 544EB688
P 7850 2550
F 0 "U9" H 8250 1700 60  0000 C CNN
F 1 "SN65LVDS391PW" V 7850 2550 79  0000 C CNN
F 2 "" H 7850 2550 60  0001 C CNN
F 3 "" H 7850 2550 60  0001 C CNN
	1    7850 2550
	1    0    0    -1  
$EndComp
$Comp
L C C23
U 1 1 544F30D0
P 8750 4050
F 0 "C23" V 8850 4200 50  0000 C CNN
F 1 "0.1uF" V 8850 3900 50  0000 C CNN
F 2 "" H 8750 4050 60  0001 C CNN
F 3 "" H 8750 4050 60  0001 C CNN
	1    8750 4050
	1    0    0    -1  
$EndComp
$Comp
L SN65LVDS389 U10
U 1 1 544EFA09
P 7850 5100
F 0 "U10" H 8250 4250 60  0000 C CNN
F 1 "SN65LVDS391PW" V 7850 5100 79  0000 C CNN
F 2 "" H 7850 5100 60  0001 C CNN
F 3 "" H 7850 5100 60  0001 C CNN
	1    7850 5100
	1    0    0    -1  
$EndComp
$Comp
L +1.6V #PWR043
U 1 1 544F5C03
P 7850 3800
F 0 "#PWR043" H 7850 3940 20  0001 C CNN
F 1 "+1.6V" H 7850 3910 30  0000 C CNN
F 2 "" H 7850 3800 60  0001 C CNN
F 3 "" H 7850 3800 60  0001 C CNN
	1    7850 3800
	1    0    0    -1  
$EndComp
$Comp
L -1.6V #PWR044
U 1 1 544F640F
P 7950 6150
F 0 "#PWR044" H 7950 6290 20  0001 C CNN
F 1 "-1.6V" H 7950 6260 30  0000 C CNN
F 2 "" H 7950 6150 60  0001 C CNN
F 3 "" H 7950 6150 60  0001 C CNN
	1    7950 6150
	1    0    0    -1  
$EndComp
$Sheet
S 5550 1950 600  300 
U 544FB3AB
F0 "Level shift 1" 50
F1 "sch/LevelShift.sch" 50
F2 "InB" I L 5550 2150 60 
F3 "InA" I L 5550 2050 60 
F4 "OutA" O R 6150 2050 60 
F5 "OutB" O R 6150 2150 60 
$EndSheet
$Sheet
S 5550 2550 600  300 
U 544FC061
F0 "Level shift 2" 50
F1 "sch/LevelShift.sch" 50
F2 "InB" I L 5550 2750 60 
F3 "InA" I L 5550 2650 60 
F4 "OutA" O R 6150 2650 60 
F5 "OutB" O R 6150 2750 60 
$EndSheet
$Sheet
S 5550 3000 600  300 
U 544FC510
F0 "Level shift 3" 50
F1 "sch/LevelShift.sch" 50
F2 "InB" I L 5550 3200 60 
F3 "InA" I L 5550 3100 60 
F4 "OutA" O R 6150 3100 60 
F5 "OutB" O R 6150 3200 60 
$EndSheet
$Sheet
S 5550 4500 600  300 
U 545005D7
F0 "Level shift 4" 50
F1 "sch/LevelShift.sch" 50
F2 "InB" I L 5550 4700 60 
F3 "InA" I L 5550 4600 60 
F4 "OutA" O R 6150 4600 60 
F5 "OutB" O R 6150 4700 60 
$EndSheet
$Sheet
S 5550 5100 600  300 
U 545005DD
F0 "Level shift 5" 50
F1 "sch/LevelShift.sch" 50
F2 "InB" I L 5550 5300 60 
F3 "InA" I L 5550 5200 60 
F4 "OutA" O R 6150 5200 60 
F5 "OutB" O R 6150 5300 60 
$EndSheet
$Sheet
S 5550 5550 600  300 
U 545005E3
F0 "Level shift 6" 50
F1 "sch/LevelShift.sch" 50
F2 "InB" I L 5550 5750 60 
F3 "InA" I L 5550 5650 60 
F4 "OutA" O R 6150 5650 60 
F5 "OutB" O R 6150 5750 60 
$EndSheet
Text Label 5350 2150 0    60   ~ 0
TP0
Text Label 5350 2650 0    60   ~ 0
TP1
Text Label 5350 2750 0    60   ~ 0
TP4
Text Label 5350 3100 0    60   ~ 0
TP5
Text Label 5350 4700 0    60   ~ 0
TP2
Text Label 5350 5200 0    60   ~ 0
TP3
Text Label 5350 5300 0    60   ~ 0
TP6
Text Label 5350 5650 0    60   ~ 0
TP7
Entry Wire Line
	5250 3000 5350 3100
Entry Wire Line
	5250 2250 5350 2150
Entry Wire Line
	5250 2750 5350 2650
Entry Wire Line
	5250 2850 5350 2750
Entry Wire Line
	5250 4800 5350 4700
Entry Wire Line
	5250 5100 5350 5200
Entry Wire Line
	5250 5200 5350 5300
Entry Wire Line
	5250 5550 5350 5650
Text HLabel 3850 3750 0    60   Input ~ 0
TP[7..0]
Text Label 5350 2050 0    60   ~ 0
EN0
Text Label 5350 3200 0    60   ~ 0
EN1
Text Label 5350 4600 0    60   ~ 0
EN2
Text Label 5350 5750 0    60   ~ 0
EN3
Entry Wire Line
	4600 2150 4700 2050
Entry Wire Line
	4600 3300 4700 3200
Entry Wire Line
	4600 4500 4700 4600
Entry Wire Line
	4600 5650 4700 5750
Text HLabel 3850 3850 0    60   Input ~ 0
EN[3..0]
Wire Wire Line
	2800 2050 2800 2300
Wire Wire Line
	2050 2250 2050 2150
Wire Wire Line
	3400 1650 3550 1650
Wire Wire Line
	3550 1650 3550 1750
Wire Wire Line
	3550 1750 3750 1750
Wire Wire Line
	2800 2250 4150 2250
Connection ~ 2800 2250
Connection ~ 3750 1250
Wire Wire Line
	4150 2250 4150 2000
Connection ~ 3750 2250
Wire Wire Line
	3400 1250 4250 1250
Wire Wire Line
	4150 1250 4150 1500
Connection ~ 4150 1250
Wire Wire Line
	4900 1200 4900 1250
Wire Wire Line
	2200 1250 1600 1250
Wire Wire Line
	2050 1550 2050 1650
Wire Wire Line
	2050 1650 2200 1650
Wire Wire Line
	1000 1250 1100 1250
Wire Wire Line
	4750 1250 5100 1250
Wire Wire Line
	5100 1250 5100 1200
Connection ~ 4900 1250
$Comp
L PWR_FLAG #FLG045
U 1 1 5475C819
P 5100 1200
F 0 "#FLG045" H 5100 1295 30  0001 C CNN
F 1 "PWR_FLAG" H 5100 1380 30  0000 C CNN
F 2 "" H 5100 1200 60  0001 C CNN
F 3 "" H 5100 1200 60  0001 C CNN
	1    5100 1200
	1    0    0    -1  
$EndComp
$Comp
L TPS73201QDBVRQ1 U8
U 1 1 5475C81F
P 2800 1450
F 0 "U8" H 3150 1000 60  0000 C CNN
F 1 "TPS73201QDBVRQ1" H 3300 1850 60  0000 C CNN
F 2 "" H 2800 1450 60  0001 C CNN
F 3 "" H 2800 1450 60  0001 C CNN
	1    2800 1450
	1    0    0    -1  
$EndComp
$Comp
L R R19
U 1 1 5475C825
P 3750 1500
F 0 "R19" V 3830 1500 50  0000 C CNN
F 1 "25k" V 3750 1500 50  0000 C CNN
F 2 "" H 3750 1500 60  0001 C CNN
F 3 "" H 3750 1500 60  0001 C CNN
	1    3750 1500
	1    0    0    -1  
$EndComp
$Comp
L R R20
U 1 1 5475C82B
P 3750 2000
F 0 "R20" V 3830 2000 50  0000 C CNN
F 1 "77k" V 3750 2000 50  0000 C CNN
F 2 "" H 3750 2000 60  0001 C CNN
F 3 "" H 3750 2000 60  0001 C CNN
	1    3750 2000
	1    0    0    -1  
$EndComp
$Comp
L GND #PWR046
U 1 1 5475C831
P 2800 2300
F 0 "#PWR046" H 2800 2300 30  0001 C CNN
F 1 "GND" H 2800 2230 30  0001 C CNN
F 2 "" H 2800 2300 60  0001 C CNN
F 3 "" H 2800 2300 60  0001 C CNN
	1    2800 2300
	1    0    0    -1  
$EndComp
Text Notes 1750 600  0    60   ~ 0
1.6V Regulator\nMax 250mA\nTotal: 50mA\nLVDS buf 2x 25mA
Text HLabel 1000 1250 0    60   Input ~ 0
EN1V6
$Comp
L C C21
U 1 1 5475C839
P 4150 1750
F 0 "C21" V 4250 1900 50  0000 C CNN
F 1 "0.1uF" V 4250 1600 50  0000 C CNN
F 2 "" H 4150 1750 60  0001 C CNN
F 3 "" H 4150 1750 60  0001 C CNN
	1    4150 1750
	1    0    0    -1  
$EndComp
$Comp
L +1.6V #PWR047
U 1 1 5475C83F
P 4900 1200
F 0 "#PWR047" H 4900 1340 20  0001 C CNN
F 1 "+1.6V" H 4900 1310 30  0000 C CNN
F 2 "" H 4900 1200 60  0001 C CNN
F 3 "" H 4900 1200 60  0001 C CNN
	1    4900 1200
	1    0    0    -1  
$EndComp
$Comp
L R R17
U 1 1 5475C845
P 4500 1250
F 0 "R17" V 4580 1250 50  0000 C CNN
F 1 "0.1" V 4500 1250 50  0000 C CNN
F 2 "" H 4500 1250 60  0001 C CNN
F 3 "" H 4500 1250 60  0001 C CNN
	1    4500 1250
	0    -1   -1   0   
$EndComp
$Comp
L +3.3V #PWR048
U 1 1 5475C84B
P 1600 750
F 0 "#PWR048" H 1600 710 30  0001 C CNN
F 1 "+3.3V" H 1600 860 30  0000 C CNN
F 2 "" H 1600 750 60  0001 C CNN
F 3 "" H 1600 750 60  0001 C CNN
	1    1600 750 
	1    0    0    -1  
$EndComp
$Comp
L R R18
U 1 1 5475C851
P 1600 1500
F 0 "R18" V 1680 1500 50  0000 C CNN
F 1 "1k" V 1600 1500 50  0000 C CNN
F 2 "" H 1600 1500 60  0001 C CNN
F 3 "" H 1600 1500 60  0001 C CNN
	1    1600 1500
	1    0    0    -1  
$EndComp
$Comp
L GND #PWR049
U 1 1 5475C857
P 1600 1850
F 0 "#PWR049" H 1600 1850 30  0001 C CNN
F 1 "GND" H 1600 1780 30  0001 C CNN
F 2 "" H 1600 1850 60  0001 C CNN
F 3 "" H 1600 1850 60  0001 C CNN
	1    1600 1850
	1    0    0    -1  
$EndComp
$Comp
L R R16
U 1 1 5475C85D
P 1350 1250
F 0 "R16" V 1430 1250 50  0000 C CNN
F 1 "0" V 1350 1250 50  0000 C CNN
F 2 "" H 1350 1250 60  0001 C CNN
F 3 "" H 1350 1250 60  0001 C CNN
	1    1350 1250
	0    -1   -1   0   
$EndComp
$Comp
L R R15
U 1 1 5475C863
P 1600 1000
F 0 "R15" V 1680 1000 50  0000 C CNN
F 1 "DNP" V 1600 1000 50  0000 C CNN
F 2 "" H 1600 1000 60  0001 C CNN
F 3 "" H 1600 1000 60  0001 C CNN
	1    1600 1000
	1    0    0    -1  
$EndComp
$Comp
L +3V #PWR050
U 1 1 5475C869
P 2050 1550
F 0 "#PWR050" H 2050 1690 20  0001 C CNN
F 1 "+3V" H 2050 1660 30  0000 C CNN
F 2 "" H 2050 1550 60  0001 C CNN
F 3 "" H 2050 1550 60  0001 C CNN
	1    2050 1550
	1    0    0    -1  
$EndComp
$Comp
L C C22
U 1 1 5475C86F
P 2050 1900
F 0 "C22" V 2150 2050 50  0000 C CNN
F 1 "0.1uF" V 2150 1750 50  0000 C CNN
F 2 "" H 2050 1900 60  0001 C CNN
F 3 "" H 2050 1900 60  0001 C CNN
	1    2050 1900
	1    0    0    -1  
$EndComp
$Comp
L GND #PWR051
U 1 1 5475C875
P 2050 2250
F 0 "#PWR051" H 2050 2250 30  0001 C CNN
F 1 "GND" H 2050 2180 30  0001 C CNN
F 2 "" H 2050 2250 60  0001 C CNN
F 3 "" H 2050 2250 60  0001 C CNN
	1    2050 2250
	1    0    0    -1  
$EndComp
Wire Wire Line
	1600 1750 1600 1850
Wire Wire Line
	7850 6150 7850 6200
Wire Wire Line
	7650 6200 7950 6200
Wire Wire Line
	7950 6200 7950 6150
Wire Wire Line
	7850 3600 7850 3650
Wire Wire Line
	7650 3650 7950 3650
Wire Wire Line
	7950 3650 7950 3600
Wire Wire Line
	2600 6300 2600 6100
Wire Wire Line
	2800 6300 2800 6100
Wire Wire Line
	3400 6700 3550 6700
Wire Wire Line
	3550 6700 3550 6600
Wire Wire Line
	3550 6600 3750 6600
Wire Wire Line
	2600 6100 4150 6100
Connection ~ 2800 6100
Wire Wire Line
	4150 7100 4150 6850
Connection ~ 3750 7100
Wire Wire Line
	4150 6100 4150 6350
Connection ~ 3750 6100
Wire Wire Line
	1600 6700 2200 6700
Wire Wire Line
	1100 6700 950  6700
Connection ~ 4150 7100
Wire Wire Line
	3400 7100 4350 7100
Wire Wire Line
	4900 7100 4900 7050
Wire Wire Line
	2050 7650 2050 7700
Wire Wire Line
	2050 7000 2050 7150
Wire Wire Line
	2200 7100 2050 7100
Connection ~ 2050 7100
Wire Wire Line
	1600 7200 1600 7250
Wire Wire Line
	4850 7100 5150 7100
Wire Wire Line
	5150 7100 5150 7050
Connection ~ 4900 7100
$Comp
L PWR_FLAG #FLG052
U 1 1 547660DE
P 5150 7050
F 0 "#FLG052" H 5150 7145 30  0001 C CNN
F 1 "PWR_FLAG" H 5150 7230 30  0000 C CNN
F 2 "" H 5150 7050 60  0001 C CNN
F 3 "" H 5150 7050 60  0001 C CNN
	1    5150 7050
	1    0    0    -1  
$EndComp
Text Notes 1700 5950 0    60   ~ 0
-1.6V Regulator\nMax 200mA\nTotal: 80mA\nLVDS buf 2x 25mA\nLVDS en 4x 7mA\n
$Comp
L TPS72301DBVR U11
U 1 1 547660E5
P 2800 6900
F 0 "U11" H 3150 6450 60  0000 C CNN
F 1 "TPS72301DBVR" H 3300 7300 60  0000 C CNN
F 2 "" H 2800 6900 60  0001 C CNN
F 3 "" H 2800 6900 60  0001 C CNN
	1    2800 6900
	1    0    0    -1  
$EndComp
$Comp
L R R25
U 1 1 547660EB
P 1600 6950
F 0 "R25" V 1680 6950 50  0000 C CNN
F 1 "1k" V 1600 6950 50  0000 C CNN
F 2 "" H 1600 6950 60  0001 C CNN
F 3 "" H 1600 6950 60  0001 C CNN
	1    1600 6950
	1    0    0    -1  
$EndComp
Text HLabel 950  6700 0    60   Input ~ 0
EN-1V6
$Comp
L GND #PWR053
U 1 1 547660F2
P 1600 7250
F 0 "#PWR053" H 1600 7250 30  0001 C CNN
F 1 "GND" H 1600 7180 30  0001 C CNN
F 2 "" H 1600 7250 60  0001 C CNN
F 3 "" H 1600 7250 60  0001 C CNN
	1    1600 7250
	1    0    0    -1  
$EndComp
$Comp
L GND #PWR054
U 1 1 547660F8
P 2600 6300
F 0 "#PWR054" H 2600 6300 30  0001 C CNN
F 1 "GND" H 2600 6230 30  0001 C CNN
F 2 "" H 2600 6300 60  0001 C CNN
F 3 "" H 2600 6300 60  0001 C CNN
	1    2600 6300
	1    0    0    -1  
$EndComp
$Comp
L R R24
U 1 1 547660FE
P 3750 6850
F 0 "R24" V 3830 6850 50  0000 C CNN
F 1 "26.1k" V 3750 6850 50  0000 C CNN
F 2 "" H 3750 6850 60  0001 C CNN
F 3 "" H 3750 6850 60  0001 C CNN
	1    3750 6850
	1    0    0    -1  
$EndComp
$Comp
L R R21
U 1 1 54766104
P 3750 6350
F 0 "R21" V 3830 6350 50  0000 C CNN
F 1 "73.2k" V 3750 6350 50  0000 C CNN
F 2 "" H 3750 6350 60  0001 C CNN
F 3 "" H 3750 6350 60  0001 C CNN
	1    3750 6350
	1    0    0    -1  
$EndComp
$Comp
L R R22
U 1 1 5476610A
P 1600 6450
F 0 "R22" V 1680 6450 50  0000 C CNN
F 1 "DNP" V 1600 6450 50  0000 C CNN
F 2 "" H 1600 6450 60  0001 C CNN
F 3 "" H 1600 6450 60  0001 C CNN
	1    1600 6450
	1    0    0    -1  
$EndComp
$Comp
L +3.3V #PWR055
U 1 1 54766110
P 1600 6200
F 0 "#PWR055" H 1600 6160 30  0001 C CNN
F 1 "+3.3V" H 1600 6310 30  0000 C CNN
F 2 "" H 1600 6200 60  0001 C CNN
F 3 "" H 1600 6200 60  0001 C CNN
	1    1600 6200
	1    0    0    -1  
$EndComp
$Comp
L C C24
U 1 1 54766116
P 4150 6600
F 0 "C24" V 4250 6750 50  0000 C CNN
F 1 "2.2uF" V 4250 6450 50  0000 C CNN
F 2 "" H 4150 6600 60  0001 C CNN
F 3 "" H 4150 6600 60  0001 C CNN
	1    4150 6600
	1    0    0    -1  
$EndComp
$Comp
L R R23
U 1 1 5476611C
P 1350 6700
F 0 "R23" V 1430 6700 50  0000 C CNN
F 1 "0" V 1350 6700 50  0000 C CNN
F 2 "" H 1350 6700 60  0001 C CNN
F 3 "" H 1350 6700 60  0001 C CNN
	1    1350 6700
	0    -1   -1   0   
$EndComp
$Comp
L -1.6V #PWR056
U 1 1 54766122
P 4900 7050
F 0 "#PWR056" H 4900 7190 20  0001 C CNN
F 1 "-1.6V" H 4900 7160 30  0000 C CNN
F 2 "" H 4900 7050 60  0001 C CNN
F 3 "" H 4900 7050 60  0001 C CNN
	1    4900 7050
	1    0    0    -1  
$EndComp
$Comp
L R R26
U 1 1 54766128
P 4600 7100
F 0 "R26" V 4680 7100 50  0000 C CNN
F 1 "0.1" V 4600 7100 50  0000 C CNN
F 2 "" H 4600 7100 60  0001 C CNN
F 3 "" H 4600 7100 60  0001 C CNN
	1    4600 7100
	0    -1   -1   0   
$EndComp
$Comp
L -3V #PWR057
U 1 1 5476612E
P 2050 7000
F 0 "#PWR057" H 2050 7140 20  0001 C CNN
F 1 "-3V" H 2050 7110 30  0000 C CNN
F 2 "" H 2050 7000 60  0001 C CNN
F 3 "" H 2050 7000 60  0001 C CNN
	1    2050 7000
	1    0    0    -1  
$EndComp
$Comp
L C C25
U 1 1 54766134
P 2050 7400
F 0 "C25" V 2150 7550 50  0000 C CNN
F 1 "2.2uF" V 2150 7250 50  0000 C CNN
F 2 "" H 2050 7400 60  0001 C CNN
F 3 "" H 2050 7400 60  0001 C CNN
	1    2050 7400
	1    0    0    -1  
$EndComp
$Comp
L GND #PWR058
U 1 1 5476613A
P 2050 7700
F 0 "#PWR058" H 2050 7700 30  0001 C CNN
F 1 "GND" H 2050 7630 30  0001 C CNN
F 2 "" H 2050 7700 60  0001 C CNN
F 3 "" H 2050 7700 60  0001 C CNN
	1    2050 7700
	1    0    0    -1  
$EndComp
Wire Bus Line
	5250 2250 5250 5550
Wire Bus Line
	4600 2150 4600 5650
Wire Bus Line
	3850 3850 4600 3850
Wire Bus Line
	3850 3750 5250 3750
Wire Wire Line
	6150 2050 6800 2050
Wire Wire Line
	6800 2050 6800 3100
Wire Wire Line
	6800 3100 7000 3100
Wire Wire Line
	6150 3200 7000 3200
Wire Wire Line
	6150 3100 6650 3100
Wire Wire Line
	6650 3100 6650 2850
Wire Wire Line
	6650 2850 7000 2850
Wire Wire Line
	6150 2750 6650 2750
Wire Wire Line
	6650 2750 6650 2550
Wire Wire Line
	6650 2550 7000 2550
Wire Wire Line
	6150 2650 6500 2650
Wire Wire Line
	6500 2650 6500 2250
Wire Wire Line
	6500 2250 7000 2250
Wire Wire Line
	6150 2150 6500 2150
Wire Wire Line
	6500 2150 6500 1950
Wire Wire Line
	6500 1950 7000 1950
Wire Wire Line
	6150 4600 6800 4600
Wire Wire Line
	6800 4600 6800 5650
Wire Wire Line
	6800 5650 7000 5650
Wire Wire Line
	6150 5750 7000 5750
Wire Wire Line
	6150 5650 6650 5650
Wire Wire Line
	6650 5650 6650 5400
Wire Wire Line
	6650 5400 7000 5400
Wire Wire Line
	6150 5300 6650 5300
Wire Wire Line
	6650 5300 6650 5100
Wire Wire Line
	6650 5100 7000 5100
Wire Wire Line
	6150 5200 6500 5200
Wire Wire Line
	6500 5200 6500 4800
Wire Wire Line
	6500 4800 7000 4800
Wire Wire Line
	6150 4700 6500 4700
Wire Wire Line
	6500 4700 6500 4500
Wire Wire Line
	6500 4500 7000 4500
$Comp
L C C100
U 1 1 54B83655
P 7400 3650
F 0 "C100" V 7500 3800 50  0000 C CNN
F 1 "0.1uF" V 7500 3500 50  0000 C CNN
F 2 "" H 7400 3650 60  0001 C CNN
F 3 "" H 7400 3650 60  0001 C CNN
	1    7400 3650
	0    -1   -1   0   
$EndComp
$Comp
L C C101
U 1 1 54B83B70
P 7400 6200
F 0 "C101" V 7500 6350 50  0000 C CNN
F 1 "0.1uF" V 7500 6050 50  0000 C CNN
F 2 "" H 7400 6200 60  0001 C CNN
F 3 "" H 7400 6200 60  0001 C CNN
	1    7400 6200
	0    -1   -1   0   
$EndComp
Connection ~ 7850 6200
$Comp
L GND #PWR059
U 1 1 54B84504
P 7100 6300
F 0 "#PWR059" H 7100 6300 30  0001 C CNN
F 1 "GND" H 7100 6230 30  0001 C CNN
F 2 "" H 7100 6300 60  0000 C CNN
F 3 "" H 7100 6300 60  0000 C CNN
	1    7100 6300
	1    0    0    -1  
$EndComp
Wire Wire Line
	7100 6300 7100 6200
Wire Wire Line
	7100 6200 7150 6200
$Comp
L GND #PWR060
U 1 1 54B84B87
P 8750 4350
F 0 "#PWR060" H 8750 4350 30  0001 C CNN
F 1 "GND" H 8750 4280 30  0001 C CNN
F 2 "" H 8750 4350 60  0000 C CNN
F 3 "" H 8750 4350 60  0000 C CNN
	1    8750 4350
	1    0    0    -1  
$EndComp
$Comp
L GND #PWR061
U 1 1 54B84E6B
P 8750 1800
F 0 "#PWR061" H 8750 1800 30  0001 C CNN
F 1 "GND" H 8750 1730 30  0001 C CNN
F 2 "" H 8750 1800 60  0000 C CNN
F 3 "" H 8750 1800 60  0000 C CNN
	1    8750 1800
	1    0    0    -1  
$EndComp
$Comp
L GND #PWR062
U 1 1 54B852FF
P 7100 3700
F 0 "#PWR062" H 7100 3700 30  0001 C CNN
F 1 "GND" H 7100 3630 30  0001 C CNN
F 2 "" H 7100 3700 60  0000 C CNN
F 3 "" H 7100 3700 60  0000 C CNN
	1    7100 3700
	1    0    0    -1  
$EndComp
Wire Wire Line
	7100 3700 7100 3650
Wire Wire Line
	7100 3650 7150 3650
Connection ~ 7850 3650
$EndSCHEMATC
