EESchema Schematic File Version 2
LIBS:sn65hvd3083edgsr
LIBS:conn
LIBS:power
LIBS:pspice
LIBS:zl40216
LIBS:sfp
LIBS:FIN1108
LIBS:sn65lvds389
LIBS:max5825baup
LIBS:tps72301dbvr
LIBS:ina195a
LIBS:tps78630kttt
LIBS:tps73501drbt
LIBS:lt3015eq
LIBS:lt1086cm-3
LIBS:tps72012drvt
LIBS:ina202a
LIBS:transistors
LIBS:2sk3019
LIBS:sn74hc05d
LIBS:ad7998
LIBS:ao3401a
LIBS:opa703
LIBS:6slx45fgg484pkg
LIBS:ERM8-RA
LIBS:cdclvd1204
LIBS:sy89835u
LIBS:zl40212
LIBS:opa4703ea
LIBS:tps73201qdbvrq1
LIBS:m25p32
LIBS:bav99
LIBS:si590
LIBS:iso7242c
LIBS:lmk00304
LIBS:pins_14x2
LIBS:ds18b20u
LIBS:2x14_conn
LIBS:led
LIBS:LogicBoard-cache
EELAYER 24 0
EELAYER END
$Descr A4 11693 8268
encoding utf-8
Sheet 2 23
Title ""
Date "1 dec 2015"
Rev ""
Comp ""
Comment1 ""
Comment2 ""
Comment3 ""
Comment4 ""
$EndDescr
Wire Wire Line
	7550 2550 6950 2550
Wire Bus Line
	3800 3150 4400 3150
Wire Bus Line
	3800 2950 4400 2950
Wire Wire Line
	4500 3250 4900 3250
Wire Wire Line
	4500 3050 4900 3050
Wire Wire Line
	7350 2850 6950 2850
Wire Wire Line
	7350 1350 6950 1350
Wire Wire Line
	7350 1450 6950 1450
Wire Wire Line
	7350 2950 6950 2950
Wire Wire Line
	7350 1250 6950 1250
Wire Wire Line
	7350 1150 6950 1150
Wire Wire Line
	7350 2650 6950 2650
Wire Wire Line
	4500 2650 4900 2650
Wire Wire Line
	4500 1150 4900 1150
Wire Wire Line
	4500 1250 4900 1250
Wire Wire Line
	4500 2750 4900 2750
Wire Wire Line
	4500 2950 4900 2950
Wire Wire Line
	4500 1450 4900 1450
Wire Wire Line
	4900 1550 4200 1550
Wire Wire Line
	4900 1750 4200 1750
Wire Wire Line
	4900 1950 4150 1950
Wire Wire Line
	4900 2150 4150 2150
Wire Wire Line
	7700 1850 6950 1850
Wire Wire Line
	7700 1650 6950 1650
Wire Wire Line
	6950 1950 7700 1950
Wire Wire Line
	6950 2150 7700 2150
Wire Wire Line
	4150 2450 4900 2450
Wire Wire Line
	4150 2550 4900 2550
Wire Wire Line
	4900 4350 4500 4350
Wire Wire Line
	4900 4450 4500 4450
Wire Wire Line
	4500 4550 4900 4550
Wire Wire Line
	4900 4650 4500 4650
Wire Wire Line
	6950 4350 7050 4350
Wire Wire Line
	6950 4450 7050 4450
Wire Wire Line
	6950 4550 7050 4550
Wire Wire Line
	6950 4650 7050 4650
Wire Wire Line
	4500 4750 4900 4750
Wire Wire Line
	4500 4850 4900 4850
Wire Wire Line
	4500 4950 4900 4950
Wire Wire Line
	4500 5050 4900 5050
Wire Wire Line
	6950 5050 7050 5050
Wire Wire Line
	6950 4950 7050 4950
Wire Wire Line
	6950 4850 7050 4850
Wire Wire Line
	6950 4750 7050 4750
Wire Bus Line
	4100 1400 3850 1400
Wire Bus Line
	4050 1800 4050 2150
Wire Bus Line
	4050 1800 3800 1800
Wire Bus Line
	7800 1800 7800 2150
Wire Bus Line
	7800 1800 8050 1800
Wire Bus Line
	7800 1400 7800 1750
Wire Bus Line
	7800 1400 8050 1400
Wire Wire Line
	6950 5650 7450 5650
Wire Wire Line
	7100 5650 7100 6050
Wire Wire Line
	7100 5850 6950 5850
Connection ~ 7100 5650
Wire Wire Line
	7100 5750 6950 5750
Connection ~ 7100 5750
Connection ~ 7100 5950
Wire Wire Line
	7100 6050 6950 6050
Wire Wire Line
	4400 3450 4900 3450
Wire Wire Line
	4750 3650 4900 3650
Connection ~ 4750 3450
Wire Wire Line
	4750 3550 4900 3550
Connection ~ 4750 3550
Wire Wire Line
	4400 3450 4400 3500
Wire Wire Line
	6950 5250 7450 5250
Wire Wire Line
	7100 5250 7100 5550
Wire Wire Line
	7100 5550 6950 5550
Connection ~ 7100 5250
Wire Wire Line
	7100 5350 6950 5350
Connection ~ 7100 5350
Wire Wire Line
	7100 5450 6950 5450
Connection ~ 7100 5450
Wire Wire Line
	4400 3850 4900 3850
Wire Wire Line
	4750 3850 4750 4150
Wire Wire Line
	4750 4050 4900 4050
Connection ~ 4750 3850
Wire Wire Line
	4750 3950 4900 3950
Connection ~ 4750 3950
Wire Wire Line
	4400 3850 4400 3900
Wire Wire Line
	4750 4150 4900 4150
Connection ~ 4750 4050
Wire Wire Line
	7450 4150 6950 4150
Wire Wire Line
	7450 4050 6950 4050
Wire Wire Line
	7450 3950 6950 3950
Wire Wire Line
	7450 3850 6950 3850
Wire Bus Line
	7550 3750 7800 3750
Wire Wire Line
	7450 3750 6950 3750
Wire Wire Line
	7450 3650 6950 3650
Wire Wire Line
	7450 3550 6950 3550
Wire Wire Line
	7450 3450 6950 3450
Wire Bus Line
	7550 3300 7550 3650
Wire Bus Line
	7550 3300 7800 3300
Wire Wire Line
	4400 5250 4900 5250
Wire Wire Line
	4750 5250 4750 5550
Wire Wire Line
	4750 5450 4900 5450
Connection ~ 4750 5250
Wire Wire Line
	4750 5350 4900 5350
Connection ~ 4750 5350
Wire Wire Line
	4400 5250 4400 5300
Wire Wire Line
	4750 5550 4900 5550
Connection ~ 4750 5450
Wire Wire Line
	4400 5650 4900 5650
Wire Wire Line
	4750 5650 4750 6050
Wire Wire Line
	4750 5850 4900 5850
Connection ~ 4750 5650
Wire Wire Line
	4750 5750 4900 5750
Connection ~ 4750 5750
Wire Wire Line
	4400 5650 4400 5700
Wire Wire Line
	4750 5950 4900 5950
Connection ~ 4750 5850
Wire Wire Line
	7700 2250 6950 2250
Wire Wire Line
	6950 2050 7700 2050
Wire Wire Line
	7700 1550 6950 1550
Wire Wire Line
	7700 1750 6950 1750
Wire Wire Line
	4900 2250 4150 2250
Wire Wire Line
	4900 2050 4150 2050
Wire Wire Line
	4900 1850 4200 1850
Wire Wire Line
	4900 1650 4200 1650
Wire Wire Line
	4500 1350 4900 1350
Wire Wire Line
	4500 2850 4900 2850
Wire Wire Line
	7350 2750 6950 2750
Wire Wire Line
	6950 3350 7450 3350
Wire Wire Line
	6950 3150 7450 3150
Wire Wire Line
	6950 3050 7450 3050
Wire Wire Line
	6950 3250 7450 3250
Wire Wire Line
	4500 3150 4900 3150
Wire Wire Line
	4500 3350 4900 3350
Wire Bus Line
	3800 3050 4400 3050
Wire Bus Line
	3800 3250 4400 3250
Wire Wire Line
	6950 2450 7550 2450
Wire Wire Line
	7550 2450 7550 2600
Connection ~ 7550 2550
Wire Wire Line
	4750 3750 4900 3750
Wire Wire Line
	4750 3450 4750 3750
Connection ~ 4750 3650
Wire Bus Line
	3900 2650 4050 2650
Wire Bus Line
	4050 2650 4050 2550
$Comp
L GND #PWR06
U 1 1 54694D96
P 7650 4350
F 0 "#PWR06" H 7650 4350 30  0001 C CNN
F 1 "GND" H 7650 4280 30  0001 C CNN
F 2 "" H 7650 4350 60  0001 C CNN
F 3 "" H 7650 4350 60  0001 C CNN
	1    7650 4350
	-1   0    0    -1  
$EndComp
$Comp
L GND #PWR07
U 1 1 545FF0C8
P 7550 2600
F 0 "#PWR07" H 7550 2600 30  0001 C CNN
F 1 "GND" H 7550 2530 30  0001 C CNN
F 2 "" H 7550 2600 60  0001 C CNN
F 3 "" H 7550 2600 60  0001 C CNN
	1    7550 2600
	1    0    0    -1  
$EndComp
Entry Wire Line
	4050 2550 4150 2450
Entry Wire Line
	4050 2650 4150 2550
Text Label 4250 2550 0    60   ~ 0
TEMP1
Text Label 4250 2450 0    60   ~ 0
TEMP0
Text Label 7150 3050 0    60   ~ 0
TCK0
Text Label 7150 3150 0    60   ~ 0
TSM0
Text Label 7150 3350 0    60   ~ 0
TDO0
Text Label 7150 3250 0    60   ~ 0
TDI0
Entry Wire Line
	4400 3250 4500 3350
Entry Wire Line
	4400 3150 4500 3250
Entry Wire Line
	4400 3050 4500 3150
Entry Wire Line
	4400 2950 4500 3050
Text Label 4600 3250 0    60   ~ 0
TDI1
Text Label 4600 3350 0    60   ~ 0
TDO1
Text Label 4600 3150 0    60   ~ 0
TSM1
Text Label 4600 3050 0    60   ~ 0
TCK1
Text HLabel 3800 3250 0    60   Output ~ 0
TDO[1..0]
Text HLabel 3800 3150 0    60   Input ~ 0
TDI[1..0]
Text HLabel 3800 3050 0    60   Input ~ 0
TSM[1..0]
Text HLabel 3800 2950 0    60   Input ~ 0
TCK[1..0]
Text Label 7068 1250 0    60   ~ 0
C5_N0
Text HLabel 1350 1400 0    60   Input ~ 0
TDC_N[3..0]
Text HLabel 1350 1300 0    60   Input ~ 0
TDC_P[3..0]
Text HLabel 1350 1200 0    60   Input ~ 0
C5_N[3..0]
Text HLabel 1350 1100 0    60   Input ~ 0
C5_P[3..0]
Text Label 7070 1350 0    60   ~ 0
C5_P1
Text Label 7068 1450 0    60   ~ 0
C5_N1
Text Label 7022 2850 0    60   ~ 0
TDC_P1
Text Label 7018 2950 0    60   ~ 0
TDC_N1
Text Label 7018 2750 0    60   ~ 0
TDC_N0
Text Label 7022 2650 0    60   ~ 0
TDC_P0
Text Label 7070 1150 0    60   ~ 0
C5_P0
Text Label 4500 1150 0    60   ~ 0
C5_P2
Text Label 4500 1250 0    60   ~ 0
C5_N2
Text Label 4500 2650 0    60   ~ 0
TDC_P2
Text Label 4500 2750 0    60   ~ 0
TDC_N2
Text Label 4500 2950 0    60   ~ 0
TDC_N3
Text Label 4500 2850 0    60   ~ 0
TDC_P3
Text Label 4500 1450 0    60   ~ 0
C5_N3
Text Label 4500 1350 0    60   ~ 0
C5_P3
$Comp
L ERM8-RA P1
U 1 1 545D479C
P 5300 2350
F 0 "P1" H 5300 3650 60  0000 C CNN
F 1 "ERM8-RA" H 5950 -1450 50  0000 C CNN
F 2 "ERM8-RA" H 5300 2350 60  0001 C CNN
F 3 "" H 5300 2350 60  0001 C CNN
	1    5300 2350
	1    0    0    -1  
$EndComp
Text HLabel 3900 2650 0    60   Input ~ 0
TEMP[1..0]
Text Label 4500 4750 0    60   ~ 0
TP_P6
Text Label 4500 4850 0    60   ~ 0
TP_N6
Text Label 4500 4950 0    60   ~ 0
TP_P7
Text Label 4500 5050 0    60   ~ 0
TP_N7
Text Label 7050 4350 0    60   ~ 0
TP_P0
Text Label 7050 4450 0    60   ~ 0
TP_N0
Text Label 7050 4550 0    60   ~ 0
TP_P1
Text Label 7050 4650 0    60   ~ 0
TP_N1
Text Label 4500 4350 0    60   ~ 0
TP_P4
Text Label 4500 4450 0    60   ~ 0
TP_N4
Text Label 4500 4550 0    60   ~ 0
TP_P5
Text Label 4500 4650 0    60   ~ 0
TP_N5
Text Label 7050 4750 0    60   ~ 0
TP_P2
Text Label 7050 4850 0    60   ~ 0
TP_N2
Text Label 7050 4950 0    60   ~ 0
TP_P3
Text Label 7050 5050 0    60   ~ 0
TP_N3
Text HLabel 1350 900  0    60   Input ~ 0
TP_P[7..0]
Text HLabel 1350 1000 0    60   Input ~ 0
TP_N[7..0]
Text Label 4250 1550 0    60   ~ 0
Vref_ASDQ_C0
Text Label 4250 1650 0    60   ~ 0
Vref_ASDQ_C1
Text Label 4250 1750 0    60   ~ 0
Vref_ASDQ_C2
Text Label 4250 1850 0    60   ~ 0
Vref_ASDQ_C3
Text Label 4250 1950 0    60   ~ 0
Vref_ASDQ_D0
Text Label 4250 2050 0    60   ~ 0
Vref_ASDQ_D1
Text Label 4250 2150 0    60   ~ 0
Vref_ASDQ_D2
Text Label 4250 2250 0    60   ~ 0
Vref_ASDQ_D3
Text Label 6950 1550 0    60   ~ 0
Vref_ASDQ_A0
Text Label 6950 1650 0    60   ~ 0
Vref_ASDQ_A1
Text Label 6950 1750 0    60   ~ 0
Vref_ASDQ_A2
Text Label 6950 1850 0    60   ~ 0
Vref_ASDQ_A3
Text Label 6950 1950 0    60   ~ 0
Vref_ASDQ_B0
Text Label 6950 2050 0    60   ~ 0
Vref_ASDQ_B1
Text Label 6950 2150 0    60   ~ 0
Vref_ASDQ_B2
Text Label 6950 2250 0    60   ~ 0
Vref_ASDQ_B3
Entry Wire Line
	4100 1450 4200 1550
Entry Wire Line
	4100 1550 4200 1650
Entry Wire Line
	4100 1650 4200 1750
Entry Wire Line
	4100 1750 4200 1850
Text HLabel 3850 1400 0    60   Input ~ 0
Vref_ASDQ_C[3..0]
Entry Wire Line
	4050 1950 4150 2050
Entry Wire Line
	4050 2050 4150 2150
Entry Wire Line
	4050 2150 4150 2250
Entry Wire Line
	4050 1850 4150 1950
Text HLabel 3800 1800 0    60   Input ~ 0
Vref_ASDQ_D[3..0]
Entry Wire Line
	7800 1850 7700 1950
Entry Wire Line
	7800 1950 7700 2050
Entry Wire Line
	7800 2050 7700 2150
Entry Wire Line
	7800 2150 7700 2250
Text HLabel 8050 1800 2    60   Input ~ 0
Vref_ASDQ_B[3..0]
Entry Wire Line
	7800 1450 7700 1550
Entry Wire Line
	7800 1550 7700 1650
Entry Wire Line
	7800 1650 7700 1750
Entry Wire Line
	7800 1750 7700 1850
Text HLabel 8050 1400 2    60   Input ~ 0
Vref_ASDQ_A[3..0]
Text HLabel 7450 5650 2    60   Input ~ 0
TDCMB_V
$Comp
L GND #PWR08
U 1 1 545DA1C2
P 4400 3500
F 0 "#PWR08" H 4400 3500 30  0001 C CNN
F 1 "GND" H 4400 3430 30  0001 C CNN
F 2 "" H 4400 3500 60  0001 C CNN
F 3 "" H 4400 3500 60  0001 C CNN
	1    4400 3500
	-1   0    0    -1  
$EndComp
Text HLabel 7450 5250 2    60   Input ~ 0
ASDQ_1V4
$Comp
L GND #PWR09
U 1 1 545DA62A
P 4400 3900
F 0 "#PWR09" H 4400 3900 30  0001 C CNN
F 1 "GND" H 4400 3830 30  0001 C CNN
F 2 "" H 4400 3900 60  0001 C CNN
F 3 "" H 4400 3900 60  0001 C CNN
	1    4400 3900
	-1   0    0    -1  
$EndComp
Text Label 7350 3850 2    60   ~ 0
ASDQ_3V3
Text Label 7350 3950 2    60   ~ 0
ASDQ_3V2
Text Label 7350 4050 2    60   ~ 0
ASDQ_3V1
Text Label 7350 4150 2    60   ~ 0
ASDQ_3V0
Entry Wire Line
	7550 3750 7450 3850
Entry Wire Line
	7550 3850 7450 3950
Entry Wire Line
	7550 3950 7450 4050
Entry Wire Line
	7550 4050 7450 4150
Text HLabel 7800 3750 2    60   Input ~ 0
ASDQ_3V[3..0]
Text Label 7400 3450 2    60   ~ 0
ASDQ_-3V3
Text Label 7400 3550 2    60   ~ 0
ASDQ_-3V2
Text Label 7400 3650 2    60   ~ 0
ASDQ_-3V1
Text Label 7400 3750 2    60   ~ 0
ASDQ_-3V0
Entry Wire Line
	7550 3350 7450 3450
Entry Wire Line
	7550 3450 7450 3550
Entry Wire Line
	7550 3550 7450 3650
Entry Wire Line
	7550 3650 7450 3750
Text HLabel 7800 3300 2    60   Input ~ 0
ASDQ_-3V[3..0]
$Comp
L GND #PWR010
U 1 1 545DBB56
P 4400 5300
F 0 "#PWR010" H 4400 5300 30  0001 C CNN
F 1 "GND" H 4400 5230 30  0001 C CNN
F 2 "" H 4400 5300 60  0001 C CNN
F 3 "" H 4400 5300 60  0001 C CNN
	1    4400 5300
	-1   0    0    -1  
$EndComp
$Comp
L GND #PWR011
U 1 1 545DBB65
P 4400 5700
F 0 "#PWR011" H 4400 5700 30  0001 C CNN
F 1 "GND" H 4400 5630 30  0001 C CNN
F 2 "" H 4400 5700 60  0001 C CNN
F 3 "" H 4400 5700 60  0001 C CNN
	1    4400 5700
	-1   0    0    -1  
$EndComp
Wire Bus Line
	7550 3750 7550 4050
Connection ~ 7100 5850
Wire Wire Line
	6950 5950 7100 5950
Wire Bus Line
	4100 1400 4100 1750
Wire Wire Line
	4750 6050 4900 6050
Connection ~ 4750 5950
Wire Wire Line
	6950 4250 7650 4250
Wire Wire Line
	7450 4250 7450 5150
Wire Wire Line
	7450 5150 6950 5150
Wire Wire Line
	7650 4250 7650 4350
Connection ~ 7450 4250
$Comp
L GND #PWR012
U 1 1 5491FF28
P 4200 4350
F 0 "#PWR012" H 4200 4350 30  0001 C CNN
F 1 "GND" H 4200 4280 30  0001 C CNN
F 2 "" H 4200 4350 60  0001 C CNN
F 3 "" H 4200 4350 60  0001 C CNN
	1    4200 4350
	1    0    0    -1  
$EndComp
Wire Wire Line
	4200 4250 4900 4250
Wire Wire Line
	4400 4250 4400 5150
Wire Wire Line
	4400 5150 4900 5150
Wire Wire Line
	4200 4250 4200 4350
Connection ~ 4400 4250
Text HLabel 2250 2350 0    60   Input ~ 0
TDC_I2C_CLK
Text HLabel 9400 2350 2    60   BiDi ~ 0
TDC_I2C_DATA
$Comp
L R R200
U 1 1 54B57A55
P 2350 2050
F 0 "R200" V 2430 2050 50  0000 C CNN
F 1 "4k" V 2350 2050 50  0000 C CNN
F 2 "SM0402" H 2350 2050 60  0001 C CNN
F 3 "" H 2350 2050 60  0000 C CNN
	1    2350 2050
	1    0    0    -1  
$EndComp
$Comp
L R R201
U 1 1 54B57A69
P 2350 2650
F 0 "R201" V 2430 2650 50  0000 C CNN
F 1 "DNP" V 2350 2650 50  0000 C CNN
F 2 "SM0402" H 2350 2650 60  0001 C CNN
F 3 "" H 2350 2650 60  0000 C CNN
	1    2350 2650
	1    0    0    -1  
$EndComp
Wire Wire Line
	2250 2350 4900 2350
Wire Wire Line
	2350 2300 2350 2400
Connection ~ 2350 2350
$Comp
L GND #PWR013
U 1 1 54B57C92
P 2350 2950
F 0 "#PWR013" H 2350 2950 30  0001 C CNN
F 1 "GND" H 2350 2880 30  0001 C CNN
F 2 "" H 2350 2950 60  0000 C CNN
F 3 "" H 2350 2950 60  0000 C CNN
	1    2350 2950
	1    0    0    -1  
$EndComp
$Comp
L +3.3V #PWR014
U 1 1 54B57CA6
P 2350 1750
F 0 "#PWR014" H 2350 1710 30  0001 C CNN
F 1 "+3.3V" H 2350 1860 30  0000 C CNN
F 2 "" H 2350 1750 60  0000 C CNN
F 3 "" H 2350 1750 60  0000 C CNN
	1    2350 1750
	1    0    0    -1  
$EndComp
Wire Wire Line
	2350 1750 2350 1800
Wire Wire Line
	2350 2900 2350 2950
$Comp
L R R202
U 1 1 54B57DFA
P 9150 2050
F 0 "R202" V 9230 2050 50  0000 C CNN
F 1 "4k" V 9150 2050 50  0000 C CNN
F 2 "SM0402" H 9150 2050 60  0001 C CNN
F 3 "" H 9150 2050 60  0000 C CNN
	1    9150 2050
	1    0    0    -1  
$EndComp
$Comp
L R R203
U 1 1 54B57E00
P 9150 2650
F 0 "R203" V 9230 2650 50  0000 C CNN
F 1 "DNP" V 9150 2650 50  0000 C CNN
F 2 "SM0402" H 9150 2650 60  0001 C CNN
F 3 "" H 9150 2650 60  0000 C CNN
	1    9150 2650
	1    0    0    -1  
$EndComp
Wire Wire Line
	9150 2300 9150 2400
Connection ~ 9150 2350
$Comp
L GND #PWR015
U 1 1 54B57E09
P 9150 2950
F 0 "#PWR015" H 9150 2950 30  0001 C CNN
F 1 "GND" H 9150 2880 30  0001 C CNN
F 2 "" H 9150 2950 60  0000 C CNN
F 3 "" H 9150 2950 60  0000 C CNN
	1    9150 2950
	1    0    0    -1  
$EndComp
$Comp
L +3.3V #PWR016
U 1 1 54B57E0F
P 9150 1750
F 0 "#PWR016" H 9150 1710 30  0001 C CNN
F 1 "+3.3V" H 9150 1860 30  0000 C CNN
F 2 "" H 9150 1750 60  0000 C CNN
F 3 "" H 9150 1750 60  0000 C CNN
	1    9150 1750
	1    0    0    -1  
$EndComp
Wire Wire Line
	9150 1750 9150 1800
Wire Wire Line
	9150 2900 9150 2950
Wire Wire Line
	6950 2350 9400 2350
$EndSCHEMATC
