PCBNEW-LibModule-V1  Wed 09 Jul 2014 11:10:30 AM EDT
# encoding utf-8
Units mm
$INDEX
XC6SLX45
$EndINDEX
$MODULE XC6SLX45
Po 0 0 0 15 53BD5B52 00000000 ~~
Li XC6SLX45
Sc 0
AR /53695EA9/536966F3
Op 0 0 0
At SMD
T0 0 -0.381 0.508 0.508 0 0.1016 N V 25 N "U7"
T1 0 0.381 0.508 0.508 0 0.1016 N I 25 N "XC6SLX45-2FGG484C"
DS 21.99894 -0.99822 21.99894 21.99894 0.127 21
DS 21.99894 21.99894 -0.99822 21.99894 0.127 21
DS -0.99822 21.99894 -0.99822 -0.99822 0.127 21
DS -0.99822 -0.99822 21.99894 -0.99822 0.127 21
DS 21.99894 -0.99822 21.99894 21.99894 0.127 21
DS 21.99894 21.99894 -0.99822 21.99894 0.127 21
DS -0.99822 21.99894 -0.99822 -0.99822 0.127 21
DS -0.99822 -0.99822 21.99894 -0.99822 0.127 21
DS 21.99894 -0.99822 21.99894 21.99894 0.127 21
DS 21.99894 21.99894 -0.99822 21.99894 0.127 21
DS -0.99822 21.99894 -0.99822 -0.99822 0.127 21
DS -0.99822 -0.99822 21.99894 -0.99822 0.127 21
DS 21.99894 -0.99822 21.99894 21.99894 0.127 21
DS 21.99894 21.99894 -0.99822 21.99894 0.127 21
DS -0.99822 21.99894 -0.99822 -0.99822 0.127 21
DS -0.99822 -0.99822 21.99894 -0.99822 0.127 21
DS 21.99894 -0.99822 21.99894 21.99894 0.127 21
DS 21.99894 21.99894 -0.99822 21.99894 0.127 21
DS -0.99822 21.99894 -0.99822 -0.99822 0.127 21
DS -0.99822 -0.99822 21.99894 -0.99822 0.127 21
DS 21.99894 -0.99822 21.99894 21.99894 0.127 21
DS 21.99894 21.99894 -0.99822 21.99894 0.127 21
DS -0.99822 21.99894 -0.99822 -0.99822 0.127 21
DS -0.99822 -0.99822 21.99894 -0.99822 0.127 21
DS 21.99894 -0.99822 21.99894 21.99894 0.127 21
DS 21.99894 21.99894 -0.99822 21.99894 0.127 21
DS -0.99822 21.99894 -0.99822 -0.99822 0.127 21
DS -0.99822 -0.99822 21.99894 -0.99822 0.127 21
DS 21.99894 -0.99822 21.99894 21.99894 0.127 21
DS 21.99894 21.99894 -0.99822 21.99894 0.127 21
DS -0.99822 21.99894 -0.99822 -0.99822 0.127 21
DS -0.99822 -0.99822 21.99894 -0.99822 0.127 21
DS 21.99894 -0.99822 21.99894 21.99894 0.127 21
DS 21.99894 21.99894 -0.99822 21.99894 0.127 21
DS -0.99822 21.99894 -0.99822 -0.99822 0.127 21
DS -0.99822 -0.99822 21.99894 -0.99822 0.127 21
DS 21.99894 -0.99822 21.99894 21.99894 0.127 21
DS 21.99894 21.99894 -0.99822 21.99894 0.127 21
DS -0.99822 21.99894 -0.99822 -0.99822 0.127 21
DS -0.99822 -0.99822 21.99894 -0.99822 0.127 21
DS 21.99894 -0.99822 21.99894 21.99894 0.127 21
DS 21.99894 21.99894 -0.99822 21.99894 0.127 21
DS -0.99822 21.99894 -0.99822 -0.99822 0.127 21
DS -0.99822 -0.99822 21.99894 -0.99822 0.127 21
DS 21.99894 -0.99822 21.99894 21.99894 0.127 21
DS 21.99894 21.99894 -0.99822 21.99894 0.127 21
DS -0.99822 21.99894 -0.99822 -0.99822 0.127 21
DS -0.99822 -0.99822 21.99894 -0.99822 0.127 21
DS 21.99894 -0.99822 21.99894 21.99894 0.127 21
DS 21.99894 21.99894 -0.99822 21.99894 0.127 21
DS -0.99822 21.99894 -0.99822 -0.99822 0.127 21
DS -0.99822 -0.99822 21.99894 -0.99822 0.127 21
DS 21.99894 -0.99822 21.99894 21.99894 0.127 21
DS 21.99894 21.99894 -0.99822 21.99894 0.127 21
DS -0.99822 21.99894 -0.99822 -0.99822 0.127 21
DS -0.99822 -0.99822 21.99894 -0.99822 0.127 21
DS 21.99894 -0.99822 21.99894 21.99894 0.127 21
DS 21.99894 21.99894 -0.99822 21.99894 0.127 21
DS -0.99822 21.99894 -0.99822 -0.99822 0.127 21
DS -0.99822 -0.99822 21.99894 -0.99822 0.127 21
DS 21.99894 -0.99822 21.99894 21.99894 0.127 21
DS 21.99894 21.99894 -0.99822 21.99894 0.127 21
DS -0.99822 21.99894 -0.99822 -0.99822 0.127 21
DS -0.99822 -0.99822 21.99894 -0.99822 0.127 21
DS 21.99894 -0.99822 21.99894 21.99894 0.127 21
DS 21.99894 21.99894 -0.99822 21.99894 0.127 21
DS -0.99822 21.99894 -0.99822 -0.99822 0.127 21
DS -0.99822 -0.99822 21.99894 -0.99822 0.127 21
DS 21.99894 -0.99822 21.99894 21.99894 0.127 21
DS 21.99894 21.99894 -0.99822 21.99894 0.127 21
DS -0.99822 21.99894 -0.99822 -0.99822 0.127 21
DS -0.99822 -0.99822 21.99894 -0.99822 0.127 21
DS 21.99894 -0.99822 21.99894 21.99894 0.127 21
DS 21.99894 21.99894 -0.99822 21.99894 0.127 21
DS -0.99822 21.99894 -0.99822 -0.99822 0.127 21
DS -0.99822 -0.99822 21.99894 -0.99822 0.127 21
DS 21.99894 -0.99822 21.99894 21.99894 0.127 21
DS 21.99894 21.99894 -0.99822 21.99894 0.127 21
DS -0.99822 21.99894 -0.99822 -0.99822 0.127 21
DS -0.99822 -0.99822 21.99894 -0.99822 0.127 21
DS 21.99894 -0.99822 21.99894 21.99894 0.127 21
DS 21.99894 21.99894 -0.99822 21.99894 0.127 21
DS -0.99822 21.99894 -0.99822 -0.99822 0.127 21
DS -0.99822 -0.99822 21.99894 -0.99822 0.127 21
DS 21.99894 -0.99822 21.99894 21.99894 0.127 21
DS 21.99894 21.99894 -0.99822 21.99894 0.127 21
DS -0.99822 21.99894 -0.99822 -0.99822 0.127 21
DS -0.99822 -0.99822 21.99894 -0.99822 0.127 21
DS 0 -0.99822 -0.99822 0 0.127 21
DS 0 -0.99822 -0.99822 0 0.127 21
DS 0 -0.99822 -0.99822 0 0.127 21
DS 0 -0.99822 -0.99822 0 0.127 21
DS 0 -0.99822 -0.99822 0 0.127 21
DS 0 -0.99822 -0.99822 0 0.127 21
DS 0 -0.99822 -0.99822 0 0.127 21
DS 0 -0.99822 -0.99822 0 0.127 21
DS 0 -0.99822 -0.99822 0 0.127 21
DS 0 -0.99822 -0.99822 0 0.127 21
DS 0 -0.99822 -0.99822 0 0.127 21
DS 0 -0.99822 -0.99822 0 0.127 21
DS 0 -0.99822 -0.99822 0 0.127 21
DS 0 -0.99822 -0.99822 0 0.127 21
DS 0 -0.99822 -0.99822 0 0.127 21
DS 0 -0.99822 -0.99822 0 0.127 21
DS 0 -0.99822 -0.99822 0 0.127 21
DS 0 -0.99822 -0.99822 0 0.127 21
DS 0 -0.99822 -0.99822 0 0.127 21
DS 0 -0.99822 -0.99822 0 0.127 21
DS 0 -0.99822 -0.99822 0 0.127 21
DS 0 -0.99822 -0.99822 0 0.127 21
$PAD
Sh "A13" C 0.5 0.5 0 0 0
Dr 0 0 0
At SMD N 00888000
Ne $1 ""
Po 11.99896 0
.SolderMask 0.100076
.LocalClearance 0.0762
$EndPAD
$PAD
Sh "A14" C 0.5 0.5 0 0 0
Dr 0 0 0
At SMD N 00888000
Ne $1 ""
Po 12.99972 0
.SolderMask 0.100076
.LocalClearance 0.0762
$EndPAD
$PAD
Sh "A15" C 0.5 0.5 0 0 0
Dr 0 0 0
At SMD N 00888000
Ne $1 ""
Po 13.99794 0
.SolderMask 0.100076
.LocalClearance 0.0762
$EndPAD
$PAD
Sh "A16" C 0.5 0.5 0 0 0
Dr 0 0 0
At SMD N 00888000
Ne $1 ""
Po 14.9987 0
.SolderMask 0.100076
.LocalClearance 0.0762
$EndPAD
$PAD
Sh "A17" C 0.5 0.5 0 0 0
Dr 0 0 0
At SMD N 00888000
Ne $1 ""
Po 15.99946 0
.SolderMask 0.100076
.LocalClearance 0.0762
$EndPAD
$PAD
Sh "A18" C 0.5 0.5 0 0 0
Dr 0 0 0
At SMD N 00888000
Ne $1 ""
Po 16.99768 0
.SolderMask 0.100076
.LocalClearance 0.0762
$EndPAD
$PAD
Sh "A19" C 0.5 0.5 0 0 0
Dr 0 0 0
At SMD N 00888000
Ne $1 ""
Po 17.99844 0
.SolderMask 0.100076
.LocalClearance 0.0762
$EndPAD
$PAD
Sh "A20" C 0.5 0.5 0 0 0
Dr 0 0 0
At SMD N 00888000
Ne $1 ""
Po 18.9992 0
.SolderMask 0.100076
.LocalClearance 0.0762
$EndPAD
$PAD
Sh "A21" C 0.5 0.5 0 0 0
Dr 0 0 0
At SMD N 00888000
Ne $1 ""
Po 19.99742 0
.SolderMask 0.100076
.LocalClearance 0.0762
$EndPAD
$PAD
Sh "A22" C 0.5 0.5 0 0 0
Dr 0 0 0
At SMD N 00888000
Ne $1 ""
Po 20.99818 0
.SolderMask 0.100076
.LocalClearance 0.0762
$EndPAD
$PAD
Sh "A1" C 0.5 0.5 0 0 0
Dr 0 0 0
At SMD N 00888000
Ne $1 ""
Po 0 0
.SolderMask 0.100076
.LocalClearance 0.100076
$EndPAD
$PAD
Sh "A2" C 0.5 0.5 0 0 0
Dr 0 0 0
At SMD N 00888000
Ne $1 ""
Po 0.99822 0
.SolderMask 0.100076
.LocalClearance 0.0762
$EndPAD
$PAD
Sh "A3" C 0.5 0.5 0 0 0
Dr 0 0 0
At SMD N 00888000
Ne $1 ""
Po 1.99898 0
.SolderMask 0.100076
.LocalClearance 0.0762
$EndPAD
$PAD
Sh "A4" C 0.5 0.5 0 0 0
Dr 0 0 0
At SMD N 00888000
Ne $1 ""
Po 2.9972 0
.SolderMask 0.100076
.LocalClearance 0.0762
$EndPAD
$PAD
Sh "A5" C 0.5 0.5 0 0 0
Dr 0 0 0
At SMD N 00888000
Ne $1 ""
Po 3.99796 0
.SolderMask 0.100076
.LocalClearance 0.0762
$EndPAD
$PAD
Sh "A6" C 0.5 0.5 0 0 0
Dr 0 0 0
At SMD N 00888000
Ne $1 ""
Po 4.99872 0
.SolderMask 0.100076
.LocalClearance 0.0762
$EndPAD
$PAD
Sh "A7" C 0.5 0.5 0 0 0
Dr 0 0 0
At SMD N 00888000
Ne $1 ""
Po 5.99948 0
.SolderMask 0.100076
.LocalClearance 0.0762
$EndPAD
$PAD
Sh "A8" C 0.5 0.5 0 0 0
Dr 0 0 0
At SMD N 00888000
Ne $1 ""
Po 6.9977 0
.SolderMask 0.100076
.LocalClearance 0.0762
$EndPAD
$PAD
Sh "A9" C 0.5 0.5 0 0 0
Dr 0 0 0
At SMD N 00888000
Ne $1 ""
Po 7.99846 0
.SolderMask 0.100076
.LocalClearance 0.0762
$EndPAD
$PAD
Sh "A10" C 0.5 0.5 0 0 0
Dr 0 0 0
At SMD N 00888000
Ne $1 ""
Po 8.99922 0
.SolderMask 0.100076
.LocalClearance 0.0762
$EndPAD
$PAD
Sh "A11" C 0.5 0.5 0 0 0
Dr 0 0 0
At SMD N 00888000
Ne $1 ""
Po 9.99744 0
.SolderMask 0.100076
.LocalClearance 0.0762
$EndPAD
$PAD
Sh "A12" C 0.5 0.5 0 0 0
Dr 0 0 0
At SMD N 00888000
Ne $1 ""
Po 10.9982 0
.SolderMask 0.100076
.LocalClearance 0.0762
$EndPAD
$PAD
Sh "B13" C 0.5 0.5 0 0 0
Dr 0 0 0
At SMD N 00888000
Ne $1 ""
Po 11.99896 0.99822
.SolderMask 0.100076
.LocalClearance 0.0762
$EndPAD
$PAD
Sh "B14" C 0.5 0.5 0 0 0
Dr 0 0 0
At SMD N 00888000
Ne $1 ""
Po 12.99972 0.99822
.SolderMask 0.100076
.LocalClearance 0.0762
$EndPAD
$PAD
Sh "B15" C 0.5 0.5 0 0 0
Dr 0 0 0
At SMD N 00888000
Ne $1 ""
Po 13.99794 0.99822
.SolderMask 0.100076
.LocalClearance 0.0762
$EndPAD
$PAD
Sh "B16" C 0.5 0.5 0 0 0
Dr 0 0 0
At SMD N 00888000
Ne $1 ""
Po 14.9987 0.99822
.SolderMask 0.100076
.LocalClearance 0.0762
$EndPAD
$PAD
Sh "B17" C 0.5 0.5 0 0 0
Dr 0 0 0
At SMD N 00888000
Ne $1 ""
Po 15.99946 0.99822
.SolderMask 0.100076
.LocalClearance 0.0762
$EndPAD
$PAD
Sh "B18" C 0.5 0.5 0 0 0
Dr 0 0 0
At SMD N 00888000
Ne $1 ""
Po 16.99768 0.99822
.SolderMask 0.100076
.LocalClearance 0.0762
$EndPAD
$PAD
Sh "B19" C 0.5 0.5 0 0 0
Dr 0 0 0
At SMD N 00888000
Ne $1 ""
Po 17.99844 0.99822
.SolderMask 0.100076
.LocalClearance 0.0762
$EndPAD
$PAD
Sh "B20" C 0.5 0.5 0 0 0
Dr 0 0 0
At SMD N 00888000
Ne $1 ""
Po 18.9992 0.99822
.SolderMask 0.100076
.LocalClearance 0.0762
$EndPAD
$PAD
Sh "B21" C 0.5 0.5 0 0 0
Dr 0 0 0
At SMD N 00888000
Ne $1 ""
Po 19.99742 0.99822
.SolderMask 0.100076
.LocalClearance 0.0762
$EndPAD
$PAD
Sh "B22" C 0.5 0.5 0 0 0
Dr 0 0 0
At SMD N 00888000
Ne $1 ""
Po 20.99818 0.99822
.SolderMask 0.100076
.LocalClearance 0.0762
$EndPAD
$PAD
Sh "B1" C 0.5 0.5 0 0 0
Dr 0 0 0
At SMD N 00888000
Ne $1 ""
Po 0 0.99822
.SolderMask 0.100076
.LocalClearance 0.0762
$EndPAD
$PAD
Sh "B2" C 0.5 0.5 0 0 0
Dr 0 0 0
At SMD N 00888000
Ne $1 ""
Po 0.99822 0.99822
.SolderMask 0.100076
.LocalClearance 0.0762
$EndPAD
$PAD
Sh "B3" C 0.5 0.5 0 0 0
Dr 0 0 0
At SMD N 00888000
Ne $1 ""
Po 1.99898 0.99822
.SolderMask 0.100076
.LocalClearance 0.0762
$EndPAD
$PAD
Sh "B4" C 0.5 0.5 0 0 0
Dr 0 0 0
At SMD N 00888000
Ne $1 ""
Po 2.9972 0.99822
.SolderMask 0.100076
.LocalClearance 0.0762
$EndPAD
$PAD
Sh "B5" C 0.5 0.5 0 0 0
Dr 0 0 0
At SMD N 00888000
Ne $1 ""
Po 3.99796 0.99822
.SolderMask 0.100076
.LocalClearance 0.0762
$EndPAD
$PAD
Sh "B6" C 0.5 0.5 0 0 0
Dr 0 0 0
At SMD N 00888000
Ne $1 ""
Po 4.99872 0.99822
.SolderMask 0.100076
.LocalClearance 0.0762
$EndPAD
$PAD
Sh "B7" C 0.5 0.5 0 0 0
Dr 0 0 0
At SMD N 00888000
Ne $1 ""
Po 5.99948 0.99822
.SolderMask 0.100076
.LocalClearance 0.0762
$EndPAD
$PAD
Sh "B8" C 0.5 0.5 0 0 0
Dr 0 0 0
At SMD N 00888000
Ne $1 ""
Po 6.9977 0.99822
.SolderMask 0.100076
.LocalClearance 0.0762
$EndPAD
$PAD
Sh "B9" C 0.5 0.5 0 0 0
Dr 0 0 0
At SMD N 00888000
Ne $1 ""
Po 7.99846 0.99822
.SolderMask 0.100076
.LocalClearance 0.0762
$EndPAD
$PAD
Sh "B10" C 0.5 0.5 0 0 0
Dr 0 0 0
At SMD N 00888000
Ne $1 ""
Po 8.99922 0.99822
.SolderMask 0.100076
.LocalClearance 0.0762
$EndPAD
$PAD
Sh "B11" C 0.5 0.5 0 0 0
Dr 0 0 0
At SMD N 00888000
Ne $1 ""
Po 9.99744 0.99822
.SolderMask 0.100076
.LocalClearance 0.0762
$EndPAD
$PAD
Sh "B12" C 0.5 0.5 0 0 0
Dr 0 0 0
At SMD N 00888000
Ne $1 ""
Po 10.9982 0.99822
.SolderMask 0.100076
.LocalClearance 0.0762
$EndPAD
$PAD
Sh "C13" C 0.5 0.5 0 0 0
Dr 0 0 0
At SMD N 00888000
Ne $1 ""
Po 11.99896 1.99898
.SolderMask 0.100076
.LocalClearance 0.0762
$EndPAD
$PAD
Sh "C14" C 0.5 0.5 0 0 0
Dr 0 0 0
At SMD N 00888000
Ne $1 ""
Po 12.99972 1.99898
.SolderMask 0.100076
.LocalClearance 0.0762
$EndPAD
$PAD
Sh "C15" C 0.5 0.5 0 0 0
Dr 0 0 0
At SMD N 00888000
Ne $1 ""
Po 13.99794 1.99898
.SolderMask 0.100076
.LocalClearance 0.0762
$EndPAD
$PAD
Sh "C16" C 0.5 0.5 0 0 0
Dr 0 0 0
At SMD N 00888000
Ne $1 ""
Po 14.9987 1.99898
.SolderMask 0.100076
.LocalClearance 0.0762
$EndPAD
$PAD
Sh "C17" C 0.5 0.5 0 0 0
Dr 0 0 0
At SMD N 00888000
Ne $1 ""
Po 15.99946 1.99898
.SolderMask 0.100076
.LocalClearance 0.0762
$EndPAD
$PAD
Sh "C18" C 0.5 0.5 0 0 0
Dr 0 0 0
At SMD N 00888000
Ne $1 ""
Po 16.99768 1.99898
.SolderMask 0.100076
.LocalClearance 0.0762
$EndPAD
$PAD
Sh "C19" C 0.5 0.5 0 0 0
Dr 0 0 0
At SMD N 00888000
Ne $1 ""
Po 17.99844 1.99898
.SolderMask 0.100076
.LocalClearance 0.0762
$EndPAD
$PAD
Sh "C20" C 0.5 0.5 0 0 0
Dr 0 0 0
At SMD N 00888000
Ne $1 ""
Po 18.9992 1.99898
.SolderMask 0.100076
.LocalClearance 0.0762
$EndPAD
$PAD
Sh "C21" C 0.5 0.5 0 0 0
Dr 0 0 0
At SMD N 00888000
Ne $1 ""
Po 19.99742 1.99898
.SolderMask 0.100076
.LocalClearance 0.0762
$EndPAD
$PAD
Sh "C22" C 0.5 0.5 0 0 0
Dr 0 0 0
At SMD N 00888000
Ne $1 ""
Po 20.99818 1.99898
.SolderMask 0.100076
.LocalClearance 0.0762
$EndPAD
$PAD
Sh "C1" C 0.5 0.5 0 0 0
Dr 0 0 0
At SMD N 00888000
Ne $1 ""
Po 0 1.99898
.SolderMask 0.100076
.LocalClearance 0.0762
$EndPAD
$PAD
Sh "C2" C 0.5 0.5 0 0 0
Dr 0 0 0
At SMD N 00888000
Ne $1 ""
Po 0.99822 1.99898
.SolderMask 0.100076
.LocalClearance 0.0762
$EndPAD
$PAD
Sh "C3" C 0.5 0.5 0 0 0
Dr 0 0 0
At SMD N 00888000
Ne $1 ""
Po 1.99898 1.99898
.SolderMask 0.100076
.LocalClearance 0.0762
$EndPAD
$PAD
Sh "C4" C 0.5 0.5 0 0 0
Dr 0 0 0
At SMD N 00888000
Ne $1 ""
Po 2.9972 1.99898
.SolderMask 0.100076
.LocalClearance 0.0762
$EndPAD
$PAD
Sh "C5" C 0.5 0.5 0 0 0
Dr 0 0 0
At SMD N 00888000
Ne $1 ""
Po 3.99796 1.99898
.SolderMask 0.100076
.LocalClearance 0.0762
$EndPAD
$PAD
Sh "C6" C 0.5 0.5 0 0 0
Dr 0 0 0
At SMD N 00888000
Ne $1 ""
Po 4.99872 1.99898
.SolderMask 0.100076
.LocalClearance 0.0762
$EndPAD
$PAD
Sh "C7" C 0.5 0.5 0 0 0
Dr 0 0 0
At SMD N 00888000
Ne $1 ""
Po 5.99948 1.99898
.SolderMask 0.100076
.LocalClearance 0.0762
$EndPAD
$PAD
Sh "C8" C 0.5 0.5 0 0 0
Dr 0 0 0
At SMD N 00888000
Ne $1 ""
Po 6.9977 1.99898
.SolderMask 0.100076
.LocalClearance 0.0762
$EndPAD
$PAD
Sh "C9" C 0.5 0.5 0 0 0
Dr 0 0 0
At SMD N 00888000
Ne $1 ""
Po 7.99846 1.99898
.SolderMask 0.100076
.LocalClearance 0.0762
$EndPAD
$PAD
Sh "C10" C 0.5 0.5 0 0 0
Dr 0 0 0
At SMD N 00888000
Ne $1 ""
Po 8.99922 1.99898
.SolderMask 0.100076
.LocalClearance 0.0762
$EndPAD
$PAD
Sh "C11" C 0.5 0.5 0 0 0
Dr 0 0 0
At SMD N 00888000
Ne $1 ""
Po 9.99744 1.99898
.SolderMask 0.100076
.LocalClearance 0.0762
$EndPAD
$PAD
Sh "C12" C 0.5 0.5 0 0 0
Dr 0 0 0
At SMD N 00888000
Ne $1 ""
Po 10.9982 1.99898
.SolderMask 0.100076
.LocalClearance 0.0762
$EndPAD
$PAD
Sh "D13" C 0.5 0.5 0 0 0
Dr 0 0 0
At SMD N 00888000
Ne $1 ""
Po 11.99896 2.9972
.SolderMask 0.100076
.LocalClearance 0.0762
$EndPAD
$PAD
Sh "D14" C 0.5 0.5 0 0 0
Dr 0 0 0
At SMD N 00888000
Ne $1 ""
Po 12.99972 2.9972
.SolderMask 0.100076
.LocalClearance 0.0762
$EndPAD
$PAD
Sh "D15" C 0.5 0.5 0 0 0
Dr 0 0 0
At SMD N 00888000
Ne $1 ""
Po 13.99794 2.9972
.SolderMask 0.100076
.LocalClearance 0.0762
$EndPAD
$PAD
Sh "D16" C 0.5 0.5 0 0 0
Dr 0 0 0
At SMD N 00888000
Ne $1 ""
Po 14.9987 2.9972
.SolderMask 0.100076
.LocalClearance 0.0762
$EndPAD
$PAD
Sh "D17" C 0.5 0.5 0 0 0
Dr 0 0 0
At SMD N 00888000
Ne $1 ""
Po 15.99946 2.9972
.SolderMask 0.100076
.LocalClearance 0.0762
$EndPAD
$PAD
Sh "D18" C 0.5 0.5 0 0 0
Dr 0 0 0
At SMD N 00888000
Ne $1 ""
Po 16.99768 2.9972
.SolderMask 0.100076
.LocalClearance 0.0762
$EndPAD
$PAD
Sh "D19" C 0.5 0.5 0 0 0
Dr 0 0 0
At SMD N 00888000
Ne $1 ""
Po 17.99844 2.9972
.SolderMask 0.100076
.LocalClearance 0.0762
$EndPAD
$PAD
Sh "D20" C 0.5 0.5 0 0 0
Dr 0 0 0
At SMD N 00888000
Ne $1 ""
Po 18.9992 2.9972
.SolderMask 0.100076
.LocalClearance 0.0762
$EndPAD
$PAD
Sh "D21" C 0.5 0.5 0 0 0
Dr 0 0 0
At SMD N 00888000
Ne $1 ""
Po 19.99742 2.9972
.SolderMask 0.100076
.LocalClearance 0.0762
$EndPAD
$PAD
Sh "D22" C 0.5 0.5 0 0 0
Dr 0 0 0
At SMD N 00888000
Ne $1 ""
Po 20.99818 2.9972
.SolderMask 0.100076
.LocalClearance 0.0762
$EndPAD
$PAD
Sh "D1" C 0.5 0.5 0 0 0
Dr 0 0 0
At SMD N 00888000
Ne $1 ""
Po 0 2.9972
.SolderMask 0.100076
.LocalClearance 0.0762
$EndPAD
$PAD
Sh "D2" C 0.5 0.5 0 0 0
Dr 0 0 0
At SMD N 00888000
Ne $1 ""
Po 0.99822 2.9972
.SolderMask 0.100076
.LocalClearance 0.0762
$EndPAD
$PAD
Sh "D3" C 0.5 0.5 0 0 0
Dr 0 0 0
At SMD N 00888000
Ne $1 ""
Po 1.99898 2.9972
.SolderMask 0.100076
.LocalClearance 0.0762
$EndPAD
$PAD
Sh "D4" C 0.5 0.5 0 0 0
Dr 0 0 0
At SMD N 00888000
Ne $1 ""
Po 2.9972 2.9972
.SolderMask 0.100076
.LocalClearance 0.0762
$EndPAD
$PAD
Sh "D5" C 0.5 0.5 0 0 0
Dr 0 0 0
At SMD N 00888000
Ne $1 ""
Po 3.99796 2.9972
.SolderMask 0.100076
.LocalClearance 0.0762
$EndPAD
$PAD
Sh "D6" C 0.5 0.5 0 0 0
Dr 0 0 0
At SMD N 00888000
Ne $1 ""
Po 4.99872 2.9972
.SolderMask 0.100076
.LocalClearance 0.0762
$EndPAD
$PAD
Sh "D7" C 0.5 0.5 0 0 0
Dr 0 0 0
At SMD N 00888000
Ne $1 ""
Po 5.99948 2.9972
.SolderMask 0.100076
.LocalClearance 0.0762
$EndPAD
$PAD
Sh "D8" C 0.5 0.5 0 0 0
Dr 0 0 0
At SMD N 00888000
Ne $1 ""
Po 6.9977 2.9972
.SolderMask 0.100076
.LocalClearance 0.0762
$EndPAD
$PAD
Sh "D9" C 0.5 0.5 0 0 0
Dr 0 0 0
At SMD N 00888000
Ne $1 ""
Po 7.99846 2.9972
.SolderMask 0.100076
.LocalClearance 0.0762
$EndPAD
$PAD
Sh "D10" C 0.5 0.5 0 0 0
Dr 0 0 0
At SMD N 00888000
Ne $1 ""
Po 8.99922 2.9972
.SolderMask 0.100076
.LocalClearance 0.0762
$EndPAD
$PAD
Sh "D11" C 0.5 0.5 0 0 0
Dr 0 0 0
At SMD N 00888000
Ne $1 ""
Po 9.99744 2.9972
.SolderMask 0.100076
.LocalClearance 0.0762
$EndPAD
$PAD
Sh "D12" C 0.5 0.5 0 0 0
Dr 0 0 0
At SMD N 00888000
Ne $1 ""
Po 10.9982 2.9972
.SolderMask 0.100076
.LocalClearance 0.0762
$EndPAD
$PAD
Sh "E13" C 0.5 0.5 0 0 0
Dr 0 0 0
At SMD N 00888000
Ne $1 ""
Po 11.99896 3.99796
.SolderMask 0.100076
.LocalClearance 0.0762
$EndPAD
$PAD
Sh "E14" C 0.5 0.5 0 0 0
Dr 0 0 0
At SMD N 00888000
Ne $1 ""
Po 12.99972 3.99796
.SolderMask 0.100076
.LocalClearance 0.0762
$EndPAD
$PAD
Sh "E15" C 0.5 0.5 0 0 0
Dr 0 0 0
At SMD N 00888000
Ne $1 ""
Po 13.99794 3.99796
.SolderMask 0.100076
.LocalClearance 0.0762
$EndPAD
$PAD
Sh "E16" C 0.5 0.5 0 0 0
Dr 0 0 0
At SMD N 00888000
Ne $1 ""
Po 14.9987 3.99796
.SolderMask 0.100076
.LocalClearance 0.0762
$EndPAD
$PAD
Sh "E17" C 0.5 0.5 0 0 0
Dr 0 0 0
At SMD N 00888000
Ne $1 ""
Po 15.99946 3.99796
.SolderMask 0.100076
.LocalClearance 0.0762
$EndPAD
$PAD
Sh "E18" C 0.5 0.5 0 0 0
Dr 0 0 0
At SMD N 00888000
Ne $1 ""
Po 16.99768 3.99796
.SolderMask 0.100076
.LocalClearance 0.0762
$EndPAD
$PAD
Sh "E19" C 0.5 0.5 0 0 0
Dr 0 0 0
At SMD N 00888000
Ne $1 ""
Po 17.99844 3.99796
.SolderMask 0.100076
.LocalClearance 0.0762
$EndPAD
$PAD
Sh "E20" C 0.5 0.5 0 0 0
Dr 0 0 0
At SMD N 00888000
Ne $1 ""
Po 18.9992 3.99796
.SolderMask 0.100076
.LocalClearance 0.0762
$EndPAD
$PAD
Sh "E21" C 0.5 0.5 0 0 0
Dr 0 0 0
At SMD N 00888000
Ne $1 ""
Po 19.99742 3.99796
.SolderMask 0.100076
.LocalClearance 0.0762
$EndPAD
$PAD
Sh "E22" C 0.5 0.5 0 0 0
Dr 0 0 0
At SMD N 00888000
Ne $1 ""
Po 20.99818 3.99796
.SolderMask 0.100076
.LocalClearance 0.0762
$EndPAD
$PAD
Sh "E1" C 0.5 0.5 0 0 0
Dr 0 0 0
At SMD N 00888000
Ne $1 ""
Po 0 3.99796
.SolderMask 0.100076
.LocalClearance 0.0762
$EndPAD
$PAD
Sh "E2" C 0.5 0.5 0 0 0
Dr 0 0 0
At SMD N 00888000
Ne $1 ""
Po 0.99822 3.99796
.SolderMask 0.100076
.LocalClearance 0.0762
$EndPAD
$PAD
Sh "E3" C 0.5 0.5 0 0 0
Dr 0 0 0
At SMD N 00888000
Ne $1 ""
Po 1.99898 3.99796
.SolderMask 0.100076
.LocalClearance 0.0762
$EndPAD
$PAD
Sh "E4" C 0.5 0.5 0 0 0
Dr 0 0 0
At SMD N 00888000
Ne $1 ""
Po 2.9972 3.99796
.SolderMask 0.100076
.LocalClearance 0.0762
$EndPAD
$PAD
Sh "E5" C 0.5 0.5 0 0 0
Dr 0 0 0
At SMD N 00888000
Ne $1 ""
Po 3.99796 3.99796
.SolderMask 0.100076
.LocalClearance 0.0762
$EndPAD
$PAD
Sh "E6" C 0.5 0.5 0 0 0
Dr 0 0 0
At SMD N 00888000
Ne $1 ""
Po 4.99872 3.99796
.SolderMask 0.100076
.LocalClearance 0.0762
$EndPAD
$PAD
Sh "E7" C 0.5 0.5 0 0 0
Dr 0 0 0
At SMD N 00888000
Ne $1 ""
Po 5.99948 3.99796
.SolderMask 0.100076
.LocalClearance 0.0762
$EndPAD
$PAD
Sh "E8" C 0.5 0.5 0 0 0
Dr 0 0 0
At SMD N 00888000
Ne $1 ""
Po 6.9977 3.99796
.SolderMask 0.100076
.LocalClearance 0.0762
$EndPAD
$PAD
Sh "E9" C 0.5 0.5 0 0 0
Dr 0 0 0
At SMD N 00888000
Ne $1 ""
Po 7.99846 3.99796
.SolderMask 0.100076
.LocalClearance 0.0762
$EndPAD
$PAD
Sh "E10" C 0.5 0.5 0 0 0
Dr 0 0 0
At SMD N 00888000
Ne $1 ""
Po 8.99922 3.99796
.SolderMask 0.100076
.LocalClearance 0.0762
$EndPAD
$PAD
Sh "E11" C 0.5 0.5 0 0 0
Dr 0 0 0
At SMD N 00888000
Ne $1 ""
Po 9.99744 3.99796
.SolderMask 0.100076
.LocalClearance 0.0762
$EndPAD
$PAD
Sh "E12" C 0.5 0.5 0 0 0
Dr 0 0 0
At SMD N 00888000
Ne $1 ""
Po 10.9982 3.99796
.SolderMask 0.100076
.LocalClearance 0.0762
$EndPAD
$PAD
Sh "F13" C 0.5 0.5 0 0 0
Dr 0 0 0
At SMD N 00888000
Ne $1 ""
Po 11.99896 4.99872
.SolderMask 0.100076
.LocalClearance 0.0762
$EndPAD
$PAD
Sh "F14" C 0.5 0.5 0 0 0
Dr 0 0 0
At SMD N 00888000
Ne $1 ""
Po 12.99972 4.99872
.SolderMask 0.100076
.LocalClearance 0.0762
$EndPAD
$PAD
Sh "F15" C 0.5 0.5 0 0 0
Dr 0 0 0
At SMD N 00888000
Ne $1 ""
Po 13.99794 4.99872
.SolderMask 0.100076
.LocalClearance 0.0762
$EndPAD
$PAD
Sh "F16" C 0.5 0.5 0 0 0
Dr 0 0 0
At SMD N 00888000
Ne $1 ""
Po 14.9987 4.99872
.SolderMask 0.100076
.LocalClearance 0.0762
$EndPAD
$PAD
Sh "F17" C 0.5 0.5 0 0 0
Dr 0 0 0
At SMD N 00888000
Ne $1 ""
Po 15.99946 4.99872
.SolderMask 0.100076
.LocalClearance 0.0762
$EndPAD
$PAD
Sh "F18" C 0.5 0.5 0 0 0
Dr 0 0 0
At SMD N 00888000
Ne $1 ""
Po 16.99768 4.99872
.SolderMask 0.100076
.LocalClearance 0.0762
$EndPAD
$PAD
Sh "F19" C 0.5 0.5 0 0 0
Dr 0 0 0
At SMD N 00888000
Ne $1 ""
Po 17.99844 4.99872
.SolderMask 0.100076
.LocalClearance 0.0762
$EndPAD
$PAD
Sh "F20" C 0.5 0.5 0 0 0
Dr 0 0 0
At SMD N 00888000
Ne $1 ""
Po 18.9992 4.99872
.SolderMask 0.100076
.LocalClearance 0.0762
$EndPAD
$PAD
Sh "F21" C 0.5 0.5 0 0 0
Dr 0 0 0
At SMD N 00888000
Ne $1 ""
Po 19.99742 4.99872
.SolderMask 0.100076
.LocalClearance 0.0762
$EndPAD
$PAD
Sh "F22" C 0.5 0.5 0 0 0
Dr 0 0 0
At SMD N 00888000
Ne $1 ""
Po 20.99818 4.99872
.SolderMask 0.100076
.LocalClearance 0.0762
$EndPAD
$PAD
Sh "F1" C 0.5 0.5 0 0 0
Dr 0 0 0
At SMD N 00888000
Ne $1 ""
Po 0 4.99872
.SolderMask 0.100076
.LocalClearance 0.0762
$EndPAD
$PAD
Sh "F2" C 0.5 0.5 0 0 0
Dr 0 0 0
At SMD N 00888000
Ne $1 ""
Po 0.99822 4.99872
.SolderMask 0.100076
.LocalClearance 0.0762
$EndPAD
$PAD
Sh "F3" C 0.5 0.5 0 0 0
Dr 0 0 0
At SMD N 00888000
Ne $1 ""
Po 1.99898 4.99872
.SolderMask 0.100076
.LocalClearance 0.0762
$EndPAD
$PAD
Sh "F4" C 0.5 0.5 0 0 0
Dr 0 0 0
At SMD N 00888000
Ne $1 ""
Po 2.9972 4.99872
.SolderMask 0.100076
.LocalClearance 0.0762
$EndPAD
$PAD
Sh "F5" C 0.5 0.5 0 0 0
Dr 0 0 0
At SMD N 00888000
Ne $1 ""
Po 3.99796 4.99872
.SolderMask 0.100076
.LocalClearance 0.0762
$EndPAD
$PAD
Sh "F6" C 0.5 0.5 0 0 0
Dr 0 0 0
At SMD N 00888000
Ne $1 ""
Po 4.99872 4.99872
.SolderMask 0.100076
.LocalClearance 0.0762
$EndPAD
$PAD
Sh "F7" C 0.5 0.5 0 0 0
Dr 0 0 0
At SMD N 00888000
Ne $1 ""
Po 5.99948 4.99872
.SolderMask 0.100076
.LocalClearance 0.0762
$EndPAD
$PAD
Sh "F8" C 0.5 0.5 0 0 0
Dr 0 0 0
At SMD N 00888000
Ne $1 ""
Po 6.9977 4.99872
.SolderMask 0.100076
.LocalClearance 0.0762
$EndPAD
$PAD
Sh "F9" C 0.5 0.5 0 0 0
Dr 0 0 0
At SMD N 00888000
Ne $1 ""
Po 7.99846 4.99872
.SolderMask 0.100076
.LocalClearance 0.0762
$EndPAD
$PAD
Sh "F10" C 0.5 0.5 0 0 0
Dr 0 0 0
At SMD N 00888000
Ne $1 ""
Po 8.99922 4.99872
.SolderMask 0.100076
.LocalClearance 0.0762
$EndPAD
$PAD
Sh "F11" C 0.5 0.5 0 0 0
Dr 0 0 0
At SMD N 00888000
Ne $1 ""
Po 9.99744 4.99872
.SolderMask 0.100076
.LocalClearance 0.0762
$EndPAD
$PAD
Sh "F12" C 0.5 0.5 0 0 0
Dr 0 0 0
At SMD N 00888000
Ne $1 ""
Po 10.9982 4.99872
.SolderMask 0.100076
.LocalClearance 0.0762
$EndPAD
$PAD
Sh "G13" C 0.5 0.5 0 0 0
Dr 0 0 0
At SMD N 00888000
Ne $1 ""
Po 11.99896 5.99948
.SolderMask 0.100076
.LocalClearance 0.0762
$EndPAD
$PAD
Sh "G14" C 0.5 0.5 0 0 0
Dr 0 0 0
At SMD N 00888000
Ne $1 ""
Po 12.99972 5.99948
.SolderMask 0.100076
.LocalClearance 0.0762
$EndPAD
$PAD
Sh "G15" C 0.5 0.5 0 0 0
Dr 0 0 0
At SMD N 00888000
Ne $1 ""
Po 13.99794 5.99948
.SolderMask 0.100076
.LocalClearance 0.0762
$EndPAD
$PAD
Sh "G16" C 0.5 0.5 0 0 0
Dr 0 0 0
At SMD N 00888000
Ne $1 ""
Po 14.9987 5.99948
.SolderMask 0.100076
.LocalClearance 0.0762
$EndPAD
$PAD
Sh "G17" C 0.5 0.5 0 0 0
Dr 0 0 0
At SMD N 00888000
Ne $1 ""
Po 15.99946 5.99948
.SolderMask 0.100076
.LocalClearance 0.0762
$EndPAD
$PAD
Sh "G18" C 0.5 0.5 0 0 0
Dr 0 0 0
At SMD N 00888000
Ne $1 ""
Po 16.99768 5.99948
.SolderMask 0.100076
.LocalClearance 0.0762
$EndPAD
$PAD
Sh "G19" C 0.5 0.5 0 0 0
Dr 0 0 0
At SMD N 00888000
Ne $1 ""
Po 17.99844 5.99948
.SolderMask 0.100076
.LocalClearance 0.0762
$EndPAD
$PAD
Sh "G20" C 0.5 0.5 0 0 0
Dr 0 0 0
At SMD N 00888000
Ne $1 ""
Po 18.9992 5.99948
.SolderMask 0.100076
.LocalClearance 0.0762
$EndPAD
$PAD
Sh "G21" C 0.5 0.5 0 0 0
Dr 0 0 0
At SMD N 00888000
Ne $1 ""
Po 19.99742 5.99948
.SolderMask 0.100076
.LocalClearance 0.0762
$EndPAD
$PAD
Sh "G22" C 0.5 0.5 0 0 0
Dr 0 0 0
At SMD N 00888000
Ne $1 ""
Po 20.99818 5.99948
.SolderMask 0.100076
.LocalClearance 0.0762
$EndPAD
$PAD
Sh "G1" C 0.5 0.5 0 0 0
Dr 0 0 0
At SMD N 00888000
Ne $1 ""
Po 0 5.99948
.SolderMask 0.100076
.LocalClearance 0.0762
$EndPAD
$PAD
Sh "G2" C 0.5 0.5 0 0 0
Dr 0 0 0
At SMD N 00888000
Ne $1 ""
Po 0.99822 5.99948
.SolderMask 0.100076
.LocalClearance 0.0762
$EndPAD
$PAD
Sh "G3" C 0.5 0.5 0 0 0
Dr 0 0 0
At SMD N 00888000
Ne $1 ""
Po 1.99898 5.99948
.SolderMask 0.100076
.LocalClearance 0.0762
$EndPAD
$PAD
Sh "G4" C 0.5 0.5 0 0 0
Dr 0 0 0
At SMD N 00888000
Ne $1 ""
Po 2.9972 5.99948
.SolderMask 0.100076
.LocalClearance 0.0762
$EndPAD
$PAD
Sh "G5" C 0.5 0.5 0 0 0
Dr 0 0 0
At SMD N 00888000
Ne $1 ""
Po 3.99796 5.99948
.SolderMask 0.100076
.LocalClearance 0.0762
$EndPAD
$PAD
Sh "G6" C 0.5 0.5 0 0 0
Dr 0 0 0
At SMD N 00888000
Ne $1 ""
Po 4.99872 5.99948
.SolderMask 0.100076
.LocalClearance 0.0762
$EndPAD
$PAD
Sh "G7" C 0.5 0.5 0 0 0
Dr 0 0 0
At SMD N 00888000
Ne $1 ""
Po 5.99948 5.99948
.SolderMask 0.100076
.LocalClearance 0.0762
$EndPAD
$PAD
Sh "G8" C 0.5 0.5 0 0 0
Dr 0 0 0
At SMD N 00888000
Ne $1 ""
Po 6.9977 5.99948
.SolderMask 0.100076
.LocalClearance 0.0762
$EndPAD
$PAD
Sh "G9" C 0.5 0.5 0 0 0
Dr 0 0 0
At SMD N 00888000
Ne $1 ""
Po 7.99846 5.99948
.SolderMask 0.100076
.LocalClearance 0.0762
$EndPAD
$PAD
Sh "G10" C 0.5 0.5 0 0 0
Dr 0 0 0
At SMD N 00888000
Ne $1 ""
Po 8.99922 5.99948
.SolderMask 0.100076
.LocalClearance 0.0762
$EndPAD
$PAD
Sh "G11" C 0.5 0.5 0 0 0
Dr 0 0 0
At SMD N 00888000
Ne $1 ""
Po 9.99744 5.99948
.SolderMask 0.100076
.LocalClearance 0.0762
$EndPAD
$PAD
Sh "G12" C 0.5 0.5 0 0 0
Dr 0 0 0
At SMD N 00888000
Ne $1 ""
Po 10.9982 5.99948
.SolderMask 0.100076
.LocalClearance 0.0762
$EndPAD
$PAD
Sh "H13" C 0.5 0.5 0 0 0
Dr 0 0 0
At SMD N 00888000
Ne $1 ""
Po 11.99896 6.9977
.SolderMask 0.100076
.LocalClearance 0.0762
$EndPAD
$PAD
Sh "H14" C 0.5 0.5 0 0 0
Dr 0 0 0
At SMD N 00888000
Ne $1 ""
Po 12.99972 6.9977
.SolderMask 0.100076
.LocalClearance 0.0762
$EndPAD
$PAD
Sh "H15" C 0.5 0.5 0 0 0
Dr 0 0 0
At SMD N 00888000
Ne $1 ""
Po 13.99794 6.9977
.SolderMask 0.100076
.LocalClearance 0.0762
$EndPAD
$PAD
Sh "H16" C 0.5 0.5 0 0 0
Dr 0 0 0
At SMD N 00888000
Ne $1 ""
Po 14.9987 6.9977
.SolderMask 0.100076
.LocalClearance 0.0762
$EndPAD
$PAD
Sh "H17" C 0.5 0.5 0 0 0
Dr 0 0 0
At SMD N 00888000
Ne $1 ""
Po 15.99946 6.9977
.SolderMask 0.100076
.LocalClearance 0.0762
$EndPAD
$PAD
Sh "H18" C 0.5 0.5 0 0 0
Dr 0 0 0
At SMD N 00888000
Ne $1 ""
Po 16.99768 6.9977
.SolderMask 0.100076
.LocalClearance 0.0762
$EndPAD
$PAD
Sh "H19" C 0.5 0.5 0 0 0
Dr 0 0 0
At SMD N 00888000
Ne $1 ""
Po 17.99844 6.9977
.SolderMask 0.100076
.LocalClearance 0.0762
$EndPAD
$PAD
Sh "H20" C 0.5 0.5 0 0 0
Dr 0 0 0
At SMD N 00888000
Ne $1 ""
Po 18.9992 6.9977
.SolderMask 0.100076
.LocalClearance 0.0762
$EndPAD
$PAD
Sh "H21" C 0.5 0.5 0 0 0
Dr 0 0 0
At SMD N 00888000
Ne $1 ""
Po 19.99742 6.9977
.SolderMask 0.100076
.LocalClearance 0.0762
$EndPAD
$PAD
Sh "H22" C 0.5 0.5 0 0 0
Dr 0 0 0
At SMD N 00888000
Ne $1 ""
Po 20.99818 6.9977
.SolderMask 0.100076
.LocalClearance 0.0762
$EndPAD
$PAD
Sh "H1" C 0.5 0.5 0 0 0
Dr 0 0 0
At SMD N 00888000
Ne $1 ""
Po 0 6.9977
.SolderMask 0.100076
.LocalClearance 0.0762
$EndPAD
$PAD
Sh "H2" C 0.5 0.5 0 0 0
Dr 0 0 0
At SMD N 00888000
Ne $1 ""
Po 0.99822 6.9977
.SolderMask 0.100076
.LocalClearance 0.0762
$EndPAD
$PAD
Sh "H3" C 0.5 0.5 0 0 0
Dr 0 0 0
At SMD N 00888000
Ne $1 ""
Po 1.99898 6.9977
.SolderMask 0.100076
.LocalClearance 0.0762
$EndPAD
$PAD
Sh "H4" C 0.5 0.5 0 0 0
Dr 0 0 0
At SMD N 00888000
Ne $1 ""
Po 2.9972 6.9977
.SolderMask 0.100076
.LocalClearance 0.0762
$EndPAD
$PAD
Sh "H5" C 0.5 0.5 0 0 0
Dr 0 0 0
At SMD N 00888000
Ne $1 ""
Po 3.99796 6.9977
.SolderMask 0.100076
.LocalClearance 0.0762
$EndPAD
$PAD
Sh "H6" C 0.5 0.5 0 0 0
Dr 0 0 0
At SMD N 00888000
Ne $1 ""
Po 4.99872 6.9977
.SolderMask 0.100076
.LocalClearance 0.0762
$EndPAD
$PAD
Sh "H7" C 0.5 0.5 0 0 0
Dr 0 0 0
At SMD N 00888000
Ne $1 ""
Po 5.99948 6.9977
.SolderMask 0.100076
.LocalClearance 0.0762
$EndPAD
$PAD
Sh "H8" C 0.5 0.5 0 0 0
Dr 0 0 0
At SMD N 00888000
Ne $1 ""
Po 6.9977 6.9977
.SolderMask 0.100076
.LocalClearance 0.0762
$EndPAD
$PAD
Sh "H9" C 0.5 0.5 0 0 0
Dr 0 0 0
At SMD N 00888000
Ne $1 ""
Po 7.99846 6.9977
.SolderMask 0.100076
.LocalClearance 0.0762
$EndPAD
$PAD
Sh "H10" C 0.5 0.5 0 0 0
Dr 0 0 0
At SMD N 00888000
Ne $1 ""
Po 8.99922 6.9977
.SolderMask 0.100076
.LocalClearance 0.0762
$EndPAD
$PAD
Sh "H11" C 0.5 0.5 0 0 0
Dr 0 0 0
At SMD N 00888000
Ne $1 ""
Po 9.99744 6.9977
.SolderMask 0.100076
.LocalClearance 0.0762
$EndPAD
$PAD
Sh "H12" C 0.5 0.5 0 0 0
Dr 0 0 0
At SMD N 00888000
Ne $1 ""
Po 10.9982 6.9977
.SolderMask 0.100076
.LocalClearance 0.0762
$EndPAD
$PAD
Sh "J13" C 0.5 0.5 0 0 0
Dr 0 0 0
At SMD N 00888000
Ne $1 ""
Po 11.99896 7.99846
.SolderMask 0.100076
.LocalClearance 0.0762
$EndPAD
$PAD
Sh "J14" C 0.5 0.5 0 0 0
Dr 0 0 0
At SMD N 00888000
Ne $1 ""
Po 12.99972 7.99846
.SolderMask 0.100076
.LocalClearance 0.0762
$EndPAD
$PAD
Sh "J15" C 0.5 0.5 0 0 0
Dr 0 0 0
At SMD N 00888000
Ne $1 ""
Po 13.99794 7.99846
.SolderMask 0.100076
.LocalClearance 0.0762
$EndPAD
$PAD
Sh "J16" C 0.5 0.5 0 0 0
Dr 0 0 0
At SMD N 00888000
Ne $1 ""
Po 14.9987 7.99846
.SolderMask 0.100076
.LocalClearance 0.0762
$EndPAD
$PAD
Sh "J17" C 0.5 0.5 0 0 0
Dr 0 0 0
At SMD N 00888000
Ne $1 ""
Po 15.99946 7.99846
.SolderMask 0.100076
.LocalClearance 0.0762
$EndPAD
$PAD
Sh "J18" C 0.5 0.5 0 0 0
Dr 0 0 0
At SMD N 00888000
Ne $1 ""
Po 16.99768 7.99846
.SolderMask 0.100076
.LocalClearance 0.0762
$EndPAD
$PAD
Sh "J19" C 0.5 0.5 0 0 0
Dr 0 0 0
At SMD N 00888000
Ne $1 ""
Po 17.99844 7.99846
.SolderMask 0.100076
.LocalClearance 0.0762
$EndPAD
$PAD
Sh "J20" C 0.5 0.5 0 0 0
Dr 0 0 0
At SMD N 00888000
Ne $1 ""
Po 18.9992 7.99846
.SolderMask 0.100076
.LocalClearance 0.0762
$EndPAD
$PAD
Sh "J21" C 0.5 0.5 0 0 0
Dr 0 0 0
At SMD N 00888000
Ne $1 ""
Po 19.99742 7.99846
.SolderMask 0.100076
.LocalClearance 0.0762
$EndPAD
$PAD
Sh "J22" C 0.5 0.5 0 0 0
Dr 0 0 0
At SMD N 00888000
Ne $1 ""
Po 20.99818 7.99846
.SolderMask 0.100076
.LocalClearance 0.0762
$EndPAD
$PAD
Sh "J1" C 0.5 0.5 0 0 0
Dr 0 0 0
At SMD N 00888000
Ne $1 ""
Po 0 7.99846
.SolderMask 0.100076
.LocalClearance 0.0762
$EndPAD
$PAD
Sh "J2" C 0.5 0.5 0 0 0
Dr 0 0 0
At SMD N 00888000
Ne $1 ""
Po 0.99822 7.99846
.SolderMask 0.100076
.LocalClearance 0.0762
$EndPAD
$PAD
Sh "J3" C 0.5 0.5 0 0 0
Dr 0 0 0
At SMD N 00888000
Ne $1 ""
Po 1.99898 7.99846
.SolderMask 0.100076
.LocalClearance 0.0762
$EndPAD
$PAD
Sh "J4" C 0.5 0.5 0 0 0
Dr 0 0 0
At SMD N 00888000
Ne $1 ""
Po 2.9972 7.99846
.SolderMask 0.100076
.LocalClearance 0.0762
$EndPAD
$PAD
Sh "J5" C 0.5 0.5 0 0 0
Dr 0 0 0
At SMD N 00888000
Ne $1 ""
Po 3.99796 7.99846
.SolderMask 0.100076
.LocalClearance 0.0762
$EndPAD
$PAD
Sh "J6" C 0.5 0.5 0 0 0
Dr 0 0 0
At SMD N 00888000
Ne $1 ""
Po 4.99872 7.99846
.SolderMask 0.100076
.LocalClearance 0.0762
$EndPAD
$PAD
Sh "J7" C 0.5 0.5 0 0 0
Dr 0 0 0
At SMD N 00888000
Ne $1 ""
Po 5.99948 7.99846
.SolderMask 0.100076
.LocalClearance 0.0762
$EndPAD
$PAD
Sh "J8" C 0.5 0.5 0 0 0
Dr 0 0 0
At SMD N 00888000
Ne $1 ""
Po 6.9977 7.99846
.SolderMask 0.100076
.LocalClearance 0.0762
$EndPAD
$PAD
Sh "J9" C 0.5 0.5 0 0 0
Dr 0 0 0
At SMD N 00888000
Ne $1 ""
Po 7.99846 7.99846
.SolderMask 0.100076
.LocalClearance 0.0762
$EndPAD
$PAD
Sh "J10" C 0.5 0.5 0 0 0
Dr 0 0 0
At SMD N 00888000
Ne $1 ""
Po 8.99922 7.99846
.SolderMask 0.100076
.LocalClearance 0.0762
$EndPAD
$PAD
Sh "J11" C 0.5 0.5 0 0 0
Dr 0 0 0
At SMD N 00888000
Ne $1 ""
Po 9.99744 7.99846
.SolderMask 0.100076
.LocalClearance 0.0762
$EndPAD
$PAD
Sh "J12" C 0.5 0.5 0 0 0
Dr 0 0 0
At SMD N 00888000
Ne $1 ""
Po 10.9982 7.99846
.SolderMask 0.100076
.LocalClearance 0.0762
$EndPAD
$PAD
Sh "K13" C 0.5 0.5 0 0 0
Dr 0 0 0
At SMD N 00888000
Ne $1 ""
Po 11.99896 8.99922
.SolderMask 0.100076
.LocalClearance 0.0762
$EndPAD
$PAD
Sh "K14" C 0.5 0.5 0 0 0
Dr 0 0 0
At SMD N 00888000
Ne $1 ""
Po 12.99972 8.99922
.SolderMask 0.100076
.LocalClearance 0.0762
$EndPAD
$PAD
Sh "K15" C 0.5 0.5 0 0 0
Dr 0 0 0
At SMD N 00888000
Ne $1 ""
Po 13.99794 8.99922
.SolderMask 0.100076
.LocalClearance 0.0762
$EndPAD
$PAD
Sh "K16" C 0.5 0.5 0 0 0
Dr 0 0 0
At SMD N 00888000
Ne $1 ""
Po 14.9987 8.99922
.SolderMask 0.100076
.LocalClearance 0.0762
$EndPAD
$PAD
Sh "K17" C 0.5 0.5 0 0 0
Dr 0 0 0
At SMD N 00888000
Ne $1 ""
Po 15.99946 8.99922
.SolderMask 0.100076
.LocalClearance 0.0762
$EndPAD
$PAD
Sh "K18" C 0.5 0.5 0 0 0
Dr 0 0 0
At SMD N 00888000
Ne $1 ""
Po 16.99768 8.99922
.SolderMask 0.100076
.LocalClearance 0.0762
$EndPAD
$PAD
Sh "K19" C 0.5 0.5 0 0 0
Dr 0 0 0
At SMD N 00888000
Ne $1 ""
Po 17.99844 8.99922
.SolderMask 0.100076
.LocalClearance 0.0762
$EndPAD
$PAD
Sh "K20" C 0.5 0.5 0 0 0
Dr 0 0 0
At SMD N 00888000
Ne $1 ""
Po 18.9992 8.99922
.SolderMask 0.100076
.LocalClearance 0.0762
$EndPAD
$PAD
Sh "K21" C 0.5 0.5 0 0 0
Dr 0 0 0
At SMD N 00888000
Ne $1 ""
Po 19.99742 8.99922
.SolderMask 0.100076
.LocalClearance 0.0762
$EndPAD
$PAD
Sh "K22" C 0.5 0.5 0 0 0
Dr 0 0 0
At SMD N 00888000
Ne $1 ""
Po 20.99818 8.99922
.SolderMask 0.100076
.LocalClearance 0.0762
$EndPAD
$PAD
Sh "K1" C 0.5 0.5 0 0 0
Dr 0 0 0
At SMD N 00888000
Ne $1 ""
Po 0 8.99922
.SolderMask 0.100076
.LocalClearance 0.0762
$EndPAD
$PAD
Sh "K2" C 0.5 0.5 0 0 0
Dr 0 0 0
At SMD N 00888000
Ne $1 ""
Po 0.99822 8.99922
.SolderMask 0.100076
.LocalClearance 0.0762
$EndPAD
$PAD
Sh "K3" C 0.5 0.5 0 0 0
Dr 0 0 0
At SMD N 00888000
Ne $1 ""
Po 1.99898 8.99922
.SolderMask 0.100076
.LocalClearance 0.0762
$EndPAD
$PAD
Sh "K4" C 0.5 0.5 0 0 0
Dr 0 0 0
At SMD N 00888000
Ne $1 ""
Po 2.9972 8.99922
.SolderMask 0.100076
.LocalClearance 0.0762
$EndPAD
$PAD
Sh "K5" C 0.5 0.5 0 0 0
Dr 0 0 0
At SMD N 00888000
Ne $1 ""
Po 3.99796 8.99922
.SolderMask 0.100076
.LocalClearance 0.0762
$EndPAD
$PAD
Sh "K6" C 0.5 0.5 0 0 0
Dr 0 0 0
At SMD N 00888000
Ne $1 ""
Po 4.99872 8.99922
.SolderMask 0.100076
.LocalClearance 0.0762
$EndPAD
$PAD
Sh "K7" C 0.5 0.5 0 0 0
Dr 0 0 0
At SMD N 00888000
Ne $1 ""
Po 5.99948 8.99922
.SolderMask 0.100076
.LocalClearance 0.0762
$EndPAD
$PAD
Sh "K8" C 0.5 0.5 0 0 0
Dr 0 0 0
At SMD N 00888000
Ne $1 ""
Po 6.9977 8.99922
.SolderMask 0.100076
.LocalClearance 0.0762
$EndPAD
$PAD
Sh "K9" C 0.5 0.5 0 0 0
Dr 0 0 0
At SMD N 00888000
Ne $1 ""
Po 7.99846 8.99922
.SolderMask 0.100076
.LocalClearance 0.0762
$EndPAD
$PAD
Sh "K10" C 0.5 0.5 0 0 0
Dr 0 0 0
At SMD N 00888000
Ne $1 ""
Po 8.99922 8.99922
.SolderMask 0.100076
.LocalClearance 0.0762
$EndPAD
$PAD
Sh "K11" C 0.5 0.5 0 0 0
Dr 0 0 0
At SMD N 00888000
Ne $1 ""
Po 9.99744 8.99922
.SolderMask 0.100076
.LocalClearance 0.0762
$EndPAD
$PAD
Sh "K12" C 0.5 0.5 0 0 0
Dr 0 0 0
At SMD N 00888000
Ne $1 ""
Po 10.9982 8.99922
.SolderMask 0.100076
.LocalClearance 0.0762
$EndPAD
$PAD
Sh "L13" C 0.5 0.5 0 0 0
Dr 0 0 0
At SMD N 00888000
Ne $1 ""
Po 11.99896 9.99744
.SolderMask 0.100076
.LocalClearance 0.0762
$EndPAD
$PAD
Sh "L14" C 0.5 0.5 0 0 0
Dr 0 0 0
At SMD N 00888000
Ne $1 ""
Po 12.99972 9.99744
.SolderMask 0.100076
.LocalClearance 0.0762
$EndPAD
$PAD
Sh "L15" C 0.5 0.5 0 0 0
Dr 0 0 0
At SMD N 00888000
Ne $1 ""
Po 13.99794 9.99744
.SolderMask 0.100076
.LocalClearance 0.0762
$EndPAD
$PAD
Sh "L16" C 0.5 0.5 0 0 0
Dr 0 0 0
At SMD N 00888000
Ne $1 ""
Po 14.9987 9.99744
.SolderMask 0.100076
.LocalClearance 0.0762
$EndPAD
$PAD
Sh "L17" C 0.5 0.5 0 0 0
Dr 0 0 0
At SMD N 00888000
Ne $1 ""
Po 15.99946 9.99744
.SolderMask 0.100076
.LocalClearance 0.0762
$EndPAD
$PAD
Sh "L18" C 0.5 0.5 0 0 0
Dr 0 0 0
At SMD N 00888000
Ne $1 ""
Po 16.99768 9.99744
.SolderMask 0.100076
.LocalClearance 0.0762
$EndPAD
$PAD
Sh "L19" C 0.5 0.5 0 0 0
Dr 0 0 0
At SMD N 00888000
Ne $1 ""
Po 17.99844 9.99744
.SolderMask 0.100076
.LocalClearance 0.0762
$EndPAD
$PAD
Sh "L20" C 0.5 0.5 0 0 0
Dr 0 0 0
At SMD N 00888000
Ne $1 ""
Po 18.9992 9.99744
.SolderMask 0.100076
.LocalClearance 0.0762
$EndPAD
$PAD
Sh "L21" C 0.5 0.5 0 0 0
Dr 0 0 0
At SMD N 00888000
Ne $1 ""
Po 19.99742 9.99744
.SolderMask 0.100076
.LocalClearance 0.0762
$EndPAD
$PAD
Sh "L22" C 0.5 0.5 0 0 0
Dr 0 0 0
At SMD N 00888000
Ne $1 ""
Po 20.99818 9.99744
.SolderMask 0.100076
.LocalClearance 0.0762
$EndPAD
$PAD
Sh "L1" C 0.5 0.5 0 0 0
Dr 0 0 0
At SMD N 00888000
Ne $1 ""
Po 0 9.99744
.SolderMask 0.100076
.LocalClearance 0.0762
$EndPAD
$PAD
Sh "L2" C 0.5 0.5 0 0 0
Dr 0 0 0
At SMD N 00888000
Ne $1 ""
Po 0.99822 9.99744
.SolderMask 0.100076
.LocalClearance 0.0762
$EndPAD
$PAD
Sh "L3" C 0.5 0.5 0 0 0
Dr 0 0 0
At SMD N 00888000
Ne $1 ""
Po 1.99898 9.99744
.SolderMask 0.100076
.LocalClearance 0.0762
$EndPAD
$PAD
Sh "L4" C 0.5 0.5 0 0 0
Dr 0 0 0
At SMD N 00888000
Ne $1 ""
Po 2.9972 9.99744
.SolderMask 0.100076
.LocalClearance 0.0762
$EndPAD
$PAD
Sh "L5" C 0.5 0.5 0 0 0
Dr 0 0 0
At SMD N 00888000
Ne $1 ""
Po 3.99796 9.99744
.SolderMask 0.100076
.LocalClearance 0.0762
$EndPAD
$PAD
Sh "L6" C 0.5 0.5 0 0 0
Dr 0 0 0
At SMD N 00888000
Ne $1 ""
Po 4.99872 9.99744
.SolderMask 0.100076
.LocalClearance 0.0762
$EndPAD
$PAD
Sh "L7" C 0.5 0.5 0 0 0
Dr 0 0 0
At SMD N 00888000
Ne $1 ""
Po 5.99948 9.99744
.SolderMask 0.100076
.LocalClearance 0.0762
$EndPAD
$PAD
Sh "L8" C 0.5 0.5 0 0 0
Dr 0 0 0
At SMD N 00888000
Ne $1 ""
Po 6.9977 9.99744
.SolderMask 0.100076
.LocalClearance 0.0762
$EndPAD
$PAD
Sh "L9" C 0.5 0.5 0 0 0
Dr 0 0 0
At SMD N 00888000
Ne $1 ""
Po 7.99846 9.99744
.SolderMask 0.100076
.LocalClearance 0.0762
$EndPAD
$PAD
Sh "L10" C 0.5 0.5 0 0 0
Dr 0 0 0
At SMD N 00888000
Ne $1 ""
Po 8.99922 9.99744
.SolderMask 0.100076
.LocalClearance 0.0762
$EndPAD
$PAD
Sh "L11" C 0.5 0.5 0 0 0
Dr 0 0 0
At SMD N 00888000
Ne $1 ""
Po 9.99744 9.99744
.SolderMask 0.100076
.LocalClearance 0.0762
$EndPAD
$PAD
Sh "L12" C 0.5 0.5 0 0 0
Dr 0 0 0
At SMD N 00888000
Ne $1 ""
Po 10.9982 9.99744
.SolderMask 0.100076
.LocalClearance 0.0762
$EndPAD
$PAD
Sh "M13" C 0.5 0.5 0 0 0
Dr 0 0 0
At SMD N 00888000
Ne $1 ""
Po 11.99896 10.9982
.SolderMask 0.100076
.LocalClearance 0.0762
$EndPAD
$PAD
Sh "M14" C 0.5 0.5 0 0 0
Dr 0 0 0
At SMD N 00888000
Ne $1 ""
Po 12.99972 10.9982
.SolderMask 0.100076
.LocalClearance 0.0762
$EndPAD
$PAD
Sh "M15" C 0.5 0.5 0 0 0
Dr 0 0 0
At SMD N 00888000
Ne $1 ""
Po 13.99794 10.9982
.SolderMask 0.100076
.LocalClearance 0.0762
$EndPAD
$PAD
Sh "M16" C 0.5 0.5 0 0 0
Dr 0 0 0
At SMD N 00888000
Ne $1 ""
Po 14.9987 10.9982
.SolderMask 0.100076
.LocalClearance 0.0762
$EndPAD
$PAD
Sh "M17" C 0.5 0.5 0 0 0
Dr 0 0 0
At SMD N 00888000
Ne $1 ""
Po 15.99946 10.9982
.SolderMask 0.100076
.LocalClearance 0.0762
$EndPAD
$PAD
Sh "M18" C 0.5 0.5 0 0 0
Dr 0 0 0
At SMD N 00888000
Ne $1 ""
Po 16.99768 10.9982
.SolderMask 0.100076
.LocalClearance 0.0762
$EndPAD
$PAD
Sh "M19" C 0.5 0.5 0 0 0
Dr 0 0 0
At SMD N 00888000
Ne $1 ""
Po 17.99844 10.9982
.SolderMask 0.100076
.LocalClearance 0.0762
$EndPAD
$PAD
Sh "M20" C 0.5 0.5 0 0 0
Dr 0 0 0
At SMD N 00888000
Ne $1 ""
Po 18.9992 10.9982
.SolderMask 0.100076
.LocalClearance 0.0762
$EndPAD
$PAD
Sh "M21" C 0.5 0.5 0 0 0
Dr 0 0 0
At SMD N 00888000
Ne $1 ""
Po 19.99742 10.9982
.SolderMask 0.100076
.LocalClearance 0.0762
$EndPAD
$PAD
Sh "M22" C 0.5 0.5 0 0 0
Dr 0 0 0
At SMD N 00888000
Ne $1 ""
Po 20.99818 10.9982
.SolderMask 0.100076
.LocalClearance 0.0762
$EndPAD
$PAD
Sh "M1" C 0.5 0.5 0 0 0
Dr 0 0 0
At SMD N 00888000
Ne $1 ""
Po 0 10.9982
.SolderMask 0.100076
.LocalClearance 0.0762
$EndPAD
$PAD
Sh "M2" C 0.5 0.5 0 0 0
Dr 0 0 0
At SMD N 00888000
Ne $1 ""
Po 0.99822 10.9982
.SolderMask 0.100076
.LocalClearance 0.0762
$EndPAD
$PAD
Sh "M3" C 0.5 0.5 0 0 0
Dr 0 0 0
At SMD N 00888000
Ne $1 ""
Po 1.99898 10.9982
.SolderMask 0.100076
.LocalClearance 0.0762
$EndPAD
$PAD
Sh "M4" C 0.5 0.5 0 0 0
Dr 0 0 0
At SMD N 00888000
Ne $1 ""
Po 2.9972 10.9982
.SolderMask 0.100076
.LocalClearance 0.0762
$EndPAD
$PAD
Sh "M5" C 0.5 0.5 0 0 0
Dr 0 0 0
At SMD N 00888000
Ne $1 ""
Po 3.99796 10.9982
.SolderMask 0.100076
.LocalClearance 0.0762
$EndPAD
$PAD
Sh "M6" C 0.5 0.5 0 0 0
Dr 0 0 0
At SMD N 00888000
Ne $1 ""
Po 4.99872 10.9982
.SolderMask 0.100076
.LocalClearance 0.0762
$EndPAD
$PAD
Sh "M7" C 0.5 0.5 0 0 0
Dr 0 0 0
At SMD N 00888000
Ne $1 ""
Po 5.99948 10.9982
.SolderMask 0.100076
.LocalClearance 0.0762
$EndPAD
$PAD
Sh "M8" C 0.5 0.5 0 0 0
Dr 0 0 0
At SMD N 00888000
Ne $1 ""
Po 6.9977 10.9982
.SolderMask 0.100076
.LocalClearance 0.0762
$EndPAD
$PAD
Sh "M9" C 0.5 0.5 0 0 0
Dr 0 0 0
At SMD N 00888000
Ne $1 ""
Po 7.99846 10.9982
.SolderMask 0.100076
.LocalClearance 0.0762
$EndPAD
$PAD
Sh "M10" C 0.5 0.5 0 0 0
Dr 0 0 0
At SMD N 00888000
Ne $1 ""
Po 8.99922 10.9982
.SolderMask 0.100076
.LocalClearance 0.0762
$EndPAD
$PAD
Sh "M11" C 0.5 0.5 0 0 0
Dr 0 0 0
At SMD N 00888000
Ne $1 ""
Po 9.99744 10.9982
.SolderMask 0.100076
.LocalClearance 0.0762
$EndPAD
$PAD
Sh "M12" C 0.5 0.5 0 0 0
Dr 0 0 0
At SMD N 00888000
Ne $1 ""
Po 10.9982 10.9982
.SolderMask 0.100076
.LocalClearance 0.0762
$EndPAD
$PAD
Sh "N13" C 0.5 0.5 0 0 0
Dr 0 0 0
At SMD N 00888000
Ne $1 ""
Po 11.99896 11.99896
.SolderMask 0.100076
.LocalClearance 0.0762
$EndPAD
$PAD
Sh "N14" C 0.5 0.5 0 0 0
Dr 0 0 0
At SMD N 00888000
Ne $1 ""
Po 12.99972 11.99896
.SolderMask 0.100076
.LocalClearance 0.0762
$EndPAD
$PAD
Sh "N15" C 0.5 0.5 0 0 0
Dr 0 0 0
At SMD N 00888000
Ne $1 ""
Po 13.99794 11.99896
.SolderMask 0.100076
.LocalClearance 0.0762
$EndPAD
$PAD
Sh "N16" C 0.5 0.5 0 0 0
Dr 0 0 0
At SMD N 00888000
Ne $1 ""
Po 14.9987 11.99896
.SolderMask 0.100076
.LocalClearance 0.0762
$EndPAD
$PAD
Sh "N17" C 0.5 0.5 0 0 0
Dr 0 0 0
At SMD N 00888000
Ne $1 ""
Po 15.99946 11.99896
.SolderMask 0.100076
.LocalClearance 0.0762
$EndPAD
$PAD
Sh "N18" C 0.5 0.5 0 0 0
Dr 0 0 0
At SMD N 00888000
Ne $1 ""
Po 16.99768 11.99896
.SolderMask 0.100076
.LocalClearance 0.0762
$EndPAD
$PAD
Sh "N19" C 0.5 0.5 0 0 0
Dr 0 0 0
At SMD N 00888000
Ne $1 ""
Po 17.99844 11.99896
.SolderMask 0.100076
.LocalClearance 0.0762
$EndPAD
$PAD
Sh "N20" C 0.5 0.5 0 0 0
Dr 0 0 0
At SMD N 00888000
Ne $1 ""
Po 18.9992 11.99896
.SolderMask 0.100076
.LocalClearance 0.0762
$EndPAD
$PAD
Sh "N21" C 0.5 0.5 0 0 0
Dr 0 0 0
At SMD N 00888000
Ne $1 ""
Po 19.99742 11.99896
.SolderMask 0.100076
.LocalClearance 0.0762
$EndPAD
$PAD
Sh "N22" C 0.5 0.5 0 0 0
Dr 0 0 0
At SMD N 00888000
Ne $1 ""
Po 20.99818 11.99896
.SolderMask 0.100076
.LocalClearance 0.0762
$EndPAD
$PAD
Sh "N1" C 0.5 0.5 0 0 0
Dr 0 0 0
At SMD N 00888000
Ne $1 ""
Po 0 11.99896
.SolderMask 0.100076
.LocalClearance 0.0762
$EndPAD
$PAD
Sh "N2" C 0.5 0.5 0 0 0
Dr 0 0 0
At SMD N 00888000
Ne $1 ""
Po 0.99822 11.99896
.SolderMask 0.100076
.LocalClearance 0.0762
$EndPAD
$PAD
Sh "N3" C 0.5 0.5 0 0 0
Dr 0 0 0
At SMD N 00888000
Ne $1 ""
Po 1.99898 11.99896
.SolderMask 0.100076
.LocalClearance 0.0762
$EndPAD
$PAD
Sh "N4" C 0.5 0.5 0 0 0
Dr 0 0 0
At SMD N 00888000
Ne $1 ""
Po 2.9972 11.99896
.SolderMask 0.100076
.LocalClearance 0.0762
$EndPAD
$PAD
Sh "N5" C 0.5 0.5 0 0 0
Dr 0 0 0
At SMD N 00888000
Ne $1 ""
Po 3.99796 11.99896
.SolderMask 0.100076
.LocalClearance 0.0762
$EndPAD
$PAD
Sh "N6" C 0.5 0.5 0 0 0
Dr 0 0 0
At SMD N 00888000
Ne $1 ""
Po 4.99872 11.99896
.SolderMask 0.100076
.LocalClearance 0.0762
$EndPAD
$PAD
Sh "N7" C 0.5 0.5 0 0 0
Dr 0 0 0
At SMD N 00888000
Ne $1 ""
Po 5.99948 11.99896
.SolderMask 0.100076
.LocalClearance 0.0762
$EndPAD
$PAD
Sh "N8" C 0.5 0.5 0 0 0
Dr 0 0 0
At SMD N 00888000
Ne $1 ""
Po 6.9977 11.99896
.SolderMask 0.100076
.LocalClearance 0.0762
$EndPAD
$PAD
Sh "N9" C 0.5 0.5 0 0 0
Dr 0 0 0
At SMD N 00888000
Ne $1 ""
Po 7.99846 11.99896
.SolderMask 0.100076
.LocalClearance 0.0762
$EndPAD
$PAD
Sh "N10" C 0.5 0.5 0 0 0
Dr 0 0 0
At SMD N 00888000
Ne $1 ""
Po 8.99922 11.99896
.SolderMask 0.100076
.LocalClearance 0.0762
$EndPAD
$PAD
Sh "N11" C 0.5 0.5 0 0 0
Dr 0 0 0
At SMD N 00888000
Ne $1 ""
Po 9.99744 11.99896
.SolderMask 0.100076
.LocalClearance 0.0762
$EndPAD
$PAD
Sh "N12" C 0.5 0.5 0 0 0
Dr 0 0 0
At SMD N 00888000
Ne $1 ""
Po 10.9982 11.99896
.SolderMask 0.100076
.LocalClearance 0.0762
$EndPAD
$PAD
Sh "P13" C 0.5 0.5 0 0 0
Dr 0 0 0
At SMD N 00888000
Ne $1 ""
Po 11.99896 12.99972
.SolderMask 0.100076
.LocalClearance 0.0762
$EndPAD
$PAD
Sh "P14" C 0.5 0.5 0 0 0
Dr 0 0 0
At SMD N 00888000
Ne $1 ""
Po 12.99972 12.99972
.SolderMask 0.100076
.LocalClearance 0.0762
$EndPAD
$PAD
Sh "P15" C 0.5 0.5 0 0 0
Dr 0 0 0
At SMD N 00888000
Ne $1 ""
Po 13.99794 12.99972
.SolderMask 0.100076
.LocalClearance 0.0762
$EndPAD
$PAD
Sh "P16" C 0.5 0.5 0 0 0
Dr 0 0 0
At SMD N 00888000
Ne $1 ""
Po 14.9987 12.99972
.SolderMask 0.100076
.LocalClearance 0.0762
$EndPAD
$PAD
Sh "P17" C 0.5 0.5 0 0 0
Dr 0 0 0
At SMD N 00888000
Ne $1 ""
Po 15.99946 12.99972
.SolderMask 0.100076
.LocalClearance 0.0762
$EndPAD
$PAD
Sh "P18" C 0.5 0.5 0 0 0
Dr 0 0 0
At SMD N 00888000
Ne $1 ""
Po 16.99768 12.99972
.SolderMask 0.100076
.LocalClearance 0.0762
$EndPAD
$PAD
Sh "P19" C 0.5 0.5 0 0 0
Dr 0 0 0
At SMD N 00888000
Ne $1 ""
Po 17.99844 12.99972
.SolderMask 0.100076
.LocalClearance 0.0762
$EndPAD
$PAD
Sh "P20" C 0.5 0.5 0 0 0
Dr 0 0 0
At SMD N 00888000
Ne $1 ""
Po 18.9992 12.99972
.SolderMask 0.100076
.LocalClearance 0.0762
$EndPAD
$PAD
Sh "P21" C 0.5 0.5 0 0 0
Dr 0 0 0
At SMD N 00888000
Ne $1 ""
Po 19.99742 12.99972
.SolderMask 0.100076
.LocalClearance 0.0762
$EndPAD
$PAD
Sh "P22" C 0.5 0.5 0 0 0
Dr 0 0 0
At SMD N 00888000
Ne $1 ""
Po 20.99818 12.99972
.SolderMask 0.100076
.LocalClearance 0.0762
$EndPAD
$PAD
Sh "P1" C 0.5 0.5 0 0 0
Dr 0 0 0
At SMD N 00888000
Ne $1 ""
Po 0 12.99972
.SolderMask 0.100076
.LocalClearance 0.0762
$EndPAD
$PAD
Sh "P2" C 0.5 0.5 0 0 0
Dr 0 0 0
At SMD N 00888000
Ne $1 ""
Po 0.99822 12.99972
.SolderMask 0.100076
.LocalClearance 0.0762
$EndPAD
$PAD
Sh "P3" C 0.5 0.5 0 0 0
Dr 0 0 0
At SMD N 00888000
Ne $1 ""
Po 1.99898 12.99972
.SolderMask 0.100076
.LocalClearance 0.0762
$EndPAD
$PAD
Sh "P4" C 0.5 0.5 0 0 0
Dr 0 0 0
At SMD N 00888000
Ne $1 ""
Po 2.9972 12.99972
.SolderMask 0.100076
.LocalClearance 0.0762
$EndPAD
$PAD
Sh "P5" C 0.5 0.5 0 0 0
Dr 0 0 0
At SMD N 00888000
Ne $1 ""
Po 3.99796 12.99972
.SolderMask 0.100076
.LocalClearance 0.0762
$EndPAD
$PAD
Sh "P6" C 0.5 0.5 0 0 0
Dr 0 0 0
At SMD N 00888000
Ne $1 ""
Po 4.99872 12.99972
.SolderMask 0.100076
.LocalClearance 0.0762
$EndPAD
$PAD
Sh "P7" C 0.5 0.5 0 0 0
Dr 0 0 0
At SMD N 00888000
Ne $1 ""
Po 5.99948 12.99972
.SolderMask 0.100076
.LocalClearance 0.0762
$EndPAD
$PAD
Sh "P8" C 0.5 0.5 0 0 0
Dr 0 0 0
At SMD N 00888000
Ne $1 ""
Po 6.9977 12.99972
.SolderMask 0.100076
.LocalClearance 0.0762
$EndPAD
$PAD
Sh "P9" C 0.5 0.5 0 0 0
Dr 0 0 0
At SMD N 00888000
Ne $1 ""
Po 7.99846 12.99972
.SolderMask 0.100076
.LocalClearance 0.0762
$EndPAD
$PAD
Sh "P10" C 0.5 0.5 0 0 0
Dr 0 0 0
At SMD N 00888000
Ne $1 ""
Po 8.99922 12.99972
.SolderMask 0.100076
.LocalClearance 0.0762
$EndPAD
$PAD
Sh "P11" C 0.5 0.5 0 0 0
Dr 0 0 0
At SMD N 00888000
Ne $1 ""
Po 9.99744 12.99972
.SolderMask 0.100076
.LocalClearance 0.0762
$EndPAD
$PAD
Sh "P12" C 0.5 0.5 0 0 0
Dr 0 0 0
At SMD N 00888000
Ne $1 ""
Po 10.9982 12.99972
.SolderMask 0.100076
.LocalClearance 0.0762
$EndPAD
$PAD
Sh "R13" C 0.5 0.5 0 0 0
Dr 0 0 0
At SMD N 00888000
Ne $1 ""
Po 11.99896 13.99794
.SolderMask 0.100076
.LocalClearance 0.0762
$EndPAD
$PAD
Sh "R14" C 0.5 0.5 0 0 0
Dr 0 0 0
At SMD N 00888000
Ne $1 ""
Po 12.99972 13.99794
.SolderMask 0.100076
.LocalClearance 0.0762
$EndPAD
$PAD
Sh "R15" C 0.5 0.5 0 0 0
Dr 0 0 0
At SMD N 00888000
Ne $1 ""
Po 13.99794 13.99794
.SolderMask 0.100076
.LocalClearance 0.0762
$EndPAD
$PAD
Sh "R16" C 0.5 0.5 0 0 0
Dr 0 0 0
At SMD N 00888000
Ne $1 ""
Po 14.9987 13.99794
.SolderMask 0.100076
.LocalClearance 0.0762
$EndPAD
$PAD
Sh "R17" C 0.5 0.5 0 0 0
Dr 0 0 0
At SMD N 00888000
Ne $1 ""
Po 15.99946 13.99794
.SolderMask 0.100076
.LocalClearance 0.0762
$EndPAD
$PAD
Sh "R18" C 0.5 0.5 0 0 0
Dr 0 0 0
At SMD N 00888000
Ne $1 ""
Po 16.99768 13.99794
.SolderMask 0.100076
.LocalClearance 0.0762
$EndPAD
$PAD
Sh "R19" C 0.5 0.5 0 0 0
Dr 0 0 0
At SMD N 00888000
Ne $1 ""
Po 17.99844 13.99794
.SolderMask 0.100076
.LocalClearance 0.0762
$EndPAD
$PAD
Sh "R20" C 0.5 0.5 0 0 0
Dr 0 0 0
At SMD N 00888000
Ne $1 ""
Po 18.9992 13.99794
.SolderMask 0.100076
.LocalClearance 0.0762
$EndPAD
$PAD
Sh "R21" C 0.5 0.5 0 0 0
Dr 0 0 0
At SMD N 00888000
Ne $1 ""
Po 19.99742 13.99794
.SolderMask 0.100076
.LocalClearance 0.0762
$EndPAD
$PAD
Sh "R22" C 0.5 0.5 0 0 0
Dr 0 0 0
At SMD N 00888000
Ne $1 ""
Po 20.99818 13.99794
.SolderMask 0.100076
.LocalClearance 0.0762
$EndPAD
$PAD
Sh "R1" C 0.5 0.5 0 0 0
Dr 0 0 0
At SMD N 00888000
Ne $1 ""
Po 0 13.99794
.SolderMask 0.100076
.LocalClearance 0.0762
$EndPAD
$PAD
Sh "R2" C 0.5 0.5 0 0 0
Dr 0 0 0
At SMD N 00888000
Ne $1 ""
Po 0.99822 13.99794
.SolderMask 0.100076
.LocalClearance 0.0762
$EndPAD
$PAD
Sh "R3" C 0.5 0.5 0 0 0
Dr 0 0 0
At SMD N 00888000
Ne $1 ""
Po 1.99898 13.99794
.SolderMask 0.100076
.LocalClearance 0.0762
$EndPAD
$PAD
Sh "R4" C 0.5 0.5 0 0 0
Dr 0 0 0
At SMD N 00888000
Ne $1 ""
Po 2.9972 13.99794
.SolderMask 0.100076
.LocalClearance 0.0762
$EndPAD
$PAD
Sh "R5" C 0.5 0.5 0 0 0
Dr 0 0 0
At SMD N 00888000
Ne $1 ""
Po 3.99796 13.99794
.SolderMask 0.100076
.LocalClearance 0.0762
$EndPAD
$PAD
Sh "R6" C 0.5 0.5 0 0 0
Dr 0 0 0
At SMD N 00888000
Ne $1 ""
Po 4.99872 13.99794
.SolderMask 0.100076
.LocalClearance 0.0762
$EndPAD
$PAD
Sh "R7" C 0.5 0.5 0 0 0
Dr 0 0 0
At SMD N 00888000
Ne $1 ""
Po 5.99948 13.99794
.SolderMask 0.100076
.LocalClearance 0.0762
$EndPAD
$PAD
Sh "R8" C 0.5 0.5 0 0 0
Dr 0 0 0
At SMD N 00888000
Ne $1 ""
Po 6.9977 13.99794
.SolderMask 0.100076
.LocalClearance 0.0762
$EndPAD
$PAD
Sh "R9" C 0.5 0.5 0 0 0
Dr 0 0 0
At SMD N 00888000
Ne $1 ""
Po 7.99846 13.99794
.SolderMask 0.100076
.LocalClearance 0.0762
$EndPAD
$PAD
Sh "R10" C 0.5 0.5 0 0 0
Dr 0 0 0
At SMD N 00888000
Ne $1 ""
Po 8.99922 13.99794
.SolderMask 0.100076
.LocalClearance 0.0762
$EndPAD
$PAD
Sh "R11" C 0.5 0.5 0 0 0
Dr 0 0 0
At SMD N 00888000
Ne $1 ""
Po 9.99744 13.99794
.SolderMask 0.100076
.LocalClearance 0.0762
$EndPAD
$PAD
Sh "R12" C 0.5 0.5 0 0 0
Dr 0 0 0
At SMD N 00888000
Ne $1 ""
Po 10.9982 13.99794
.SolderMask 0.100076
.LocalClearance 0.0762
$EndPAD
$PAD
Sh "T13" C 0.5 0.5 0 0 0
Dr 0 0 0
At SMD N 00888000
Ne $1 ""
Po 11.99896 14.9987
.SolderMask 0.100076
.LocalClearance 0.0762
$EndPAD
$PAD
Sh "T14" C 0.5 0.5 0 0 0
Dr 0 0 0
At SMD N 00888000
Ne $1 ""
Po 12.99972 14.9987
.SolderMask 0.100076
.LocalClearance 0.0762
$EndPAD
$PAD
Sh "T15" C 0.5 0.5 0 0 0
Dr 0 0 0
At SMD N 00888000
Ne $1 ""
Po 13.99794 14.9987
.SolderMask 0.100076
.LocalClearance 0.0762
$EndPAD
$PAD
Sh "T16" C 0.5 0.5 0 0 0
Dr 0 0 0
At SMD N 00888000
Ne $1 ""
Po 14.9987 14.9987
.SolderMask 0.100076
.LocalClearance 0.0762
$EndPAD
$PAD
Sh "T17" C 0.5 0.5 0 0 0
Dr 0 0 0
At SMD N 00888000
Ne $1 ""
Po 15.99946 14.9987
.SolderMask 0.100076
.LocalClearance 0.0762
$EndPAD
$PAD
Sh "T18" C 0.5 0.5 0 0 0
Dr 0 0 0
At SMD N 00888000
Ne $1 ""
Po 16.99768 14.9987
.SolderMask 0.100076
.LocalClearance 0.0762
$EndPAD
$PAD
Sh "T19" C 0.5 0.5 0 0 0
Dr 0 0 0
At SMD N 00888000
Ne $1 ""
Po 17.99844 14.9987
.SolderMask 0.100076
.LocalClearance 0.0762
$EndPAD
$PAD
Sh "T20" C 0.5 0.5 0 0 0
Dr 0 0 0
At SMD N 00888000
Ne $1 ""
Po 18.9992 14.9987
.SolderMask 0.100076
.LocalClearance 0.0762
$EndPAD
$PAD
Sh "T21" C 0.5 0.5 0 0 0
Dr 0 0 0
At SMD N 00888000
Ne $1 ""
Po 19.99742 14.9987
.SolderMask 0.100076
.LocalClearance 0.0762
$EndPAD
$PAD
Sh "T22" C 0.5 0.5 0 0 0
Dr 0 0 0
At SMD N 00888000
Ne $1 ""
Po 20.99818 14.9987
.SolderMask 0.100076
.LocalClearance 0.0762
$EndPAD
$PAD
Sh "T1" C 0.5 0.5 0 0 0
Dr 0 0 0
At SMD N 00888000
Ne $1 ""
Po 0 14.9987
.SolderMask 0.100076
.LocalClearance 0.0762
$EndPAD
$PAD
Sh "T2" C 0.5 0.5 0 0 0
Dr 0 0 0
At SMD N 00888000
Ne $1 ""
Po 0.99822 14.9987
.SolderMask 0.100076
.LocalClearance 0.0762
$EndPAD
$PAD
Sh "T3" C 0.5 0.5 0 0 0
Dr 0 0 0
At SMD N 00888000
Ne $1 ""
Po 1.99898 14.9987
.SolderMask 0.100076
.LocalClearance 0.0762
$EndPAD
$PAD
Sh "T4" C 0.5 0.5 0 0 0
Dr 0 0 0
At SMD N 00888000
Ne $1 ""
Po 2.9972 14.9987
.SolderMask 0.100076
.LocalClearance 0.0762
$EndPAD
$PAD
Sh "T5" C 0.5 0.5 0 0 0
Dr 0 0 0
At SMD N 00888000
Ne $1 ""
Po 3.99796 14.9987
.SolderMask 0.100076
.LocalClearance 0.0762
$EndPAD
$PAD
Sh "T6" C 0.5 0.5 0 0 0
Dr 0 0 0
At SMD N 00888000
Ne $1 ""
Po 4.99872 14.9987
.SolderMask 0.100076
.LocalClearance 0.0762
$EndPAD
$PAD
Sh "T7" C 0.5 0.5 0 0 0
Dr 0 0 0
At SMD N 00888000
Ne $1 ""
Po 5.99948 14.9987
.SolderMask 0.100076
.LocalClearance 0.0762
$EndPAD
$PAD
Sh "T8" C 0.5 0.5 0 0 0
Dr 0 0 0
At SMD N 00888000
Ne $1 ""
Po 6.9977 14.9987
.SolderMask 0.100076
.LocalClearance 0.0762
$EndPAD
$PAD
Sh "T9" C 0.5 0.5 0 0 0
Dr 0 0 0
At SMD N 00888000
Ne $1 ""
Po 7.99846 14.9987
.SolderMask 0.100076
.LocalClearance 0.0762
$EndPAD
$PAD
Sh "T10" C 0.5 0.5 0 0 0
Dr 0 0 0
At SMD N 00888000
Ne $1 ""
Po 8.99922 14.9987
.SolderMask 0.100076
.LocalClearance 0.0762
$EndPAD
$PAD
Sh "T11" C 0.5 0.5 0 0 0
Dr 0 0 0
At SMD N 00888000
Ne $1 ""
Po 9.99744 14.9987
.SolderMask 0.100076
.LocalClearance 0.0762
$EndPAD
$PAD
Sh "T12" C 0.5 0.5 0 0 0
Dr 0 0 0
At SMD N 00888000
Ne $1 ""
Po 10.9982 14.9987
.SolderMask 0.100076
.LocalClearance 0.0762
$EndPAD
$PAD
Sh "U13" C 0.5 0.5 0 0 0
Dr 0 0 0
At SMD N 00888000
Ne $1 ""
Po 11.99896 15.99946
.SolderMask 0.100076
.LocalClearance 0.0762
$EndPAD
$PAD
Sh "U14" C 0.5 0.5 0 0 0
Dr 0 0 0
At SMD N 00888000
Ne $1 ""
Po 12.99972 15.99946
.SolderMask 0.100076
.LocalClearance 0.0762
$EndPAD
$PAD
Sh "U15" C 0.5 0.5 0 0 0
Dr 0 0 0
At SMD N 00888000
Ne $1 ""
Po 13.99794 15.99946
.SolderMask 0.100076
.LocalClearance 0.0762
$EndPAD
$PAD
Sh "U16" C 0.5 0.5 0 0 0
Dr 0 0 0
At SMD N 00888000
Ne $1 ""
Po 14.9987 15.99946
.SolderMask 0.100076
.LocalClearance 0.0762
$EndPAD
$PAD
Sh "U17" C 0.5 0.5 0 0 0
Dr 0 0 0
At SMD N 00888000
Ne $1 ""
Po 15.99946 15.99946
.SolderMask 0.100076
.LocalClearance 0.0762
$EndPAD
$PAD
Sh "U18" C 0.5 0.5 0 0 0
Dr 0 0 0
At SMD N 00888000
Ne $1 ""
Po 16.99768 15.99946
.SolderMask 0.100076
.LocalClearance 0.0762
$EndPAD
$PAD
Sh "U19" C 0.5 0.5 0 0 0
Dr 0 0 0
At SMD N 00888000
Ne $1 ""
Po 17.99844 15.99946
.SolderMask 0.100076
.LocalClearance 0.0762
$EndPAD
$PAD
Sh "U20" C 0.5 0.5 0 0 0
Dr 0 0 0
At SMD N 00888000
Ne $1 ""
Po 18.9992 15.99946
.SolderMask 0.100076
.LocalClearance 0.0762
$EndPAD
$PAD
Sh "U21" C 0.5 0.5 0 0 0
Dr 0 0 0
At SMD N 00888000
Ne $1 ""
Po 19.99742 15.99946
.SolderMask 0.100076
.LocalClearance 0.0762
$EndPAD
$PAD
Sh "U22" C 0.5 0.5 0 0 0
Dr 0 0 0
At SMD N 00888000
Ne $1 ""
Po 20.99818 15.99946
.SolderMask 0.100076
.LocalClearance 0.0762
$EndPAD
$PAD
Sh "U1" C 0.5 0.5 0 0 0
Dr 0 0 0
At SMD N 00888000
Ne $1 ""
Po 0 15.99946
.SolderMask 0.100076
.LocalClearance 0.0762
$EndPAD
$PAD
Sh "U2" C 0.5 0.5 0 0 0
Dr 0 0 0
At SMD N 00888000
Ne $1 ""
Po 0.99822 15.99946
.SolderMask 0.100076
.LocalClearance 0.0762
$EndPAD
$PAD
Sh "U3" C 0.5 0.5 0 0 0
Dr 0 0 0
At SMD N 00888000
Ne $1 ""
Po 1.99898 15.99946
.SolderMask 0.100076
.LocalClearance 0.0762
$EndPAD
$PAD
Sh "U4" C 0.5 0.5 0 0 0
Dr 0 0 0
At SMD N 00888000
Ne $1 ""
Po 2.9972 15.99946
.SolderMask 0.100076
.LocalClearance 0.0762
$EndPAD
$PAD
Sh "U5" C 0.5 0.5 0 0 0
Dr 0 0 0
At SMD N 00888000
Ne $1 ""
Po 3.99796 15.99946
.SolderMask 0.100076
.LocalClearance 0.0762
$EndPAD
$PAD
Sh "U6" C 0.5 0.5 0 0 0
Dr 0 0 0
At SMD N 00888000
Ne $1 ""
Po 4.99872 15.99946
.SolderMask 0.100076
.LocalClearance 0.0762
$EndPAD
$PAD
Sh "U7" C 0.5 0.5 0 0 0
Dr 0 0 0
At SMD N 00888000
Ne $1 ""
Po 5.99948 15.99946
.SolderMask 0.100076
.LocalClearance 0.0762
$EndPAD
$PAD
Sh "U8" C 0.5 0.5 0 0 0
Dr 0 0 0
At SMD N 00888000
Ne $1 ""
Po 6.9977 15.99946
.SolderMask 0.100076
.LocalClearance 0.0762
$EndPAD
$PAD
Sh "U9" C 0.5 0.5 0 0 0
Dr 0 0 0
At SMD N 00888000
Ne $1 ""
Po 7.99846 15.99946
.SolderMask 0.100076
.LocalClearance 0.0762
$EndPAD
$PAD
Sh "U10" C 0.5 0.5 0 0 0
Dr 0 0 0
At SMD N 00888000
Ne $1 ""
Po 8.99922 15.99946
.SolderMask 0.100076
.LocalClearance 0.0762
$EndPAD
$PAD
Sh "U11" C 0.5 0.5 0 0 0
Dr 0 0 0
At SMD N 00888000
Ne $1 ""
Po 9.99744 15.99946
.SolderMask 0.100076
.LocalClearance 0.0762
$EndPAD
$PAD
Sh "U12" C 0.5 0.5 0 0 0
Dr 0 0 0
At SMD N 00888000
Ne $1 ""
Po 10.9982 15.99946
.SolderMask 0.100076
.LocalClearance 0.0762
$EndPAD
$PAD
Sh "V13" C 0.5 0.5 0 0 0
Dr 0 0 0
At SMD N 00888000
Ne $1 ""
Po 11.99896 16.99768
.SolderMask 0.100076
.LocalClearance 0.0762
$EndPAD
$PAD
Sh "V14" C 0.5 0.5 0 0 0
Dr 0 0 0
At SMD N 00888000
Ne $1 ""
Po 12.99972 16.99768
.SolderMask 0.100076
.LocalClearance 0.0762
$EndPAD
$PAD
Sh "V15" C 0.5 0.5 0 0 0
Dr 0 0 0
At SMD N 00888000
Ne $1 ""
Po 13.99794 16.99768
.SolderMask 0.100076
.LocalClearance 0.0762
$EndPAD
$PAD
Sh "V16" C 0.5 0.5 0 0 0
Dr 0 0 0
At SMD N 00888000
Ne $1 ""
Po 14.9987 16.99768
.SolderMask 0.100076
.LocalClearance 0.0762
$EndPAD
$PAD
Sh "V17" C 0.5 0.5 0 0 0
Dr 0 0 0
At SMD N 00888000
Ne $1 ""
Po 15.99946 16.99768
.SolderMask 0.100076
.LocalClearance 0.0762
$EndPAD
$PAD
Sh "V18" C 0.5 0.5 0 0 0
Dr 0 0 0
At SMD N 00888000
Ne $1 ""
Po 16.99768 16.99768
.SolderMask 0.100076
.LocalClearance 0.0762
$EndPAD
$PAD
Sh "V19" C 0.5 0.5 0 0 0
Dr 0 0 0
At SMD N 00888000
Ne $1 ""
Po 17.99844 16.99768
.SolderMask 0.100076
.LocalClearance 0.0762
$EndPAD
$PAD
Sh "V20" C 0.5 0.5 0 0 0
Dr 0 0 0
At SMD N 00888000
Ne $1 ""
Po 18.9992 16.99768
.SolderMask 0.100076
.LocalClearance 0.0762
$EndPAD
$PAD
Sh "V21" C 0.5 0.5 0 0 0
Dr 0 0 0
At SMD N 00888000
Ne $1 ""
Po 19.99742 16.99768
.SolderMask 0.100076
.LocalClearance 0.0762
$EndPAD
$PAD
Sh "V22" C 0.5 0.5 0 0 0
Dr 0 0 0
At SMD N 00888000
Ne $1 ""
Po 20.99818 16.99768
.SolderMask 0.100076
.LocalClearance 0.0762
$EndPAD
$PAD
Sh "V1" C 0.5 0.5 0 0 0
Dr 0 0 0
At SMD N 00888000
Ne $1 ""
Po 0 16.99768
.SolderMask 0.100076
.LocalClearance 0.0762
$EndPAD
$PAD
Sh "V2" C 0.5 0.5 0 0 0
Dr 0 0 0
At SMD N 00888000
Ne $1 ""
Po 0.99822 16.99768
.SolderMask 0.100076
.LocalClearance 0.0762
$EndPAD
$PAD
Sh "V3" C 0.5 0.5 0 0 0
Dr 0 0 0
At SMD N 00888000
Ne $1 ""
Po 1.99898 16.99768
.SolderMask 0.100076
.LocalClearance 0.0762
$EndPAD
$PAD
Sh "V4" C 0.5 0.5 0 0 0
Dr 0 0 0
At SMD N 00888000
Ne $1 ""
Po 2.9972 16.99768
.SolderMask 0.100076
.LocalClearance 0.0762
$EndPAD
$PAD
Sh "V5" C 0.5 0.5 0 0 0
Dr 0 0 0
At SMD N 00888000
Ne $1 ""
Po 3.99796 16.99768
.SolderMask 0.100076
.LocalClearance 0.0762
$EndPAD
$PAD
Sh "V6" C 0.5 0.5 0 0 0
Dr 0 0 0
At SMD N 00888000
Ne $1 ""
Po 4.99872 16.99768
.SolderMask 0.100076
.LocalClearance 0.0762
$EndPAD
$PAD
Sh "V7" C 0.5 0.5 0 0 0
Dr 0 0 0
At SMD N 00888000
Ne $1 ""
Po 5.99948 16.99768
.SolderMask 0.100076
.LocalClearance 0.0762
$EndPAD
$PAD
Sh "V8" C 0.5 0.5 0 0 0
Dr 0 0 0
At SMD N 00888000
Ne $1 ""
Po 6.9977 16.99768
.SolderMask 0.100076
.LocalClearance 0.0762
$EndPAD
$PAD
Sh "V9" C 0.5 0.5 0 0 0
Dr 0 0 0
At SMD N 00888000
Ne $1 ""
Po 7.99846 16.99768
.SolderMask 0.100076
.LocalClearance 0.0762
$EndPAD
$PAD
Sh "V10" C 0.5 0.5 0 0 0
Dr 0 0 0
At SMD N 00888000
Ne $1 ""
Po 8.99922 16.99768
.SolderMask 0.100076
.LocalClearance 0.0762
$EndPAD
$PAD
Sh "V11" C 0.5 0.5 0 0 0
Dr 0 0 0
At SMD N 00888000
Ne $1 ""
Po 9.99744 16.99768
.SolderMask 0.100076
.LocalClearance 0.0762
$EndPAD
$PAD
Sh "V12" C 0.5 0.5 0 0 0
Dr 0 0 0
At SMD N 00888000
Ne $1 ""
Po 10.9982 16.99768
.SolderMask 0.100076
.LocalClearance 0.0762
$EndPAD
$PAD
Sh "W13" C 0.5 0.5 0 0 0
Dr 0 0 0
At SMD N 00888000
Ne $1 ""
Po 11.99896 17.99844
.SolderMask 0.100076
.LocalClearance 0.0762
$EndPAD
$PAD
Sh "W14" C 0.5 0.5 0 0 0
Dr 0 0 0
At SMD N 00888000
Ne $1 ""
Po 12.99972 17.99844
.SolderMask 0.100076
.LocalClearance 0.0762
$EndPAD
$PAD
Sh "W15" C 0.5 0.5 0 0 0
Dr 0 0 0
At SMD N 00888000
Ne $1 ""
Po 13.99794 17.99844
.SolderMask 0.100076
.LocalClearance 0.0762
$EndPAD
$PAD
Sh "W16" C 0.5 0.5 0 0 0
Dr 0 0 0
At SMD N 00888000
Ne $1 ""
Po 14.9987 17.99844
.SolderMask 0.100076
.LocalClearance 0.0762
$EndPAD
$PAD
Sh "W17" C 0.5 0.5 0 0 0
Dr 0 0 0
At SMD N 00888000
Ne $1 ""
Po 15.99946 17.99844
.SolderMask 0.100076
.LocalClearance 0.0762
$EndPAD
$PAD
Sh "W18" C 0.5 0.5 0 0 0
Dr 0 0 0
At SMD N 00888000
Ne $1 ""
Po 16.99768 17.99844
.SolderMask 0.100076
.LocalClearance 0.0762
$EndPAD
$PAD
Sh "W19" C 0.5 0.5 0 0 0
Dr 0 0 0
At SMD N 00888000
Ne $1 ""
Po 17.99844 17.99844
.SolderMask 0.100076
.LocalClearance 0.0762
$EndPAD
$PAD
Sh "W20" C 0.5 0.5 0 0 0
Dr 0 0 0
At SMD N 00888000
Ne $1 ""
Po 18.9992 17.99844
.SolderMask 0.100076
.LocalClearance 0.0762
$EndPAD
$PAD
Sh "W21" C 0.5 0.5 0 0 0
Dr 0 0 0
At SMD N 00888000
Ne $1 ""
Po 19.99742 17.99844
.SolderMask 0.100076
.LocalClearance 0.0762
$EndPAD
$PAD
Sh "W22" C 0.5 0.5 0 0 0
Dr 0 0 0
At SMD N 00888000
Ne $1 ""
Po 20.99818 17.99844
.SolderMask 0.100076
.LocalClearance 0.0762
$EndPAD
$PAD
Sh "W1" C 0.5 0.5 0 0 0
Dr 0 0 0
At SMD N 00888000
Ne $1 ""
Po 0 17.99844
.SolderMask 0.100076
.LocalClearance 0.0762
$EndPAD
$PAD
Sh "W2" C 0.5 0.5 0 0 0
Dr 0 0 0
At SMD N 00888000
Ne $1 ""
Po 0.99822 17.99844
.SolderMask 0.100076
.LocalClearance 0.0762
$EndPAD
$PAD
Sh "W3" C 0.5 0.5 0 0 0
Dr 0 0 0
At SMD N 00888000
Ne $1 ""
Po 1.99898 17.99844
.SolderMask 0.100076
.LocalClearance 0.0762
$EndPAD
$PAD
Sh "W4" C 0.5 0.5 0 0 0
Dr 0 0 0
At SMD N 00888000
Ne $1 ""
Po 2.9972 17.99844
.SolderMask 0.100076
.LocalClearance 0.0762
$EndPAD
$PAD
Sh "W5" C 0.5 0.5 0 0 0
Dr 0 0 0
At SMD N 00888000
Ne $1 ""
Po 3.99796 17.99844
.SolderMask 0.100076
.LocalClearance 0.0762
$EndPAD
$PAD
Sh "W6" C 0.5 0.5 0 0 0
Dr 0 0 0
At SMD N 00888000
Ne $1 ""
Po 4.99872 17.99844
.SolderMask 0.100076
.LocalClearance 0.0762
$EndPAD
$PAD
Sh "W7" C 0.5 0.5 0 0 0
Dr 0 0 0
At SMD N 00888000
Ne $1 ""
Po 5.99948 17.99844
.SolderMask 0.100076
.LocalClearance 0.0762
$EndPAD
$PAD
Sh "W8" C 0.5 0.5 0 0 0
Dr 0 0 0
At SMD N 00888000
Ne $1 ""
Po 6.9977 17.99844
.SolderMask 0.100076
.LocalClearance 0.0762
$EndPAD
$PAD
Sh "W9" C 0.5 0.5 0 0 0
Dr 0 0 0
At SMD N 00888000
Ne $1 ""
Po 7.99846 17.99844
.SolderMask 0.100076
.LocalClearance 0.0762
$EndPAD
$PAD
Sh "W10" C 0.5 0.5 0 0 0
Dr 0 0 0
At SMD N 00888000
Ne $1 ""
Po 8.99922 17.99844
.SolderMask 0.100076
.LocalClearance 0.0762
$EndPAD
$PAD
Sh "W11" C 0.5 0.5 0 0 0
Dr 0 0 0
At SMD N 00888000
Ne $1 ""
Po 9.99744 17.99844
.SolderMask 0.100076
.LocalClearance 0.0762
$EndPAD
$PAD
Sh "W12" C 0.5 0.5 0 0 0
Dr 0 0 0
At SMD N 00888000
Ne $1 ""
Po 10.9982 17.99844
.SolderMask 0.100076
.LocalClearance 0.0762
$EndPAD
$PAD
Sh "Y13" C 0.5 0.5 0 0 0
Dr 0 0 0
At SMD N 00888000
Ne $1 ""
Po 11.99896 18.9992
.SolderMask 0.100076
.LocalClearance 0.0762
$EndPAD
$PAD
Sh "Y14" C 0.5 0.5 0 0 0
Dr 0 0 0
At SMD N 00888000
Ne $1 ""
Po 12.99972 18.9992
.SolderMask 0.100076
.LocalClearance 0.0762
$EndPAD
$PAD
Sh "Y15" C 0.5 0.5 0 0 0
Dr 0 0 0
At SMD N 00888000
Ne $1 ""
Po 13.99794 18.9992
.SolderMask 0.100076
.LocalClearance 0.0762
$EndPAD
$PAD
Sh "Y16" C 0.5 0.5 0 0 0
Dr 0 0 0
At SMD N 00888000
Ne $1 ""
Po 14.9987 18.9992
.SolderMask 0.100076
.LocalClearance 0.0762
$EndPAD
$PAD
Sh "Y17" C 0.5 0.5 0 0 0
Dr 0 0 0
At SMD N 00888000
Ne $1 ""
Po 15.99946 18.9992
.SolderMask 0.100076
.LocalClearance 0.0762
$EndPAD
$PAD
Sh "Y18" C 0.5 0.5 0 0 0
Dr 0 0 0
At SMD N 00888000
Ne $1 ""
Po 16.99768 18.9992
.SolderMask 0.100076
.LocalClearance 0.0762
$EndPAD
$PAD
Sh "Y19" C 0.5 0.5 0 0 0
Dr 0 0 0
At SMD N 00888000
Ne $1 ""
Po 17.99844 18.9992
.SolderMask 0.100076
.LocalClearance 0.0762
$EndPAD
$PAD
Sh "Y20" C 0.5 0.5 0 0 0
Dr 0 0 0
At SMD N 00888000
Ne $1 ""
Po 18.9992 18.9992
.SolderMask 0.100076
.LocalClearance 0.0762
$EndPAD
$PAD
Sh "Y21" C 0.5 0.5 0 0 0
Dr 0 0 0
At SMD N 00888000
Ne $1 ""
Po 19.99742 18.9992
.SolderMask 0.100076
.LocalClearance 0.0762
$EndPAD
$PAD
Sh "Y22" C 0.5 0.5 0 0 0
Dr 0 0 0
At SMD N 00888000
Ne $1 ""
Po 20.99818 18.9992
.SolderMask 0.100076
.LocalClearance 0.0762
$EndPAD
$PAD
Sh "Y1" C 0.5 0.5 0 0 0
Dr 0 0 0
At SMD N 00888000
Ne $1 ""
Po 0 18.9992
.SolderMask 0.100076
.LocalClearance 0.0762
$EndPAD
$PAD
Sh "Y2" C 0.5 0.5 0 0 0
Dr 0 0 0
At SMD N 00888000
Ne $1 ""
Po 0.99822 18.9992
.SolderMask 0.100076
.LocalClearance 0.0762
$EndPAD
$PAD
Sh "Y3" C 0.5 0.5 0 0 0
Dr 0 0 0
At SMD N 00888000
Ne $1 ""
Po 1.99898 18.9992
.SolderMask 0.100076
.LocalClearance 0.0762
$EndPAD
$PAD
Sh "Y4" C 0.5 0.5 0 0 0
Dr 0 0 0
At SMD N 00888000
Ne $1 ""
Po 2.9972 18.9992
.SolderMask 0.100076
.LocalClearance 0.0762
$EndPAD
$PAD
Sh "Y5" C 0.5 0.5 0 0 0
Dr 0 0 0
At SMD N 00888000
Ne $1 ""
Po 3.99796 18.9992
.SolderMask 0.100076
.LocalClearance 0.0762
$EndPAD
$PAD
Sh "Y6" C 0.5 0.5 0 0 0
Dr 0 0 0
At SMD N 00888000
Ne $1 ""
Po 4.99872 18.9992
.SolderMask 0.100076
.LocalClearance 0.0762
$EndPAD
$PAD
Sh "Y7" C 0.5 0.5 0 0 0
Dr 0 0 0
At SMD N 00888000
Ne $1 ""
Po 5.99948 18.9992
.SolderMask 0.100076
.LocalClearance 0.0762
$EndPAD
$PAD
Sh "Y8" C 0.5 0.5 0 0 0
Dr 0 0 0
At SMD N 00888000
Ne $1 ""
Po 6.9977 18.9992
.SolderMask 0.100076
.LocalClearance 0.0762
$EndPAD
$PAD
Sh "Y9" C 0.5 0.5 0 0 0
Dr 0 0 0
At SMD N 00888000
Ne $1 ""
Po 7.99846 18.9992
.SolderMask 0.100076
.LocalClearance 0.0762
$EndPAD
$PAD
Sh "Y10" C 0.5 0.5 0 0 0
Dr 0 0 0
At SMD N 00888000
Ne $1 ""
Po 8.99922 18.9992
.SolderMask 0.100076
.LocalClearance 0.0762
$EndPAD
$PAD
Sh "Y11" C 0.5 0.5 0 0 0
Dr 0 0 0
At SMD N 00888000
Ne $1 ""
Po 9.99744 18.9992
.SolderMask 0.100076
.LocalClearance 0.0762
$EndPAD
$PAD
Sh "Y12" C 0.5 0.5 0 0 0
Dr 0 0 0
At SMD N 00888000
Ne $1 ""
Po 10.9982 18.9992
.SolderMask 0.100076
.LocalClearance 0.0762
$EndPAD
$PAD
Sh "AA13" C 0.5 0.5 0 0 0
Dr 0 0 0
At SMD N 00888000
Ne $1 ""
Po 11.99896 19.99742
.SolderMask 0.100076
.LocalClearance 0.0762
$EndPAD
$PAD
Sh "AA14" C 0.5 0.5 0 0 0
Dr 0 0 0
At SMD N 00888000
Ne $1 ""
Po 12.99972 19.99742
.SolderMask 0.100076
.LocalClearance 0.0762
$EndPAD
$PAD
Sh "AA15" C 0.5 0.5 0 0 0
Dr 0 0 0
At SMD N 00888000
Ne $1 ""
Po 13.99794 19.99742
.SolderMask 0.100076
.LocalClearance 0.0762
$EndPAD
$PAD
Sh "AA16" C 0.5 0.5 0 0 0
Dr 0 0 0
At SMD N 00888000
Ne $1 ""
Po 14.9987 19.99742
.SolderMask 0.100076
.LocalClearance 0.0762
$EndPAD
$PAD
Sh "AA17" C 0.5 0.5 0 0 0
Dr 0 0 0
At SMD N 00888000
Ne $1 ""
Po 15.99946 19.99742
.SolderMask 0.100076
.LocalClearance 0.0762
$EndPAD
$PAD
Sh "AA18" C 0.5 0.5 0 0 0
Dr 0 0 0
At SMD N 00888000
Ne $1 ""
Po 16.99768 19.99742
.SolderMask 0.100076
.LocalClearance 0.0762
$EndPAD
$PAD
Sh "AA19" C 0.5 0.5 0 0 0
Dr 0 0 0
At SMD N 00888000
Ne $1 ""
Po 17.99844 19.99742
.SolderMask 0.100076
.LocalClearance 0.0762
$EndPAD
$PAD
Sh "AA20" C 0.5 0.5 0 0 0
Dr 0 0 0
At SMD N 00888000
Ne $1 ""
Po 18.9992 19.99742
.SolderMask 0.100076
.LocalClearance 0.0762
$EndPAD
$PAD
Sh "AA21" C 0.5 0.5 0 0 0
Dr 0 0 0
At SMD N 00888000
Ne $1 ""
Po 19.99742 19.99742
.SolderMask 0.100076
.LocalClearance 0.0762
$EndPAD
$PAD
Sh "AA22" C 0.5 0.5 0 0 0
Dr 0 0 0
At SMD N 00888000
Ne $1 ""
Po 20.99818 19.99742
.SolderMask 0.100076
.LocalClearance 0.0762
$EndPAD
$PAD
Sh "AA1" C 0.5 0.5 0 0 0
Dr 0 0 0
At SMD N 00888000
Ne $1 ""
Po 0 19.99742
.SolderMask 0.100076
.LocalClearance 0.0762
$EndPAD
$PAD
Sh "AA2" C 0.5 0.5 0 0 0
Dr 0 0 0
At SMD N 00888000
Ne $1 ""
Po 0.99822 19.99742
.SolderMask 0.100076
.LocalClearance 0.0762
$EndPAD
$PAD
Sh "AA3" C 0.5 0.5 0 0 0
Dr 0 0 0
At SMD N 00888000
Ne $1 ""
Po 1.99898 19.99742
.SolderMask 0.100076
.LocalClearance 0.0762
$EndPAD
$PAD
Sh "AA4" C 0.5 0.5 0 0 0
Dr 0 0 0
At SMD N 00888000
Ne $1 ""
Po 2.9972 19.99742
.SolderMask 0.100076
.LocalClearance 0.0762
$EndPAD
$PAD
Sh "AA5" C 0.5 0.5 0 0 0
Dr 0 0 0
At SMD N 00888000
Ne $1 ""
Po 3.99796 19.99742
.SolderMask 0.100076
.LocalClearance 0.0762
$EndPAD
$PAD
Sh "AA6" C 0.5 0.5 0 0 0
Dr 0 0 0
At SMD N 00888000
Ne $1 ""
Po 4.99872 19.99742
.SolderMask 0.100076
.LocalClearance 0.0762
$EndPAD
$PAD
Sh "AA7" C 0.5 0.5 0 0 0
Dr 0 0 0
At SMD N 00888000
Ne $1 ""
Po 5.99948 19.99742
.SolderMask 0.100076
.LocalClearance 0.0762
$EndPAD
$PAD
Sh "AA8" C 0.5 0.5 0 0 0
Dr 0 0 0
At SMD N 00888000
Ne $1 ""
Po 6.9977 19.99742
.SolderMask 0.100076
.LocalClearance 0.0762
$EndPAD
$PAD
Sh "AA9" C 0.5 0.5 0 0 0
Dr 0 0 0
At SMD N 00888000
Ne $1 ""
Po 7.99846 19.99742
.SolderMask 0.100076
.LocalClearance 0.0762
$EndPAD
$PAD
Sh "AA10" C 0.5 0.5 0 0 0
Dr 0 0 0
At SMD N 00888000
Ne $1 ""
Po 8.99922 19.99742
.SolderMask 0.100076
.LocalClearance 0.0762
$EndPAD
$PAD
Sh "AA11" C 0.5 0.5 0 0 0
Dr 0 0 0
At SMD N 00888000
Ne $1 ""
Po 9.99744 19.99742
.SolderMask 0.100076
.LocalClearance 0.0762
$EndPAD
$PAD
Sh "AA12" C 0.5 0.5 0 0 0
Dr 0 0 0
At SMD N 00888000
Ne $1 ""
Po 10.9982 19.99742
.SolderMask 0.100076
.LocalClearance 0.0762
$EndPAD
$PAD
Sh "AB13" C 0.5 0.5 0 0 0
Dr 0 0 0
At SMD N 00888000
Ne $1 ""
Po 11.99896 20.99818
.SolderMask 0.100076
.LocalClearance 0.0762
$EndPAD
$PAD
Sh "AB14" C 0.5 0.5 0 0 0
Dr 0 0 0
At SMD N 00888000
Ne $1 ""
Po 12.99972 20.99818
.SolderMask 0.100076
.LocalClearance 0.0762
$EndPAD
$PAD
Sh "AB15" C 0.5 0.5 0 0 0
Dr 0 0 0
At SMD N 00888000
Ne $1 ""
Po 13.99794 20.99818
.SolderMask 0.100076
.LocalClearance 0.0762
$EndPAD
$PAD
Sh "AB16" C 0.5 0.5 0 0 0
Dr 0 0 0
At SMD N 00888000
Ne $1 ""
Po 14.9987 20.99818
.SolderMask 0.100076
.LocalClearance 0.0762
$EndPAD
$PAD
Sh "AB17" C 0.5 0.5 0 0 0
Dr 0 0 0
At SMD N 00888000
Ne $1 ""
Po 15.99946 20.99818
.SolderMask 0.100076
.LocalClearance 0.0762
$EndPAD
$PAD
Sh "AB18" C 0.5 0.5 0 0 0
Dr 0 0 0
At SMD N 00888000
Ne $1 ""
Po 16.99768 20.99818
.SolderMask 0.100076
.LocalClearance 0.0762
$EndPAD
$PAD
Sh "AB19" C 0.5 0.5 0 0 0
Dr 0 0 0
At SMD N 00888000
Ne $1 ""
Po 17.99844 20.99818
.SolderMask 0.100076
.LocalClearance 0.0762
$EndPAD
$PAD
Sh "AB20" C 0.5 0.5 0 0 0
Dr 0 0 0
At SMD N 00888000
Ne $1 ""
Po 18.9992 20.99818
.SolderMask 0.100076
.LocalClearance 0.0762
$EndPAD
$PAD
Sh "AB21" C 0.5 0.5 0 0 0
Dr 0 0 0
At SMD N 00888000
Ne $1 ""
Po 19.99742 20.99818
.SolderMask 0.100076
.LocalClearance 0.0762
$EndPAD
$PAD
Sh "AB22" C 0.5 0.5 0 0 0
Dr 0 0 0
At SMD N 00888000
Ne $1 ""
Po 20.99818 20.99818
.SolderMask 0.100076
.LocalClearance 0.0762
$EndPAD
$PAD
Sh "AB1" C 0.5 0.5 0 0 0
Dr 0 0 0
At SMD N 00888000
Ne $1 ""
Po 0 20.99818
.SolderMask 0.100076
.LocalClearance 0.0762
$EndPAD
$PAD
Sh "AB2" C 0.5 0.5 0 0 0
Dr 0 0 0
At SMD N 00888000
Ne $1 ""
Po 0.99822 20.99818
.SolderMask 0.100076
.LocalClearance 0.0762
$EndPAD
$PAD
Sh "AB3" C 0.5 0.5 0 0 0
Dr 0 0 0
At SMD N 00888000
Ne $1 ""
Po 1.99898 20.99818
.SolderMask 0.100076
.LocalClearance 0.0762
$EndPAD
$PAD
Sh "AB4" C 0.5 0.5 0 0 0
Dr 0 0 0
At SMD N 00888000
Ne $1 ""
Po 2.9972 20.99818
.SolderMask 0.100076
.LocalClearance 0.0762
$EndPAD
$PAD
Sh "AB5" C 0.5 0.5 0 0 0
Dr 0 0 0
At SMD N 00888000
Ne $1 ""
Po 3.99796 20.99818
.SolderMask 0.100076
.LocalClearance 0.0762
$EndPAD
$PAD
Sh "AB6" C 0.5 0.5 0 0 0
Dr 0 0 0
At SMD N 00888000
Ne $1 ""
Po 4.99872 20.99818
.SolderMask 0.100076
.LocalClearance 0.0762
$EndPAD
$PAD
Sh "AB7" C 0.5 0.5 0 0 0
Dr 0 0 0
At SMD N 00888000
Ne $1 ""
Po 5.99948 20.99818
.SolderMask 0.100076
.LocalClearance 0.0762
$EndPAD
$PAD
Sh "AB8" C 0.5 0.5 0 0 0
Dr 0 0 0
At SMD N 00888000
Ne $1 ""
Po 6.9977 20.99818
.SolderMask 0.100076
.LocalClearance 0.0762
$EndPAD
$PAD
Sh "AB9" C 0.5 0.5 0 0 0
Dr 0 0 0
At SMD N 00888000
Ne $1 ""
Po 7.99846 20.99818
.SolderMask 0.100076
.LocalClearance 0.0762
$EndPAD
$PAD
Sh "AB10" C 0.5 0.5 0 0 0
Dr 0 0 0
At SMD N 00888000
Ne $1 ""
Po 8.99922 20.99818
.SolderMask 0.100076
.LocalClearance 0.0762
$EndPAD
$PAD
Sh "AB11" C 0.5 0.5 0 0 0
Dr 0 0 0
At SMD N 00888000
Ne $1 ""
Po 9.99744 20.99818
.SolderMask 0.100076
.LocalClearance 0.0762
$EndPAD
$PAD
Sh "AB12" C 0.5 0.5 0 0 0
Dr 0 0 0
At SMD N 00888000
Ne $1 ""
Po 10.9982 20.99818
.SolderMask 0.100076
.LocalClearance 0.0762
$EndPAD
$EndMODULE XC6SLX45
$EndLIBRARY
