EESchema Schematic File Version 2
LIBS:sn65hvd3083edgsr
LIBS:conn
LIBS:power
LIBS:pspice
LIBS:zl40216
LIBS:sfp
LIBS:FIN1108
LIBS:sn65lvds389
LIBS:max5825baup
LIBS:tps72301dbvr
LIBS:ina195a
LIBS:tps78630kttt
LIBS:tps73501drbt
LIBS:lt3015eq
LIBS:lt1086cm-3
LIBS:tps72012drvt
LIBS:ina202a
LIBS:transistors
LIBS:2sk3019
LIBS:sn74hc05d
LIBS:ad7998
LIBS:ao3401a
LIBS:opa703
LIBS:6slx45fgg484pkg
LIBS:ERM8-RA
LIBS:cdclvd1204
LIBS:sy89835u
LIBS:zl40212
LIBS:opa4703ea
LIBS:tps73201qdbvrq1
LIBS:m25p32
LIBS:bav99
LIBS:si590
LIBS:iso7242c
LIBS:lmk00304
LIBS:pins_14x2
LIBS:ds18b20u
LIBS:2x14_conn
LIBS:led
LIBS:LogicBoard-cache
EELAYER 24 0
EELAYER END
$Descr A4 11693 8268
encoding utf-8
Sheet 20 23
Title ""
Date "1 dec 2015"
Rev ""
Comp ""
Comment1 ""
Comment2 ""
Comment3 ""
Comment4 ""
$EndDescr
NoConn ~ 3300 3900
NoConn ~ 4800 3900
NoConn ~ 6800 3900
NoConn ~ 600  3900
NoConn ~ 10400 3900
NoConn ~ 10300 3900
NoConn ~ 10200 3900
NoConn ~ 10100 3900
NoConn ~ 10000 3900
NoConn ~ 9900 3900
NoConn ~ 9800 3900
NoConn ~ 9700 3900
NoConn ~ 9600 3900
NoConn ~ 9400 3900
NoConn ~ 9200 3900
NoConn ~ 9000 3900
NoConn ~ 8900 3900
NoConn ~ 8800 3900
NoConn ~ 8700 3900
NoConn ~ 8600 3900
NoConn ~ 8500 3900
NoConn ~ 8400 3900
NoConn ~ 8300 3900
NoConn ~ 8200 3900
NoConn ~ 8100 3900
NoConn ~ 8000 3900
NoConn ~ 7800 3900
NoConn ~ 7700 3900
NoConn ~ 7600 3900
NoConn ~ 7500 3900
NoConn ~ 7400 3900
NoConn ~ 7100 3900
NoConn ~ 7000 3900
NoConn ~ 6700 3900
NoConn ~ 6600 3900
NoConn ~ 6300 3900
NoConn ~ 6200 3900
NoConn ~ 6000 3900
NoConn ~ 5600 3900
NoConn ~ 5500 3900
NoConn ~ 5400 3900
NoConn ~ 5300 3900
NoConn ~ 5200 3900
NoConn ~ 5100 3900
NoConn ~ 5000 3900
NoConn ~ 4700 3900
NoConn ~ 4600 3900
NoConn ~ 4300 3900
NoConn ~ 4200 3900
NoConn ~ 4100 3900
NoConn ~ 4000 3900
NoConn ~ 3100 3900
NoConn ~ 3000 3900
NoConn ~ 2900 3900
NoConn ~ 2800 3900
NoConn ~ 2700 3900
NoConn ~ 2600 3900
NoConn ~ 2500 3900
NoConn ~ 2400 3900
NoConn ~ 2300 3900
NoConn ~ 2200 3900
NoConn ~ 2100 3900
NoConn ~ 2000 3900
NoConn ~ 1900 3900
NoConn ~ 1800 3900
$Comp
L C C60
U 1 1 5467E6A6
P 4050 1600
F 0 "C60" V 4150 1750 50  0000 C CNN
F 1 "0.47uF LO ESR" V 4250 1550 50  0000 C CNN
F 2 "SM0402" H 4050 1600 60  0001 C CNN
F 3 "" H 4050 1600 60  0001 C CNN
F 4 "GRM155R60J474KE19D" V 8650 1700 60  0001 C CNN "Field1"
	1    4050 1600
	1    0    0    -1  
$EndComp
$Comp
L C C59
U 1 1 5467E6A2
P 3650 1600
F 0 "C59" V 3750 1750 50  0000 C CNN
F 1 "0.47uF LO ESR" V 3850 1550 50  0000 C CNN
F 2 "SM0402" H 3650 1600 60  0001 C CNN
F 3 "" H 3650 1600 60  0001 C CNN
F 4 "GRM155R60J474KE19D" V 8650 1700 60  0001 C CNN "Field1"
	1    3650 1600
	1    0    0    -1  
$EndComp
$Comp
L GND #PWR0135
U 1 1 5467E690
P 1800 2000
F 0 "#PWR0135" H 1800 2000 30  0001 C CNN
F 1 "GND" H 1800 1930 30  0001 C CNN
F 2 "" H 1800 2000 60  0001 C CNN
F 3 "" H 1800 2000 60  0001 C CNN
	1    1800 2000
	1    0    0    -1  
$EndComp
$Comp
L C C57
U 1 1 5467E68F
P 2850 1600
F 0 "C57" V 2950 1750 50  0000 C CNN
F 1 "0.47uF LO ESR" V 3050 1550 50  0000 C CNN
F 2 "SM0402" H 2850 1600 60  0001 C CNN
F 3 "" H 2850 1600 60  0001 C CNN
F 4 "GRM155R60J474KE19D" V 8650 1700 60  0001 C CNN "Field1"
	1    2850 1600
	1    0    0    -1  
$EndComp
$Comp
L C C58
U 1 1 5467E68E
P 3250 1600
F 0 "C58" V 3350 1750 50  0000 C CNN
F 1 "0.47uF LO ESR" V 3450 1550 50  0000 C CNN
F 2 "SM0402" H 3250 1600 60  0001 C CNN
F 3 "" H 3250 1600 60  0001 C CNN
F 4 "GRM155R60J474KE19D" V 8650 1700 60  0001 C CNN "Field1"
	1    3250 1600
	1    0    0    -1  
$EndComp
$Comp
L C C56
U 1 1 5467E68D
P 2450 1600
F 0 "C56" V 2550 1750 50  0000 C CNN
F 1 "4.7uF LO ESR" V 2650 1600 50  0000 C CNN
F 2 "SM0805" H 2450 1600 60  0001 C CNN
F 3 "" H 2450 1600 60  0001 C CNN
F 4 "LMK212B7475KG-T" V 7850 1700 60  0001 C CNN "Field1"
	1    2450 1600
	1    0    0    -1  
$EndComp
$Comp
L C C55
U 1 1 5467E68C
P 2050 1600
F 0 "C55" V 2150 1750 50  0000 C CNN
F 1 "100uF LO ESR" V 2250 1600 50  0000 C CNN
F 2 "SM1210" H 2050 1600 60  0001 C CNN
F 3 "" H 2050 1600 60  0001 C CNN
F 4 "GRM32ER60J107ME20L" V 7450 1700 60  0001 C CNN "Field1"
	1    2050 1600
	1    0    0    -1  
$EndComp
$Comp
L +3.3V #PWR0136
U 1 1 5467E68B
P 1800 1250
F 0 "#PWR0136" H 1800 1210 30  0001 C CNN
F 1 "+3.3V" H 1800 1360 30  0000 C CNN
F 2 "" H 1800 1250 60  0001 C CNN
F 3 "" H 1800 1250 60  0001 C CNN
	1    1800 1250
	1    0    0    -1  
$EndComp
$Comp
L 6SLX45FGG484PKG U16
U 4 1 5461B1A8
P 2200 3400
F 0 "U16" H 3400 5150 60  0000 C CNN
F 1 "6SLX45FGG484PKG" H 2250 5150 60  0000 C CNN
F 2 "XC6SLX45" H 2200 3400 60  0001 C CNN
F 3 "" H 2200 3400 60  0001 C CNN
	4    2200 3400
	0    -1   -1   0   
$EndComp
Text HLabel 5800 4150 3    60   Output ~ 0
EN1V6
Text HLabel 1600 5400 0    60   Output ~ 0
TDC_TP_EN[3..1]
Text HLabel 800  4600 0    60   Output ~ 0
TDC_TP[7..2]
Text Label 1000 4500 1    60   ~ 0
TDC_TP4
Text Label 3500 5300 1    60   ~ 0
TDC_TP_EN2
Text Label 5700 5300 1    60   ~ 0
TDC_TP_EN3
Text Label 1700 5300 1    60   ~ 0
TDC_TP_EN1
Entry Wire Line
	3500 5300 3600 5400
Entry Wire Line
	5600 5400 5700 5300
Entry Wire Line
	1700 5300 1800 5400
Text Label 1100 4500 1    60   ~ 0
TDC_TP5
Text Label 3700 4500 1    60   ~ 0
TDC_TP2
Text Label 4500 4500 1    60   ~ 0
TDC_TP3
Text Label 4900 4500 1    60   ~ 0
TDC_TP6
Text Label 3900 4500 1    60   ~ 0
TDC_TP7
Entry Wire Line
	4900 4500 5000 4600
Entry Wire Line
	3900 4500 4000 4600
Entry Wire Line
	1000 4500 1100 4600
Entry Wire Line
	1100 4500 1200 4600
Entry Wire Line
	3700 4500 3800 4600
Entry Wire Line
	4400 4600 4500 4500
NoConn ~ 1400 3900
NoConn ~ 1500 3900
NoConn ~ 1600 3900
NoConn ~ 3600 3900
Text Notes 5850 5250 0    60   ~ 12
C5 10Mhz clock in\nMake sure we can mux this \nwith an internal clock.
Text HLabel 5900 4750 3    60   Input ~ 0
CLK_IN
NoConn ~ 6100 3900
NoConn ~ 6400 3900
NoConn ~ 6500 3900
NoConn ~ 6900 3900
NoConn ~ 7200 3900
NoConn ~ 7300 3900
NoConn ~ 7900 3900
NoConn ~ 3400 3900
NoConn ~ 4400 3900
NoConn ~ 3800 3900
Entry Wire Line
	9200 4450 9300 4350
Entry Wire Line
	9400 4450 9500 4350
Entry Wire Line
	10400 4450 10500 4350
Entry Wire Line
	9000 4450 9100 4350
Text Label 9100 4300 1    60   ~ 0
GPIO3
Text Label 9300 4300 1    60   ~ 0
GPIO2
Text Label 9500 4300 1    60   ~ 0
GPIO1
Text Label 10500 4300 1    60   ~ 0
GPIO0
Connection ~ 1400 1800
Wire Wire Line
	1400 1800 1400 1900
Connection ~ 1200 1800
Wire Wire Line
	1200 1800 1200 1900
Connection ~ 1000 1800
Wire Wire Line
	1000 1800 1000 1900
Connection ~ 800  1800
Wire Wire Line
	800  1800 800  1900
Connection ~ 600  1800
Wire Wire Line
	600  1800 1600 1800
Wire Wire Line
	1600 1800 1600 1900
Connection ~ 3650 1250
Wire Wire Line
	3650 1250 3650 1350
Connection ~ 3650 1950
Wire Wire Line
	3650 1950 3650 1850
Connection ~ 2450 1950
Wire Wire Line
	2450 1950 2450 1850
Wire Wire Line
	1800 2000 1800 1950
Wire Wire Line
	3250 1950 3250 1850
Connection ~ 2450 1250
Wire Wire Line
	2450 1250 2450 1350
Connection ~ 1800 1250
Wire Wire Line
	3250 1250 3250 1350
Wire Wire Line
	2850 1250 2850 1350
Connection ~ 2850 1250
Wire Wire Line
	2050 1250 2050 1350
Connection ~ 2050 1250
Wire Wire Line
	2050 1850 2050 1950
Connection ~ 2050 1950
Wire Wire Line
	2850 1950 2850 1850
Connection ~ 2850 1950
Wire Wire Line
	1800 1950 4050 1950
Wire Wire Line
	4050 1950 4050 1850
Connection ~ 3250 1950
Wire Wire Line
	4050 1250 4050 1350
Connection ~ 3250 1250
Wire Wire Line
	600  1250 600  1900
Wire Wire Line
	600  1250 4050 1250
Wire Wire Line
	700  1900 700  1800
Connection ~ 700  1800
Wire Wire Line
	900  1900 900  1800
Connection ~ 900  1800
Wire Wire Line
	1100 1900 1100 1800
Connection ~ 1100 1800
Wire Wire Line
	1300 1900 1300 1800
Connection ~ 1300 1800
Wire Wire Line
	1500 1900 1500 1800
Connection ~ 1500 1800
Wire Wire Line
	1700 3900 1700 5300
Wire Wire Line
	5700 3900 5700 5300
Wire Wire Line
	3500 3900 3500 5300
Wire Wire Line
	3700 3900 3700 4500
Wire Wire Line
	4500 3900 4500 4500
Wire Bus Line
	800  4600 5800 4600
Wire Bus Line
	1600 5400 5600 5400
Wire Wire Line
	1000 3900 1000 4500
Wire Wire Line
	1100 3900 1100 4500
Wire Wire Line
	4900 3900 4900 4500
Wire Wire Line
	3900 3900 3900 4500
Wire Wire Line
	5800 3900 5800 4150
Wire Wire Line
	5900 4750 5900 3900
Wire Wire Line
	9500 3900 9500 4350
Wire Wire Line
	9300 3900 9300 4350
Wire Wire Line
	10500 3900 10500 4350
Wire Wire Line
	9100 3900 9100 4350
Wire Bus Line
	8350 4450 10400 4450
Text HLabel 8350 4450 0    60   BiDi ~ 0
GPIO[3..0]
$EndSCHEMATC
