PCBNEW-LibModule-V1  Fri 21 Nov 2014 04:59:08 PM EST
# encoding utf-8
Units mm
$INDEX
87832-1420
$EndINDEX
$MODULE 87832-1420
Po 0 0 0 15 546FB59F 00000000 ~~
Li 87832-1420
Sc 0
AR 
Op 0 0 0
T0 0 -4.826 1 1 0 0.15 N I 21 N "87832-1420"
T1 0 4.826 1 1 0 0.15 N V 21 N "VAL**"
DC -7.874 4.1656 -7.7216 3.5814 0.15 21
DS 8.325 3.15 7 3.15 0.15 21
DS 8.325 -3.15 7 -3.15 0.15 21
DS -8.325 3.15 -7 3.15 0.15 21
DS -8.325 -3.15 -8.325 3.15 0.15 21
DS -8.325 -3.15 -7 -3.15 0.15 21
DS 8.325 -3.15 8.325 3.15 0.15 21
$PAD
Sh "11" R 1 2.75 0 0 0
Dr 0 0 0
At SMD N 00888000
Ne 0 ""
Po 4 2.125
$EndPAD
$PAD
Sh "12" R 1 2.75 0 0 0
Dr 0 0 0
At SMD N 00888000
Ne 0 ""
Po 4 -2.125
$EndPAD
$PAD
Sh "9" R 1 2.75 0 0 0
Dr 0 0 0
At SMD N 00888000
Ne 0 ""
Po 2 2.125
$EndPAD
$PAD
Sh "10" R 1 2.75 0 0 0
Dr 0 0 0
At SMD N 00888000
Ne 0 ""
Po 2 -2.125
$EndPAD
$PAD
Sh "14" R 1 2.75 0 0 0
Dr 0 0 0
At SMD N 00888000
Ne 0 ""
Po 6 -2.125
$EndPAD
$PAD
Sh "13" R 1 2.75 0 0 0
Dr 0 0 0
At SMD N 00888000
Ne 0 ""
Po 6 2.125
$EndPAD
$PAD
Sh "7" R 1 2.75 0 0 0
Dr 0 0 0
At SMD N 00888000
Ne 0 ""
Po 0 2.125
$EndPAD
$PAD
Sh "8" R 1 2.75 0 0 0
Dr 0 0 0
At SMD N 00888000
Ne 0 ""
Po 0 -2.125
$EndPAD
$PAD
Sh "5" R 1 2.75 0 0 0
Dr 0 0 0
At SMD N 00888000
Ne 0 ""
Po -2 2.125
$EndPAD
$PAD
Sh "6" R 1 2.75 0 0 0
Dr 0 0 0
At SMD N 00888000
Ne 0 ""
Po -2 -2.125
$EndPAD
$PAD
Sh "2" R 1 2.75 0 0 0
Dr 0 0 0
At SMD N 00888000
Ne 0 ""
Po -6 -2.125
$EndPAD
$PAD
Sh "1" R 1 2.75 0 0 0
Dr 0 0 0
At SMD N 00888000
Ne 0 ""
Po -6 2.125
$EndPAD
$PAD
Sh "4" R 1 2.75 0 0 0
Dr 0 0 0
At SMD N 00888000
Ne 0 ""
Po -4 -2.125
$EndPAD
$PAD
Sh "3" R 1 2.75 0 0 0
Dr 0 0 0
At SMD N 00888000
Ne 0 ""
Po -4 2.125
$EndPAD
$PAD
Sh "" C 1 1 0 0 0
Dr 1 0 0
At HOLE N 00E0FFFF
Ne 0 ""
Po -5 0
$EndPAD
$PAD
Sh "" C 1 1 0 0 0
Dr 1 0 0
At HOLE N 00E0FFFF
Ne 0 ""
Po 5 0
$EndPAD
$EndMODULE 87832-1420
$EndLIBRARY
