EESchema Schematic File Version 2
LIBS:sn65hvd3083edgsr
LIBS:conn
LIBS:power
LIBS:pspice
LIBS:iso7221a
LIBS:zl40216
LIBS:sfp
LIBS:si590
LIBS:FIN1108
LIBS:bav99
LIBS:LogicBoard-cache
EELAYER 24 0
EELAYER END
$Descr A4 11693 8268
encoding utf-8
Sheet 7 14
Title ""
Date ""
Rev ""
Comp ""
Comment1 ""
Comment2 ""
Comment3 ""
Comment4 ""
$EndDescr
$Comp
L R R14
U 1 1 544830D1
P 3500 2550
AR Path="/5446A203/544830BC/544830D1" Ref="R14"  Part="1" 
AR Path="/5446A203/5448407D/544830D1" Ref="R17"  Part="1" 
AR Path="/5446A203/54485494/544830D1" Ref="R20"  Part="1" 
AR Path="/5446A203/544854A1/544830D1" Ref="R23"  Part="1" 
AR Path="/5446A203/544861CE/544830D1" Ref="R26"  Part="1" 
AR Path="/5446A203/544861DB/544830D1" Ref="R29"  Part="1" 
AR Path="/5446A203/544861E8/544830D1" Ref="R32"  Part="1" 
AR Path="/5446A203/544861F5/544830D1" Ref="R35"  Part="1" 
F 0 "R14" V 3580 2550 50  0000 C CNN
F 1 "100" V 3500 2550 50  0000 C CNN
F 2 "" H 3500 2550 60  0000 C CNN
F 3 "" H 3500 2550 60  0000 C CNN
	1    3500 2550
	1    0    0    1   
$EndComp
$Comp
L -1.6V #PWR018
U 1 1 544830DD
P 4550 3650
AR Path="/5446A203/544830BC/544830DD" Ref="#PWR018"  Part="1" 
AR Path="/5446A203/5448407D/544830DD" Ref="#PWR019"  Part="1" 
AR Path="/5446A203/54485494/544830DD" Ref="#PWR020"  Part="1" 
AR Path="/5446A203/544854A1/544830DD" Ref="#PWR021"  Part="1" 
AR Path="/5446A203/544861CE/544830DD" Ref="#PWR022"  Part="1" 
AR Path="/5446A203/544861DB/544830DD" Ref="#PWR023"  Part="1" 
AR Path="/5446A203/544861E8/544830DD" Ref="#PWR024"  Part="1" 
AR Path="/5446A203/544861F5/544830DD" Ref="#PWR025"  Part="1" 
F 0 "#PWR018" H 4550 3790 20  0001 C CNN
F 1 "-1.6V" H 4550 3760 30  0000 C CNN
F 2 "" H 4550 3650 60  0000 C CNN
F 3 "" H 4550 3650 60  0000 C CNN
	1    4550 3650
	1    0    0    -1  
$EndComp
$Comp
L C C16
U 1 1 544830E4
P 3900 3050
AR Path="/5446A203/544830BC/544830E4" Ref="C16"  Part="1" 
AR Path="/5446A203/5448407D/544830E4" Ref="C19"  Part="1" 
AR Path="/5446A203/54485494/544830E4" Ref="C22"  Part="1" 
AR Path="/5446A203/544854A1/544830E4" Ref="C25"  Part="1" 
AR Path="/5446A203/544861CE/544830E4" Ref="C28"  Part="1" 
AR Path="/5446A203/544861DB/544830E4" Ref="C31"  Part="1" 
AR Path="/5446A203/544861E8/544830E4" Ref="C34"  Part="1" 
AR Path="/5446A203/544861F5/544830E4" Ref="C37"  Part="1" 
F 0 "C16" V 4000 3200 50  0000 C CNN
F 1 "0.1uF" V 4000 2900 50  0000 C CNN
F 2 "" H 3900 3050 60  0000 C CNN
F 3 "" H 3900 3050 60  0000 C CNN
	1    3900 3050
	0    -1   1    0   
$EndComp
$Comp
L C C18
U 1 1 544830EA
P 3900 2050
AR Path="/5446A203/544830BC/544830EA" Ref="C18"  Part="1" 
AR Path="/5446A203/5448407D/544830EA" Ref="C21"  Part="1" 
AR Path="/5446A203/54485494/544830EA" Ref="C24"  Part="1" 
AR Path="/5446A203/544854A1/544830EA" Ref="C27"  Part="1" 
AR Path="/5446A203/544861CE/544830EA" Ref="C30"  Part="1" 
AR Path="/5446A203/544861DB/544830EA" Ref="C33"  Part="1" 
AR Path="/5446A203/544861E8/544830EA" Ref="C36"  Part="1" 
AR Path="/5446A203/544861F5/544830EA" Ref="C39"  Part="1" 
F 0 "C18" V 3800 2200 50  0000 C CNN
F 1 "0.1uF" V 3800 1900 50  0000 C CNN
F 2 "" H 3900 2050 60  0000 C CNN
F 3 "" H 3900 2050 60  0000 C CNN
	1    3900 2050
	0    -1   1    0   
$EndComp
Text HLabel 3200 3050 0    60   Input ~ 0
IN_P
Text HLabel 3200 2050 0    60   Input ~ 0
IN_N
Text HLabel 4650 2300 2    60   Output ~ 0
OUT_N
Text HLabel 4650 2800 2    60   Output ~ 0
OUT_P
Connection ~ 4350 2050
Connection ~ 4350 3050
Wire Wire Line
	3200 3050 3650 3050
Wire Wire Line
	3650 2050 3200 2050
$Comp
L R R?
U 1 1 544E8902
P 4350 2550
F 0 "R?" V 4430 2550 50  0000 C CNN
F 1 "100" V 4350 2550 50  0000 C CNN
F 2 "" H 4350 2550 60  0000 C CNN
F 3 "" H 4350 2550 60  0000 C CNN
	1    4350 2550
	1    0    0    1   
$EndComp
Wire Wire Line
	4350 2800 4350 3150
Wire Wire Line
	4350 1950 4350 2300
Wire Wire Line
	3500 2800 3500 3050
Connection ~ 3500 3050
Wire Wire Line
	3500 2300 3500 2050
Connection ~ 3500 2050
$Comp
L +1.6V #PWR?
U 1 1 544E893B
P 4350 1350
F 0 "#PWR?" H 4350 1490 20  0001 C CNN
F 1 "+1.6V" H 4350 1460 30  0000 C CNN
F 2 "" H 4350 1350 60  0000 C CNN
F 3 "" H 4350 1350 60  0000 C CNN
	1    4350 1350
	1    0    0    -1  
$EndComp
$Comp
L R R?
U 1 1 544E8963
P 4350 1700
F 0 "R?" V 4430 1700 50  0000 C CNN
F 1 "R" V 4350 1700 50  0000 C CNN
F 2 "" H 4350 1700 60  0000 C CNN
F 3 "" H 4350 1700 60  0000 C CNN
	1    4350 1700
	1    0    0    -1  
$EndComp
$Comp
L R R?
U 1 1 544E8977
P 4350 3400
F 0 "R?" V 4430 3400 50  0000 C CNN
F 1 "R" V 4350 3400 50  0000 C CNN
F 2 "" H 4350 3400 60  0000 C CNN
F 3 "" H 4350 3400 60  0000 C CNN
	1    4350 3400
	1    0    0    -1  
$EndComp
Wire Wire Line
	4350 1350 4350 1450
Wire Wire Line
	4350 3650 4550 3650
Wire Wire Line
	4150 2050 4350 2050
Wire Wire Line
	4150 3050 4350 3050
Wire Wire Line
	4350 2800 4650 2800
Wire Wire Line
	4350 2300 4650 2300
$EndSCHEMATC
