PCBNEW-LibModule-V1  Fri 19 Dec 2014 10:18:08 AM EST
# encoding utf-8
Units mm
$INDEX
DB9
$EndINDEX
$MODULE DB9
Po 0 0 0 15 549441AA 00000000 ~~
Li DB9
Sc 0
AR 
Op 0 0 0
T0 0 16.5608 1 1 0 0.15 N V 21 N "DB9"
T1 0 14.5542 1 1 0 0.15 N V 21 N "VAL**"
DS 15.405 9.5 15.405 -3 0.15 21
DS -15.405 9.5 -15.405 -3 0.15 21
DS -15.405 -3 15.405 -3 0.15 21
DS -8.47 15.3 -8.47 9.5 0.15 21
DS 8.47 15.3 8.47 9.5 0.15 21
DS -15.405 9.5 15.405 9.5 0.15 21
DS -8.47 15.3 8.47 15.3 0.15 21
$PAD
Sh "6" C 2 2 0 0 0
Dr 1.27 0 0
At STD N 00E0FFFF
Ne 0 ""
Po -4.155 1.42
$EndPAD
$PAD
Sh "7" C 2 2 0 0 0
Dr 1.27 0 0
At STD N 00E0FFFF
Ne 0 ""
Po -1.385 1.42
$EndPAD
$PAD
Sh "9" C 2 2 0 0 0
Dr 1.27 0 0
At STD N 00E0FFFF
Ne 0 ""
Po 4.155 1.42
$EndPAD
$PAD
Sh "8" C 2 2 0 0 0
Dr 1.27 0 0
At STD N 00E0FFFF
Ne 0 ""
Po 1.385 1.42
$EndPAD
$PAD
Sh "1" C 2 2 0 0 0
Dr 1.27 0 0
At STD N 00E0FFFF
Ne 0 ""
Po -5.54 -1.42
$EndPAD
$PAD
Sh "2" C 2 2 0 0 0
Dr 1.27 0 0
At STD N 00E0FFFF
Ne 0 ""
Po -2.77 -1.42
$EndPAD
$PAD
Sh "3" C 2 2 0 0 0
Dr 1.27 0 0
At STD N 00E0FFFF
Ne 0 ""
Po 0 -1.42
$EndPAD
$PAD
Sh "4" C 2 2 0 0 0
Dr 1.27 0 0
At STD N 00E0FFFF
Ne 0 ""
Po 2.77 -1.42
$EndPAD
$PAD
Sh "S" C 5 5 0 0 0
Dr 3.556 0 0
At STD N 00E0FFFF
Ne 0 ""
Po -12.5 0
$EndPAD
$PAD
Sh "S" C 5 5 0 0 0
Dr 3.556 0 0
At STD N 00E0FFFF
Ne 0 ""
Po 12.5 0
$EndPAD
$PAD
Sh "5" C 2 2 0 0 0
Dr 1.27 0 0
At STD N 00E0FFFF
Ne 0 ""
Po 5.54 -1.42
$EndPAD
$EndMODULE DB9
$EndLIBRARY
