D0.0	1001110100	0110001011
D1.0	0111010100	1000101011
D2.0	1011010100	0100101011
D3.0	1100011011	1100010100
D4.0	1101010100	0010101011
D5.0	1010011011	1010010100
D6.0	0110011011	0110010100
D7.0	1110001011	0001110100
D8.0	1110010100	0001101011
D9.0	1001011011	1001010100
D10.0	0101011011	0101010100
D11.0	1101001011	1101000100
D12.0	0011011011	0011010100
D13.0	1011001011	1011000100
D14.0	0111001011	0111000100
D15.0	0101110100	1010001011
D16.0	0110110100	1001001011
D17.0	1000111011	1000110100
D18.0	0100111011	0100110100
D19.0	1100101011	1100100100
D20.0	0010111011	0010110100
D21.0	1010101011	1010100100
D22.0	0110101011	0110100100
D23.0	1110100100	0001011011
D24.0	1100110100	0011001011
D25.0	1001101011	1001100100
D26.0	0101101011	0101100100
D27.0	1101100100	0010011011
D28.0	0011101011	0011100100
D29.0	1011100100	0100011011
D30.0	0111100100	1000011011
D31.0	1010110100	0101001011
D0.1	1001111001	0110001001
D1.1	0111011001	1000101001
D2.1	1011011001	0100101001
D3.1	1100011001	1100011001
D4.1	1101011001	0010101001
D5.1	1010011001	1010011001
D6.1	0110011001	0110011001
D7.1	1110001001	0001111001
D8.1	1110011001	0001101001
D9.1	1001011001	1001011001
D10.1	0101011001	0101011001
D11.1	1101001001	1101001001
D12.1	0011011001	0011011001
D13.1	1011001001	1011001001
D14.1	0111001001	0111001001
D15.1	0101111001	1010001001
D16.1	0110111001	1001001001
D17.1	1000111001	1000111001
D18.1	0100111001	0100111001
D19.1	1100101001	1100101001
D20.1	0010111001	0010111001
D21.1	1010101001	1010101001
D22.1	0110101001	0110101001
D23.1	1110101001	0001011001
D24.1	1100111001	0011001001
D25.1	1001101001	1001101001
D26.1	0101101001	0101101001
D27.1	1101101001	0010011001
D28.1	0011101001	0011101001
D29.1	1011101001	0100011001
D30.1	0111101001	1000011001
D31.1	1010111001	0101001001
D0.2	1001110101	0110000101
D1.2	0111010101	1000100101
D2.2	1011010101	0100100101
D3.2	1100010101	1100010101
D4.2	1101010101	0010100101
D5.2	1010010101	1010010101
D6.2	0110010101	0110010101
D7.2	1110000101	0001110101
D8.2	1110010101	0001100101
D9.2	1001010101	1001010101
D10.2	0101010101	0101010101
D11.2	1101000101	1101000101
D12.2	0011010101	0011010101
D13.2	1011000101	1011000101
D14.2	0111000101	0111000101
D15.2	0101110101	1010000101
D16.2	0110110101	1001000101
D17.2	1000110101	1000110101
D18.2	0100110101	0100110101
D19.2	1100100101	1100100101
D20.2	0010110101	0010110101
D21.2	1010100101	1010100101
D22.2	0110100101	0110100101
D23.2	1110100101	0001010101
D24.2	1100110101	0011000101
D25.2	1001100101	1001100101
D26.2	0101100101	0101100101
D27.2	1101100101	0010010101
D28.2	0011100101	0011100101
D29.2	1011100101	0100010101
D30.2	0111100101	1000010101
D31.2	1010110101	0101000101
D0.3	1001110011	0110001100
D1.3	0111010011	1000101100
D2.3	1011010011	0100101100
D3.3	1100011100	1100010011
D4.3	1101010011	0010101100
D5.3	1010011100	1010010011
D6.3	0110011100	0110010011
D7.3	1110001100	0001110011
D8.3	1110010011	0001101100
D9.3	1001011100	1001010011
D10.3	0101011100	0101010011
D11.3	1101001100	1101000011
D12.3	0011011100	0011010011
D13.3	1011001100	1011000011
D14.3	0111001100	0111000011
D15.3	0101110011	1010001100
D16.3	0110110011	1001001100
D17.3	1000111100	1000110011
D18.3	0100111100	0100110011
D19.3	1100101100	1100100011
D20.3	0010111100	0010110011
D21.3	1010101100	1010100011
D22.3	0110101100	0110100011
D23.3	1110100011	0001011100
D24.3	1100110011	0011001100
D25.3	1001101100	1001100011
D26.3	0101101100	0101100011
D27.3	1101100011	0010011100
D28.3	0011101100	0011100011
D29.3	1011100011	0100011100
D30.3	0111100011	1000011100
D31.3	1010110011	0101001100
D0.4	1001110010	0110001101
D1.4	0111010010	1000101101
D2.4	1011010010	0100101101
D3.4	1100011101	1100010010
D4.4	1101010010	0010101101
D5.4	1010011101	1010010010
D6.4	0110011101	0110010010
D7.4	1110001101	0001110010
D8.4	1110010010	0001101101
D9.4	1001011101	1001010010
D10.4	0101011101	0101010010
D11.4	1101001101	1101000010
D12.4	0011011101	0011010010
D13.4	1011001101	1011000010
D14.4	0111001101	0111000010
D15.4	0101110010	1010001101
D16.4	0110110010	1001001101
D17.4	1000111101	1000110010
D18.4	0100111101	0100110010
D19.4	1100101101	1100100010
D20.4	0010111101	0010110010
D21.4	1010101101	1010100010
D22.4	0110101101	0110100010
D23.4	1110100010	0001011101
D24.4	1100110010	0011001101
D25.4	1001101101	1001100010
D26.4	0101101101	0101100010
D27.4	1101100010	0010011101
D28.4	0011101101	0011100010
D29.4	1011100010	0100011101
D30.4	0111100010	1000011101
D31.4	1010110010	0101001101
D0.5	1001111010	0110001010
D1.5	0111011010	1000101010
D2.5	1011011010	0100101010
D3.5	1100011010	1100011010
D4.5	1101011010	0010101010
D5.5	1010011010	1010011010
D6.5	0110011010	0110011010
D7.5	1110001010	0001111010
D8.5	1110011010	0001101010
D9.5	1001011010	1001011010
D10.5	0101011010	0101011010
D11.5	1101001010	1101001010
D12.5	0011011010	0011011010
D13.5	1011001010	1011001010
D14.5	0111001010	0111001010
D15.5	0101111010	1010001010
D16.5	0110111010	1001001010
D17.5	1000111010	1000111010
D18.5	0100111010	0100111010
D19.5	1100101010	1100101010
D20.5	0010111010	0010111010
D21.5	1010101010	1010101010
D22.5	0110101010	0110101010
D23.5	1110101010	0001011010
D24.5	1100111010	0011001010
D25.5	1001101010	1001101010
D26.5	0101101010	0101101010
D27.5	1101101010	0010011010
D28.5	0011101010	0011101010
D29.5	1011101010	0100011010
D30.5	0111101010	1000011010
D31.5	1010111010	0101001010
D0.6	1001110110	0110000110
D1.6	0111010110	1000100110
D2.6	1011010110	0100100110
D3.6	1100010110	1100010110
D4.6	1101010110	0010100110
D5.6	1010010110	1010010110
D6.6	0110010110	0110010110
D7.6	1110000110	0001110110
D8.6	1110010110	0001100110
D9.6	1001010110	1001010110
D10.6	0101010110	0101010110
D11.6	1101000110	1101000110
D12.6	0011010110	0011010110
D13.6	1011000110	1011000110
D14.6	0111000110	0111000110
D15.6	0101110110	1010000110
D16.6	0110110110	1001000110
D17.6	1000110110	1000110110
D18.6	0100110110	0100110110
D19.6	1100100110	1100100110
D20.6	0010110110	0010110110
D21.6	1010100110	1010100110
D22.6	0110100110	0110100110
D23.6	1110100110	0001010110
D24.6	1100110110	0011000110
D25.6	1001100110	1001100110
D26.6	0101100110	0101100110
D27.6	1101100110	0010010110
D28.6	0011100110	0011100110
D29.6	1011100110	0100010110
D30.6	0111100110	1000010110
D31.6	1010110110	0101000110
D0.7	1001110001	0110001110
D1.7	0111010001	1000101110
D2.7	1011010001	0100101110
D3.7	1100011110	1100010001
D4.7	1101010001	0010101110
D5.7	1010011110	1010010001
D6.7	0110011110	0110010001
D7.7	1110001110	0001110001
D8.7	1110010001	0001101110
D9.7	1001011110	1001010001
D10.7	0101011110	0101010001
D11.7	1101001110	1101001000
D12.7	0011011110	0011010001
D13.7	1011001110	1011001000
D14.7	0111001110	0111001000
D15.7	0101110001	1010001110
D16.7	0110110001	1001001110
D17.7	1000110111	1000110001
D18.7	0100110111	0100110001
D19.7	1100101110	1100100001
D20.7	0010110111	0010110001
D21.7	1010101110	1010100001
D22.7	0110101110	0110100001
D23.7	1110100001	0001011110
D24.7	1100110001	0011001110
D25.7	1001101110	1001100001
D26.7	0101101110	0101100001
D27.7	1101100001	0010011110
D28.7	0011101110	0011100001
D29.7	1011100001	0100011110
D30.7	0111100001	1000011110
D31.7	1010110001	0101001110
