PCBNEW-LibModule-V1  Mon 25 Aug 2014 09:36:47 AM EDT
# encoding utf-8
Units mm
$INDEX
TPS72012
$EndINDEX
$MODULE TPS72012
Po 0 0 0 15 53FB3B77 00000000 ~~
Li TPS72012
Sc 0
AR /53480C4F/53866932
Op 0 0 0
T0 -1.75 -4.25 1 1 900 0.15 N V 21 N "U22"
T1 0 -3.175 1 1 0 0.15 N I 21 N "TPS72012"
DC -0.889 1.4732 -0.889 1.4478 0.15 21
$PAD
Sh "7" R 1.4 0.8 0 0 0
Dr 0 0 0
At SMD N 00888000
Ne 3 "GND"
Po 0 0
$EndPAD
$PAD
Sh "4" R 0.25 0.65 0 0 0
Dr 0 0 0
At SMD N 00888000
Ne 2 "+3.3V"
Po 0.65 -1.05
$EndPAD
$PAD
Sh "5" R 0.25 0.65 0 0 0
Dr 0 0 0
At SMD N 00888000
Ne 3 "GND"
Po 0 -1.05
$EndPAD
$PAD
Sh "6" R 0.25 0.65 0 0 0
Dr 0 0 0
At SMD N 00888000
Ne 2 "+3.3V"
Po -0.65 -1.05
$EndPAD
$PAD
Sh "3" R 0.25 0.65 0 0 0
Dr 0 0 0
At SMD N 00888000
Ne 2 "+3.3V"
Po 0.65 1.05
$EndPAD
$PAD
Sh "2" R 0.25 0.65 0 0 0
Dr 0 0 0
At SMD N 00888000
Ne 0 ""
Po 0 1.05
$EndPAD
$PAD
Sh "1" R 0.25 0.65 0 0 0
Dr 0 0 0
At SMD N 00888000
Ne 1 "+1.2V"
Po -0.65 1.05
$EndPAD
$EndMODULE TPS72012
$EndLIBRARY
