PCBNEW-LibModule-V1  Thu 20 Nov 2014 05:19:29 PM EST
# encoding utf-8
Units mm
$INDEX
SOIC-16
$EndINDEX
$MODULE SOIC-16
Po 0 0 0 15 546E68C9 00000000 ~~
Li SOIC-16
Sc 0
AR 
Op 0 0 0
At SMD
T0 0 -0.381 0.508 0.508 0 0.1016 N V 25 N "SOIC-16"
T1 0 0.381 0.508 0.508 0 0.1016 N I 25 N "Val*"
DC -5.4229 2.39776 -5.4229 2.18694 0.127 21
DS -4.94792 3.52552 -4.94792 -3.52552 0.127 21
DS -4.94792 -3.52552 4.94792 -3.52552 0.127 21
DS 4.94792 -3.52552 4.94792 3.52552 0.127 21
DS 4.94792 3.52552 -4.94792 3.52552 0.127 21
$PAD
Sh "16" R 0.60198 1.99898 0 0 0
Dr 0 0 0
At SMD N 00888000
Ne 0 ""
Po -4.44246 -4.65
$EndPAD
$PAD
Sh "1" R 0.60198 1.99898 0 0 0
Dr 0 0 0
At SMD N 00888000
Ne 0 ""
Po -4.44246 4.65
$EndPAD
$PAD
Sh "15" R 0.60198 1.99898 0 0 0
Dr 0 0 0
At SMD N 00888000
Ne 0 ""
Po -3.17246 -4.65
$EndPAD
$PAD
Sh "2" R 0.60198 1.99898 0 0 0
Dr 0 0 0
At SMD N 00888000
Ne 0 ""
Po -3.17246 4.65
$EndPAD
$PAD
Sh "14" R 0.60198 1.99898 0 0 0
Dr 0 0 0
At SMD N 00888000
Ne 0 ""
Po -1.90246 -4.65
$EndPAD
$PAD
Sh "3" R 0.60198 1.99898 0 0 0
Dr 0 0 0
At SMD N 00888000
Ne 0 ""
Po -1.90246 4.65
$EndPAD
$PAD
Sh "13" R 0.60198 1.99898 0 0 0
Dr 0 0 0
At SMD N 00888000
Ne 0 ""
Po -0.63246 -4.65
$EndPAD
$PAD
Sh "4" R 0.60198 1.99898 0 0 0
Dr 0 0 0
At SMD N 00888000
Ne 0 ""
Po -0.63246 4.65
$EndPAD
$PAD
Sh "12" R 0.60198 1.99898 0 0 0
Dr 0 0 0
At SMD N 00888000
Ne 0 ""
Po 0.63246 -4.65
$EndPAD
$PAD
Sh "5" R 0.60198 1.99898 0 0 0
Dr 0 0 0
At SMD N 00888000
Ne 0 ""
Po 0.63246 4.65
$EndPAD
$PAD
Sh "11" R 0.60198 1.99898 0 0 0
Dr 0 0 0
At SMD N 00888000
Ne 0 ""
Po 1.90246 -4.65
$EndPAD
$PAD
Sh "6" R 0.60198 1.99898 0 0 0
Dr 0 0 0
At SMD N 00888000
Ne 0 ""
Po 1.90246 4.65
$EndPAD
$PAD
Sh "10" R 0.60198 1.99898 0 0 0
Dr 0 0 0
At SMD N 00888000
Ne 0 ""
Po 3.17246 -4.65
$EndPAD
$PAD
Sh "7" R 0.60198 1.99898 0 0 0
Dr 0 0 0
At SMD N 00888000
Ne 0 ""
Po 3.17246 4.65
$EndPAD
$PAD
Sh "9" R 0.60198 1.99898 0 0 0
Dr 0 0 0
At SMD N 00888000
Ne 0 ""
Po 4.44246 -4.65
$EndPAD
$PAD
Sh "8" R 0.60198 1.99898 0 0 0
Dr 0 0 0
At SMD N 00888000
Ne 0 ""
Po 4.44246 4.65
$EndPAD
$EndMODULE SOIC-16
$EndLIBRARY
