EESchema Schematic File Version 2
LIBS:sn65hvd3083edgsr
LIBS:conn
LIBS:power
LIBS:pspice
LIBS:zl40216
LIBS:sfp
LIBS:FIN1108
LIBS:sn65lvds389
LIBS:max5825baup
LIBS:tps72301dbvr
LIBS:ina195a
LIBS:tps78630kttt
LIBS:tps73501drbt
LIBS:lt3015eq
LIBS:lt1086cm-3
LIBS:tps72012drvt
LIBS:ina202a
LIBS:transistors
LIBS:2sk3019
LIBS:sn74hc05d
LIBS:ad7998
LIBS:ao3401a
LIBS:opa703
LIBS:6slx45fgg484pkg
LIBS:ERM8-RA
LIBS:cdclvd1204
LIBS:sy89835u
LIBS:zl40212
LIBS:opa4703ea
LIBS:tps73201qdbvrq1
LIBS:m25p32
LIBS:bav99
LIBS:si590
LIBS:iso7242c
LIBS:lmk00304
LIBS:pins_14x2
LIBS:ds18b20u
LIBS:2x14_conn
LIBS:led
LIBS:LogicBoard-cache
EELAYER 24 0
EELAYER END
$Descr A4 11693 8268
encoding utf-8
Sheet 19 23
Title ""
Date "1 dec 2015"
Rev ""
Comp ""
Comment1 ""
Comment2 ""
Comment3 ""
Comment4 ""
$EndDescr
NoConn ~ 4300 4300
NoConn ~ 4300 4200
Connection ~ 3300 4300
Wire Wire Line
	3400 4300 3300 4300
Connection ~ 3300 4100
Wire Wire Line
	3400 4100 3300 4100
Connection ~ 3300 3900
Wire Wire Line
	3400 3900 3300 3900
Wire Wire Line
	3300 4450 3300 3700
Wire Wire Line
	3300 3700 3400 3700
Wire Wire Line
	5250 4100 4300 4100
Wire Wire Line
	5250 3900 4300 3900
Wire Wire Line
	5250 4200 5100 4200
Wire Wire Line
	5250 3600 4600 3600
Wire Wire Line
	4600 3050 4950 3050
Wire Wire Line
	4950 3050 4950 3400
Wire Wire Line
	4950 3400 5250 3400
Wire Wire Line
	5100 3200 5100 3150
Wire Wire Line
	5100 3150 5200 3150
Wire Wire Line
	5200 3150 5200 3300
Wire Wire Line
	5200 3300 5250 3300
Wire Wire Line
	10550 2900 10550 2500
Wire Wire Line
	10550 2500 9600 2500
Connection ~ 10300 2500
Wire Wire Line
	10300 2900 10200 2900
Wire Wire Line
	9000 3200 7250 3200
Wire Wire Line
	9000 3100 7250 3100
Wire Wire Line
	9600 2500 9600 2550
Connection ~ 8250 2200
Wire Wire Line
	8000 2250 8000 2200
Wire Wire Line
	8000 2200 8500 2200
Connection ~ 8500 2200
Wire Wire Line
	8250 2200 8250 2250
Connection ~ 8500 3200
Wire Wire Line
	8500 2150 8500 2250
Wire Wire Line
	9600 3750 9600 3850
Wire Wire Line
	8250 2750 8250 3600
Wire Wire Line
	8250 3600 7250 3600
Wire Wire Line
	8000 2750 8000 3500
Wire Wire Line
	8000 3500 7250 3500
Wire Wire Line
	9000 3000 7250 3000
Wire Wire Line
	8500 3200 8500 2750
Wire Wire Line
	9000 3300 7250 3300
Wire Wire Line
	10300 2450 10300 3400
Wire Wire Line
	10300 3400 10200 3400
Connection ~ 10300 2900
Wire Wire Line
	10550 3400 10550 3800
Wire Wire Line
	10550 3800 9600 3800
Connection ~ 9600 3800
Wire Wire Line
	5250 3200 5200 3200
Connection ~ 5200 3200
Wire Wire Line
	4600 3100 4600 3000
Connection ~ 4600 3050
Wire Wire Line
	5100 4200 5100 4300
Wire Wire Line
	5250 3800 4300 3800
Wire Wire Line
	5250 4000 4300 4000
Wire Wire Line
	4300 3600 4300 3700
Wire Wire Line
	3400 3800 3300 3800
Connection ~ 3300 3800
Wire Wire Line
	3400 4000 3300 4000
Connection ~ 3300 4000
Wire Wire Line
	3400 4200 3300 4200
Connection ~ 3300 4200
$Comp
L +3.3V #PWR0127
U 1 1 54693CF7
P 4300 3600
F 0 "#PWR0127" H 4300 3560 30  0001 C CNN
F 1 "+3.3V" H 4300 3710 30  0000 C CNN
F 2 "" H 4300 3600 60  0001 C CNN
F 3 "" H 4300 3600 60  0001 C CNN
	1    4300 3600
	1    0    0    -1  
$EndComp
$Comp
L GND #PWR0128
U 1 1 54693CF0
P 3300 4450
F 0 "#PWR0128" H 3300 4450 30  0001 C CNN
F 1 "GND" H 3300 4380 30  0001 C CNN
F 2 "" H 3300 4450 60  0001 C CNN
F 3 "" H 3300 4450 60  0001 C CNN
	1    3300 4450
	1    0    0    -1  
$EndComp
$Comp
L GND #PWR0129
U 1 1 5469387E
P 5100 4300
F 0 "#PWR0129" H 5100 4300 30  0001 C CNN
F 1 "GND" H 5100 4230 30  0001 C CNN
F 2 "" H 5100 4300 60  0001 C CNN
F 3 "" H 5100 4300 60  0001 C CNN
	1    5100 4300
	1    0    0    -1  
$EndComp
$Comp
L +3.3V #PWR0130
U 1 1 54693851
P 4600 3000
F 0 "#PWR0130" H 4600 2960 30  0001 C CNN
F 1 "+3.3V" H 4600 3110 30  0000 C CNN
F 2 "" H 4600 3000 60  0001 C CNN
F 3 "" H 4600 3000 60  0001 C CNN
	1    4600 3000
	1    0    0    -1  
$EndComp
$Comp
L R R49
U 1 1 54693841
P 4600 3350
F 0 "R49" V 4680 3350 50  0000 C CNN
F 1 "4.7k" V 4600 3350 50  0000 C CNN
F 2 "SM0402" H 4600 3350 60  0001 C CNN
F 3 "" H 4600 3350 60  0001 C CNN
	1    4600 3350
	1    0    0    -1  
$EndComp
$Comp
L GND #PWR0131
U 1 1 54693822
P 5100 3200
F 0 "#PWR0131" H 5100 3200 30  0001 C CNN
F 1 "GND" H 5100 3130 30  0001 C CNN
F 2 "" H 5100 3200 60  0001 C CNN
F 3 "" H 5100 3200 60  0001 C CNN
	1    5100 3200
	1    0    0    -1  
$EndComp
$Comp
L C C54
U 1 1 546937D2
P 10550 3150
F 0 "C54" V 10650 3300 50  0000 C CNN
F 1 "0.1uF" V 10650 3000 50  0000 C CNN
F 2 "SM0402" H 10550 3150 60  0001 C CNN
F 3 "" H 10550 3150 60  0001 C CNN
	1    10550 3150
	1    0    0    -1  
$EndComp
NoConn ~ 7250 2900
$Comp
L R R46
U 1 1 54693558
P 8000 2500
F 0 "R46" V 8080 2500 50  0000 C CNN
F 1 "4.7k" V 8000 2500 50  0000 C CNN
F 2 "SM0402" H 8000 2500 60  0001 C CNN
F 3 "" H 8000 2500 60  0001 C CNN
	1    8000 2500
	1    0    0    -1  
$EndComp
$Comp
L R R47
U 1 1 54693541
P 8250 2500
F 0 "R47" V 8330 2500 50  0000 C CNN
F 1 "330" V 8250 2500 50  0000 C CNN
F 2 "SM0402" H 8250 2500 60  0001 C CNN
F 3 "" H 8250 2500 60  0001 C CNN
	1    8250 2500
	1    0    0    -1  
$EndComp
$Comp
L +3.3V #PWR0132
U 1 1 54693406
P 8500 2150
F 0 "#PWR0132" H 8500 2110 30  0001 C CNN
F 1 "+3.3V" H 8500 2260 30  0000 C CNN
F 2 "" H 8500 2150 60  0001 C CNN
F 3 "" H 8500 2150 60  0001 C CNN
	1    8500 2150
	1    0    0    -1  
$EndComp
$Comp
L R R48
U 1 1 546933DF
P 8500 2500
F 0 "R48" V 8580 2500 50  0000 C CNN
F 1 "2.4k" V 8500 2500 50  0000 C CNN
F 2 "SM0402" H 8500 2500 60  0001 C CNN
F 3 "" H 8500 2500 60  0001 C CNN
	1    8500 2500
	1    0    0    -1  
$EndComp
$Comp
L GND #PWR0133
U 1 1 546933BA
P 9600 3850
F 0 "#PWR0133" H 9600 3850 30  0001 C CNN
F 1 "GND" H 9600 3780 30  0001 C CNN
F 2 "" H 9600 3850 60  0001 C CNN
F 3 "" H 9600 3850 60  0001 C CNN
	1    9600 3850
	1    0    0    -1  
$EndComp
$Comp
L +3.3V #PWR0134
U 1 1 54693398
P 10300 2450
F 0 "#PWR0134" H 10300 2410 30  0001 C CNN
F 1 "+3.3V" H 10300 2560 30  0000 C CNN
F 2 "" H 10300 2450 60  0001 C CNN
F 3 "" H 10300 2450 60  0001 C CNN
	1    10300 2450
	1    0    0    -1  
$EndComp
$Comp
L M25P32 U17
U 1 1 5468221D
P 9600 3150
F 0 "U17" H 9900 2650 60  0000 C CNN
F 1 "M25P32" H 9600 3150 60  0000 C CNN
F 2 "SO8W" H 9600 3150 60  0001 C CNN
F 3 "" H 9600 3150 60  0001 C CNN
	1    9600 3150
	1    0    0    -1  
$EndComp
$Comp
L 6SLX45FGG484PKG U16
U 6 1 5467EB08
P 5750 4200
F 0 "U16" H 6950 5950 60  0000 C CNN
F 1 "6SLX45FGG484PKG" H 5800 5950 60  0000 C CNN
F 2 "XC6SLX45" H 5750 4200 60  0001 C CNN
F 3 "" H 5750 4200 60  0001 C CNN
	6    5750 4200
	1    0    0    -1  
$EndComp
$Comp
L PINS_14X2 U18
U 1 1 546C19D8
P 3850 3950
F 0 "U18" H 4000 3450 60  0000 C CNN
F 1 "PINS_14X2" V 3850 3900 60  0000 C CNN
F 2 "87832-1420" H 3850 3950 60  0001 C CNN
F 3 "" H 3850 3950 60  0000 C CNN
	1    3850 3950
	1    0    0    -1  
$EndComp
$EndSCHEMATC
