EESchema Schematic File Version 2
LIBS:sn65hvd3083edgsr
LIBS:conn
LIBS:power
LIBS:pspice
LIBS:zl40216
LIBS:sfp
LIBS:FIN1108
LIBS:sn65lvds389
LIBS:max5825baup
LIBS:tps72301dbvr
LIBS:ina195a
LIBS:tps78630kttt
LIBS:tps73501drbt
LIBS:lt3015eq
LIBS:lt1086cm-3
LIBS:tps72012drvt
LIBS:ina202a
LIBS:transistors
LIBS:2sk3019
LIBS:sn74hc05d
LIBS:ad7998
LIBS:ao3401a
LIBS:opa703
LIBS:6slx45fgg484pkg
LIBS:ERM8-RA
LIBS:cdclvd1204
LIBS:sy89835u
LIBS:zl40212
LIBS:opa4703ea
LIBS:tps73201qdbvrq1
LIBS:m25p32
LIBS:bav99
LIBS:si590
LIBS:iso7242c
LIBS:lmk00304
LIBS:pins_14x2
LIBS:ds18b20u
LIBS:2x14_conn
LIBS:led
LIBS:LogicBoard-cache
EELAYER 24 0
EELAYER END
$Descr A4 11693 8268
encoding utf-8
Sheet 1 23
Title ""
Date "1 dec 2015"
Rev ""
Comp ""
Comment1 ""
Comment2 ""
Comment3 ""
Comment4 ""
$EndDescr
Wire Bus Line
	2550 5750 2550 6000
Wire Wire Line
	4200 1150 4800 1150
Wire Wire Line
	4200 1050 4800 1050
Wire Bus Line
	7000 3250 10000 3250
Wire Bus Line
	7000 3050 10000 3050
Wire Bus Line
	7000 2750 10000 2750
Wire Wire Line
	7000 4050 7900 4050
Wire Bus Line
	7000 5200 7900 5200
Wire Bus Line
	8850 4550 10000 4550
Wire Bus Line
	8850 4350 10000 4350
Wire Bus Line
	3450 5250 1600 5250
Wire Bus Line
	1600 5650 3450 5650
Wire Bus Line
	1600 5850 2450 5850
Wire Bus Line
	2550 5750 1600 5750
Wire Bus Line
	1600 5450 3450 5450
Wire Wire Line
	1600 5550 3450 5550
Wire Bus Line
	8850 4250 10000 4250
Wire Bus Line
	8850 4450 10000 4450
Wire Bus Line
	7000 5100 7900 5100
Wire Wire Line
	7000 3950 7900 3950
Wire Wire Line
	4200 850  4800 850 
Wire Bus Line
	10000 2650 7000 2650
Wire Bus Line
	10000 2950 7000 2950
Wire Bus Line
	7000 3150 10000 3150
Wire Wire Line
	9400 900  10000 900 
Wire Wire Line
	9400 1100 10000 1100
Wire Bus Line
	9400 1200 10000 1200
Wire Bus Line
	9400 1300 10000 1300
Wire Wire Line
	1600 3850 3450 3850
Wire Wire Line
	1600 3950 3450 3950
Wire Wire Line
	1600 4050 3450 4050
Wire Wire Line
	1600 4150 3450 4150
Wire Wire Line
	3450 4600 1600 4600
Wire Wire Line
	1600 4700 3450 4700
Wire Wire Line
	3450 4800 1600 4800
Wire Wire Line
	1600 4900 3450 4900
Wire Wire Line
	3450 5000 1600 5000
Wire Bus Line
	2550 6000 10000 6000
Wire Bus Line
	10000 6100 2450 6100
Wire Bus Line
	2450 6100 2450 5850
Wire Wire Line
	2050 2500 2050 3700
Wire Wire Line
	2050 3700 3450 3700
Wire Wire Line
	700  3100 700  3200
Wire Wire Line
	700  3200 1400 3200
Wire Wire Line
	1400 3200 1400 3150
Wire Wire Line
	1050 3200 1050 3250
Connection ~ 1050 3200
Wire Wire Line
	700  2400 700  2600
Wire Wire Line
	700  2500 750  2500
Connection ~ 700  2500
Wire Wire Line
	2000 2200 2000 2150
Wire Wire Line
	1400 1850 1400 1500
Wire Wire Line
	2000 1650 1400 1650
Connection ~ 1400 1650
Wire Wire Line
	700  1900 700  1750
Wire Wire Line
	700  1750 1400 1750
Connection ~ 1400 1750
Text Label 4250 1150 0    60   ~ 0
TDC-
Text Label 4250 1050 0    60   ~ 0
TDC+
$Sheet
S 10000 800  950  5400
U 544175A1
F0 "Back plane" 50
F1 "sch/Backplane.sch" 50
F2 "TDC_N[3..0]" I L 10000 2750 60 
F3 "TDC_P[3..0]" I L 10000 2650 60 
F4 "C5_N[3..0]" I L 10000 6100 60 
F5 "C5_P[3..0]" I L 10000 6000 60 
F6 "TP_P[7..0]" I L 10000 5400 60 
F7 "TP_N[7..0]" I L 10000 5500 60 
F8 "Vref_ASDQ_C[3..0]" I L 10000 4450 60 
F9 "Vref_ASDQ_D[3..0]" I L 10000 4550 60 
F10 "Vref_ASDQ_B[3..0]" I L 10000 4350 60 
F11 "Vref_ASDQ_A[3..0]" I L 10000 4250 60 
F12 "ASDQ_1V4" I L 10000 1100 60 
F13 "ASDQ_3V[3..0]" I L 10000 1200 60 
F14 "ASDQ_-3V[3..0]" I L 10000 1300 60 
F15 "TSM[1..0]" I L 10000 3050 60 
F16 "TEMP[1..0]" I L 10000 2550 60 
F17 "TDO[1..0]" O L 10000 3250 60 
F18 "TDI[1..0]" I L 10000 3150 60 
F19 "TCK[1..0]" I L 10000 2950 60 
F20 "TDCMB_V" I L 10000 900 60 
F21 "TDC_I2C_CLK" I L 10000 3450 60 
F22 "TDC_I2C_DATA" B L 10000 3550 60 
$EndSheet
$Sheet
S 7900 2150 1100 450 
U 545D5204
F0 "Monitoring" 50
F1 "sch/Monitoring.sch" 50
F2 "TEMP_OUT[1..0]" B R 9000 2550 60 
F3 "TEMP[1..0]" B L 7900 2200 60 
$EndSheet
Text Label 4250 850  0    60   ~ 0
V_TDCMB
$Sheet
S 900  3750 700  500 
U 54417517
F0 "Slow control" 50
F1 "sch/SlowControl.sch" 50
F2 "SC_IN" O R 1600 3850 60 
F3 "SC_OUT" I R 1600 3950 60 
F4 "SC_OE" I R 1600 4150 60 
F5 "_SC_PRESENT" O R 1600 4050 60 
$EndSheet
$Sheet
S 900  4400 700  1550
U 54417559
F0 "SFP" 50
F1 "sch/SFP.sch" 50
F2 "Tx_Disable" I R 1600 4600 60 
F3 "LOS" O R 1600 4700 60 
F4 "SCL" I R 1600 5000 60 
F5 "SDA" B R 1600 4900 60 
F6 "Present" O R 1600 4800 60 
F7 "C5_OUT[1..0]" I R 1600 5650 60 
F8 "C5_SEL" I R 1600 5550 60 
F9 "C5_IN[1..0]" O R 1600 5450 60 
F10 "C5_P[3..0]" O R 1600 5750 60 
F11 "C5_N[3..0]" O R 1600 5850 60 
F12 "Data_out[1..0]" I R 1600 5250 60 
$EndSheet
$Sheet
S 7900 5000 1200 600 
U 5446A203
F0 "Test pulse" 50
F1 "sch/TestPulse.sch" 50
F2 "TP_P[7..0]" O R 9100 5400 60 
F3 "TP_N[7..0]" O R 9100 5500 60 
F4 "TP[7..0]" I L 7900 5100 60 
F5 "EN[3..0]" I L 7900 5200 60 
F6 "EN1V6" I L 7900 5400 60 
F7 "EN-1V6" I L 7900 5500 60 
$EndSheet
$Sheet
S 7900 3850 950  800 
U 545104B4
F0 "DACs" 50
F1 "sch/DACs.sch" 50
F2 "SCL_IN" I L 7900 3950 60 
F3 "SDA_IN" B L 7900 4050 60 
F4 "ASDQ_D[3..0]" O R 8850 4550 60 
F5 "ASDQ_C[3..0]" O R 8850 4450 60 
F6 "ASDQ_B[3..0]" O R 8850 4350 60 
F7 "ASDQ_A[3..0]" O R 8850 4250 60 
$EndSheet
Text Notes 10200 700  0    120  ~ 24
Connector
Text Label 9450 900  0    60   ~ 0
V_TDCMB
Text Label 9450 1100 0    60   ~ 0
V_1V4
Text Label 9450 1200 0    60   ~ 0
V_3V[3..0]
Text Label 9450 1300 0    60   ~ 0
V_-3V[3..0]
$Comp
L SI590 U1
U 1 1 546A812F
P 1400 2500
F 0 "U1" H 1850 2050 60  0000 C CNN
F 1 "590CX125M000DGR" H 1400 2950 60  0000 C CNN
F 2 "Si590" H 1400 2500 60  0001 C CNN
F 3 "" H 1400 2500 60  0001 C CNN
	1    1400 2500
	1    0    0    -1  
$EndComp
$Comp
L R R1
U 1 1 546AC6F1
P 700 2150
F 0 "R1" V 780 2150 50  0000 C CNN
F 1 "DNP" V 700 2150 50  0000 C CNN
F 2 "SM0402" H 700 2150 60  0001 C CNN
F 3 "" H 700 2150 60  0001 C CNN
	1    700  2150
	1    0    0    -1  
$EndComp
$Comp
L R R2
U 1 1 546AC870
P 700 2850
F 0 "R2" V 780 2850 50  0000 C CNN
F 1 "DNP" V 700 2850 50  0000 C CNN
F 2 "SM0402" H 700 2850 60  0001 C CNN
F 3 "" H 700 2850 60  0001 C CNN
	1    700  2850
	1    0    0    -1  
$EndComp
$Comp
L GND #PWR01
U 1 1 546AC9EF
P 1050 3250
F 0 "#PWR01" H 1050 3250 30  0001 C CNN
F 1 "GND" H 1050 3180 30  0001 C CNN
F 2 "" H 1050 3250 60  0001 C CNN
F 3 "" H 1050 3250 60  0001 C CNN
	1    1050 3250
	1    0    0    -1  
$EndComp
$Comp
L C C1
U 1 1 546AF36B
P 2000 1900
F 0 "C1" V 2100 2050 50  0000 C CNN
F 1 "0.01uF" V 2100 1750 50  0000 C CNN
F 2 "SM0402" H 2000 1900 60  0001 C CNN
F 3 "" H 2000 1900 60  0001 C CNN
	1    2000 1900
	1    0    0    -1  
$EndComp
$Comp
L GND #PWR02
U 1 1 546B08C4
P 2000 2200
F 0 "#PWR02" H 2000 2200 30  0001 C CNN
F 1 "GND" H 2000 2130 30  0001 C CNN
F 2 "" H 2000 2200 60  0001 C CNN
F 3 "" H 2000 2200 60  0001 C CNN
	1    2000 2200
	1    0    0    -1  
$EndComp
$Comp
L +3.3V #PWR03
U 1 1 546B1774
P 1400 1500
F 0 "#PWR03" H 1400 1460 30  0001 C CNN
F 1 "+3.3V" H 1400 1610 30  0000 C CNN
F 2 "" H 1400 1500 60  0001 C CNN
F 3 "" H 1400 1500 60  0001 C CNN
	1    1400 1500
	1    0    0    -1  
$EndComp
Text Notes 700  1250 0    60   ~ 0
125 Mhz clock\nOE pulled to on with no resistors.
$Sheet
S 2900 750  1300 500 
U 54417533
F0 "Power & sense" 50
F1 "sch/Power.sch" 50
F2 "TDC+" O R 4200 1050 60 
F3 "TDC-" O R 4200 1150 60 
F4 "TDCMB" O R 4200 850 60 
$EndSheet
Text Notes 4900 5850 0    60   ~ 12
TDC Power monitoring
Wire Bus Line
	7900 2200 7000 2200
Wire Bus Line
	9000 2550 10000 2550
$Sheet
S 6250 700  1150 700 
U 54768022
F0 "Daughter board conn" 50
F1 "sch/DB_CONN.sch" 50
F2 "SDA" B L 6250 900 60 
F3 "SCL" I L 6250 800 60 
F4 "ASDQ_1V4" O R 7400 900 60 
F5 "ASDQ_3V[3..0]" O R 7400 800 60 
F6 "ASDQ_-3V[3..0]" O R 7400 1000 60 
F7 "INT" O L 6250 1000 60 
F8 "TEMP" B R 7400 1200 60 
F9 "TDC+" I L 6250 1200 60 
F10 "TDC-" I L 6250 1300 60 
$EndSheet
Wire Bus Line
	9100 5400 10000 5400
Wire Bus Line
	9100 5500 10000 5500
Entry Wire Line
	7600 2200 7700 2100
Text Label 7700 2100 1    60   ~ 0
TEMP1
Wire Wire Line
	7700 2100 7700 1200
Wire Wire Line
	7700 1200 7400 1200
Wire Bus Line
	7400 800  8000 800 
Text Label 7450 800  0    60   ~ 0
V_3V[3..0]
Wire Bus Line
	7400 1000 8000 1000
Text Label 7450 1000 0    60   ~ 0
V_-3V[3..0]
Wire Wire Line
	7400 900  8000 900 
Text Label 7450 900  0    60   ~ 0
V_1V4
Wire Wire Line
	5650 1300 6250 1300
Wire Wire Line
	5650 1200 6250 1200
Text Label 5700 1300 0    60   ~ 0
TDC-
Text Label 5700 1200 0    60   ~ 0
TDC+
Text Label 5650 800  0    60   ~ 0
DB_SCL
Text Label 5650 900  0    60   ~ 0
DB_SDA
Text Label 5650 1000 0    60   ~ 0
DB_INT
Wire Wire Line
	5650 800  6250 800 
Wire Wire Line
	5650 900  6250 900 
Wire Wire Line
	5650 1000 6250 1000
$Sheet
S 3450 2100 3550 3650
U 545FDC30
F0 "FPGA S6 LX45-2" 60
F1 "sch/FPGA.sch" 60
F2 "C5_SEL" O L 3450 5550 60 
F3 "C5_IN[1..0]" I L 3450 5450 60 
F4 "C5_OUT[1..0]" O L 3450 5650 60 
F5 "Data_out[1..0]" O L 3450 5250 60 
F6 "TDC_TP_EN[3..0]" O R 7000 5200 60 
F7 "TDC_TP[7..0]" O R 7000 5100 60 
F8 "SCL" O R 7000 3950 60 
F9 "SDA" B R 7000 4050 60 
F10 "TDC_N[3..0]" I R 7000 2750 60 
F11 "TDC_P[3..0]" I R 7000 2650 60 
F12 "TMS[1..0]" O R 7000 3050 60 
F13 "TCK[1..0]" O R 7000 2950 60 
F14 "TEMP[1..0]" B R 7000 2200 60 
F15 "TDO[1..0]" I R 7000 3250 60 
F16 "TDI[1..0]" O R 7000 3150 60 
F17 "SC_IN" I L 3450 3850 60 
F18 "SC_OUT" O L 3450 3950 60 
F19 "_SC_PRESENT" I L 3450 4050 60 
F20 "SC_OE" O L 3450 4150 60 
F21 "Present" I L 3450 4800 60 
F22 "Tx_Disable" O L 3450 4600 60 
F23 "LOS" I L 3450 4700 60 
F24 "SFP_SCL" O L 3450 5000 60 
F25 "SFP_SDA" B L 3450 4900 60 
F26 "CLK_IN" I L 3450 3700 60 
F27 "DB_SCL" O L 3450 2350 60 
F28 "DB_SDA" B L 3450 2450 60 
F29 "DB_INT" I L 3450 2550 60 
F30 "EN1V6" O R 7000 5400 60 
F31 "EN-1V6" O R 7000 5500 60 
F32 "TDC_I2C_CLK" O R 7000 3450 60 
F33 "TDC_I2C_DATA" B R 7000 3550 60 
F34 "GPIO[3..0]" B L 3450 3500 60 
F35 "LED[3..0]" O L 3450 2200 60 
$EndSheet
Text Label 2850 2350 0    60   ~ 0
DB_SCL
Text Label 2850 2450 0    60   ~ 0
DB_SDA
Text Label 2850 2550 0    60   ~ 0
DB_INT
Wire Wire Line
	2850 2350 3450 2350
Wire Wire Line
	2850 2450 3450 2450
Wire Wire Line
	2850 2550 3450 2550
Wire Wire Line
	7000 5400 7900 5400
Wire Wire Line
	7000 5500 7900 5500
Text Label 7050 2200 0    60   ~ 0
TEMP[1..0]
Wire Wire Line
	7000 3450 10000 3450
Wire Wire Line
	7000 3550 10000 3550
$Comp
L CONN_6 P2
U 1 1 54B8A4D5
P 2250 3150
F 0 "P2" V 2200 3150 60  0000 C CNN
F 1 "CONN_6" V 2300 3150 60  0000 C CNN
F 2 "PIN_ARRAY-6X1" H 2250 3150 60  0001 C CNN
F 3 "" H 2250 3150 60  0000 C CNN
F 4 "0.1\"" V 2250 3150 60  0001 C CNN "Field1"
	1    2250 3150
	-1   0    0    1   
$EndComp
Entry Wire Line
	2950 3400 3050 3500
Entry Wire Line
	2950 3300 3050 3400
Entry Wire Line
	2950 3200 3050 3300
Entry Wire Line
	2950 3100 3050 3200
Text Label 2650 3400 0    60   ~ 0
GPIO0
Text Label 2650 3300 0    60   ~ 0
GPIO1
Text Label 2650 3200 0    60   ~ 0
GPIO2
Text Label 2650 3100 0    60   ~ 0
GPIO3
Wire Wire Line
	2600 3100 2950 3100
Wire Wire Line
	2600 3200 2950 3200
Wire Wire Line
	2600 3300 2950 3300
Wire Wire Line
	2600 3400 2950 3400
$Comp
L +3.3V #PWR04
U 1 1 54B901AF
P 2950 2900
F 0 "#PWR04" H 2950 2860 30  0001 C CNN
F 1 "+3.3V" H 2950 3010 30  0000 C CNN
F 2 "" H 2950 2900 60  0000 C CNN
F 3 "" H 2950 2900 60  0000 C CNN
	1    2950 2900
	1    0    0    -1  
$EndComp
$Comp
L GND #PWR05
U 1 1 54B902E6
P 3050 3050
F 0 "#PWR05" H 3050 3050 30  0001 C CNN
F 1 "GND" H 3050 2980 30  0001 C CNN
F 2 "" H 3050 3050 60  0000 C CNN
F 3 "" H 3050 3050 60  0000 C CNN
	1    3050 3050
	1    0    0    -1  
$EndComp
Wire Wire Line
	2600 3000 3050 3000
Wire Wire Line
	3050 3000 3050 3050
Wire Wire Line
	2600 2900 2950 2900
Wire Bus Line
	3050 3500 3450 3500
Wire Bus Line
	3050 3200 3050 3500
Text Label 3100 3500 0    60   ~ 0
GPIO[3..0]
$Sheet
S 2750 1550 500  350 
U 54B84944
F0 "LEDs" 50
F1 "sch/LEDs.sch" 50
F2 "LED[3..0]" I L 2750 1800 60 
$EndSheet
Wire Bus Line
	2750 1800 2600 1800
Wire Bus Line
	2600 1800 2600 2200
Wire Bus Line
	2600 2200 3450 2200
$EndSCHEMATC
