PCBNEW-LibModule-V1  Thu 15 Jan 2015 02:16:06 PM EST
# encoding utf-8
Units mm
$INDEX
1 SFP Cage
1_SFP_Cage
$EndINDEX
$MODULE 1 SFP Cage
Po 0 0 0 15 5397616C 00000000 ~~
Li 1 SFP Cage
Sc 0
AR 
Op 0 0 0
T0 0 19.685 1 1 0 0.15 N V 21 N "1 SFP Cage"
T1 0 -3.556 1 1 0 0.15 N V 21 N "VAL**"
DC 0.9 2.33 1.675 2.33 0.5 21
DC 0.9 11.93 1.675 11.93 0.5 21
$PAD
Sh "" R 2 2 0 0 0
Dr 1.05 0 0
At STD N 00E0FFFF
Ne 0 ""
Po 0 0
$EndPAD
$PAD
Sh "" R 2 2 0 0 0
Dr 1.05 0 0
At STD N 00E0FFFF
Ne 0 ""
Po 2.5 0
$EndPAD
$PAD
Sh "" R 2 2 0 0 0
Dr 1.05 0 0
At STD N 00E0FFFF
Ne 0 ""
Po -2.5 0
$EndPAD
$PAD
Sh "" R 2 2 0 0 0
Dr 1.05 0 0
At STD N 00E0FFFF
Ne 0 ""
Po -7.2 0
$EndPAD
$PAD
Sh "" R 2 2 0 0 0
Dr 1.05 0 0
At STD N 00E0FFFF
Ne 0 ""
Po -10 5.68
$EndPAD
$PAD
Sh "" R 2 2 0 0 0
Dr 1.05 0 0
At STD N 00E0FFFF
Ne 0 ""
Po -10 11.08
$EndPAD
$PAD
Sh "" R 2 2 0 0 0
Dr 1.05 0 0
At STD N 00E0FFFF
Ne 0 ""
Po 5 14.25
$EndPAD
$PAD
Sh "" R 2 2 0 0 0
Dr 1.05 0 0
At STD N 00E0FFFF
Ne 0 ""
Po -5 14.25
$EndPAD
$PAD
Sh "" R 2 2 0 0 0
Dr 1.05 0 0
At STD N 00E0FFFF
Ne 0 ""
Po 2.5 14.25
$EndPAD
$PAD
Sh "" R 2 2 0 0 0
Dr 1.05 0 0
At STD N 00E0FFFF
Ne 0 ""
Po -2.5 14.25
$EndPAD
$PAD
Sh "" R 2 2 0 0 0
Dr 1.05 0 0
At STD N 00E0FFFF
Ne 0 ""
Po -7.2 14.25
$EndPAD
$PAD
Sh "" R 2 2 0 0 0
Dr 1.05 0 0
At STD N 00E0FFFF
Ne 0 ""
Po 7.1 11.93
$EndPAD
$PAD
Sh "" R 2 2 0 0 0
Dr 1.05 0 0
At STD N 00E0FFFF
Ne 0 ""
Po 7.1 2.33
$EndPAD
$PAD
Sh "" R 2 2 0 0 0
Dr 1.05 0 0
At STD N 00E0FFFF
Ne 0 ""
Po 7.1 7.13
$EndPAD
$PAD
Sh "" R 2 2 0 0 0
Dr 1.05 0 0
At STD N 00E0FFFF
Ne 0 ""
Po -10 0
$EndPAD
$PAD
Sh "" R 2 2 0 0 0
Dr 1.05 0 0
At STD N 00E0FFFF
Ne 0 ""
Po -20 0
$EndPAD
$PAD
Sh "" R 2 2 0 0 0
Dr 1.05 0 0
At STD N 00E0FFFF
Ne 0 ""
Po -30 0
$EndPAD
$PAD
Sh "" R 2 2 0 0 0
Dr 1.05 0 0
At STD N 00E0FFFF
Ne 0 ""
Po -15 14.224
$EndPAD
$PAD
Sh "" R 2 2 0 0 0
Dr 1.05 0 0
At STD N 00E0FFFF
Ne 0 ""
Po -25 14.25
$EndPAD
$PAD
Sh "" R 2 2 0 0 0
Dr 1.05 0 0
At STD N 00E0FFFF
Ne 0 ""
Po -30 8.58
$EndPAD
$EndMODULE 1 SFP Cage
$MODULE 1_SFP_Cage
Po 0 0 0 15 54B811EF 00000000 ~~
Li 1_SFP_Cage
Sc 0
AR 
Op 0 0 0
T0 0 19.685 1 1 0 0.15 N I 21 N "1_SFP_Cage"
T1 0 -3.556 1 1 0 0.15 N I 21 N "VAL**"
DS -34.5 -2 -34.5 16.25 0.15 21
DS -40.9 -2 -40.9 16.25 0.15 21
DS 7.8 -2 7.8 16.25 0.15 21
DS -40.9 16.25 7.8 16.25 0.15 21
DS -40.9 -2 7.8 -2 0.15 21
DC 0.9 2.33 1.927 2.33 0.127 21
DC 0.9 11.93 1.927 11.93 0.127 21
$PAD
Sh "" R 2 2 0 0 0
Dr 1.1 0 0
At STD N 00E0FFFF
Ne 0 ""
Po 0 0
$EndPAD
$PAD
Sh "" C 1.1 1.1 0 0 0
Dr 1.1 0 0
At HOLE N 00E0FFFF
Ne 0 ""
Po 2.5 0
.LocalClearance 0.381
$EndPAD
$PAD
Sh "" C 1.1 1.1 0 0 0
Dr 1.1 0 0
At HOLE N 00E0FFFF
Ne 0 ""
Po -2.5 0
.LocalClearance 0.381
$EndPAD
$PAD
Sh "" C 1.1 1.1 0 0 0
Dr 1.1 0 0
At HOLE N 00E0FFFF
Ne 0 ""
Po -7.2 0
.LocalClearance 0.381
$EndPAD
$PAD
Sh "" R 2 2 0 0 0
Dr 1.1 0 0
At STD N 00E0FFFF
Ne 0 ""
Po -10 5.68
$EndPAD
$PAD
Sh "" R 2 2 0 0 0
Dr 1.1 0 0
At STD N 00E0FFFF
Ne 0 ""
Po -10 11.08
$EndPAD
$PAD
Sh "" R 2 2 0 0 0
Dr 1.1 0 0
At STD N 00E0FFFF
Ne 0 ""
Po 5 14.25
$EndPAD
$PAD
Sh "" R 2 2 0 0 0
Dr 1.1 0 0
At STD N 00E0FFFF
Ne 0 ""
Po -5 14.25
$EndPAD
$PAD
Sh "" C 1.1 1.1 0 0 0
Dr 1.1 0 0
At HOLE N 00E0FFFF
Ne 0 ""
Po 2.5 14.25
.LocalClearance 0.381
$EndPAD
$PAD
Sh "" C 1.1 1.1 0 0 0
Dr 1.1 0 0
At HOLE N 00E0FFFF
Ne 0 ""
Po -2.5 14.25
.LocalClearance 0.381
$EndPAD
$PAD
Sh "" C 1.1 1.1 0 0 0
Dr 1.1 0 0
At HOLE N 00E0FFFF
Ne 0 ""
Po -7.2 14.25
.LocalClearance 0.381
$EndPAD
$PAD
Sh "" C 1.1 1.1 0 0 0
Dr 1.1 0 0
At HOLE N 00E0FFFF
Ne 0 ""
Po 7.1 11.93
.LocalClearance 0.381
$EndPAD
$PAD
Sh "" C 1.1 1.1 0 0 0
Dr 1.1 0 0
At HOLE N 00E0FFFF
Ne 0 ""
Po 7.1 2.33
.LocalClearance 0.381
$EndPAD
$PAD
Sh "" C 1.1 1.1 0 0 0
Dr 1.1 0 0
At HOLE N 00E0FFFF
Ne 0 ""
Po 7.1 7.13
.LocalClearance 0.381
$EndPAD
$PAD
Sh "" R 2 2 0 0 0
Dr 1.1 0 0
At STD N 00E0FFFF
Ne 0 ""
Po -10 0
$EndPAD
$PAD
Sh "" R 2 2 0 0 0
Dr 1.1 0 0
At STD N 00E0FFFF
Ne 0 ""
Po -20 0
$EndPAD
$PAD
Sh "" R 2 2 0 0 0
Dr 1.1 0 0
At STD N 00E0FFFF
Ne 0 ""
Po -30 0
$EndPAD
$PAD
Sh "" R 2 2 0 0 0
Dr 1.05 0 0
At STD N 00E0FFFF
Ne 0 ""
Po -15 14.224
$EndPAD
$PAD
Sh "" R 2 2 0 0 0
Dr 1.1 0 0
At STD N 00E0FFFF
Ne 0 ""
Po -25 14.25
$EndPAD
$PAD
Sh "" R 2 2 0 0 0
Dr 1.1 0 0
At STD N 00E0FFFF
Ne 0 ""
Po -30 8.58
$EndPAD
$EndMODULE 1_SFP_Cage
$EndLIBRARY
