EESchema Schematic File Version 2
LIBS:sn65hvd3083edgsr
LIBS:conn
LIBS:power
LIBS:pspice
LIBS:zl40216
LIBS:sfp
LIBS:FIN1108
LIBS:sn65lvds389
LIBS:max5825baup
LIBS:tps72301dbvr
LIBS:ina195a
LIBS:tps78630kttt
LIBS:tps73501drbt
LIBS:lt3015eq
LIBS:lt1086cm-3
LIBS:tps72012drvt
LIBS:ina202a
LIBS:transistors
LIBS:2sk3019
LIBS:sn74hc05d
LIBS:ad7998
LIBS:ao3401a
LIBS:opa703
LIBS:6slx45fgg484pkg
LIBS:ERM8-RA
LIBS:cdclvd1204
LIBS:sy89835u
LIBS:zl40212
LIBS:opa4703ea
LIBS:tps73201qdbvrq1
LIBS:m25p32
LIBS:bav99
LIBS:si590
LIBS:iso7242c
LIBS:lmk00304
LIBS:pins_14x2
LIBS:ds18b20u
LIBS:2x14_conn
LIBS:led
EELAYER 27 0
EELAYER END
$Descr A4 11693 8268
encoding utf-8
Sheet 18 23
Title ""
Date "17 mar 2015"
Rev ""
Comp ""
Comment1 ""
Comment2 ""
Comment3 ""
Comment4 ""
$EndDescr
Wire Wire Line
	6300 1050 6450 1050
Wire Wire Line
	6300 750  9500 750 
Connection ~ 9100 750 
Wire Wire Line
	9100 850  9100 750 
Connection ~ 8700 1450
Wire Wire Line
	8700 1350 8700 1450
Connection ~ 8300 750 
Wire Wire Line
	9500 750  9500 850 
Connection ~ 7500 2850
Wire Wire Line
	7500 2750 7500 2850
Wire Wire Line
	6850 2900 6850 2850
Wire Wire Line
	6850 2850 8300 2850
Wire Wire Line
	8300 2850 8300 2750
Connection ~ 7500 2150
Wire Wire Line
	7500 2250 7500 2150
Connection ~ 6850 2150
Wire Wire Line
	8300 2250 8300 2150
Wire Wire Line
	8300 2150 6300 2150
Connection ~ 6450 950 
Wire Wire Line
	6300 950  6450 950 
Connection ~ 6450 1150
Wire Wire Line
	6300 1150 6450 1150
Connection ~ 6450 1350
Wire Wire Line
	6300 1350 6450 1350
Connection ~ 6450 1550
Wire Wire Line
	6300 1550 6450 1550
Connection ~ 6450 1750
Wire Wire Line
	6300 1750 6450 1750
Connection ~ 6450 1950
Wire Wire Line
	6300 1950 6450 1950
Connection ~ 6450 750 
Wire Wire Line
	6450 750  6450 2050
Connection ~ 6450 3950
Wire Wire Line
	6300 3950 6450 3950
Connection ~ 6450 3750
Wire Wire Line
	6300 3750 6450 3750
Connection ~ 6450 3550
Wire Wire Line
	6300 3550 6450 3550
Connection ~ 6450 3350
Wire Wire Line
	6300 3350 6450 3350
Connection ~ 6450 3150
Wire Wire Line
	6300 3150 6450 3150
Connection ~ 6450 2950
Wire Wire Line
	6300 2950 6450 2950
Connection ~ 6450 2750
Wire Wire Line
	6300 2750 6450 2750
Connection ~ 6450 2550
Wire Wire Line
	6300 2550 6450 2550
Connection ~ 6450 2350
Wire Wire Line
	6300 2350 6450 2350
Connection ~ 6450 2150
Wire Wire Line
	6450 2150 6450 4050
Wire Wire Line
	6450 4050 6300 4050
Wire Wire Line
	4200 7150 4200 1250
Wire Wire Line
	4200 1250 4300 1250
Wire Wire Line
	4200 1350 4300 1350
Connection ~ 4200 1350
Wire Wire Line
	4200 1450 4300 1450
Connection ~ 4200 1450
Wire Wire Line
	4200 1550 4300 1550
Connection ~ 4200 1550
Wire Wire Line
	4200 1650 4300 1650
Connection ~ 4200 1650
Wire Wire Line
	4200 1750 4300 1750
Connection ~ 4200 1750
Wire Wire Line
	4200 1850 4300 1850
Connection ~ 4200 1850
Wire Wire Line
	4200 1950 4300 1950
Connection ~ 4200 1950
Wire Wire Line
	4200 2050 4300 2050
Connection ~ 4200 2050
Wire Wire Line
	4200 2150 4300 2150
Connection ~ 4200 2150
Wire Wire Line
	4200 2250 4300 2250
Connection ~ 4200 2250
Wire Wire Line
	4200 2350 4300 2350
Connection ~ 4200 2350
Wire Wire Line
	4200 2450 4300 2450
Connection ~ 4200 2450
Wire Wire Line
	4200 2550 4300 2550
Connection ~ 4200 2550
Wire Wire Line
	4200 2650 4300 2650
Connection ~ 4200 2650
Wire Wire Line
	4200 2750 4300 2750
Connection ~ 4200 2750
Wire Wire Line
	4200 2850 4300 2850
Connection ~ 4200 2850
Wire Wire Line
	4200 2950 4300 2950
Connection ~ 4200 2950
Wire Wire Line
	4200 3050 4300 3050
Connection ~ 4200 3050
Wire Wire Line
	4200 3150 4300 3150
Connection ~ 4200 3150
Wire Wire Line
	4200 3250 4300 3250
Connection ~ 4200 3250
Wire Wire Line
	4200 3350 4300 3350
Connection ~ 4200 3350
Wire Wire Line
	4200 3450 4300 3450
Connection ~ 4200 3450
Wire Wire Line
	4200 3550 4300 3550
Connection ~ 4200 3550
Wire Wire Line
	4200 3650 4300 3650
Connection ~ 4200 3650
Wire Wire Line
	4200 3750 4300 3750
Connection ~ 4200 3750
Wire Wire Line
	4200 3850 4300 3850
Connection ~ 4200 3850
Wire Wire Line
	4200 3950 4300 3950
Connection ~ 4200 3950
Wire Wire Line
	4200 4050 4300 4050
Connection ~ 4200 4050
Wire Wire Line
	4200 4150 4300 4150
Connection ~ 4200 4150
Wire Wire Line
	4200 4250 4300 4250
Connection ~ 4200 4250
Wire Wire Line
	4200 4350 4300 4350
Connection ~ 4200 4350
Wire Wire Line
	4200 4450 4300 4450
Connection ~ 4200 4450
Wire Wire Line
	4200 4550 4300 4550
Connection ~ 4200 4550
Wire Wire Line
	4200 4650 4300 4650
Connection ~ 4200 4650
Wire Wire Line
	4200 4750 4300 4750
Connection ~ 4200 4750
Wire Wire Line
	4200 4850 4300 4850
Connection ~ 4200 4850
Wire Wire Line
	4200 4950 4300 4950
Connection ~ 4200 4950
Wire Wire Line
	4200 5050 4300 5050
Connection ~ 4200 5050
Wire Wire Line
	4200 5150 4300 5150
Connection ~ 4200 5150
Wire Wire Line
	4200 5250 4300 5250
Connection ~ 4200 5250
Wire Wire Line
	4200 5350 4300 5350
Connection ~ 4200 5350
Wire Wire Line
	4200 5450 4300 5450
Connection ~ 4200 5450
Wire Wire Line
	4200 5550 4300 5550
Connection ~ 4200 5550
Wire Wire Line
	4200 5650 4300 5650
Connection ~ 4200 5650
Wire Wire Line
	4200 5750 4300 5750
Connection ~ 4200 5750
Wire Wire Line
	4200 5850 4300 5850
Connection ~ 4200 5850
Wire Wire Line
	4200 5950 4300 5950
Connection ~ 4200 5950
Wire Wire Line
	4200 6050 4300 6050
Connection ~ 4200 6050
Wire Wire Line
	4200 6150 4300 6150
Connection ~ 4200 6150
Wire Wire Line
	4200 6250 4300 6250
Connection ~ 4200 6250
Wire Wire Line
	4200 6350 4300 6350
Connection ~ 4200 6350
Wire Wire Line
	4200 6450 4300 6450
Connection ~ 4200 6450
Wire Wire Line
	4200 6550 4300 6550
Connection ~ 4200 6550
Wire Wire Line
	4200 6650 4300 6650
Connection ~ 4200 6650
Wire Wire Line
	4200 6750 4300 6750
Connection ~ 4200 6750
Wire Wire Line
	4200 6850 4300 6850
Connection ~ 4200 6850
Wire Wire Line
	4200 6950 4300 6950
Connection ~ 4200 6950
Wire Wire Line
	4200 7050 4300 7050
Connection ~ 4200 7050
Wire Wire Line
	6300 2250 6450 2250
Connection ~ 6450 2250
Wire Wire Line
	6300 2450 6450 2450
Connection ~ 6450 2450
Wire Wire Line
	6300 2650 6450 2650
Connection ~ 6450 2650
Wire Wire Line
	6300 2850 6450 2850
Connection ~ 6450 2850
Wire Wire Line
	6300 3050 6450 3050
Connection ~ 6450 3050
Wire Wire Line
	6300 3250 6450 3250
Connection ~ 6450 3250
Wire Wire Line
	6300 3450 6450 3450
Connection ~ 6450 3450
Connection ~ 6450 3650
Wire Wire Line
	6300 3850 6450 3850
Connection ~ 6450 3850
Wire Wire Line
	6450 2050 6300 2050
Wire Wire Line
	6300 1850 6450 1850
Connection ~ 6450 1850
Wire Wire Line
	6300 1650 6450 1650
Connection ~ 6450 1650
Wire Wire Line
	6300 1450 6450 1450
Connection ~ 6450 1450
Wire Wire Line
	6300 1250 6450 1250
Connection ~ 6450 1250
Connection ~ 6450 1050
Wire Wire Line
	6300 850  6450 850 
Connection ~ 6450 850 
Wire Wire Line
	7900 2250 7900 2150
Connection ~ 7900 2150
Wire Wire Line
	7100 2250 7100 2150
Connection ~ 7100 2150
Wire Wire Line
	7100 2750 7100 2850
Connection ~ 7100 2850
Wire Wire Line
	7900 2750 7900 2850
Connection ~ 7900 2850
Connection ~ 7900 1450
Wire Wire Line
	7900 1350 7900 1450
Connection ~ 7100 1450
Wire Wire Line
	7100 1350 7100 1450
Connection ~ 7100 750 
Wire Wire Line
	7100 850  7100 750 
Connection ~ 7900 750 
Wire Wire Line
	7900 850  7900 750 
Wire Wire Line
	8300 750  8300 850 
Connection ~ 6850 750 
Wire Wire Line
	7500 850  7500 750 
Connection ~ 7500 750 
Wire Wire Line
	8300 1450 8300 1350
Wire Wire Line
	6850 1500 6850 1450
Wire Wire Line
	7500 1350 7500 1450
Connection ~ 7500 1450
Wire Wire Line
	9500 1350 9500 1450
Wire Wire Line
	9500 1450 6850 1450
Connection ~ 8300 1450
Wire Wire Line
	9100 1350 9100 1450
Connection ~ 9100 1450
Wire Wire Line
	8700 850  8700 750 
Connection ~ 8700 750 
Wire Wire Line
	6300 3650 6450 3650
$Comp
L C C48
U 1 1 5467E525
P 9100 1100
F 0 "C48" V 9200 1250 50  0000 C CNN
F 1 "0.47uF LO ESR" V 9300 1050 50  0000 C CNN
F 2 "" H 9100 1100 60  0001 C CNN
F 3 "" H 9100 1100 60  0001 C CNN
	1    9100 1100
	1    0    0    -1  
$EndComp
$Comp
L C C49
U 1 1 5467E524
P 9500 1100
F 0 "C49" V 9600 1250 50  0000 C CNN
F 1 "0.47uF LO ESR" V 9700 1050 50  0000 C CNN
F 2 "" H 9500 1100 60  0001 C CNN
F 3 "" H 9500 1100 60  0001 C CNN
	1    9500 1100
	1    0    0    -1  
$EndComp
$Comp
L C C47
U 1 1 5467E518
P 8700 1100
F 0 "C47" V 8800 1250 50  0000 C CNN
F 1 "0.47uF LO ESR" V 8900 1050 50  0000 C CNN
F 2 "" H 8700 1100 60  0001 C CNN
F 3 "" H 8700 1100 60  0001 C CNN
	1    8700 1100
	1    0    0    -1  
$EndComp
Text Notes 7750 750  0    60   ~ 12
CONFIG VCCAUX=3.3;
$Comp
L C C43
U 1 1 5467E4BB
P 7100 1100
F 0 "C43" V 7200 1250 50  0000 C CNN
F 1 "100uF LO ESR" V 7300 1050 50  0000 C CNN
F 2 "" H 7100 1100 60  0001 C CNN
F 3 "" H 7100 1100 60  0001 C CNN
	1    7100 1100
	1    0    0    -1  
$EndComp
$Comp
L C C44
U 1 1 5467E4BA
P 7500 1100
F 0 "C44" V 7600 1250 50  0000 C CNN
F 1 "4.7uF LO ESR" V 7700 1050 50  0000 C CNN
F 2 "" H 7500 1100 60  0001 C CNN
F 3 "" H 7500 1100 60  0001 C CNN
	1    7500 1100
	1    0    0    -1  
$EndComp
$Comp
L C C46
U 1 1 5467E4B9
P 8300 1100
F 0 "C46" V 8400 1250 50  0000 C CNN
F 1 "0.47uF LO ESR" V 8500 1050 50  0000 C CNN
F 2 "" H 8300 1100 60  0001 C CNN
F 3 "" H 8300 1100 60  0001 C CNN
	1    8300 1100
	1    0    0    -1  
$EndComp
$Comp
L C C45
U 1 1 5467E4B8
P 7900 1100
F 0 "C45" V 8000 1250 50  0000 C CNN
F 1 "4.7uF LO ESR" V 8100 1050 50  0000 C CNN
F 2 "" H 7900 1100 60  0001 C CNN
F 3 "" H 7900 1100 60  0001 C CNN
	1    7900 1100
	1    0    0    -1  
$EndComp
$Comp
L GND #PWR0120
U 1 1 5467E4B7
P 6850 1500
F 0 "#PWR0120" H 6850 1500 30  0001 C CNN
F 1 "GND" H 6850 1430 30  0001 C CNN
F 2 "" H 6850 1500 60  0001 C CNN
F 3 "" H 6850 1500 60  0001 C CNN
	1    6850 1500
	1    0    0    -1  
$EndComp
$Comp
L GND #PWR0121
U 1 1 5467E48A
P 6850 2900
F 0 "#PWR0121" H 6850 2900 30  0001 C CNN
F 1 "GND" H 6850 2830 30  0001 C CNN
F 2 "" H 6850 2900 60  0001 C CNN
F 3 "" H 6850 2900 60  0001 C CNN
	1    6850 2900
	1    0    0    -1  
$EndComp
$Comp
L C C52
U 1 1 5467E415
P 7900 2500
F 0 "C52" V 8000 2650 50  0000 C CNN
F 1 "0.47uF LO ESR" V 8100 2450 50  0000 C CNN
F 2 "" H 7900 2500 60  0001 C CNN
F 3 "" H 7900 2500 60  0001 C CNN
	1    7900 2500
	1    0    0    -1  
$EndComp
$Comp
L C C53
U 1 1 5467E414
P 8300 2500
F 0 "C53" V 8400 2650 50  0000 C CNN
F 1 "0.47uF LO ESR" V 8550 2450 50  0000 C CNN
F 2 "" H 8300 2500 60  0001 C CNN
F 3 "" H 8300 2500 60  0001 C CNN
	1    8300 2500
	1    0    0    -1  
$EndComp
$Comp
L C C51
U 1 1 5467E406
P 7500 2500
F 0 "C51" V 7600 2650 50  0000 C CNN
F 1 "4.7uF LO ESR" V 7700 2450 50  0000 C CNN
F 2 "" H 7500 2500 60  0001 C CNN
F 3 "" H 7500 2500 60  0001 C CNN
	1    7500 2500
	1    0    0    -1  
$EndComp
$Comp
L C C50
U 1 1 5467E3F3
P 7100 2500
F 0 "C50" V 7200 2650 50  0000 C CNN
F 1 "100uF LO ESR" V 7300 2450 50  0000 C CNN
F 2 "" H 7100 2500 60  0001 C CNN
F 3 "" H 7100 2500 60  0001 C CNN
	1    7100 2500
	1    0    0    -1  
$EndComp
$Comp
L +3.3V #PWR0122
U 1 1 5467E2AA
P 6850 750
F 0 "#PWR0122" H 6850 710 30  0001 C CNN
F 1 "+3.3V" H 6850 860 30  0000 C CNN
F 2 "" H 6850 750 60  0001 C CNN
F 3 "" H 6850 750 60  0001 C CNN
	1    6850 750 
	1    0    0    -1  
$EndComp
$Comp
L +1.2V #PWR0123
U 1 1 5467E264
P 6850 2150
F 0 "#PWR0123" H 6850 2290 20  0001 C CNN
F 1 "+1.2V" H 6850 2260 30  0000 C CNN
F 2 "" H 6850 2150 60  0001 C CNN
F 3 "" H 6850 2150 60  0001 C CNN
	1    6850 2150
	1    0    0    -1  
$EndComp
$Comp
L 6SLX45FGG484PKG U16
U 5 1 5461B191
P 4800 2350
F 0 "U16" H 6000 4100 60  0000 C CNN
F 1 "6SLX45FGG484PKG" H 4850 4100 60  0000 C CNN
F 2 "" H 4800 2350 60  0001 C CNN
F 3 "" H 4800 2350 60  0001 C CNN
	5    4800 2350
	1    0    0    -1  
$EndComp
$Comp
L GND #PWR0124
U 1 1 5461B25D
P 4200 7150
F 0 "#PWR0124" H 4200 7150 30  0001 C CNN
F 1 "GND" H 4200 7080 30  0001 C CNN
F 2 "" H 4200 7150 60  0001 C CNN
F 3 "" H 4200 7150 60  0001 C CNN
	1    4200 7150
	1    0    0    -1  
$EndComp
$EndSCHEMATC
