EESchema Schematic File Version 2
LIBS:sn65hvd3083edgsr
LIBS:conn
LIBS:power
LIBS:pspice
LIBS:zl40216
LIBS:sfp
LIBS:FIN1108
LIBS:sn65lvds389
LIBS:max5825baup
LIBS:tps72301dbvr
LIBS:ina195a
LIBS:tps78630kttt
LIBS:tps73501drbt
LIBS:lt3015eq
LIBS:lt1086cm-3
LIBS:tps72012drvt
LIBS:ina202a
LIBS:transistors
LIBS:2sk3019
LIBS:sn74hc05d
LIBS:ad7998
LIBS:ao3401a
LIBS:opa703
LIBS:6slx45fgg484pkg
LIBS:ERM8-RA
LIBS:cdclvd1204
LIBS:sy89835u
LIBS:zl40212
LIBS:opa4703ea
LIBS:tps73201qdbvrq1
LIBS:m25p32
LIBS:bav99
LIBS:si590
LIBS:iso7242c
LIBS:lmk00304
LIBS:pins_14x2
LIBS:ds18b20u
LIBS:2x14_conn
LIBS:led
LIBS:LogicBoard-cache
EELAYER 24 0
EELAYER END
$Descr A4 11693 8268
encoding utf-8
Sheet 14 23
Title ""
Date "1 dec 2015"
Rev ""
Comp ""
Comment1 ""
Comment2 ""
Comment3 ""
Comment4 ""
$EndDescr
Wire Wire Line
	3100 4100 3100 4000
Wire Wire Line
	1800 1150 2500 1150
Wire Wire Line
	3450 1650 1800 1650
Wire Wire Line
	3500 4000 3500 3950
Wire Wire Line
	3200 4100 3200 4000
Connection ~ 3200 4000
Wire Wire Line
	900  3950 900  4100
Connection ~ 900  4000
Wire Wire Line
	900  4600 900  4700
Wire Wire Line
	3200 4600 3200 4700
Wire Wire Line
	7400 3850 7400 3750
Connection ~ 7400 3750
Wire Wire Line
	7600 3750 7600 3700
Wire Wire Line
	4950 3650 4950 3850
Connection ~ 4950 3750
Wire Wire Line
	5800 3950 5700 3950
Connection ~ 5700 3750
Wire Wire Line
	5700 4150 5800 4150
Connection ~ 5700 3950
Wire Wire Line
	7400 4350 7400 4600
Wire Wire Line
	6550 4600 6550 4550
Wire Wire Line
	4950 4600 4950 4350
Wire Wire Line
	1950 1150 1950 1350
Connection ~ 2250 1150
Connection ~ 1950 1150
Connection ~ 2850 1250
Connection ~ 2850 1650
Connection ~ 1950 1750
Wire Wire Line
	2350 4600 2350 4700
NoConn ~ 1800 1550
Text Notes 1100 850  0    60   ~ 12
Power input
$Comp
L DB9 J2
U 1 1 54518251
P 1350 1550
F 0 "J2" H 1350 2100 70  0000 C CNN
F 1 "DB9" H 1350 1000 70  0000 C CNN
F 2 "DB9" H 1350 1550 60  0001 C CNN
F 3 "" H 1350 1550 60  0001 C CNN
	1    1350 1550
	-1   0    0    1   
$EndComp
$Comp
L +5V #PWR081
U 1 1 5451826F
P 2250 1150
F 0 "#PWR081" H 2250 1240 20  0001 C CNN
F 1 "+5V" H 2250 1240 30  0000 C CNN
F 2 "" H 2250 1150 60  0001 C CNN
F 3 "" H 2250 1150 60  0001 C CNN
	1    2250 1150
	1    0    0    -1  
$EndComp
$Comp
L -5V #PWR082
U 1 1 54518283
P 2250 2050
F 0 "#PWR082" H 2250 2190 20  0001 C CNN
F 1 "-5V" H 2250 2160 30  0000 C CNN
F 2 "" H 2250 2050 60  0001 C CNN
F 3 "" H 2250 2050 60  0001 C CNN
	1    2250 2050
	1    0    0    -1  
$EndComp
$Comp
L PWR_FLAG #FLG083
U 1 1 54518297
P 2500 1150
F 0 "#FLG083" H 2500 1245 30  0001 C CNN
F 1 "PWR_FLAG" H 2500 1330 30  0000 C CNN
F 2 "" H 2500 1150 60  0001 C CNN
F 3 "" H 2500 1150 60  0001 C CNN
	1    2500 1150
	1    0    0    -1  
$EndComp
$Comp
L PWR_FLAG #FLG084
U 1 1 545182AB
P 2500 2100
F 0 "#FLG084" H 2500 2195 30  0001 C CNN
F 1 "PWR_FLAG" H 2500 2280 30  0000 C CNN
F 2 "" H 2500 2100 60  0001 C CNN
F 3 "" H 2500 2100 60  0001 C CNN
	1    2500 2100
	1    0    0    -1  
$EndComp
$Comp
L +5VRET #PWR085
U 1 1 54518473
P 2850 1250
F 0 "#PWR085" H 2850 1340 20  0001 C CNN
F 1 "+5VRET" H 2850 1340 30  0000 C CNN
F 2 "" H 2850 1250 60  0001 C CNN
F 3 "" H 2850 1250 60  0001 C CNN
	1    2850 1250
	1    0    0    -1  
$EndComp
$Comp
L -5VRET #PWR086
U 1 1 545184AF
P 2850 1650
F 0 "#PWR086" H 2850 1790 20  0001 C CNN
F 1 "-5VRET" H 2850 1760 30  0000 C CNN
F 2 "" H 2850 1650 60  0001 C CNN
F 3 "" H 2850 1650 60  0001 C CNN
	1    2850 1650
	1    0    0    -1  
$EndComp
$Comp
L PWR_FLAG #FLG087
U 1 1 545184C3
P 3450 1200
F 0 "#FLG087" H 3450 1295 30  0001 C CNN
F 1 "PWR_FLAG" H 3450 1380 30  0000 C CNN
F 2 "" H 3450 1200 60  0001 C CNN
F 3 "" H 3450 1200 60  0001 C CNN
	1    3450 1200
	1    0    0    -1  
$EndComp
Text Notes 1700 3400 0    60   ~ 0
+3.3V Regulator\nmax: 1.5A\nTotal: 713mA\nArea: 1" square
Text Notes 5950 3400 0    60   ~ 0
+1.2V Regulator\nmax: 350mA\nTotal: 171mA
$Comp
L LT1086CM-3.3 U15
U 1 1 545C35BB
P 2350 3950
F 0 "U15" H 2700 3450 60  0000 C CNN
F 1 "LT1086CM-3.3" H 2350 4100 60  0000 C CNN
F 2 "DPAK3" H 2350 3950 60  0001 C CNN
F 3 "" H 2350 3950 60  0001 C CNN
	1    2350 3950
	1    0    0    -1  
$EndComp
$Comp
L C C32
U 1 1 545C35C1
P 900 4350
F 0 "C32" V 1000 4500 50  0000 C CNN
F 1 "10uF" V 1000 4200 50  0000 C CNN
F 2 "SM0402" H 900 4350 60  0001 C CNN
F 3 "" H 900 4350 60  0001 C CNN
	1    900  4350
	1    0    0    -1  
$EndComp
$Comp
L C C33
U 1 1 545C35C7
P 3200 4350
F 0 "C33" V 3300 4500 50  0000 C CNN
F 1 "10uF" V 3300 4200 50  0000 C CNN
F 2 "SM0402" H 3200 4350 60  0001 C CNN
F 3 "" H 3200 4350 60  0001 C CNN
	1    3200 4350
	1    0    0    -1  
$EndComp
$Comp
L +5V #PWR088
U 1 1 545C35CD
P 900 3950
F 0 "#PWR088" H 900 4040 20  0001 C CNN
F 1 "+5V" H 900 4040 30  0000 C CNN
F 2 "" H 900 3950 60  0001 C CNN
F 3 "" H 900 3950 60  0001 C CNN
	1    900  3950
	1    0    0    -1  
$EndComp
$Comp
L +3.3V #PWR089
U 1 1 545C35D3
P 3500 3950
F 0 "#PWR089" H 3500 3910 30  0001 C CNN
F 1 "+3.3V" H 3500 4060 30  0000 C CNN
F 2 "" H 3500 3950 60  0001 C CNN
F 3 "" H 3500 3950 60  0001 C CNN
	1    3500 3950
	1    0    0    -1  
$EndComp
$Comp
L GND #PWR090
U 1 1 545C35E7
P 2350 4700
F 0 "#PWR090" H 2350 4700 30  0001 C CNN
F 1 "GND" H 2350 4630 30  0001 C CNN
F 2 "" H 2350 4700 60  0001 C CNN
F 3 "" H 2350 4700 60  0001 C CNN
	1    2350 4700
	1    0    0    -1  
$EndComp
$Comp
L R R44
U 1 1 545C35EF
P 1250 4000
F 0 "R44" V 1330 4000 50  0000 C CNN
F 1 "0" V 1250 4000 50  0000 C CNN
F 2 "SM0805" H 1250 4000 60  0001 C CNN
F 3 "" H 1250 4000 60  0001 C CNN
	1    1250 4000
	0    -1   -1   0   
$EndComp
$Comp
L TPS72012DRVT U14
U 1 1 545C35F5
P 6550 3900
F 0 "U14" H 6900 3400 60  0000 C CNN
F 1 "TPS72012DRVT" H 6550 3950 60  0000 C CNN
F 2 "TPS72012" H 6550 3900 60  0001 C CNN
F 3 "" H 6550 3900 60  0001 C CNN
	1    6550 3900
	1    0    0    -1  
$EndComp
$Comp
L C C31
U 1 1 545C35FB
P 7400 4100
F 0 "C31" V 7500 4250 50  0000 C CNN
F 1 "2.2uF" V 7500 3950 50  0000 C CNN
F 2 "SM0402" H 7400 4100 60  0001 C CNN
F 3 "" H 7400 4100 60  0001 C CNN
	1    7400 4100
	1    0    0    -1  
$EndComp
$Comp
L +3.3V #PWR091
U 1 1 545C3601
P 4950 3650
F 0 "#PWR091" H 4950 3610 30  0001 C CNN
F 1 "+3.3V" H 4950 3760 30  0000 C CNN
F 2 "" H 4950 3650 60  0001 C CNN
F 3 "" H 4950 3650 60  0001 C CNN
	1    4950 3650
	1    0    0    -1  
$EndComp
$Comp
L R R43
U 1 1 545C360B
P 5300 3750
F 0 "R43" V 5380 3750 50  0000 C CNN
F 1 "0" V 5300 3750 50  0000 C CNN
F 2 "SM0805" H 5300 3750 60  0001 C CNN
F 3 "" H 5300 3750 60  0001 C CNN
	1    5300 3750
	0    -1   -1   0   
$EndComp
$Comp
L C C30
U 1 1 545C3611
P 4950 4100
F 0 "C30" V 5050 4250 50  0000 C CNN
F 1 "0.1uF" V 5050 3950 50  0000 C CNN
F 2 "SM0402" H 4950 4100 60  0001 C CNN
F 3 "" H 4950 4100 60  0001 C CNN
	1    4950 4100
	1    0    0    -1  
$EndComp
$Comp
L GND #PWR092
U 1 1 545C3623
P 7400 4600
F 0 "#PWR092" H 7400 4600 30  0001 C CNN
F 1 "GND" H 7400 4530 30  0001 C CNN
F 2 "" H 7400 4600 60  0001 C CNN
F 3 "" H 7400 4600 60  0001 C CNN
	1    7400 4600
	1    0    0    -1  
$EndComp
$Comp
L +1.2V #PWR093
U 1 1 545C362B
P 7600 3700
F 0 "#PWR093" H 7600 3840 20  0001 C CNN
F 1 "+1.2V" H 7600 3810 30  0000 C CNN
F 2 "" H 7600 3700 60  0001 C CNN
F 3 "" H 7600 3700 60  0001 C CNN
	1    7600 3700
	1    0    0    -1  
$EndComp
Text Notes 1150 3200 0    60   ~ 12
FPGA  & local power
Text Notes 2400 5800 0    60   ~ 12
TDC Power monitoring
$Comp
L GND #PWR094
U 1 1 545C74C8
P 6550 4600
F 0 "#PWR094" H 6550 4600 30  0001 C CNN
F 1 "GND" H 6550 4530 30  0001 C CNN
F 2 "" H 6550 4600 60  0001 C CNN
F 3 "" H 6550 4600 60  0001 C CNN
	1    6550 4600
	1    0    0    -1  
$EndComp
$Comp
L GND #PWR095
U 1 1 545C7567
P 4950 4600
F 0 "#PWR095" H 4950 4600 30  0001 C CNN
F 1 "GND" H 4950 4530 30  0001 C CNN
F 2 "" H 4950 4600 60  0001 C CNN
F 3 "" H 4950 4600 60  0001 C CNN
	1    4950 4600
	1    0    0    -1  
$EndComp
$Comp
L GND #PWR096
U 1 1 545C88C8
P 3200 4700
F 0 "#PWR096" H 3200 4700 30  0001 C CNN
F 1 "GND" H 3200 4630 30  0001 C CNN
F 2 "" H 3200 4700 60  0001 C CNN
F 3 "" H 3200 4700 60  0001 C CNN
	1    3200 4700
	1    0    0    -1  
$EndComp
$Comp
L GND #PWR097
U 1 1 545C896C
P 900 4700
F 0 "#PWR097" H 900 4700 30  0001 C CNN
F 1 "GND" H 900 4630 30  0001 C CNN
F 2 "" H 900 4700 60  0001 C CNN
F 3 "" H 900 4700 60  0001 C CNN
	1    900  4700
	1    0    0    -1  
$EndComp
$Comp
L GND #PWR098
U 1 1 546C83DF
P 3450 1800
F 0 "#PWR098" H 3450 1800 30  0001 C CNN
F 1 "GND" H 3450 1730 30  0001 C CNN
F 2 "" H 3450 1800 60  0000 C CNN
F 3 "" H 3450 1800 60  0000 C CNN
	1    3450 1800
	1    0    0    -1  
$EndComp
Connection ~ 3450 1650
Wire Wire Line
	3350 6550 4350 6550
Wire Wire Line
	3350 6550 3350 6250
Wire Wire Line
	3350 6250 3050 6250
Wire Wire Line
	3050 6250 3050 6150
Wire Wire Line
	3850 6250 3850 6650
Wire Wire Line
	3850 6650 4350 6650
Text Notes 4350 6800 0    60   ~ 0
3V nominal
Text Notes 4200 6200 0    60   ~ 0
1.5A
$Comp
L R R45
U 1 1 54755A86
P 3600 6250
F 0 "R45" V 3680 6250 50  0000 C CNN
F 1 "0.02" V 3600 6250 50  0000 C CNN
F 2 "SM0805" H 3600 6250 60  0001 C CNN
F 3 "" H 3600 6250 60  0001 C CNN
	1    3600 6250
	0    -1   -1   0   
$EndComp
$Comp
L +5V #PWR099
U 1 1 54755A8C
P 3050 6150
F 0 "#PWR099" H 3050 6240 20  0001 C CNN
F 1 "+5V" H 3050 6240 30  0000 C CNN
F 2 "" H 3050 6150 60  0001 C CNN
F 3 "" H 3050 6150 60  0001 C CNN
	1    3050 6150
	1    0    0    -1  
$EndComp
Text HLabel 4250 6250 2    60   Output ~ 0
TDCMB
Wire Wire Line
	3850 6250 4250 6250
Text HLabel 4350 6550 2    60   Output ~ 0
TDC+
Text HLabel 4350 6650 2    60   Output ~ 0
TDC-
Wire Wire Line
	900  4000 1000 4000
Wire Wire Line
	1500 4000 1600 4000
Connection ~ 3500 4000
Wire Wire Line
	5550 3750 5800 3750
Wire Wire Line
	4950 3750 5050 3750
Wire Wire Line
	3100 4000 3500 4000
$Comp
L PWR_FLAG #FLG0100
U 1 1 547F94F3
P 1550 3950
F 0 "#FLG0100" H 1550 4045 30  0001 C CNN
F 1 "PWR_FLAG" H 1550 4130 30  0000 C CNN
F 2 "" H 1550 3950 60  0000 C CNN
F 3 "" H 1550 3950 60  0000 C CNN
	1    1550 3950
	1    0    0    -1  
$EndComp
Wire Wire Line
	1550 3950 1550 4000
Connection ~ 1550 4000
Wire Wire Line
	7300 3750 7600 3750
$Comp
L PWR_FLAG #FLG0101
U 1 1 547F95D7
P 5600 3700
F 0 "#FLG0101" H 5600 3795 30  0001 C CNN
F 1 "PWR_FLAG" H 5600 3880 30  0000 C CNN
F 2 "" H 5600 3700 60  0000 C CNN
F 3 "" H 5600 3700 60  0000 C CNN
	1    5600 3700
	1    0    0    -1  
$EndComp
Wire Wire Line
	5600 3700 5600 3750
Connection ~ 5600 3750
Wire Wire Line
	1950 1350 1800 1350
Wire Wire Line
	1800 1450 2850 1450
Wire Wire Line
	2850 1450 2850 1250
Wire Wire Line
	3450 1200 3450 1800
Wire Wire Line
	1800 1250 3450 1250
Wire Wire Line
	2850 1650 2850 1850
Wire Wire Line
	2850 1850 1800 1850
Connection ~ 3450 1250
Wire Wire Line
	1950 1750 1950 2100
Wire Wire Line
	1950 1950 1800 1950
Wire Wire Line
	1800 1750 1950 1750
Connection ~ 1950 1950
Wire Wire Line
	1950 2100 2500 2100
Wire Wire Line
	2250 2050 2250 2100
Connection ~ 2250 2100
Wire Wire Line
	6550 4550 6650 4550
Wire Wire Line
	5700 3950 5700 3750
$Comp
L +3.3V #PWR0102
U 1 1 5489D721
P 5700 4150
F 0 "#PWR0102" H 5700 4110 30  0001 C CNN
F 1 "+3.3V" H 5700 4260 30  0000 C CNN
F 2 "" H 5700 4150 60  0000 C CNN
F 3 "" H 5700 4150 60  0000 C CNN
	1    5700 4150
	1    0    0    -1  
$EndComp
$Comp
L SHIELD #PWR0103
U 1 1 563312D2
P 1350 2400
F 0 "#PWR0103" H 1350 2400 30  0001 C CNN
F 1 "SHIELD" H 1350 2330 30  0001 C CNN
F 2 "" H 1350 2400 60  0000 C CNN
F 3 "" H 1350 2400 60  0000 C CNN
	1    1350 2400
	1    0    0    -1  
$EndComp
Wire Wire Line
	1350 2300 1350 2400
$Comp
L PWR_FLAG #FLG0104
U 1 1 56331835
P 1550 2300
F 0 "#FLG0104" H 1550 2395 30  0001 C CNN
F 1 "PWR_FLAG" H 1550 2480 30  0000 C CNN
F 2 "" H 1550 2300 60  0000 C CNN
F 3 "" H 1550 2300 60  0000 C CNN
	1    1550 2300
	1    0    0    -1  
$EndComp
Wire Wire Line
	1350 2300 1550 2300
$EndSCHEMATC
