PCBNEW-LibModule-V1  Sun 23 Nov 2014 09:20:41 PM EST
# encoding utf-8
Units mm
$INDEX
lmk00304
$EndINDEX
$MODULE lmk00304
Po 0 0 0 15 547295EC 00000000 ~~
Li lmk00304
Sc 0
AR 
Op 0 0 0
T0 10.9982 -5.7912 1 1 0 0.15 N I 21 N "lmk00304"
T1 -0.0254 3.937 1 1 0 0.15 N V 21 N "VAL**"
DS 2.5 2.5 2 2.5 0.15 21
DS 2.5 2.5 2.5 2 0.15 21
DS -2.5 2.5 -2 2.5 0.15 21
DS -2.5 2.5 -2.5 2 0.15 21
DS 2.5 -2.5 2.5 -2 0.15 21
DS 2.5 -2.5 2 -2.5 0.15 21
DS -2 -2.5 -2.5 -2 0.15 21
$PAD
Sh "24" R 0.6 0.25 0 0 0
Dr 0 0 0
At SMD N 00888000
Ne 0 ""
Po 2.4 -1.75
$EndPAD
$PAD
Sh "23" R 0.6 0.25 0 0 0
Dr 0 0 0
At SMD N 00888000
Ne 0 ""
Po 2.4 -1.25
$EndPAD
$PAD
Sh "22" R 0.6 0.25 0 0 0
Dr 0 0 0
At SMD N 00888000
Ne 0 ""
Po 2.4 -0.75
$EndPAD
$PAD
Sh "21" R 0.6 0.25 0 0 0
Dr 0 0 0
At SMD N 00888000
Ne 0 ""
Po 2.4 -0.25
$EndPAD
$PAD
Sh "20" R 0.6 0.25 0 0 0
Dr 0 0 0
At SMD N 00888000
Ne 0 ""
Po 2.4 0.25
$EndPAD
$PAD
Sh "19" R 0.6 0.25 0 0 0
Dr 0 0 0
At SMD N 00888000
Ne 0 ""
Po 2.4 0.75
$EndPAD
$PAD
Sh "18" R 0.6 0.25 0 0 0
Dr 0 0 0
At SMD N 00888000
Ne 0 ""
Po 2.4 1.25
$EndPAD
$PAD
Sh "17" R 0.6 0.25 0 0 0
Dr 0 0 0
At SMD N 00888000
Ne 0 ""
Po 2.4 1.75
$EndPAD
$PAD
Sh "32" R 0.25 0.6 0 0 0
Dr 0 0 0
At SMD N 00888000
Ne 0 ""
Po -1.75 -2.4
$EndPAD
$PAD
Sh "31" R 0.25 0.6 0 0 0
Dr 0 0 0
At SMD N 00888000
Ne 0 ""
Po -1.25 -2.4
$EndPAD
$PAD
Sh "30" R 0.25 0.6 0 0 0
Dr 0 0 0
At SMD N 00888000
Ne 0 ""
Po -0.75 -2.4
$EndPAD
$PAD
Sh "29" R 0.25 0.6 0 0 0
Dr 0 0 0
At SMD N 00888000
Ne 0 ""
Po -0.25 -2.4
$EndPAD
$PAD
Sh "28" R 0.25 0.6 0 0 0
Dr 0 0 0
At SMD N 00888000
Ne 0 ""
Po 0.25 -2.4
$EndPAD
$PAD
Sh "27" R 0.25 0.6 0 0 0
Dr 0 0 0
At SMD N 00888000
Ne 0 ""
Po 0.75 -2.4
$EndPAD
$PAD
Sh "26" R 0.25 0.6 0 0 0
Dr 0 0 0
At SMD N 00888000
Ne 0 ""
Po 1.25 -2.4
$EndPAD
$PAD
Sh "25" R 0.25 0.6 0 0 0
Dr 0 0 0
At SMD N 00888000
Ne 0 ""
Po 1.75 -2.4
$EndPAD
$PAD
Sh "16" R 0.25 0.6 0 0 0
Dr 0 0 0
At SMD N 00888000
Ne 0 ""
Po 1.75 2.4
$EndPAD
$PAD
Sh "15" R 0.25 0.6 0 0 0
Dr 0 0 0
At SMD N 00888000
Ne 0 ""
Po 1.25 2.4
$EndPAD
$PAD
Sh "14" R 0.25 0.6 0 0 0
Dr 0 0 0
At SMD N 00888000
Ne 0 ""
Po 0.75 2.4
$EndPAD
$PAD
Sh "13" R 0.25 0.6 0 0 0
Dr 0 0 0
At SMD N 00888000
Ne 0 ""
Po 0.25 2.4
$EndPAD
$PAD
Sh "12" R 0.25 0.6 0 0 0
Dr 0 0 0
At SMD N 00888000
Ne 0 ""
Po -0.25 2.4
$EndPAD
$PAD
Sh "11" R 0.25 0.6 0 0 0
Dr 0 0 0
At SMD N 00888000
Ne 0 ""
Po -0.75 2.4
$EndPAD
$PAD
Sh "10" R 0.25 0.6 0 0 0
Dr 0 0 0
At SMD N 00888000
Ne 0 ""
Po -1.25 2.4
$EndPAD
$PAD
Sh "9" R 0.25 0.6 0 0 0
Dr 0 0 0
At SMD N 00888000
Ne 0 ""
Po -1.75 2.4
$EndPAD
$PAD
Sh "8" R 0.6 0.25 0 0 0
Dr 0 0 0
At SMD N 00888000
Ne 0 ""
Po -2.4 1.75
$EndPAD
$PAD
Sh "7" R 0.6 0.25 0 0 0
Dr 0 0 0
At SMD N 00888000
Ne 0 ""
Po -2.4 1.25
$EndPAD
$PAD
Sh "6" R 0.6 0.25 0 0 0
Dr 0 0 0
At SMD N 00888000
Ne 0 ""
Po -2.4 0.75
$EndPAD
$PAD
Sh "5" R 0.6 0.25 0 0 0
Dr 0 0 0
At SMD N 00888000
Ne 0 ""
Po -2.4 0.25
$EndPAD
$PAD
Sh "4" R 0.6 0.25 0 0 0
Dr 0 0 0
At SMD N 00888000
Ne 0 ""
Po -2.4 -0.25
$EndPAD
$PAD
Sh "3" R 0.6 0.25 0 0 0
Dr 0 0 0
At SMD N 00888000
Ne 0 ""
Po -2.4 -0.75
$EndPAD
$PAD
Sh "2" R 0.6 0.25 0 0 0
Dr 0 0 0
At SMD N 00888000
Ne 0 ""
Po -2.4 -1.25
$EndPAD
$PAD
Sh "1" R 0.6 0.25 0 0 0
Dr 0 0 0
At SMD N 00888000
Ne 0 ""
Po -2.4 -1.75
$EndPAD
$PAD
Sh "DAP" R 3.1 3.1 0 0 0
Dr 0 0 0
At SMD N 00888000
Ne 0 ""
Po 0 0
$EndPAD
$EndMODULE lmk00304
$EndLIBRARY
