EESchema Schematic File Version 2
LIBS:sn65hvd3083edgsr
LIBS:conn
LIBS:power
LIBS:pspice
LIBS:zl40216
LIBS:sfp
LIBS:FIN1108
LIBS:sn65lvds389
LIBS:max5825baup
LIBS:tps72301dbvr
LIBS:ina195a
LIBS:tps78630kttt
LIBS:tps73501drbt
LIBS:lt3015eq
LIBS:lt1086cm-3
LIBS:tps72012drvt
LIBS:ina202a
LIBS:transistors
LIBS:2sk3019
LIBS:sn74hc05d
LIBS:ad7998
LIBS:ao3401a
LIBS:opa703
LIBS:6slx45fgg484pkg
LIBS:ERM8-RA
LIBS:cdclvd1204
LIBS:sy89835u
LIBS:zl40212
LIBS:opa4703ea
LIBS:tps73201qdbvrq1
LIBS:m25p32
LIBS:bav99
LIBS:si590
LIBS:iso7242c
LIBS:lmk00304
LIBS:pins_14x2
LIBS:ds18b20u
LIBS:2x14_conn
LIBS:led
EELAYER 27 0
EELAYER END
$Descr A4 11693 8268
encoding utf-8
Sheet 7 23
Title ""
Date "17 mar 2015"
Rev ""
Comp ""
Comment1 ""
Comment2 ""
Comment3 ""
Comment4 ""
$EndDescr
Wire Wire Line
	4200 2400 4200 2800
Wire Wire Line
	4400 3400 4400 3450
Wire Wire Line
	4400 3450 3950 3450
Wire Wire Line
	4200 3300 4200 3450
Connection ~ 4200 3450
Wire Wire Line
	3950 3450 3950 3300
Connection ~ 3950 3450
Wire Wire Line
	3950 2400 3950 2800
Wire Wire Line
	3950 1900 3950 1700
Wire Wire Line
	4200 1900 4200 1700
Wire Wire Line
	3950 1700 3750 1700
Wire Wire Line
	4200 1700 4400 1700
Wire Wire Line
	3950 2750 3750 2750
Connection ~ 3950 2750
Wire Wire Line
	4200 2750 4400 2750
Connection ~ 4200 2750
$Comp
L -1.6V #PWR063
U 1 1 544FB3F8
P 4400 3400
AR Path="/5446A203/544FB3AB/544FB3F8" Ref="#PWR063"  Part="1" 
AR Path="/5446A203/544FC061/544FB3F8" Ref="#PWR064"  Part="1" 
AR Path="/5446A203/544FC510/544FB3F8" Ref="#PWR065"  Part="1" 
AR Path="/5446A203/545005D7/544FB3F8" Ref="#PWR066"  Part="1" 
AR Path="/5446A203/545005DD/544FB3F8" Ref="#PWR067"  Part="1" 
AR Path="/5446A203/545005E3/544FB3F8" Ref="#PWR068"  Part="1" 
F 0 "#PWR068" H 4400 3540 20  0001 C CNN
F 1 "-1.6V" H 4400 3510 30  0000 C CNN
F 2 "" H 4400 3400 60  0001 C CNN
F 3 "" H 4400 3400 60  0001 C CNN
	1    4400 3400
	-1   0    0    -1  
$EndComp
$Comp
L BAV99DW D1
U 1 1 544FB3FE
P 3950 2150
AR Path="/5446A203/544FB3AB/544FB3FE" Ref="D1"  Part="1" 
AR Path="/5446A203/544FC061/544FB3FE" Ref="D2"  Part="1" 
AR Path="/5446A203/544FC510/544FB3FE" Ref="D3"  Part="1" 
AR Path="/5446A203/545005D7/544FB3FE" Ref="D4"  Part="1" 
AR Path="/5446A203/545005DD/544FB3FE" Ref="D5"  Part="1" 
AR Path="/5446A203/545005E3/544FB3FE" Ref="D6"  Part="1" 
F 0 "D1" H 4350 2300 60  0000 C CNN
F 1 "BAV99DW" V 4050 2150 60  0000 C CNN
F 2 "" H 3950 2150 60  0001 C CNN
F 3 "" H 3950 2150 60  0001 C CNN
	1    3950 2150
	1    0    0    1   
$EndComp
$Comp
L R R28
U 1 1 544FB404
P 4200 3050
AR Path="/5446A203/544FB3AB/544FB404" Ref="R28"  Part="1" 
AR Path="/5446A203/544FC061/544FB404" Ref="R30"  Part="1" 
AR Path="/5446A203/544FC510/544FB404" Ref="R32"  Part="1" 
AR Path="/5446A203/545005D7/544FB404" Ref="R34"  Part="1" 
AR Path="/5446A203/545005DD/544FB404" Ref="R36"  Part="1" 
AR Path="/5446A203/545005E3/544FB404" Ref="R38"  Part="1" 
F 0 "R28" V 4280 3050 50  0000 C CNN
F 1 "500" V 4200 3050 50  0000 C CNN
F 2 "" H 4200 3050 60  0001 C CNN
F 3 "" H 4200 3050 60  0001 C CNN
	1    4200 3050
	-1   0    0    -1  
$EndComp
$Comp
L R R27
U 1 1 544FB40A
P 3950 3050
AR Path="/5446A203/544FB3AB/544FB40A" Ref="R27"  Part="1" 
AR Path="/5446A203/544FC061/544FB40A" Ref="R29"  Part="1" 
AR Path="/5446A203/544FC510/544FB40A" Ref="R31"  Part="1" 
AR Path="/5446A203/545005D7/544FB40A" Ref="R33"  Part="1" 
AR Path="/5446A203/545005DD/544FB40A" Ref="R35"  Part="1" 
AR Path="/5446A203/545005E3/544FB40A" Ref="R37"  Part="1" 
F 0 "R27" V 4030 3050 50  0000 C CNN
F 1 "500" V 3950 3050 50  0000 C CNN
F 2 "" H 3950 3050 60  0001 C CNN
F 3 "" H 3950 3050 60  0001 C CNN
	1    3950 3050
	-1   0    0    -1  
$EndComp
NoConn ~ 3800 2150
NoConn ~ 4350 2150
Text HLabel 4400 1700 2    60   Input ~ 0
InB
Text HLabel 3750 1700 0    60   Input ~ 0
InA
Text HLabel 3750 2750 0    60   Output ~ 0
OutA
Text HLabel 4400 2750 2    60   Output ~ 0
OutB
Text Notes 3300 1450 0    60   ~ 0
In = 3.3V => out = 1.9V   @7mA\nIn = 0.0V => out = -1.2V  @0.7mA
$Comp
L C C103
U 1 1 54B86C66
P 4650 2150
AR Path="/5446A203/544FB3AB/54B86C66" Ref="C103"  Part="1" 
AR Path="/5446A203/544FC061/54B86C66" Ref="C105"  Part="1" 
AR Path="/5446A203/544FC510/54B86C66" Ref="C107"  Part="1" 
AR Path="/5446A203/545005D7/54B86C66" Ref="C109"  Part="1" 
AR Path="/5446A203/545005DD/54B86C66" Ref="C111"  Part="1" 
AR Path="/5446A203/545005E3/54B86C66" Ref="C113"  Part="1" 
F 0 "C103" V 4750 2300 50  0000 C CNN
F 1 "100pF" V 4750 2000 50  0000 C CNN
F 2 "" H 4650 2150 60  0000 C CNN
F 3 "" H 4650 2150 60  0000 C CNN
	1    4650 2150
	1    0    0    -1  
$EndComp
$Comp
L C C102
U 1 1 54B86C7A
P 3500 2150
AR Path="/5446A203/544FB3AB/54B86C7A" Ref="C102"  Part="1" 
AR Path="/5446A203/544FC061/54B86C7A" Ref="C104"  Part="1" 
AR Path="/5446A203/544FC510/54B86C7A" Ref="C106"  Part="1" 
AR Path="/5446A203/545005D7/54B86C7A" Ref="C108"  Part="1" 
AR Path="/5446A203/545005DD/54B86C7A" Ref="C110"  Part="1" 
AR Path="/5446A203/545005E3/54B86C7A" Ref="C112"  Part="1" 
F 0 "C102" V 3600 2300 50  0000 C CNN
F 1 "100pF" V 3600 2000 50  0000 C CNN
F 2 "" H 3500 2150 60  0000 C CNN
F 3 "" H 3500 2150 60  0000 C CNN
	1    3500 2150
	1    0    0    -1  
$EndComp
Wire Wire Line
	3500 1900 3950 1900
Wire Wire Line
	4200 1900 4650 1900
Wire Wire Line
	4650 2400 4200 2400
Wire Wire Line
	3950 2400 3500 2400
$EndSCHEMATC
