PCBNEW-LibModule-V1  Wed 14 Jan 2015 04:48:20 PM EST
# encoding utf-8
Units mm
$INDEX
RJ45-A-2004-2-4-LPS-N-R
$EndINDEX
$MODULE RJ45-A-2004-2-4-LPS-N-R
Po 0 0 0 15 54B6E41F 00000000 ~~
Li RJ45-A-2004-2-4-LPS-N-R
Sc 0
AR 
Op 0 0 0
T0 -0.0254 5.7912 1 1 0 0.15 N I 21 N "RJ45-A-2004-2-4-LPS-N-R"
T1 10.2362 -0.0508 1 1 0 0.15 N V 21 N "VAL**"
DS 7.95 8.3 7.95 4.8768 0.15 21
DS 7.95 -10.5 7.95 1.2192 0.15 21
DS -7.95 8.3 -7.95 4.8768 0.15 21
DS -7.95 -10.5 -7.95 1.2192 0.15 21
DS 7.95 -10.5 -7.95 -10.5 0.15 21
DS 7.95 8.3 -7.95 8.3 0.15 21
$PAD
Sh "1" C 1.778 1.778 0 0 0
Dr 0.9652 0 0
At STD N 00E0FFFF
Ne 0 ""
Po -4.45 -6.35
$EndPAD
$PAD
Sh "3" C 1.778 1.778 0 0 0
Dr 0.9652 0 0
At STD N 00E0FFFF
Ne 0 ""
Po -1.905 -6.35
$EndPAD
$PAD
Sh "5" C 1.778 1.778 0 0 0
Dr 0.9652 0 0
At STD N 00E0FFFF
Ne 0 ""
Po 0.635 -6.35
$EndPAD
$PAD
Sh "7" C 1.778 1.778 0 0 0
Dr 0.9652 0 0
At STD N 00E0FFFF
Ne 0 ""
Po 3.175 -6.35
$EndPAD
$PAD
Sh "2" C 1.778 1.778 0 0 0
Dr 0.9652 0 0
At STD N 00E0FFFF
Ne 0 ""
Po -3.175 -8.89
$EndPAD
$PAD
Sh "4" C 1.778 1.778 0 0 0
Dr 0.9652 0 0
At STD N 00E0FFFF
Ne 0 ""
Po -0.635 -8.89
$EndPAD
$PAD
Sh "6" C 1.778 1.778 0 0 0
Dr 0.9652 0 0
At STD N 00E0FFFF
Ne 0 ""
Po 1.905 -8.89
$EndPAD
$PAD
Sh "9" C 2.6 2.6 0 0 0
Dr 1.6764 0 0
At STD N 00E0FFFF
Ne 0 ""
Po -7.85 3.05
$EndPAD
$PAD
Sh "" C 3.3 3.3 0 0 0
Dr 3.3 0 0
At STD N 00E0FFFF
Ne 0 ""
Po 5.715 0
.LocalClearance 0.381
$EndPAD
$PAD
Sh "8" C 1.778 1.778 0 0 0
Dr 0.9652 0 0
At STD N 00E0FFFF
Ne 0 ""
Po 4.445 -8.89
$EndPAD
$PAD
Sh "" C 3.3 3.3 0 0 0
Dr 3.3 0 0
At STD N 00E0FFFF
Ne 0 ""
Po -5.715 0
.LocalClearance 0.381
$EndPAD
$PAD
Sh "9" C 2.6 2.6 0 0 0
Dr 1.6764 0 0
At STD N 00E0FFFF
Ne 0 ""
Po 7.85 3.05
$EndPAD
$EndMODULE RJ45-A-2004-2-4-LPS-N-R
$EndLIBRARY
