EESchema Schematic File Version 2
LIBS:sn65hvd3083edgsr
LIBS:conn
LIBS:power
LIBS:pspice
LIBS:zl40216
LIBS:sfp
LIBS:FIN1108
LIBS:sn65lvds389
LIBS:max5825baup
LIBS:tps72301dbvr
LIBS:ina195a
LIBS:tps78630kttt
LIBS:tps73501drbt
LIBS:lt3015eq
LIBS:lt1086cm-3
LIBS:tps72012drvt
LIBS:ina202a
LIBS:transistors
LIBS:2sk3019
LIBS:sn74hc05d
LIBS:ad7998
LIBS:ao3401a
LIBS:opa703
LIBS:6slx45fgg484pkg
LIBS:ERM8-RA
LIBS:cdclvd1204
LIBS:sy89835u
LIBS:zl40212
LIBS:opa4703ea
LIBS:tps73201qdbvrq1
LIBS:m25p32
LIBS:bav99
LIBS:si590
LIBS:iso7242c
LIBS:lmk00304
LIBS:pins_14x2
LIBS:ds18b20u
LIBS:LogicBoard-cache
EELAYER 24 0
EELAYER END
$Descr A4 11693 8268
encoding utf-8
Sheet 13 33
Title ""
Date "18 nov 2014"
Rev ""
Comp ""
Comment1 ""
Comment2 ""
Comment3 ""
Comment4 ""
$EndDescr
Text Notes 4800 1900 0    60   ~ 0
V_I is 100x dV from + and -
Wire Wire Line
	4800 3000 4800 3050
Connection ~ 4800 2000
Wire Wire Line
	4250 1300 4250 1250
Connection ~ 4250 2400
Wire Wire Line
	4150 2400 4350 2400
Wire Wire Line
	4250 1800 4250 2400
Wire Wire Line
	4800 2500 4600 2500
Wire Wire Line
	4600 2500 4600 2200
Wire Wire Line
	4600 2200 4150 2200
Wire Wire Line
	4150 2000 5100 2000
Wire Wire Line
	2300 2400 2750 2400
Wire Wire Line
	2300 2200 2750 2200
Connection ~ 2450 1700
Wire Wire Line
	3150 1750 3150 1800
Connection ~ 3450 1250
Wire Wire Line
	3450 1200 3450 1600
Wire Wire Line
	4250 1250 3150 1250
Connection ~ 2450 2200
Wire Wire Line
	2300 1700 2750 1700
Wire Wire Line
	2750 1700 2750 2000
$Comp
L INA202A U15
U 1 1 5457D1D1
P 3450 2200
AR Path="/54417533/546954CD/5457D1D1" Ref="U15"  Part="1" 
AR Path="/54417533/54513844/546954C9/5457D1D1" Ref="U19"  Part="1" 
AR Path="/54417533/54513844/546954CA/5457D1D1" Ref="U20"  Part="1" 
AR Path="/54417533/54513844/5457F106/5457D1D1" Ref="U21"  Part="1" 
AR Path="/54417533/54513844/5457F10D/5457D1D1" Ref="U22"  Part="1" 
AR Path="/54417533/54513844/54584D89/5457D1D1" Ref="U23"  Part="1" 
AR Path="/54417533/545184E8/5457D178/5457D1D1" Ref="U26"  Part="1" 
AR Path="/54417533/545184E8/546954CB/5457D1D1" Ref="U27"  Part="1" 
AR Path="/54417533/545184E8/546954CC/5457D1D1" Ref="U28"  Part="1" 
AR Path="/54417533/545184E8/5457E1FF/5457D1D1" Ref="U29"  Part="1" 
F 0 "U28" H 3750 1800 60  0000 C CNN
F 1 "INA202A" H 3650 2550 60  0000 C CNN
F 2 "" H 3450 2200 60  0001 C CNN
F 3 "" H 3450 2200 60  0001 C CNN
	1    3450 2200
	1    0    0    -1  
$EndComp
$Comp
L GND #PWR0103
U 1 1 5457D1DC
P 3450 2800
AR Path="/54417533/546954CD/5457D1DC" Ref="#PWR0103"  Part="1" 
AR Path="/54417533/54513844/546954C9/5457D1DC" Ref="#PWR0126"  Part="1" 
AR Path="/54417533/54513844/546954CA/5457D1DC" Ref="#PWR0130"  Part="1" 
AR Path="/54417533/54513844/5457F106/5457D1DC" Ref="#PWR0134"  Part="1" 
AR Path="/54417533/54513844/5457F10D/5457D1DC" Ref="#PWR0138"  Part="1" 
AR Path="/54417533/54513844/54584D89/5457D1DC" Ref="#PWR0142"  Part="1" 
AR Path="/54417533/545184E8/5457D178/5457D1DC" Ref="#PWR0158"  Part="1" 
AR Path="/54417533/545184E8/546954CB/5457D1DC" Ref="#PWR0162"  Part="1" 
AR Path="/54417533/545184E8/546954CC/5457D1DC" Ref="#PWR0166"  Part="1" 
AR Path="/54417533/545184E8/5457E1FF/5457D1DC" Ref="#PWR0170"  Part="1" 
F 0 "#PWR0166" H 3450 2800 30  0001 C CNN
F 1 "GND" H 3450 2730 30  0001 C CNN
F 2 "" H 3450 2800 60  0001 C CNN
F 3 "" H 3450 2800 60  0001 C CNN
	1    3450 2800
	1    0    0    -1  
$EndComp
$Comp
L +5V #PWR0104
U 1 1 5457D1E2
P 3450 1200
AR Path="/54417533/546954CD/5457D1E2" Ref="#PWR0104"  Part="1" 
AR Path="/54417533/54513844/546954C9/5457D1E2" Ref="#PWR0127"  Part="1" 
AR Path="/54417533/54513844/546954CA/5457D1E2" Ref="#PWR0131"  Part="1" 
AR Path="/54417533/54513844/5457F106/5457D1E2" Ref="#PWR0135"  Part="1" 
AR Path="/54417533/54513844/5457F10D/5457D1E2" Ref="#PWR0139"  Part="1" 
AR Path="/54417533/54513844/54584D89/5457D1E2" Ref="#PWR0143"  Part="1" 
AR Path="/54417533/545184E8/5457D178/5457D1E2" Ref="#PWR0159"  Part="1" 
AR Path="/54417533/545184E8/546954CB/5457D1E2" Ref="#PWR0163"  Part="1" 
AR Path="/54417533/545184E8/546954CC/5457D1E2" Ref="#PWR0167"  Part="1" 
AR Path="/54417533/545184E8/5457E1FF/5457D1E2" Ref="#PWR0171"  Part="1" 
F 0 "#PWR0167" H 3450 1290 20  0001 C CNN
F 1 "+5V" H 3450 1290 30  0000 C CNN
F 2 "" H 3450 1200 60  0001 C CNN
F 3 "" H 3450 1200 60  0001 C CNN
	1    3450 1200
	1    0    0    -1  
$EndComp
$Comp
L C C55
U 1 1 5457D1E8
P 3150 1500
AR Path="/54417533/546954CD/5457D1E8" Ref="C55"  Part="1" 
AR Path="/54417533/54513844/546954C9/5457D1E8" Ref="C63"  Part="1" 
AR Path="/54417533/54513844/546954CA/5457D1E8" Ref="C64"  Part="1" 
AR Path="/54417533/54513844/5457F106/5457D1E8" Ref="C65"  Part="1" 
AR Path="/54417533/54513844/5457F10D/5457D1E8" Ref="C66"  Part="1" 
AR Path="/54417533/54513844/54584D89/5457D1E8" Ref="C67"  Part="1" 
AR Path="/54417533/545184E8/5457D178/5457D1E8" Ref="C72"  Part="1" 
AR Path="/54417533/545184E8/546954CB/5457D1E8" Ref="C73"  Part="1" 
AR Path="/54417533/545184E8/546954CC/5457D1E8" Ref="C74"  Part="1" 
AR Path="/54417533/545184E8/5457E1FF/5457D1E8" Ref="C75"  Part="1" 
F 0 "C74" V 3250 1650 50  0000 C CNN
F 1 "0.01uF" V 3250 1350 50  0000 C CNN
F 2 "" H 3150 1500 60  0001 C CNN
F 3 "" H 3150 1500 60  0001 C CNN
	1    3150 1500
	1    0    0    -1  
$EndComp
$Comp
L GND #PWR0105
U 1 1 5457D1F1
P 3150 1800
AR Path="/54417533/546954CD/5457D1F1" Ref="#PWR0105"  Part="1" 
AR Path="/54417533/54513844/546954C9/5457D1F1" Ref="#PWR0128"  Part="1" 
AR Path="/54417533/54513844/546954CA/5457D1F1" Ref="#PWR0132"  Part="1" 
AR Path="/54417533/54513844/5457F106/5457D1F1" Ref="#PWR0136"  Part="1" 
AR Path="/54417533/54513844/5457F10D/5457D1F1" Ref="#PWR0140"  Part="1" 
AR Path="/54417533/54513844/54584D89/5457D1F1" Ref="#PWR0144"  Part="1" 
AR Path="/54417533/545184E8/5457D178/5457D1F1" Ref="#PWR0160"  Part="1" 
AR Path="/54417533/545184E8/546954CB/5457D1F1" Ref="#PWR0164"  Part="1" 
AR Path="/54417533/545184E8/546954CC/5457D1F1" Ref="#PWR0168"  Part="1" 
AR Path="/54417533/545184E8/5457E1FF/5457D1F1" Ref="#PWR0172"  Part="1" 
F 0 "#PWR0168" H 3150 1800 30  0001 C CNN
F 1 "GND" H 3150 1730 30  0001 C CNN
F 2 "" H 3150 1800 60  0001 C CNN
F 3 "" H 3150 1800 60  0001 C CNN
	1    3150 1800
	1    0    0    -1  
$EndComp
$Comp
L R R32
U 1 1 5457D1F8
P 4800 2250
AR Path="/54417533/546954CD/5457D1F8" Ref="R32"  Part="1" 
AR Path="/54417533/54513844/546954C9/5457D1F8" Ref="R54"  Part="1" 
AR Path="/54417533/54513844/546954CA/5457D1F8" Ref="R57"  Part="1" 
AR Path="/54417533/54513844/5457F106/5457D1F8" Ref="R60"  Part="1" 
AR Path="/54417533/54513844/5457F10D/5457D1F8" Ref="R63"  Part="1" 
AR Path="/54417533/54513844/54584D89/5457D1F8" Ref="R66"  Part="1" 
AR Path="/54417533/545184E8/5457D178/5457D1F8" Ref="R83"  Part="1" 
AR Path="/54417533/545184E8/546954CB/5457D1F8" Ref="R86"  Part="1" 
AR Path="/54417533/545184E8/546954CC/5457D1F8" Ref="R89"  Part="1" 
AR Path="/54417533/545184E8/5457E1FF/5457D1F8" Ref="R92"  Part="1" 
F 0 "R89" V 4880 2250 50  0000 C CNN
F 1 "R" V 4800 2250 50  0000 C CNN
F 2 "" H 4800 2250 60  0001 C CNN
F 3 "" H 4800 2250 60  0001 C CNN
	1    4800 2250
	-1   0    0    1   
$EndComp
$Comp
L R R33
U 1 1 5457D1FE
P 4800 2750
AR Path="/54417533/546954CD/5457D1FE" Ref="R33"  Part="1" 
AR Path="/54417533/54513844/546954C9/5457D1FE" Ref="R55"  Part="1" 
AR Path="/54417533/54513844/546954CA/5457D1FE" Ref="R58"  Part="1" 
AR Path="/54417533/54513844/5457F106/5457D1FE" Ref="R61"  Part="1" 
AR Path="/54417533/54513844/5457F10D/5457D1FE" Ref="R64"  Part="1" 
AR Path="/54417533/54513844/54584D89/5457D1FE" Ref="R67"  Part="1" 
AR Path="/54417533/545184E8/5457D178/5457D1FE" Ref="R84"  Part="1" 
AR Path="/54417533/545184E8/546954CB/5457D1FE" Ref="R87"  Part="1" 
AR Path="/54417533/545184E8/546954CC/5457D1FE" Ref="R90"  Part="1" 
AR Path="/54417533/545184E8/5457E1FF/5457D1FE" Ref="R93"  Part="1" 
F 0 "R90" V 4880 2750 50  0000 C CNN
F 1 "R" V 4800 2750 50  0000 C CNN
F 2 "" H 4800 2750 60  0001 C CNN
F 3 "" H 4800 2750 60  0001 C CNN
	1    4800 2750
	-1   0    0    1   
$EndComp
Text HLabel 2300 2400 0    60   Input ~ 0
_Reset
Text HLabel 2300 2200 0    60   Input ~ 0
-
Text HLabel 2300 1700 0    60   Input ~ 0
+
Text HLabel 5100 2000 2    60   Output ~ 0
V_I
Text HLabel 4350 2400 2    60   Output ~ 0
OC
$Comp
L GND #PWR0106
U 1 1 5457D209
P 4800 3050
AR Path="/54417533/546954CD/5457D209" Ref="#PWR0106"  Part="1" 
AR Path="/54417533/54513844/546954C9/5457D209" Ref="#PWR0129"  Part="1" 
AR Path="/54417533/54513844/546954CA/5457D209" Ref="#PWR0133"  Part="1" 
AR Path="/54417533/54513844/5457F106/5457D209" Ref="#PWR0137"  Part="1" 
AR Path="/54417533/54513844/5457F10D/5457D209" Ref="#PWR0141"  Part="1" 
AR Path="/54417533/54513844/54584D89/5457D209" Ref="#PWR0145"  Part="1" 
AR Path="/54417533/545184E8/5457D178/5457D209" Ref="#PWR0161"  Part="1" 
AR Path="/54417533/545184E8/546954CB/5457D209" Ref="#PWR0165"  Part="1" 
AR Path="/54417533/545184E8/546954CC/5457D209" Ref="#PWR0169"  Part="1" 
AR Path="/54417533/545184E8/5457E1FF/5457D209" Ref="#PWR0173"  Part="1" 
F 0 "#PWR0169" H 4800 3050 30  0001 C CNN
F 1 "GND" H 4800 2980 30  0001 C CNN
F 2 "" H 4800 3050 60  0001 C CNN
F 3 "" H 4800 3050 60  0001 C CNN
	1    4800 3050
	1    0    0    -1  
$EndComp
$Comp
L R R31
U 1 1 5457D2B6
P 4250 1550
AR Path="/54417533/546954CD/5457D2B6" Ref="R31"  Part="1" 
AR Path="/54417533/54513844/546954C9/5457D2B6" Ref="R53"  Part="1" 
AR Path="/54417533/54513844/546954CA/5457D2B6" Ref="R56"  Part="1" 
AR Path="/54417533/54513844/5457F106/5457D2B6" Ref="R59"  Part="1" 
AR Path="/54417533/54513844/5457F10D/5457D2B6" Ref="R62"  Part="1" 
AR Path="/54417533/54513844/54584D89/5457D2B6" Ref="R65"  Part="1" 
AR Path="/54417533/545184E8/5457D178/5457D2B6" Ref="R82"  Part="1" 
AR Path="/54417533/545184E8/546954CB/5457D2B6" Ref="R85"  Part="1" 
AR Path="/54417533/545184E8/546954CC/5457D2B6" Ref="R88"  Part="1" 
AR Path="/54417533/545184E8/5457E1FF/5457D2B6" Ref="R91"  Part="1" 
F 0 "R88" V 4330 1550 50  0000 C CNN
F 1 "4.7k" V 4250 1550 50  0000 C CNN
F 2 "" H 4250 1550 60  0001 C CNN
F 3 "" H 4250 1550 60  0001 C CNN
	1    4250 1550
	1    0    0    -1  
$EndComp
$EndSCHEMATC
