EESchema Schematic File Version 2
LIBS:sn65hvd3083edgsr
LIBS:conn
LIBS:power
LIBS:pspice
LIBS:zl40216
LIBS:sfp
LIBS:FIN1108
LIBS:sn65lvds389
LIBS:max5825baup
LIBS:tps72301dbvr
LIBS:ina195a
LIBS:tps78630kttt
LIBS:tps73501drbt
LIBS:lt3015eq
LIBS:lt1086cm-3
LIBS:tps72012drvt
LIBS:ina202a
LIBS:transistors
LIBS:2sk3019
LIBS:sn74hc05d
LIBS:ad7998
LIBS:ao3401a
LIBS:opa703
LIBS:6slx45fgg484pkg
LIBS:ERM8-RA
LIBS:cdclvd1204
LIBS:sy89835u
LIBS:zl40212
LIBS:opa4703ea
LIBS:tps73201qdbvrq1
LIBS:m25p32
LIBS:bav99
LIBS:si590
LIBS:iso7242c
LIBS:lmk00304
LIBS:pins_14x2
LIBS:ds18b20u
LIBS:2x14_conn
LIBS:led
EELAYER 27 0
EELAYER END
$Descr A4 11693 8268
encoding utf-8
Sheet 15 23
Title ""
Date "17 mar 2015"
Rev ""
Comp ""
Comment1 ""
Comment2 ""
Comment3 ""
Comment4 ""
$EndDescr
$Comp
L -5V #PWR0103
U 1 1 547687D8
P 2850 3650
F 0 "#PWR0103" H 2850 3790 20  0001 C CNN
F 1 "-5V" H 2850 3760 30  0000 C CNN
F 2 "" H 2850 3650 60  0000 C CNN
F 3 "" H 2850 3650 60  0000 C CNN
	1    2850 3650
	1    0    0    -1  
$EndComp
$Comp
L GND #PWR0104
U 1 1 547687EC
P 2850 4050
F 0 "#PWR0104" H 2850 4050 30  0001 C CNN
F 1 "GND" H 2850 3980 30  0001 C CNN
F 2 "" H 2850 4050 60  0000 C CNN
F 3 "" H 2850 4050 60  0000 C CNN
	1    2850 4050
	1    0    0    -1  
$EndComp
$Comp
L GND #PWR0105
U 1 1 54768800
P 4050 4050
F 0 "#PWR0105" H 4050 4050 30  0001 C CNN
F 1 "GND" H 4050 3980 30  0001 C CNN
F 2 "" H 4050 4050 60  0000 C CNN
F 3 "" H 4050 4050 60  0000 C CNN
	1    4050 4050
	1    0    0    -1  
$EndComp
Text HLabel 4050 4250 2    60   BiDi ~ 0
SDA
Text HLabel 2850 4250 0    60   Input ~ 0
SCL
Text HLabel 8100 4750 2    60   Output ~ 0
ASDQ_1V4
Text HLabel 6900 3250 2    60   Output ~ 0
ASDQ_3V[3..0]
Text HLabel 6900 2850 2    60   Output ~ 0
ASDQ_-3V[3..0]
$Comp
L 2X14_CONN J3
U 1 1 547618E9
P 3450 4300
F 0 "J3" H 3450 3500 60  0000 C CNN
F 1 "2X14_CONN" V 3450 4300 60  0001 C CNN
F 2 "" H 3650 3800 60  0000 C CNN
F 3 "" H 3650 3800 60  0000 C CNN
	1    3450 4300
	1    0    0    -1  
$EndComp
$Comp
L 2X14_CONN J4
U 1 1 547618FB
P 7000 4300
F 0 "J4" H 7000 3500 60  0000 C CNN
F 1 "2X14_CONN" V 7000 4300 60  0001 C CNN
F 2 "" H 7200 3800 60  0000 C CNN
F 3 "" H 7200 3800 60  0000 C CNN
	1    7000 4300
	1    0    0    -1  
$EndComp
$Comp
L +5V #PWR0106
U 1 1 54761906
P 4050 4950
F 0 "#PWR0106" H 4050 5040 20  0001 C CNN
F 1 "+5V" H 4050 5040 30  0000 C CNN
F 2 "" H 4050 4950 60  0000 C CNN
F 3 "" H 4050 4950 60  0000 C CNN
	1    4050 4950
	1    0    0    -1  
$EndComp
Wire Wire Line
	3950 4750 3950 4950
Wire Wire Line
	3950 4850 3850 4850
Wire Wire Line
	3850 4950 4050 4950
Connection ~ 3950 4850
Wire Wire Line
	2850 4050 2850 3950
Wire Wire Line
	2850 3950 3050 3950
Wire Wire Line
	2950 3950 2950 4150
Connection ~ 2950 3950
Wire Wire Line
	2950 4050 3050 4050
Connection ~ 2950 4050
Wire Wire Line
	2950 4150 3050 4150
Wire Wire Line
	4050 3950 4050 4050
Wire Wire Line
	3850 3950 4050 3950
Wire Wire Line
	3950 3950 3950 4150
Connection ~ 3950 3950
Wire Wire Line
	3950 4150 3850 4150
Wire Wire Line
	3850 4050 3950 4050
Connection ~ 3950 4050
Wire Wire Line
	2850 3650 3050 3650
Wire Wire Line
	2950 3650 2950 3850
Wire Wire Line
	2950 3750 3050 3750
Connection ~ 2950 3650
$Comp
L -5V #PWR0107
U 1 1 54761A49
P 4050 3650
F 0 "#PWR0107" H 4050 3790 20  0001 C CNN
F 1 "-5V" H 4050 3760 30  0000 C CNN
F 2 "" H 4050 3650 60  0000 C CNN
F 3 "" H 4050 3650 60  0000 C CNN
	1    4050 3650
	1    0    0    -1  
$EndComp
Wire Wire Line
	3850 3650 4050 3650
Wire Wire Line
	3850 3750 3950 3750
Wire Wire Line
	3950 3650 3950 3850
Connection ~ 3950 3650
Wire Wire Line
	2850 4250 3050 4250
Wire Wire Line
	3850 4250 4050 4250
Text HLabel 2850 4350 0    60   Output ~ 0
INT
Wire Wire Line
	2850 4350 3050 4350
$Comp
L +3.3V #PWR0108
U 1 1 54761B26
P 4400 4350
F 0 "#PWR0108" H 4400 4310 30  0001 C CNN
F 1 "+3.3V" H 4400 4460 30  0000 C CNN
F 2 "" H 4400 4350 60  0000 C CNN
F 3 "" H 4400 4350 60  0000 C CNN
	1    4400 4350
	1    0    0    -1  
$EndComp
Wire Wire Line
	3850 4350 4400 4350
Text Notes 3300 5300 0    60   ~ 0
Female
Text HLabel 6400 3650 0    60   BiDi ~ 0
TEMP
Text Label 5950 4350 0    60   ~ 0
ASDQ_3V3
Text Label 7750 4350 0    60   ~ 0
ASDQ_3V2
Text Label 5950 4450 0    60   ~ 0
ASDQ_3V1
Text Label 7750 4450 0    60   ~ 0
ASDQ_3V0
Text Label 5950 3950 0    60   ~ 0
ASDQ_-3V3
Text Label 7750 3950 0    60   ~ 0
ASDQ_-3V2
Text Label 5950 4050 0    60   ~ 0
ASDQ_-3V1
Text Label 7750 4050 0    60   ~ 0
ASDQ_-3V0
Wire Wire Line
	7400 3950 8250 3950
Wire Wire Line
	7400 4750 8100 4750
Wire Wire Line
	7400 4650 7500 4650
Wire Wire Line
	7500 4650 7500 4750
Connection ~ 7500 4750
Wire Wire Line
	5850 3750 6600 3750
Wire Wire Line
	5850 4850 6600 4850
$Comp
L GND #PWR0109
U 1 1 547622B6
P 7650 4950
F 0 "#PWR0109" H 7650 4950 30  0001 C CNN
F 1 "GND" H 7650 4880 30  0001 C CNN
F 2 "" H 7650 4950 60  0000 C CNN
F 3 "" H 7650 4950 60  0000 C CNN
	1    7650 4950
	1    0    0    -1  
$EndComp
Wire Wire Line
	7650 4850 7400 4850
Wire Wire Line
	7650 3650 7650 4950
Text HLabel 6400 4950 0    60   Input ~ 0
TDC+
Text HLabel 6400 5050 0    60   Input ~ 0
TDC-
Wire Wire Line
	6400 4950 6600 4950
Wire Wire Line
	6400 5050 7400 5050
Wire Wire Line
	7400 5050 7400 4950
Text Notes 6850 5250 0    60   ~ 0
Male
$Comp
L +3V #PWR0110
U 1 1 54765C70
P 6000 4850
F 0 "#PWR0110" H 6000 4990 20  0001 C CNN
F 1 "+3V" H 6000 4960 30  0000 C CNN
F 2 "" H 6000 4850 60  0000 C CNN
F 3 "" H 6000 4850 60  0000 C CNN
	1    6000 4850
	1    0    0    -1  
$EndComp
$Comp
L -3V #PWR0111
U 1 1 54765C84
P 6000 3750
F 0 "#PWR0111" H 6000 3890 20  0001 C CNN
F 1 "-3V" H 6000 3860 30  0000 C CNN
F 2 "" H 6000 3750 60  0000 C CNN
F 3 "" H 6000 3750 60  0000 C CNN
	1    6000 3750
	1    0    0    -1  
$EndComp
$Comp
L PWR_FLAG #FLG0112
U 1 1 54782366
P 5850 3750
F 0 "#FLG0112" H 5850 3845 30  0001 C CNN
F 1 "PWR_FLAG" H 5850 3930 30  0000 C CNN
F 2 "" H 5850 3750 60  0000 C CNN
F 3 "" H 5850 3750 60  0000 C CNN
	1    5850 3750
	1    0    0    -1  
$EndComp
$Comp
L PWR_FLAG #FLG0113
U 1 1 5478237A
P 5850 4850
F 0 "#FLG0113" H 5850 4945 30  0001 C CNN
F 1 "PWR_FLAG" H 5850 5030 30  0000 C CNN
F 2 "" H 5850 4850 60  0000 C CNN
F 3 "" H 5850 4850 60  0000 C CNN
	1    5850 4850
	1    0    0    -1  
$EndComp
Connection ~ 6000 4850
Connection ~ 6000 3750
Wire Wire Line
	6400 3650 6600 3650
Wire Wire Line
	3950 3850 3850 3850
Connection ~ 3950 3750
Wire Wire Line
	2950 3850 3050 3850
Connection ~ 2950 3750
$Comp
L GND #PWR0114
U 1 1 547FAFDE
P 2850 4550
F 0 "#PWR0114" H 2850 4550 30  0001 C CNN
F 1 "GND" H 2850 4480 30  0001 C CNN
F 2 "" H 2850 4550 60  0000 C CNN
F 3 "" H 2850 4550 60  0000 C CNN
	1    2850 4550
	1    0    0    -1  
$EndComp
Wire Wire Line
	2850 4550 2850 4450
Wire Wire Line
	2850 4450 3050 4450
Wire Wire Line
	2950 4450 2950 4650
Connection ~ 2950 4450
Wire Wire Line
	2950 4550 3050 4550
Connection ~ 2950 4550
Wire Wire Line
	2950 4650 3050 4650
$Comp
L GND #PWR0115
U 1 1 547FAFED
P 4050 4550
F 0 "#PWR0115" H 4050 4550 30  0001 C CNN
F 1 "GND" H 4050 4480 30  0001 C CNN
F 2 "" H 4050 4550 60  0000 C CNN
F 3 "" H 4050 4550 60  0000 C CNN
	1    4050 4550
	1    0    0    -1  
$EndComp
Wire Wire Line
	4050 4450 4050 4550
Wire Wire Line
	3850 4450 4050 4450
Wire Wire Line
	3950 4450 3950 4650
Connection ~ 3950 4450
Wire Wire Line
	3950 4650 3850 4650
Wire Wire Line
	3850 4550 3950 4550
Connection ~ 3950 4550
Connection ~ 3950 4950
Wire Wire Line
	3850 4750 3950 4750
$Comp
L +5V #PWR0116
U 1 1 547FB115
P 2850 4950
F 0 "#PWR0116" H 2850 5040 20  0001 C CNN
F 1 "+5V" H 2850 5040 30  0000 C CNN
F 2 "" H 2850 4950 60  0000 C CNN
F 3 "" H 2850 4950 60  0000 C CNN
	1    2850 4950
	-1   0    0    -1  
$EndComp
Wire Wire Line
	2950 4750 2950 4950
Wire Wire Line
	2950 4850 3050 4850
Wire Wire Line
	2850 4950 3050 4950
Connection ~ 2950 4850
Connection ~ 2950 4950
Wire Wire Line
	3050 4750 2950 4750
Wire Wire Line
	7650 3650 7400 3650
Connection ~ 7650 4850
Wire Wire Line
	7400 3750 7650 3750
Connection ~ 7650 3750
Wire Wire Line
	7400 3850 7650 3850
Connection ~ 7650 3850
Wire Wire Line
	7400 4150 7650 4150
Connection ~ 7650 4150
Wire Wire Line
	7400 4250 7650 4250
Connection ~ 7650 4250
Wire Wire Line
	7400 4550 7650 4550
Connection ~ 7650 4550
Wire Wire Line
	7400 4050 8250 4050
Wire Wire Line
	5750 3950 6600 3950
Wire Wire Line
	5750 4050 6600 4050
$Comp
L GND #PWR0117
U 1 1 5481EF0A
P 6500 5250
F 0 "#PWR0117" H 6500 5250 30  0001 C CNN
F 1 "GND" H 6500 5180 30  0001 C CNN
F 2 "" H 6500 5250 60  0000 C CNN
F 3 "" H 6500 5250 60  0000 C CNN
	1    6500 5250
	1    0    0    -1  
$EndComp
Wire Wire Line
	6500 5250 6500 3850
Wire Wire Line
	6500 3850 6600 3850
Wire Wire Line
	6500 4150 6600 4150
Connection ~ 6500 4150
Wire Wire Line
	6500 4250 6600 4250
Connection ~ 6500 4250
Wire Wire Line
	6500 4550 6600 4550
Connection ~ 6500 4550
Wire Wire Line
	6500 4650 6600 4650
Connection ~ 6500 4650
Wire Wire Line
	5750 4350 6600 4350
Wire Wire Line
	5750 4450 6600 4450
Wire Wire Line
	7400 4350 8250 4350
Wire Wire Line
	7400 4450 8250 4450
Wire Wire Line
	6600 4750 6500 4750
Connection ~ 6500 4750
$EndSCHEMATC
