EESchema Schematic File Version 2
LIBS:sn65hvd3083edgsr
LIBS:conn
LIBS:power
LIBS:pspice
LIBS:zl40216
LIBS:sfp
LIBS:FIN1108
LIBS:sn65lvds389
LIBS:max5825baup
LIBS:tps72301dbvr
LIBS:ina195a
LIBS:tps78630kttt
LIBS:tps73501drbt
LIBS:lt3015eq
LIBS:lt1086cm-3
LIBS:tps72012drvt
LIBS:ina202a
LIBS:transistors
LIBS:2sk3019
LIBS:sn74hc05d
LIBS:ad7998
LIBS:ao3401a
LIBS:opa703
LIBS:6slx45fgg484pkg
LIBS:ERM8-RA
LIBS:cdclvd1204
LIBS:sy89835u
LIBS:zl40212
LIBS:opa4703ea
LIBS:tps73201qdbvrq1
LIBS:m25p32
LIBS:bav99
LIBS:si590
LIBS:iso7242c
LIBS:lmk00304
LIBS:pins_14x2
LIBS:ds18b20u
LIBS:LogicBoard-cache
EELAYER 24 0
EELAYER END
$Descr A4 11693 8268
encoding utf-8
Sheet 14 33
Title ""
Date "18 nov 2014"
Rev ""
Comp ""
Comment1 ""
Comment2 ""
Comment3 ""
Comment4 ""
$EndDescr
Text Notes 6750 4450 0    60   ~ 0
2.5V nominal
Connection ~ 4950 4550
Wire Wire Line
	4850 4550 4950 4550
Wire Wire Line
	8700 1900 8550 1900
Wire Wire Line
	8700 1900 8700 1700
Wire Wire Line
	8700 1700 8850 1700
Wire Wire Line
	8550 1400 8550 1350
Wire Wire Line
	8850 1600 8700 1600
Wire Wire Line
	8700 1600 8700 1400
Wire Wire Line
	8700 1400 8550 1400
Wire Wire Line
	8550 1900 8550 2650
Wire Wire Line
	7500 1900 7350 1900
Wire Wire Line
	7500 1900 7500 1700
Wire Wire Line
	7500 1700 7650 1700
Wire Wire Line
	7350 1350 7350 1400
Wire Wire Line
	7650 1600 7500 1600
Wire Wire Line
	7500 1600 7500 1400
Wire Wire Line
	7500 1400 7350 1400
Wire Wire Line
	7350 1900 7350 2650
Wire Wire Line
	6300 1900 6150 1900
Wire Wire Line
	6300 1900 6300 1700
Wire Wire Line
	6300 1700 6450 1700
Wire Wire Line
	6150 1350 6150 1400
Wire Wire Line
	6450 1600 6300 1600
Wire Wire Line
	6300 1600 6300 1400
Wire Wire Line
	6300 1400 6150 1400
Wire Wire Line
	6150 1900 6150 2650
Wire Wire Line
	4950 2650 4950 1900
Wire Wire Line
	5100 1400 4950 1400
Wire Wire Line
	5100 1400 5100 1600
Wire Wire Line
	5100 1600 5250 1600
Wire Wire Line
	2900 7300 2900 7550
Wire Wire Line
	2150 7500 2150 7400
Connection ~ 3900 1350
Connection ~ 3650 1350
Wire Wire Line
	3500 1650 3500 1850
Connection ~ 4400 1350
Wire Wire Line
	4400 1300 4400 1350
Wire Wire Line
	3500 6900 3650 6900
Wire Wire Line
	3650 6900 3650 7000
Wire Wire Line
	3650 7000 3850 7000
Wire Wire Line
	2900 7500 4250 7500
Connection ~ 2900 7500
Connection ~ 3850 6500
Wire Wire Line
	4250 7500 4250 7250
Connection ~ 3850 7500
Wire Wire Line
	4350 6500 3500 6500
Wire Wire Line
	4250 6500 4250 6750
Wire Wire Line
	3200 4450 3350 4450
Wire Wire Line
	3350 4450 3350 4550
Wire Wire Line
	3350 4550 3550 4550
Wire Wire Line
	2600 5100 2600 4850
Wire Wire Line
	2600 5050 3950 5050
Connection ~ 2600 5050
Connection ~ 3550 4050
Wire Wire Line
	3950 5050 3950 4800
Connection ~ 3550 5050
Wire Wire Line
	3950 4050 3950 4300
Wire Wire Line
	1850 1700 1850 1600
Wire Wire Line
	1850 1650 2000 1650
Wire Wire Line
	1850 2200 1850 2300
Wire Wire Line
	8550 1350 3500 1350
Connection ~ 4250 6500
Wire Wire Line
	5000 6450 5000 6500
Connection ~ 1850 1650
Wire Bus Line
	9700 2750 5050 2750
Connection ~ 4950 1350
Connection ~ 6150 1350
Connection ~ 7350 1350
Wire Wire Line
	4900 2100 8800 2100
Wire Wire Line
	5200 2100 5200 1900
Wire Wire Line
	5200 1900 5250 1900
Wire Wire Line
	6400 2100 6400 1900
Wire Wire Line
	6400 1900 6450 1900
Connection ~ 5200 2100
Wire Wire Line
	7600 2100 7600 1900
Wire Wire Line
	7600 1900 7650 1900
Connection ~ 6400 2100
Wire Wire Line
	8800 2100 8800 1900
Wire Wire Line
	8800 1900 8850 1900
Connection ~ 7600 2100
Wire Wire Line
	5800 1650 5850 1650
Wire Wire Line
	7000 1650 7050 1650
Wire Wire Line
	8200 1650 8250 1650
Wire Wire Line
	9400 1650 9450 1650
Wire Wire Line
	5850 1650 5850 650 
Wire Wire Line
	7050 1650 7050 650 
Wire Wire Line
	8250 1650 8250 650 
Wire Wire Line
	9450 1650 9450 650 
Wire Bus Line
	10150 550  5950 550 
Wire Bus Line
	10150 750  6100 750 
Wire Wire Line
	5800 1750 6000 1750
Wire Wire Line
	6000 1750 6000 850 
Wire Wire Line
	7000 1750 7200 1750
Wire Wire Line
	7200 1750 7200 850 
Wire Wire Line
	8200 1750 8400 1750
Wire Wire Line
	8400 1750 8400 850 
Wire Wire Line
	9400 1750 9600 1750
Wire Wire Line
	9600 1750 9600 850 
Wire Wire Line
	2000 1350 1400 1350
Wire Wire Line
	850  1350 900  1350
Wire Wire Line
	2300 6500 1700 6500
Wire Wire Line
	2150 6800 2150 6900
Wire Wire Line
	2150 6900 2300 6900
Wire Wire Line
	1100 6500 1200 6500
Wire Wire Line
	900  4050 1000 4050
Connection ~ 3950 4050
Wire Wire Line
	1850 4350 1850 4450
Wire Wire Line
	1850 4450 2000 4450
Wire Wire Line
	1850 4950 1850 5050
Wire Wire Line
	1500 4050 2000 4050
Wire Wire Line
	4800 4650 5250 4650
Wire Wire Line
	5250 4450 4950 4450
Wire Wire Line
	4950 4450 4950 5150
Wire Wire Line
	4950 5150 6350 5150
Wire Wire Line
	5800 4400 6350 4400
Wire Wire Line
	5800 4500 6350 4500
Wire Wire Line
	2700 2250 2700 2150
Wire Wire Line
	2700 2150 2800 2150
Wire Wire Line
	4350 2050 4350 2000
Wire Wire Line
	3650 2450 3650 2350
Wire Wire Line
	4350 1500 4350 1350
Connection ~ 4350 1350
Wire Wire Line
	3500 1850 3900 1850
Connection ~ 3650 1850
Wire Wire Line
	4850 6500 5200 6500
Wire Wire Line
	5200 6500 5200 6450
Connection ~ 5000 6500
Wire Wire Line
	2550 4850 2650 4850
Connection ~ 2600 4850
Wire Wire Line
	4150 4000 4150 4050
Connection ~ 4150 4050
Wire Wire Line
	4950 1400 4950 1350
Wire Wire Line
	5250 1700 5100 1700
Wire Wire Line
	5100 1700 5100 1900
Wire Wire Line
	5100 1900 4950 1900
Wire Wire Line
	3200 4050 5050 4050
Wire Wire Line
	5050 4050 5050 4350
Wire Wire Line
	5050 4350 5250 4350
Connection ~ 4850 4050
$Comp
L R R45
U 1 1 546AC535
P 4850 4300
F 0 "R45" V 4930 4300 50  0000 C CNN
F 1 "0.1" V 4850 4300 50  0000 C CNN
F 2 "" H 4850 4300 60  0001 C CNN
F 3 "" H 4850 4300 60  0001 C CNN
	1    4850 4300
	1    0    0    -1  
$EndComp
Text Notes 10700 600  0    60   ~ 0
1.25V nominal
$Comp
L R R40
U 1 1 546AC476
P 8550 1650
F 0 "R40" V 8630 1650 50  0000 C CNN
F 1 "0.1" V 8550 1650 50  0000 C CNN
F 2 "" H 8550 1650 60  0001 C CNN
F 3 "" H 8550 1650 60  0001 C CNN
	1    8550 1650
	1    0    0    -1  
$EndComp
$Comp
L R R39
U 1 1 546AC46C
P 7350 1650
F 0 "R39" V 7430 1650 50  0000 C CNN
F 1 "0.1" V 7350 1650 50  0000 C CNN
F 2 "" H 7350 1650 60  0001 C CNN
F 3 "" H 7350 1650 60  0001 C CNN
	1    7350 1650
	1    0    0    -1  
$EndComp
$Comp
L R R38
U 1 1 546AC457
P 6150 1650
F 0 "R38" V 6230 1650 50  0000 C CNN
F 1 "0.1" V 6150 1650 50  0000 C CNN
F 2 "" H 6150 1650 60  0001 C CNN
F 3 "" H 6150 1650 60  0001 C CNN
	1    6150 1650
	1    0    0    -1  
$EndComp
Text Notes 5050 2500 1    60   ~ 0
125mA
$Comp
L R R37
U 1 1 546AC398
P 4950 1650
F 0 "R37" V 5030 1650 50  0000 C CNN
F 1 "0.1" V 4950 1650 50  0000 C CNN
F 2 "" H 4950 1650 60  0001 C CNN
F 3 "" H 4950 1650 60  0001 C CNN
	1    4950 1650
	1    0    0    -1  
$EndComp
$Comp
L +1.4V #PWR0107
U 1 1 54697D0E
P 4150 4000
F 0 "#PWR0107" H 4150 4140 20  0001 C CNN
F 1 "+1.4V" H 4150 4110 30  0000 C CNN
F 2 "" H 4150 4000 60  0001 C CNN
F 3 "" H 4150 4000 60  0001 C CNN
	1    4150 4000
	1    0    0    -1  
$EndComp
$Comp
L PWR_FLAG #FLG0108
U 1 1 54697701
P 5200 6450
F 0 "#FLG0108" H 5200 6545 30  0001 C CNN
F 1 "PWR_FLAG" H 5200 6630 30  0000 C CNN
F 2 "" H 5200 6450 60  0001 C CNN
F 3 "" H 5200 6450 60  0001 C CNN
	1    5200 6450
	1    0    0    -1  
$EndComp
$Comp
L TPS73201QDBVRQ1 U18
U 1 1 54513D76
P 2900 6700
F 0 "U18" H 3250 6250 60  0000 C CNN
F 1 "TPS73201QDBVRQ1" H 3400 7100 60  0000 C CNN
F 2 "" H 2900 6700 60  0001 C CNN
F 3 "" H 2900 6700 60  0001 C CNN
	1    2900 6700
	1    0    0    -1  
$EndComp
$Comp
L R R51
U 1 1 54513EC5
P 3850 6750
F 0 "R51" V 3930 6750 50  0000 C CNN
F 1 "25k" V 3850 6750 50  0000 C CNN
F 2 "" H 3850 6750 60  0001 C CNN
F 3 "" H 3850 6750 60  0001 C CNN
	1    3850 6750
	1    0    0    -1  
$EndComp
$Comp
L R R52
U 1 1 54513F43
P 3850 7250
F 0 "R52" V 3930 7250 50  0000 C CNN
F 1 "77k" V 3850 7250 50  0000 C CNN
F 2 "" H 3850 7250 60  0001 C CNN
F 3 "" H 3850 7250 60  0001 C CNN
	1    3850 7250
	1    0    0    -1  
$EndComp
$Comp
L GND #PWR0109
U 1 1 54513F63
P 2900 7550
F 0 "#PWR0109" H 2900 7550 30  0001 C CNN
F 1 "GND" H 2900 7480 30  0001 C CNN
F 2 "" H 2900 7550 60  0001 C CNN
F 3 "" H 2900 7550 60  0001 C CNN
	1    2900 7550
	1    0    0    -1  
$EndComp
Text Notes 1850 5850 0    60   ~ 0
1.6V Regulator\nMax 250mA\nTotal: 50mA\nLVDS buf 2x 25mA
Text HLabel 1100 6500 0    60   Input ~ 0
EN1V6
$Comp
L +3.3V #PWR0110
U 1 1 54513FFF
P 1400 850
F 0 "#PWR0110" H 1400 810 30  0001 C CNN
F 1 "+3.3V" H 1400 960 30  0000 C CNN
F 2 "" H 1400 850 60  0001 C CNN
F 3 "" H 1400 850 60  0001 C CNN
	1    1400 850 
	1    0    0    -1  
$EndComp
$Comp
L C C61
U 1 1 54514017
P 4250 7000
F 0 "C61" V 4350 7150 50  0000 C CNN
F 1 "0.1uF" V 4350 6850 50  0000 C CNN
F 2 "" H 4250 7000 60  0001 C CNN
F 3 "" H 4250 7000 60  0001 C CNN
	1    4250 7000
	1    0    0    -1  
$EndComp
$Comp
L +1.6V #PWR0111
U 1 1 5451406E
P 5000 6450
F 0 "#PWR0111" H 5000 6590 20  0001 C CNN
F 1 "+1.6V" H 5000 6560 30  0000 C CNN
F 2 "" H 5000 6450 60  0001 C CNN
F 3 "" H 5000 6450 60  0001 C CNN
	1    5000 6450
	1    0    0    -1  
$EndComp
$Comp
L GND #PWR0112
U 1 1 545142F6
P 2700 2250
F 0 "#PWR0112" H 2700 2250 30  0001 C CNN
F 1 "GND" H 2700 2180 30  0001 C CNN
F 2 "" H 2700 2250 60  0001 C CNN
F 3 "" H 2700 2250 60  0001 C CNN
	1    2700 2250
	1    0    0    -1  
$EndComp
Text Notes 1550 700  0    60   ~ 0
3V Regulator\nMax  1.5 A\nTotal: 850 mA\nArea: huge...\nASDQ: 500mA\n1.6V: 75mA\n1.4V: 275mA\n
Text HLabel 850  1350 0    60   Input ~ 0
EN3V
$Comp
L C C57
U 1 1 54514321
P 4350 1750
F 0 "C57" V 4450 1900 50  0000 C CNN
F 1 "2.2uF" V 4450 1600 50  0000 C CNN
F 2 "" H 4350 1750 60  0001 C CNN
F 3 "" H 4350 1750 60  0001 C CNN
	1    4350 1750
	1    0    0    -1  
$EndComp
$Comp
L R R44
U 1 1 54514333
P 3550 4300
F 0 "R44" V 3630 4300 50  0000 C CNN
F 1 "331k" V 3550 4300 50  0000 C CNN
F 2 "" H 3550 4300 60  0001 C CNN
F 3 "" H 3550 4300 60  0001 C CNN
	1    3550 4300
	1    0    0    -1  
$EndComp
$Comp
L R R46
U 1 1 54514339
P 3550 4800
F 0 "R46" V 3630 4800 50  0000 C CNN
F 1 "1M" V 3550 4800 50  0000 C CNN
F 2 "" H 3550 4800 60  0001 C CNN
F 3 "" H 3550 4800 60  0001 C CNN
	1    3550 4800
	1    0    0    -1  
$EndComp
$Comp
L GND #PWR0113
U 1 1 54514344
P 2600 5100
F 0 "#PWR0113" H 2600 5100 30  0001 C CNN
F 1 "GND" H 2600 5030 30  0001 C CNN
F 2 "" H 2600 5100 60  0001 C CNN
F 3 "" H 2600 5100 60  0001 C CNN
	1    2600 5100
	1    0    0    -1  
$EndComp
Text Notes 1900 3400 0    60   ~ 0
1.4V Regulator\nMax 500 mA\nTotal: 256 mA\n
Text HLabel 900  4050 0    60   Input ~ 0
EN1V4
$Comp
L C C59
U 1 1 5451436F
P 3950 4550
F 0 "C59" V 4050 4700 50  0000 C CNN
F 1 "1000pF" V 4050 4400 50  0000 C CNN
F 2 "" H 3950 4550 60  0001 C CNN
F 3 "" H 3950 4550 60  0001 C CNN
	1    3950 4550
	1    0    0    -1  
$EndComp
$Comp
L TPS78630KTTT U16
U 1 1 5451462B
P 2750 1500
F 0 "U16" H 3100 1000 60  0000 C CNN
F 1 "TPS78601KTTT" H 2750 1500 60  0000 C CNN
F 2 "" H 2750 1500 60  0001 C CNN
F 3 "" H 2750 1500 60  0001 C CNN
	1    2750 1500
	1    0    0    -1  
$EndComp
$Comp
L C C56
U 1 1 545146A1
P 3900 1600
F 0 "C56" V 4000 1750 50  0000 C CNN
F 1 "15pF" V 4000 1450 50  0000 C CNN
F 2 "" H 3900 1600 60  0001 C CNN
F 3 "" H 3900 1600 60  0001 C CNN
	1    3900 1600
	1    0    0    -1  
$EndComp
$Comp
L C C58
U 1 1 545146C9
P 1850 1950
F 0 "C58" V 1950 2100 50  0000 C CNN
F 1 "2.2uF" V 1950 1800 50  0000 C CNN
F 2 "" H 1850 1950 60  0001 C CNN
F 3 "" H 1850 1950 60  0001 C CNN
	1    1850 1950
	1    0    0    -1  
$EndComp
$Comp
L GND #PWR0114
U 1 1 545147AF
P 1850 2300
F 0 "#PWR0114" H 1850 2300 30  0001 C CNN
F 1 "GND" H 1850 2230 30  0001 C CNN
F 2 "" H 1850 2300 60  0001 C CNN
F 3 "" H 1850 2300 60  0001 C CNN
	1    1850 2300
	1    0    0    -1  
$EndComp
$Comp
L GND #PWR0115
U 1 1 545147C3
P 3650 2450
F 0 "#PWR0115" H 3650 2450 30  0001 C CNN
F 1 "GND" H 3650 2380 30  0001 C CNN
F 2 "" H 3650 2450 60  0001 C CNN
F 3 "" H 3650 2450 60  0001 C CNN
	1    3650 2450
	1    0    0    -1  
$EndComp
$Comp
L TPS73501DRBT U17
U 1 1 54525DA3
P 2600 4250
F 0 "U17" H 2950 3800 60  0000 C CNN
F 1 "TPS73501DRBT" H 3100 4650 60  0000 C CNN
F 2 "" H 2600 4250 60  0001 C CNN
F 3 "" H 2600 4250 60  0001 C CNN
	1    2600 4250
	1    0    0    -1  
$EndComp
Text Label 4950 2400 3    60   ~ 0
3V_V0
Text Label 6150 2650 1    60   ~ 0
3V_V1
Text Label 7350 2650 1    60   ~ 0
3V_V2
Text Label 8550 2650 1    60   ~ 0
3V_V3
Text HLabel 9700 2750 2    60   Output ~ 0
3V_V[3..0]
$Comp
L R R49
U 1 1 5453F35F
P 4600 6500
F 0 "R49" V 4680 6500 50  0000 C CNN
F 1 "0.1" V 4600 6500 50  0000 C CNN
F 2 "" H 4600 6500 60  0001 C CNN
F 3 "" H 4600 6500 60  0001 C CNN
	1    4600 6500
	0    -1   -1   0   
$EndComp
$Comp
L GND #PWR0116
U 1 1 5453F4A9
P 4350 2050
F 0 "#PWR0116" H 4350 2050 30  0001 C CNN
F 1 "GND" H 4350 1980 30  0001 C CNN
F 2 "" H 4350 2050 60  0001 C CNN
F 3 "" H 4350 2050 60  0001 C CNN
	1    4350 2050
	1    0    0    -1  
$EndComp
$Comp
L +5V #PWR0117
U 1 1 5453F98E
P 1850 1600
F 0 "#PWR0117" H 1850 1690 20  0001 C CNN
F 1 "+5V" H 1850 1690 30  0000 C CNN
F 2 "" H 1850 1600 60  0001 C CNN
F 3 "" H 1850 1600 60  0001 C CNN
	1    1850 1600
	1    0    0    -1  
$EndComp
$Sheet
S 5250 1550 550  400 
U 546954C9
F0 "ASDQ3V0 sense" 50
F1 "sch/Current_sense.sch" 50
F2 "_Reset" I L 5250 1900 60 
F3 "-" I L 5250 1700 60 
F4 "+" I L 5250 1600 60 
F5 "V_I" O R 5800 1650 60 
F6 "OC" O R 5800 1750 60 
$EndSheet
$Sheet
S 6450 1550 550  400 
U 546954CA
F0 "ASDQ3V1 sense" 50
F1 "sch/Current_sense.sch" 50
F2 "_Reset" I L 6450 1900 60 
F3 "-" I L 6450 1700 60 
F4 "+" I L 6450 1600 60 
F5 "V_I" O R 7000 1650 60 
F6 "OC" O R 7000 1750 60 
$EndSheet
$Sheet
S 7650 1550 550  400 
U 5457F106
F0 "ASDQ3V2 sense" 50
F1 "sch/Current_sense.sch" 50
F2 "_Reset" I L 7650 1900 60 
F3 "-" I L 7650 1700 60 
F4 "+" I L 7650 1600 60 
F5 "V_I" O R 8200 1650 60 
F6 "OC" O R 8200 1750 60 
$EndSheet
Entry Wire Line
	4950 2650 5050 2750
Entry Wire Line
	6150 2650 6250 2750
Entry Wire Line
	7350 2650 7450 2750
Entry Wire Line
	8550 2650 8650 2750
Text HLabel 4900 2100 0    60   Input ~ 0
Reset3V
Text Label 5850 1050 3    60   ~ 0
3V_I0
Text Label 7050 1050 3    60   ~ 0
3V_I1
Text Label 8250 1050 3    60   ~ 0
3V_I2
Text Label 9450 1050 3    60   ~ 0
3V_I3
Entry Wire Line
	5850 650  5950 550 
Entry Wire Line
	7050 650  7150 550 
Entry Wire Line
	8250 650  8350 550 
Entry Wire Line
	9450 650  9550 550 
Text HLabel 10150 550  2    60   Output ~ 0
3V_I[3..0]
Text Label 6000 950  3    60   ~ 0
3V_OC0
Text Label 7200 950  3    60   ~ 0
3V_OC1
Text Label 8400 950  3    60   ~ 0
3V_OC2
Text Label 9600 950  3    60   ~ 0
3V_OC3
Entry Wire Line
	6000 850  6100 750 
Entry Wire Line
	7200 850  7300 750 
Entry Wire Line
	8400 850  8500 750 
Entry Wire Line
	9600 850  9700 750 
Text HLabel 10150 750  2    60   Output ~ 0
3V_OC[3..0]
$Sheet
S 8850 1550 550  400 
U 5457F10D
F0 "ASDQ3V3 sense" 50
F1 "sch/Current_sense.sch" 50
F2 "_Reset" I L 8850 1900 60 
F3 "-" I L 8850 1700 60 
F4 "+" I L 8850 1600 60 
F5 "V_I" O R 9400 1650 60 
F6 "OC" O R 9400 1750 60 
$EndSheet
$Comp
L R R35
U 1 1 5458CDCE
P 1150 1350
F 0 "R35" V 1230 1350 50  0000 C CNN
F 1 "0" V 1150 1350 50  0000 C CNN
F 2 "" H 1150 1350 60  0001 C CNN
F 3 "" H 1150 1350 60  0001 C CNN
	1    1150 1350
	0    -1   -1   0   
$EndComp
$Comp
L R R34
U 1 1 54513FF9
P 1400 1100
F 0 "R34" V 1480 1100 50  0000 C CNN
F 1 "DNP" V 1400 1100 50  0000 C CNN
F 2 "" H 1400 1100 60  0001 C CNN
F 3 "" H 1400 1100 60  0001 C CNN
	1    1400 1100
	1    0    0    -1  
$EndComp
$Comp
L +3.3V #PWR0118
U 1 1 5458DB8A
P 1700 6000
F 0 "#PWR0118" H 1700 5960 30  0001 C CNN
F 1 "+3.3V" H 1700 6110 30  0000 C CNN
F 2 "" H 1700 6000 60  0001 C CNN
F 3 "" H 1700 6000 60  0001 C CNN
	1    1700 6000
	1    0    0    -1  
$EndComp
$Comp
L R R50
U 1 1 5458DB90
P 1700 6750
F 0 "R50" V 1780 6750 50  0000 C CNN
F 1 "1k" V 1700 6750 50  0000 C CNN
F 2 "" H 1700 6750 60  0001 C CNN
F 3 "" H 1700 6750 60  0001 C CNN
	1    1700 6750
	1    0    0    -1  
$EndComp
$Comp
L GND #PWR0119
U 1 1 5458DB96
P 1700 7100
F 0 "#PWR0119" H 1700 7100 30  0001 C CNN
F 1 "GND" H 1700 7030 30  0001 C CNN
F 2 "" H 1700 7100 60  0001 C CNN
F 3 "" H 1700 7100 60  0001 C CNN
	1    1700 7100
	1    0    0    -1  
$EndComp
$Comp
L R R48
U 1 1 5458DB9D
P 1450 6500
F 0 "R48" V 1530 6500 50  0000 C CNN
F 1 "0" V 1450 6500 50  0000 C CNN
F 2 "" H 1450 6500 60  0001 C CNN
F 3 "" H 1450 6500 60  0001 C CNN
	1    1450 6500
	0    -1   -1   0   
$EndComp
$Comp
L R R47
U 1 1 5458DBA3
P 1700 6250
F 0 "R47" V 1780 6250 50  0000 C CNN
F 1 "DNP" V 1700 6250 50  0000 C CNN
F 2 "" H 1700 6250 60  0001 C CNN
F 3 "" H 1700 6250 60  0001 C CNN
	1    1700 6250
	1    0    0    -1  
$EndComp
$Comp
L +3V #PWR0120
U 1 1 545806EC
P 4400 1300
F 0 "#PWR0120" H 4400 1440 20  0001 C CNN
F 1 "+3V" H 4400 1410 30  0000 C CNN
F 2 "" H 4400 1300 60  0001 C CNN
F 3 "" H 4400 1300 60  0001 C CNN
	1    4400 1300
	1    0    0    -1  
$EndComp
$Comp
L +3V #PWR0121
U 1 1 545818DA
P 2150 6800
F 0 "#PWR0121" H 2150 6940 20  0001 C CNN
F 1 "+3V" H 2150 6910 30  0000 C CNN
F 2 "" H 2150 6800 60  0001 C CNN
F 3 "" H 2150 6800 60  0001 C CNN
	1    2150 6800
	1    0    0    -1  
$EndComp
$Comp
L C C62
U 1 1 545821C1
P 2150 7150
F 0 "C62" V 2250 7300 50  0000 C CNN
F 1 "0.1uF" V 2250 7000 50  0000 C CNN
F 2 "" H 2150 7150 60  0001 C CNN
F 3 "" H 2150 7150 60  0001 C CNN
	1    2150 7150
	1    0    0    -1  
$EndComp
$Comp
L GND #PWR0122
U 1 1 545821C7
P 2150 7500
F 0 "#PWR0122" H 2150 7500 30  0001 C CNN
F 1 "GND" H 2150 7430 30  0001 C CNN
F 2 "" H 2150 7500 60  0001 C CNN
F 3 "" H 2150 7500 60  0001 C CNN
	1    2150 7500
	1    0    0    -1  
$EndComp
$Comp
L +3.3V #PWR0123
U 1 1 5458383C
P 1500 3550
F 0 "#PWR0123" H 1500 3510 30  0001 C CNN
F 1 "+3.3V" H 1500 3660 30  0000 C CNN
F 2 "" H 1500 3550 60  0001 C CNN
F 3 "" H 1500 3550 60  0001 C CNN
	1    1500 3550
	1    0    0    -1  
$EndComp
$Comp
L R R43
U 1 1 5458384F
P 1250 4050
F 0 "R43" V 1330 4050 50  0000 C CNN
F 1 "0" V 1250 4050 50  0000 C CNN
F 2 "" H 1250 4050 60  0001 C CNN
F 3 "" H 1250 4050 60  0001 C CNN
	1    1250 4050
	0    -1   -1   0   
$EndComp
$Comp
L R R42
U 1 1 54583855
P 1500 3800
F 0 "R42" V 1580 3800 50  0000 C CNN
F 1 "DNP" V 1500 3800 50  0000 C CNN
F 2 "" H 1500 3800 60  0001 C CNN
F 3 "" H 1500 3800 60  0001 C CNN
	1    1500 3800
	1    0    0    -1  
$EndComp
Text Notes 9700 2500 0    60   ~ 0
Separate monitored supply lines \nfor each ASDQ's 3V
Text Notes 9550 700  0    60   ~ 0
For current monitoring and tripping
$Sheet
S 5250 4300 550  400 
U 54584D89
F0 "ASDQ1V4 sense" 50
F1 "sch/Current_sense.sch" 50
F2 "_Reset" I L 5250 4650 60 
F3 "-" I L 5250 4450 60 
F4 "+" I L 5250 4350 60 
F5 "V_I" O R 5800 4400 60 
F6 "OC" O R 5800 4500 60 
$EndSheet
$Comp
L +3V #PWR0124
U 1 1 5458124D
P 1850 4350
F 0 "#PWR0124" H 1850 4490 20  0001 C CNN
F 1 "+3V" H 1850 4460 30  0000 C CNN
F 2 "" H 1850 4350 60  0001 C CNN
F 3 "" H 1850 4350 60  0001 C CNN
	1    1850 4350
	1    0    0    -1  
$EndComp
$Comp
L C C60
U 1 1 54581255
P 1850 4700
F 0 "C60" V 1950 4850 50  0000 C CNN
F 1 "0.1uF" V 1950 4550 50  0000 C CNN
F 2 "" H 1850 4700 60  0001 C CNN
F 3 "" H 1850 4700 60  0001 C CNN
	1    1850 4700
	1    0    0    -1  
$EndComp
$Comp
L GND #PWR0125
U 1 1 5458125B
P 1850 5050
F 0 "#PWR0125" H 1850 5050 30  0001 C CNN
F 1 "GND" H 1850 4980 30  0001 C CNN
F 2 "" H 1850 5050 60  0001 C CNN
F 3 "" H 1850 5050 60  0001 C CNN
	1    1850 5050
	1    0    0    -1  
$EndComp
Text HLabel 4800 4650 0    60   Input ~ 0
Reset1V4
Text HLabel 6350 5150 2    60   Output ~ 0
1V4_V
Text HLabel 6350 4400 2    60   Output ~ 0
1V4_I
Text HLabel 6350 4500 2    60   Output ~ 0
1V4_OC
Text Notes 6350 5050 0    60   ~ 0
1.4V monitored supply line
Text Notes 6350 4300 0    60   ~ 0
1.4V current monitor and OC
$Comp
L R R36
U 1 1 5459A003
P 3650 1600
F 0 "R36" V 3730 1600 50  0000 C CNN
F 1 "44.4k" V 3650 1600 50  0000 C CNN
F 2 "" H 3650 1600 60  0001 C CNN
F 3 "" H 3650 1600 60  0001 C CNN
	1    3650 1600
	1    0    0    -1  
$EndComp
$Comp
L R R41
U 1 1 5459A062
P 3650 2100
F 0 "R41" V 3730 2100 50  0000 C CNN
F 1 "30.6k" V 3650 2100 50  0000 C CNN
F 2 "" H 3650 2100 60  0001 C CNN
F 3 "" H 3650 2100 60  0001 C CNN
	1    3650 2100
	1    0    0    -1  
$EndComp
Wire Wire Line
	1700 7000 1700 7100
$EndSCHEMATC
