PCBNEW-LibModule-V1 Wed Jun  4 14:34:00 2014
$INDEX
SOIC-8
SOIC-14
SOIC-16
SOIC-20
$EndINDEX
$MODULE SOIC-8
Po 0 0 0 15 538F6698 00000000 ~~
Li SOIC-8
Sc 538F6698
At SMD
Op 0 0 0
T0 0 -150 200 200 0 40 N V 25 "SOIC-8"
T1 0 150 200 200 0 40 N I 25 "Val*"
$PAD
Sh "8" R 237 787 0 0 0
At SMD N 00888000
Po -749 -944
$EndPAD
$PAD
Sh "1" R 237 787 0 0 0
At SMD N 00888000
Po -749 944
$EndPAD
$PAD
Sh "7" R 237 787 0 0 0
At SMD N 00888000
Po -249 -944
$EndPAD
$PAD
Sh "2" R 237 787 0 0 0
At SMD N 00888000
Po -249 944
$EndPAD
$PAD
Sh "6" R 237 787 0 0 0
At SMD N 00888000
Po 249 -944
$EndPAD
$PAD
Sh "3" R 237 787 0 0 0
At SMD N 00888000
Po 249 944
$EndPAD
$PAD
Sh "5" R 237 787 0 0 0
At SMD N 00888000
Po 749 -944
$EndPAD
$PAD
Sh "4" R 237 787 0 0 0
At SMD N 00888000
Po 749 944
$EndPAD
DC -1150 944 -1150 856 50 21
DS -964 1388 -964 -1388 50 21
DS -964 -1388 964 -1388 50 21
DS 964 -1388 964 1388 50 21
DS 964 1388 -964 1388 50 21
$EndMODULE SOIC-8
$MODULE SOIC-14
Po 0 0 0 15 538F6698 00000000 ~~
Li SOIC-14
Sc 538F6698
At SMD
Op 0 0 0
T0 0 -150 200 200 0 40 N V 25 "SOIC-14"
T1 0 150 200 200 0 40 N I 25 "Val*"
$PAD
Sh "14" R 237 787 0 0 0
At SMD N 00888000
Po -1499 -944
$EndPAD
$PAD
Sh "1" R 237 787 0 0 0
At SMD N 00888000
Po -1499 944
$EndPAD
$PAD
Sh "13" R 237 787 0 0 0
At SMD N 00888000
Po -999 -944
$EndPAD
$PAD
Sh "2" R 237 787 0 0 0
At SMD N 00888000
Po -999 944
$EndPAD
$PAD
Sh "12" R 237 787 0 0 0
At SMD N 00888000
Po -499 -944
$EndPAD
$PAD
Sh "3" R 237 787 0 0 0
At SMD N 00888000
Po -499 944
$EndPAD
$PAD
Sh "11" R 236 787 0 0 0
At SMD N 00888000
Po 0 -944
$EndPAD
$PAD
Sh "4" R 236 787 0 0 0
At SMD N 00888000
Po 0 944
$EndPAD
$PAD
Sh "10" R 237 787 0 0 0
At SMD N 00888000
Po 499 -944
$EndPAD
$PAD
Sh "5" R 237 787 0 0 0
At SMD N 00888000
Po 499 944
$EndPAD
$PAD
Sh "9" R 237 787 0 0 0
At SMD N 00888000
Po 999 -944
$EndPAD
$PAD
Sh "6" R 237 787 0 0 0
At SMD N 00888000
Po 999 944
$EndPAD
$PAD
Sh "8" R 237 787 0 0 0
At SMD N 00888000
Po 1499 -944
$EndPAD
$PAD
Sh "7" R 237 787 0 0 0
At SMD N 00888000
Po 1499 944
$EndPAD
DC -1888 944 -1888 860 50 21
DS -1702 1388 -1702 -1388 50 21
DS -1702 -1388 1702 -1388 50 21
DS 1702 -1388 1702 1388 50 21
DS 1702 1388 -1702 1388 50 21
$EndMODULE SOIC-14
$MODULE SOIC-16
Po 0 0 0 15 538F6698 00000000 ~~
Li SOIC-16
Sc 538F6698
At SMD
Op 0 0 0
T0 0 -150 200 200 0 40 N V 25 "SOIC-16"
T1 0 150 200 200 0 40 N I 25 "Val*"
$PAD
Sh "16" R 237 787 0 0 0
At SMD N 00888000
Po -1749 -944
$EndPAD
$PAD
Sh "1" R 237 787 0 0 0
At SMD N 00888000
Po -1749 944
$EndPAD
$PAD
Sh "15" R 237 787 0 0 0
At SMD N 00888000
Po -1249 -944
$EndPAD
$PAD
Sh "2" R 237 787 0 0 0
At SMD N 00888000
Po -1249 944
$EndPAD
$PAD
Sh "14" R 237 787 0 0 0
At SMD N 00888000
Po -749 -944
$EndPAD
$PAD
Sh "3" R 237 787 0 0 0
At SMD N 00888000
Po -749 944
$EndPAD
$PAD
Sh "13" R 237 787 0 0 0
At SMD N 00888000
Po -249 -944
$EndPAD
$PAD
Sh "4" R 237 787 0 0 0
At SMD N 00888000
Po -249 944
$EndPAD
$PAD
Sh "12" R 237 787 0 0 0
At SMD N 00888000
Po 249 -944
$EndPAD
$PAD
Sh "5" R 237 787 0 0 0
At SMD N 00888000
Po 249 944
$EndPAD
$PAD
Sh "11" R 237 787 0 0 0
At SMD N 00888000
Po 749 -944
$EndPAD
$PAD
Sh "6" R 237 787 0 0 0
At SMD N 00888000
Po 749 944
$EndPAD
$PAD
Sh "10" R 237 787 0 0 0
At SMD N 00888000
Po 1249 -944
$EndPAD
$PAD
Sh "7" R 237 787 0 0 0
At SMD N 00888000
Po 1249 944
$EndPAD
$PAD
Sh "9" R 237 787 0 0 0
At SMD N 00888000
Po 1749 -944
$EndPAD
$PAD
Sh "8" R 237 787 0 0 0
At SMD N 00888000
Po 1749 944
$EndPAD
DC -2135 944 -2135 861 50 21
DS -1948 1388 -1948 -1388 50 21
DS -1948 -1388 1948 -1388 50 21
DS 1948 -1388 1948 1388 50 21
DS 1948 1388 -1948 1388 50 21
$EndMODULE SOIC-16
$MODULE SOIC-20
Po 0 0 0 15 538F6698 00000000 ~~
Li SOIC-20
Sc 538F6698
At SMD
Op 0 0 0
T0 0 -150 200 200 0 40 N V 25 "SOIC-20"
T1 0 150 200 200 0 40 N I 25 "Val*"
$PAD
Sh "20" R 237 787 0 0 0
At SMD N 00888000
Po -2249 -944
$EndPAD
$PAD
Sh "1" R 237 787 0 0 0
At SMD N 00888000
Po -2249 944
$EndPAD
$PAD
Sh "19" R 237 787 0 0 0
At SMD N 00888000
Po -1749 -944
$EndPAD
$PAD
Sh "2" R 237 787 0 0 0
At SMD N 00888000
Po -1749 944
$EndPAD
$PAD
Sh "18" R 237 787 0 0 0
At SMD N 00888000
Po -1249 -944
$EndPAD
$PAD
Sh "3" R 237 787 0 0 0
At SMD N 00888000
Po -1249 944
$EndPAD
$PAD
Sh "17" R 237 787 0 0 0
At SMD N 00888000
Po -749 -944
$EndPAD
$PAD
Sh "4" R 237 787 0 0 0
At SMD N 00888000
Po -749 944
$EndPAD
$PAD
Sh "16" R 237 787 0 0 0
At SMD N 00888000
Po -249 -944
$EndPAD
$PAD
Sh "5" R 237 787 0 0 0
At SMD N 00888000
Po -249 944
$EndPAD
$PAD
Sh "15" R 237 787 0 0 0
At SMD N 00888000
Po 249 -944
$EndPAD
$PAD
Sh "6" R 237 787 0 0 0
At SMD N 00888000
Po 249 944
$EndPAD
$PAD
Sh "14" R 237 787 0 0 0
At SMD N 00888000
Po 749 -944
$EndPAD
$PAD
Sh "7" R 237 787 0 0 0
At SMD N 00888000
Po 749 944
$EndPAD
$PAD
Sh "13" R 237 787 0 0 0
At SMD N 00888000
Po 1249 -944
$EndPAD
$PAD
Sh "8" R 237 787 0 0 0
At SMD N 00888000
Po 1249 944
$EndPAD
$PAD
Sh "12" R 237 787 0 0 0
At SMD N 00888000
Po 1749 -944
$EndPAD
$PAD
Sh "9" R 237 787 0 0 0
At SMD N 00888000
Po 1749 944
$EndPAD
$PAD
Sh "11" R 237 787 0 0 0
At SMD N 00888000
Po 2249 -944
$EndPAD
$PAD
Sh "10" R 237 787 0 0 0
At SMD N 00888000
Po 2249 944
$EndPAD
DC -2745 944 -2745 825 50 21
DS -2559 1388 -2559 -1388 50 21
DS -2559 -1388 2559 -1388 50 21
DS 2559 -1388 2559 1388 50 21
DS 2559 1388 -2559 1388 50 21
$EndMODULE SOIC-20
$EndLIBRARY
