EESchema Schematic File Version 2
LIBS:sn65hvd3083edgsr
LIBS:conn
LIBS:power
LIBS:pspice
LIBS:zl40216
LIBS:sfp
LIBS:FIN1108
LIBS:sn65lvds389
LIBS:max5825baup
LIBS:tps72301dbvr
LIBS:ina195a
LIBS:tps78630kttt
LIBS:tps73501drbt
LIBS:lt3015eq
LIBS:lt1086cm-3
LIBS:tps72012drvt
LIBS:ina202a
LIBS:transistors
LIBS:2sk3019
LIBS:sn74hc05d
LIBS:ad7998
LIBS:ao3401a
LIBS:opa703
LIBS:6slx45fgg484pkg
LIBS:ERM8-RA
LIBS:cdclvd1204
LIBS:sy89835u
LIBS:zl40212
LIBS:opa4703ea
LIBS:tps73201qdbvrq1
LIBS:m25p32
LIBS:bav99
LIBS:si590
LIBS:iso7242c
LIBS:lmk00304
LIBS:pins_14x2
LIBS:ds18b20u
LIBS:2x14_conn
LIBS:led
LIBS:LogicBoard-cache
EELAYER 24 0
EELAYER END
$Descr A4 11693 8268
encoding utf-8
Sheet 17 23
Title ""
Date "1 dec 2015"
Rev ""
Comp ""
Comment1 ""
Comment2 ""
Comment3 ""
Comment4 ""
$EndDescr
NoConn ~ 4650 5850
NoConn ~ 4650 5750
NoConn ~ 4650 5050
NoConn ~ 4650 4950
NoConn ~ 4650 4850
NoConn ~ 4650 4750
NoConn ~ 4650 4550
NoConn ~ 4650 4450
NoConn ~ 4650 4350
NoConn ~ 4650 4150
NoConn ~ 4650 3850
NoConn ~ 4650 3750
NoConn ~ 4650 3550
NoConn ~ 4650 3250
NoConn ~ 4650 3150
NoConn ~ 4650 3050
NoConn ~ 4650 2950
NoConn ~ 4650 2750
NoConn ~ 4650 2650
NoConn ~ 4650 2550
NoConn ~ 4650 2150
NoConn ~ 4650 1850
NoConn ~ 4650 1750
NoConn ~ 4650 1450
Wire Wire Line
	4050 2050 4650 2050
Connection ~ 6800 2050
Wire Wire Line
	6650 2050 6800 2050
Connection ~ 6800 1850
Wire Wire Line
	6650 1850 6800 1850
Connection ~ 6800 1650
Wire Wire Line
	6650 1650 6800 1650
Connection ~ 6800 1450
Wire Wire Line
	6650 1450 6800 1450
Connection ~ 7850 2050
Wire Wire Line
	7850 2050 7850 1950
Wire Wire Line
	7200 2100 7200 2050
Wire Wire Line
	7200 2050 8650 2050
Wire Wire Line
	8650 2050 8650 1950
Connection ~ 7850 1350
Wire Wire Line
	7850 1450 7850 1350
Connection ~ 7200 1350
Wire Wire Line
	8650 1350 8650 1450
Wire Wire Line
	6650 1350 8650 1350
Wire Wire Line
	8250 1450 8250 1350
Connection ~ 8250 1350
Wire Wire Line
	7450 1450 7450 1350
Connection ~ 7450 1350
Wire Wire Line
	7450 1950 7450 2050
Connection ~ 7450 2050
Wire Wire Line
	8250 1950 8250 2050
Connection ~ 8250 2050
Wire Wire Line
	4200 3350 4650 3350
Wire Wire Line
	4200 3450 4650 3450
Wire Bus Line
	4050 3200 4100 3200
Wire Bus Line
	4100 3200 4100 3350
Wire Wire Line
	4200 3950 4650 3950
Wire Wire Line
	4200 4050 4650 4050
Wire Bus Line
	4050 3800 4100 3800
Wire Bus Line
	4100 3800 4100 3950
Wire Wire Line
	4200 1550 4650 1550
Wire Wire Line
	4200 1650 4650 1650
Wire Bus Line
	4050 1400 4100 1400
Wire Bus Line
	4100 1400 4100 1550
Wire Wire Line
	6800 2250 6650 2250
Wire Wire Line
	6800 1350 6800 2250
Connection ~ 6800 1350
Wire Wire Line
	6650 1550 6800 1550
Connection ~ 6800 1550
Wire Wire Line
	6650 1750 6800 1750
Connection ~ 6800 1750
Wire Wire Line
	6650 1950 6800 1950
Connection ~ 6800 1950
Wire Wire Line
	6650 2150 6800 2150
Connection ~ 6800 2150
$Comp
L +3.3V #PWR0120
U 1 1 5467E5B5
P 7200 1350
F 0 "#PWR0120" H 7200 1310 30  0001 C CNN
F 1 "+3.3V" H 7200 1460 30  0000 C CNN
F 2 "" H 7200 1350 60  0001 C CNN
F 3 "" H 7200 1350 60  0001 C CNN
	1    7200 1350
	1    0    0    -1  
$EndComp
$Comp
L C C34
U 1 1 5467E5B1
P 7450 1700
F 0 "C34" V 7550 1850 50  0000 C CNN
F 1 "100uF LO ESR" V 7650 1650 50  0000 C CNN
F 2 "SM1210" H 7450 1700 60  0001 C CNN
F 3 "" H 7450 1700 60  0001 C CNN
F 4 "GRM32ER60J107ME20L" V 7450 1700 60  0001 C CNN "Field1"
	1    7450 1700
	1    0    0    -1  
$EndComp
$Comp
L C C35
U 1 1 5467E5B0
P 7850 1700
F 0 "C35" V 7950 1850 50  0000 C CNN
F 1 "4.7uF LO ESR" V 8050 1650 50  0000 C CNN
F 2 "SM0805" H 7850 1700 60  0001 C CNN
F 3 "" H 7850 1700 60  0001 C CNN
F 4 "LMK212B7475KG-T" V 7850 1700 60  0001 C CNN "Field1"
	1    7850 1700
	1    0    0    -1  
$EndComp
$Comp
L C C37
U 1 1 5467E5AF
P 8650 1700
F 0 "C37" V 8750 1850 50  0000 C CNN
F 1 "0.47uF LO ESR" V 8850 1650 50  0000 C CNN
F 2 "SM0402" H 8650 1700 60  0001 C CNN
F 3 "" H 8650 1700 60  0001 C CNN
F 4 "GRM155R60J474KE19D" V 8650 1700 60  0001 C CNN "Field1"
	1    8650 1700
	1    0    0    -1  
$EndComp
$Comp
L C C36
U 1 1 5467E5AE
P 8250 1700
F 0 "C36" V 8350 1850 50  0000 C CNN
F 1 "0.47uF LO ESR" V 8450 1650 50  0000 C CNN
F 2 "SM0402" H 8250 1700 60  0001 C CNN
F 3 "" H 8250 1700 60  0001 C CNN
F 4 "GRM155R60J474KE19D" V 8650 1700 60  0001 C CNN "Field1"
	1    8250 1700
	1    0    0    -1  
$EndComp
$Comp
L GND #PWR0121
U 1 1 5467E5AD
P 7200 2100
F 0 "#PWR0121" H 7200 2100 30  0001 C CNN
F 1 "GND" H 7200 2030 30  0001 C CNN
F 2 "" H 7200 2100 60  0001 C CNN
F 3 "" H 7200 2100 60  0001 C CNN
	1    7200 2100
	1    0    0    -1  
$EndComp
$Comp
L 6SLX45FGG484PKG U16
U 2 1 546954CE
P 5150 2950
F 0 "U16" H 6350 4700 60  0000 C CNN
F 1 "6SLX45FGG484PKG" H 5200 4700 60  0000 C CNN
F 2 "XC6SLX45" H 5150 2950 60  0001 C CNN
F 3 "" H 5150 2950 60  0001 C CNN
	2    5150 2950
	1    0    0    -1  
$EndComp
Text HLabel 4050 1400 0    60   Output ~ 0
Data_out[1..0]
Text HLabel 4050 2050 0    60   Output ~ 0
C5_SEL
Text HLabel 4050 3200 0    60   Input ~ 0
C5_IN[1..0]
Text HLabel 4050 3800 0    60   Output ~ 0
C5_OUT[1..0]
Text Label 4200 3350 0    60   ~ 0
C5_IN0
Text Label 4200 3450 0    60   ~ 0
C5_IN1
Entry Wire Line
	4100 3350 4200 3450
Entry Wire Line
	4100 3250 4200 3350
Text Label 4200 3950 0    60   ~ 0
C5_OUT0
Text Label 4200 4050 0    60   ~ 0
C5_OUT1
Entry Wire Line
	4100 3950 4200 4050
Entry Wire Line
	4100 3850 4200 3950
Text Label 4200 1550 0    60   ~ 0
Data_out0
Text Label 4200 1650 0    60   ~ 0
Data_out1
Entry Wire Line
	4100 1550 4200 1650
Entry Wire Line
	4100 1450 4200 1550
NoConn ~ 4650 5450
NoConn ~ 4650 5350
Text HLabel 4450 4250 0    60   Output ~ 0
SCL
Text HLabel 4450 4650 0    60   BiDi ~ 0
SDA
Wire Wire Line
	4450 4250 4650 4250
Wire Wire Line
	4450 4650 4650 4650
NoConn ~ 4650 2350
NoConn ~ 4650 3650
Text HLabel 4050 5150 0    60   Input ~ 0
TDC_P2
Text HLabel 4050 5250 0    60   Input ~ 0
TDC_N2
Text HLabel 4050 5550 0    60   Input ~ 0
TDC_P0
Text HLabel 4050 5650 0    60   Input ~ 0
TDC_N0
Wire Wire Line
	4050 5150 4650 5150
Wire Wire Line
	4050 5250 4650 5250
Wire Wire Line
	4050 5650 4650 5650
Wire Wire Line
	4050 5550 4650 5550
Text HLabel 2400 1650 0    60   Output ~ 0
LED[3..0]
Text Label 4200 1950 0    60   ~ 0
LED3
Text Label 4200 2250 0    60   ~ 0
LED2
Text Label 4200 2450 0    60   ~ 0
LED1
Text Label 4200 2850 0    60   ~ 0
LED0
Wire Wire Line
	4200 1950 4650 1950
Wire Wire Line
	4200 2250 4650 2250
Wire Wire Line
	4200 2450 4650 2450
Wire Wire Line
	4200 2850 4650 2850
$EndSCHEMATC
