EESchema Schematic File Version 2
LIBS:sn65hvd3083edgsr
LIBS:conn
LIBS:power
LIBS:pspice
LIBS:zl40216
LIBS:sfp
LIBS:FIN1108
LIBS:sn65lvds389
LIBS:max5825baup
LIBS:tps72301dbvr
LIBS:ina195a
LIBS:tps78630kttt
LIBS:tps73501drbt
LIBS:lt3015eq
LIBS:lt1086cm-3
LIBS:tps72012drvt
LIBS:ina202a
LIBS:transistors
LIBS:2sk3019
LIBS:sn74hc05d
LIBS:ad7998
LIBS:ao3401a
LIBS:opa703
LIBS:6slx45fgg484pkg
LIBS:ERM8-RA
LIBS:cdclvd1204
LIBS:sy89835u
LIBS:zl40212
LIBS:opa4703ea
LIBS:tps73201qdbvrq1
LIBS:m25p32
LIBS:bav99
LIBS:si590
LIBS:iso7242c
LIBS:lmk00304
LIBS:pins_14x2
LIBS:ds18b20u
LIBS:2x14_conn
LIBS:led
LIBS:LogicBoard-cache
EELAYER 24 0
EELAYER END
$Descr A4 11693 8268
encoding utf-8
Sheet 5 23
Title ""
Date "1 dec 2015"
Rev ""
Comp ""
Comment1 ""
Comment2 ""
Comment3 ""
Comment4 ""
$EndDescr
Connection ~ 4900 1900
Wire Wire Line
	4900 1850 4900 1900
Wire Wire Line
	2650 4050 3400 4050
Wire Bus Line
	550  4450 550  5050
Wire Wire Line
	1100 4350 650  4350
Connection ~ 6900 4300
Wire Wire Line
	6850 4300 6950 4300
Wire Wire Line
	6900 4300 6900 3400
Wire Wire Line
	6900 3400 7650 3400
Wire Wire Line
	6800 3800 6850 3800
Wire Wire Line
	5600 3100 7650 3100
Wire Bus Line
	6450 3400 6450 3600
Wire Wire Line
	5600 3300 6350 3300
Connection ~ 6200 3000
Wire Wire Line
	6200 3050 6200 3000
Wire Wire Line
	4050 1900 4000 1900
Wire Wire Line
	4000 1900 4000 1850
Wire Wire Line
	4550 1900 5200 1900
Wire Wire Line
	5200 1900 5200 2100
Wire Wire Line
	5200 2100 4950 2100
Wire Wire Line
	4950 2100 4950 2500
Wire Wire Line
	4550 2600 4550 2650
Wire Wire Line
	4850 3900 4850 3950
Wire Wire Line
	4200 3250 4100 3250
Wire Wire Line
	2650 4300 4000 4300
Wire Wire Line
	9800 3750 10150 3750
Wire Wire Line
	9800 3650 10550 3650
Wire Wire Line
	9800 3450 10150 3450
Wire Wire Line
	9800 3350 10550 3350
Wire Wire Line
	9800 2850 10150 2850
Wire Wire Line
	9800 2750 10550 2750
Wire Wire Line
	9800 3150 10150 3150
Wire Wire Line
	9800 3050 10550 3050
Wire Bus Line
	10250 2950 10250 4450
Wire Bus Line
	10250 4450 10700 4450
Wire Bus Line
	10650 2850 10650 4350
Wire Bus Line
	10650 4350 10700 4350
Connection ~ 1650 3300
Connection ~ 3050 4050
Wire Wire Line
	1650 3300 2050 3300
Connection ~ 2050 3300
Connection ~ 1850 3300
Wire Wire Line
	1550 2800 2150 2800
Connection ~ 1850 2800
Wire Wire Line
	2650 3750 2750 3750
Wire Wire Line
	2750 3750 2750 4050
Wire Wire Line
	2750 3850 2650 3850
Connection ~ 2750 3850
Wire Wire Line
	2650 3950 2750 3950
Connection ~ 2750 3950
Connection ~ 2750 4050
Wire Wire Line
	2650 3650 2650 3550
Wire Wire Line
	2650 3550 3400 3550
Connection ~ 3050 3550
Wire Wire Line
	2750 3550 2750 2800
Connection ~ 2750 3550
Wire Wire Line
	650  3950 1100 3950
Wire Wire Line
	1100 3750 1000 3750
Wire Wire Line
	1000 3750 1000 3950
Connection ~ 1000 3950
Wire Wire Line
	1100 3850 1000 3850
Connection ~ 1000 3850
Wire Wire Line
	1000 2800 1000 3650
Wire Wire Line
	650  3450 1000 3450
Connection ~ 1000 3450
Wire Wire Line
	4100 3250 4100 3850
Wire Wire Line
	4100 3850 4000 3850
Wire Wire Line
	4000 3350 4000 3150
Wire Wire Line
	3900 3350 3900 4200
Wire Wire Line
	3900 3350 4000 3350
Wire Wire Line
	4000 3850 4000 4300
Wire Wire Line
	1000 3650 1100 3650
Connection ~ 1650 2800
Connection ~ 2050 2800
Wire Wire Line
	2750 2800 2650 2800
Wire Wire Line
	1000 2800 1050 2800
Wire Wire Line
	3900 4200 2650 4200
Wire Wire Line
	4000 3150 4200 3150
Wire Wire Line
	4900 3950 4900 4000
Wire Wire Line
	4850 3950 4950 3950
Wire Wire Line
	4950 3950 4950 3900
Connection ~ 4900 3950
Wire Wire Line
	4850 2500 4850 2100
Wire Wire Line
	4850 2100 4550 2100
Wire Wire Line
	4550 2100 4550 1900
Wire Wire Line
	6700 3050 6700 3100
Connection ~ 6700 3100
Wire Wire Line
	5600 3400 6350 3400
Wire Wire Line
	5600 3000 7650 3000
Wire Wire Line
	7550 3900 7650 3900
Wire Wire Line
	7650 3300 6800 3300
Wire Wire Line
	6800 3300 6800 4400
Wire Wire Line
	6800 4400 6950 4400
Connection ~ 6800 3800
Wire Bus Line
	7050 4400 7050 4550
Wire Wire Line
	1100 4450 650  4450
Wire Wire Line
	5200 2650 5200 2600
$Comp
L PWR_FLAG #FLG026
U 1 1 54697BBB
P 4900 1850
F 0 "#FLG026" H 4900 1945 30  0001 C CNN
F 1 "PWR_FLAG" H 4900 2030 30  0000 C CNN
F 2 "" H 4900 1850 60  0001 C CNN
F 3 "" H 4900 1850 60  0001 C CNN
	1    4900 1850
	1    0    0    -1  
$EndComp
Entry Wire Line
	550  4550 650  4450
Entry Wire Line
	550  4450 650  4350
Text Label 650  4450 0    60   ~ 0
Data_out1
Text Label 650  4350 0    60   ~ 0
Data_out0
Text HLabel 7050 4550 2    60   Input ~ 0
C5_OUT[1..0]
Entry Wire Line
	6950 4400 7050 4500
Entry Wire Line
	6950 4300 7050 4400
Text HLabel 7550 3900 0    60   Input ~ 0
C5_SEL
Text Label 7250 3300 0    60   ~ 0
C5_OUT0
Text Label 7250 3400 0    60   ~ 0
C5_OUT1
$Comp
L R R14
U 1 1 545FDA92
P 6850 4050
F 0 "R14" V 6930 4050 50  0000 C CNN
F 1 "100" V 6850 4050 50  0000 C CNN
F 2 "SM0402" H 6850 4050 60  0001 C CNN
F 3 "" H 6850 4050 60  0001 C CNN
	1    6850 4050
	-1   0    0    1   
$EndComp
Text HLabel 6450 3600 3    60   Output ~ 0
C5_IN[1..0]
Entry Wire Line
	6350 3400 6450 3500
Entry Wire Line
	6350 3300 6450 3400
Text Label 5800 3400 2    60   ~ 0
C5_IN1
Text Label 5800 3300 2    60   ~ 0
C5_IN0
$Comp
L R R11
U 1 1 545FDA08
P 6450 3050
F 0 "R11" V 6530 3050 50  0000 C CNN
F 1 "100" V 6450 3050 50  0000 C CNN
F 2 "SM0402" H 6450 3050 60  0001 C CNN
F 3 "" H 6450 3050 60  0001 C CNN
	1    6450 3050
	0    -1   -1   0   
$EndComp
$Comp
L +3.3V #PWR027
U 1 1 545FD8DA
P 4000 1850
F 0 "#PWR027" H 4000 1810 30  0001 C CNN
F 1 "+3.3V" H 4000 1960 30  0000 C CNN
F 2 "" H 4000 1850 60  0001 C CNN
F 3 "" H 4000 1850 60  0001 C CNN
	1    4000 1850
	1    0    0    -1  
$EndComp
$Comp
L R R10
U 1 1 545FD8C5
P 4300 1900
F 0 "R10" V 4380 1900 50  0000 C CNN
F 1 "0.3" V 4300 1900 50  0000 C CNN
F 2 "SM0402" H 4300 1900 60  0001 C CNN
F 3 "" H 4300 1900 60  0001 C CNN
	1    4300 1900
	0    -1   -1   0   
$EndComp
$Comp
L GND #PWR028
U 1 1 545FD8A7
P 4550 2650
F 0 "#PWR028" H 4550 2650 30  0001 C CNN
F 1 "GND" H 4550 2580 30  0001 C CNN
F 2 "" H 4550 2650 60  0001 C CNN
F 3 "" H 4550 2650 60  0001 C CNN
	1    4550 2650
	1    0    0    -1  
$EndComp
$Comp
L GND #PWR029
U 1 1 545FD8A4
P 5200 2650
F 0 "#PWR029" H 5200 2650 30  0001 C CNN
F 1 "GND" H 5200 2580 30  0001 C CNN
F 2 "" H 5200 2650 60  0001 C CNN
F 3 "" H 5200 2650 60  0001 C CNN
	1    5200 2650
	1    0    0    -1  
$EndComp
$Comp
L CAP C14
U 1 1 545FD88B
P 5200 2350
F 0 "C14" V 5300 2500 50  0000 C CNN
F 1 "10uF" V 5300 2200 50  0000 C CNN
F 2 "SM0402" H 5200 2350 60  0001 C CNN
F 3 "" H 5200 2350 60  0001 C CNN
	1    5200 2350
	1    0    0    -1  
$EndComp
$Comp
L CAP C13
U 1 1 545FD88A
P 4550 2350
F 0 "C13" V 4650 2500 50  0000 C CNN
F 1 "0.1uF" V 4650 2200 50  0000 C CNN
F 2 "SM0402" H 4550 2350 60  0001 C CNN
F 3 "" H 4550 2350 60  0001 C CNN
	1    4550 2350
	1    0    0    -1  
$EndComp
$Comp
L ZL40212 U5
U 1 1 545FD7F2
P 4900 3200
F 0 "U5" H 5250 2700 60  0000 C CNN
F 1 "ZL40212" H 4900 3200 60  0000 C CNN
F 2 "ZL40212" H 4900 3200 60  0001 C CNN
F 3 "" H 4900 3200 60  0001 C CNN
F 4 "ZL40212LDG1-ND	" H 4900 3200 60  0001 C CNN "Field1"
	1    4900 3200
	1    0    0    -1  
$EndComp
$Comp
L GND #PWR030
U 1 1 545FD226
P 4900 4000
F 0 "#PWR030" H 4900 4000 30  0001 C CNN
F 1 "GND" H 4900 3930 30  0001 C CNN
F 2 "" H 4900 4000 60  0001 C CNN
F 3 "" H 4900 4000 60  0001 C CNN
	1    4900 4000
	1    0    0    -1  
$EndComp
Text Label 9800 3050 0    60   ~ 0
C5_P2
Text Label 9800 3150 0    60   ~ 0
C5_N2
Text Label 9800 2750 0    60   ~ 0
C5_P3
Text Label 9800 2850 0    60   ~ 0
C5_N3
Text Label 9800 3350 0    60   ~ 0
C5_P0
Text Label 9800 3450 0    60   ~ 0
C5_N0
Text Label 9800 3650 0    60   ~ 0
C5_P1
Text Label 9800 3750 0    60   ~ 0
C5_N1
Entry Wire Line
	10150 3750 10250 3850
Entry Wire Line
	10550 3650 10650 3750
Entry Wire Line
	10150 3450 10250 3550
Entry Wire Line
	10550 3350 10650 3450
Entry Wire Line
	10150 3150 10250 3250
Entry Wire Line
	10550 3050 10650 3150
Entry Wire Line
	10150 2850 10250 2950
Entry Wire Line
	10550 2750 10650 2850
Text HLabel 10700 4350 2    60   Output ~ 0
C5_P[3..0]
Text HLabel 10700 4450 2    60   Output ~ 0
C5_N[3..0]
$Comp
L SFP+ U7
U 1 1 54468C85
P 1650 4300
F 0 "U7" H 2200 3650 60  0000 C CNN
F 1 "SFP+" H 2150 3750 60  0000 C CNN
F 2 "A97943DKR-ND" H 1650 4300 60  0001 C CNN
F 3 "" H 1650 4300 60  0001 C CNN
F 4 "A97943DKR-ND" H 1650 4300 60  0001 C CNN "Field1"
	1    1650 4300
	1    0    0    -1  
$EndComp
$Comp
L CAP C8
U 1 1 54468DF6
P 7200 1300
F 0 "C8" V 7300 1450 50  0000 C CNN
F 1 "0.1uF LO ESR" V 7400 1300 50  0000 C CNN
F 2 "SM0603" H 7200 1300 60  0001 C CNN
F 3 "" H 7200 1300 60  0001 C CNN
F 4 "C1608X7S2A104M080AB" V 6000 1300 60  0001 C CNN "Field1"
F 5 "Digi-key" V 6000 1300 60  0001 C CNN "Field2"
	1    7200 1300
	1    0    0    -1  
$EndComp
$Comp
L CAP C11
U 1 1 54468ECC
P 8400 1300
F 0 "C11" V 8500 1450 50  0000 C CNN
F 1 "0.1uF LO ESR" V 8600 1300 50  0000 C CNN
F 2 "SM0603" H 8400 1300 60  0001 C CNN
F 3 "" H 8400 1300 60  0001 C CNN
F 4 "C1608X7S2A104M080AB" V 6000 1300 60  0001 C CNN "Field1"
F 5 "Digi-key" V 6000 1300 60  0001 C CNN "Field2"
	1    8400 1300
	1    0    0    -1  
$EndComp
$Comp
L CAP C12
U 1 1 54468EE0
P 8800 1300
F 0 "C12" V 8900 1450 50  0000 C CNN
F 1 "10uF" V 8900 1150 50  0000 C CNN
F 2 "SM0402" H 8800 1300 60  0001 C CNN
F 3 "" H 8800 1300 60  0001 C CNN
	1    8800 1300
	1    0    0    -1  
$EndComp
$Comp
L GND #PWR031
U 1 1 54469294
P 6000 1650
F 0 "#PWR031" H 6000 1650 30  0001 C CNN
F 1 "GND" H 6000 1580 30  0001 C CNN
F 2 "" H 6000 1650 60  0001 C CNN
F 3 "" H 6000 1650 60  0001 C CNN
	1    6000 1650
	1    0    0    -1  
$EndComp
$Comp
L +3.3V #PWR032
U 1 1 544693D3
P 6000 950
F 0 "#PWR032" H 6000 910 30  0001 C CNN
F 1 "+3.3V" H 6000 1060 30  0000 C CNN
F 2 "" H 6000 950 60  0001 C CNN
F 3 "" H 6000 950 60  0001 C CNN
	1    6000 950 
	1    0    0    -1  
$EndComp
$Comp
L GND #PWR033
U 1 1 5446942C
P 7550 4100
F 0 "#PWR033" H 7550 4100 30  0001 C CNN
F 1 "GND" H 7550 4030 30  0001 C CNN
F 2 "" H 7550 4100 60  0001 C CNN
F 3 "" H 7550 4100 60  0001 C CNN
	1    7550 4100
	1    0    0    -1  
$EndComp
$Comp
L R R13
U 1 1 54469435
P 4000 3600
F 0 "R13" V 4080 3600 50  0000 C CNN
F 1 "100" V 4000 3600 50  0000 C CNN
F 2 "SM0402" H 4000 3600 60  0001 C CNN
F 3 "" H 4000 3600 60  0001 C CNN
	1    4000 3600
	-1   0    0    1   
$EndComp
$Comp
L CAP C17
U 1 1 544697B0
P 650 3700
F 0 "C17" V 750 3850 50  0000 C CNN
F 1 "0.1uF" V 750 3550 50  0000 C CNN
F 2 "SM0402" H 650 3700 60  0001 C CNN
F 3 "" H 650 3700 60  0001 C CNN
	1    650  3700
	1    0    0    -1  
$EndComp
$Comp
L CAP C15
U 1 1 544697B6
P 1650 3050
F 0 "C15" V 1750 3200 50  0000 C CNN
F 1 "10uF" V 1750 2900 50  0000 C CNN
F 2 "SM0402" H 1650 3050 60  0001 C CNN
F 3 "" H 1650 3050 60  0001 C CNN
	1    1650 3050
	1    0    0    -1  
$EndComp
$Comp
L CAP C16
U 1 1 544697BC
P 2050 3050
F 0 "C16" V 2150 3200 50  0000 C CNN
F 1 "0.1uF" V 2150 2900 50  0000 C CNN
F 2 "SM0402" H 2050 3050 60  0001 C CNN
F 3 "" H 2050 3050 60  0001 C CNN
	1    2050 3050
	1    0    0    -1  
$EndComp
$Comp
L CAP C18
U 1 1 544697C2
P 3050 3800
F 0 "C18" V 3150 3950 50  0000 C CNN
F 1 "10uF" V 3150 3650 50  0000 C CNN
F 2 "SM0402" H 3050 3800 60  0001 C CNN
F 3 "" H 3050 3800 60  0001 C CNN
	1    3050 3800
	1    0    0    -1  
$EndComp
$Comp
L CAP C19
U 1 1 544697C8
P 3400 3800
F 0 "C19" V 3500 3950 50  0000 C CNN
F 1 "0.1uF" V 3500 3650 50  0000 C CNN
F 2 "SM0402" H 3400 3800 60  0001 C CNN
F 3 "" H 3400 3800 60  0001 C CNN
	1    3400 3800
	1    0    0    -1  
$EndComp
$Comp
L +3.3V #PWR034
U 1 1 544697CE
P 1850 2800
F 0 "#PWR034" H 1850 2760 30  0001 C CNN
F 1 "+3.3V" H 1850 2910 30  0000 C CNN
F 2 "" H 1850 2800 60  0001 C CNN
F 3 "" H 1850 2800 60  0001 C CNN
	1    1850 2800
	1    0    0    -1  
$EndComp
$Comp
L GND #PWR035
U 1 1 544697D7
P 1850 3450
F 0 "#PWR035" H 1850 3450 30  0001 C CNN
F 1 "GND" H 1850 3380 30  0001 C CNN
F 2 "" H 1850 3450 60  0001 C CNN
F 3 "" H 1850 3450 60  0001 C CNN
	1    1850 3450
	1    0    0    -1  
$EndComp
Text HLabel 1100 4250 0    60   Input ~ 0
Tx_Disable
Text HLabel 1100 4700 0    60   Output ~ 0
LOS
Text HLabel 2650 4450 2    60   Input ~ 0
SCL
Text HLabel 2650 4550 2    60   BiDi ~ 0
SDA
Text HLabel 2650 4700 2    60   Output ~ 0
Present
$Comp
L R L2
U 1 1 5446BA72
P 2400 2800
F 0 "L2" V 2480 2800 50  0000 C CNN
F 1 "0" V 2400 2800 50  0000 C CNN
F 2 "SM0402" H 2400 2800 60  0001 C CNN
F 3 "" H 2400 2800 60  0001 C CNN
	1    2400 2800
	0    -1   -1   0   
$EndComp
$Comp
L R L1
U 1 1 5446BB67
P 1300 2800
F 0 "L1" V 1380 2800 50  0000 C CNN
F 1 "0" V 1300 2800 50  0000 C CNN
F 2 "SM0402" H 1300 2800 60  0001 C CNN
F 3 "" H 1300 2800 60  0001 C CNN
	1    1300 2800
	0    -1   -1   0   
$EndComp
Text HLabel 550  5050 2    60   Input ~ 0
Data_out[1..0]
NoConn ~ 1100 4600
NoConn ~ 1100 4150
$Comp
L LMK00304 U6
U 1 1 546C7B7E
P 8700 3300
F 0 "U6" H 9400 2300 60  0000 C CNN
F 1 "LMK00304" V 8700 3300 60  0000 C CNN
F 2 "lmk00304" H 8700 3300 60  0001 C CNN
F 3 "" H 8700 3300 60  0001 C CNN
F 4 "LMK00304SQ/NOPBCT-ND	" H 8700 3300 60  0001 C CNN "Field1"
	1    8700 3300
	1    0    0    -1  
$EndComp
NoConn ~ 9800 3950
Wire Wire Line
	8500 4500 8500 4600
Wire Wire Line
	8500 4600 8900 4600
Connection ~ 8700 4600
Wire Wire Line
	8900 4600 8900 4500
Wire Wire Line
	8800 4500 8800 4600
Connection ~ 8800 4600
Wire Wire Line
	8600 4500 8600 4600
Connection ~ 8600 4600
Wire Wire Line
	7650 4000 7550 4000
Wire Wire Line
	7550 4000 7550 4100
NoConn ~ 7650 3700
$Comp
L GND #PWR036
U 1 1 546C7FB3
P 7550 3700
F 0 "#PWR036" H 7550 3700 30  0001 C CNN
F 1 "GND" H 7550 3630 30  0001 C CNN
F 2 "" H 7550 3700 60  0001 C CNN
F 3 "" H 7550 3700 60  0001 C CNN
	1    7550 3700
	1    0    0    -1  
$EndComp
Wire Wire Line
	7550 3600 7550 3700
Wire Wire Line
	7550 3600 7650 3600
$Comp
L GND #PWR037
U 1 1 546C805B
P 8700 4650
F 0 "#PWR037" H 8700 4650 30  0001 C CNN
F 1 "GND" H 8700 4580 30  0001 C CNN
F 2 "" H 8700 4650 60  0001 C CNN
F 3 "" H 8700 4650 60  0001 C CNN
	1    8700 4650
	1    0    0    -1  
$EndComp
Wire Wire Line
	8700 4500 8700 4650
$Comp
L GND #PWR038
U 1 1 546C80E1
P 7550 2900
F 0 "#PWR038" H 7550 2900 30  0001 C CNN
F 1 "GND" H 7550 2830 30  0001 C CNN
F 2 "" H 7550 2900 60  0001 C CNN
F 3 "" H 7550 2900 60  0001 C CNN
	1    7550 2900
	1    0    0    -1  
$EndComp
Wire Wire Line
	7550 2700 7550 2900
Wire Wire Line
	7550 2800 7650 2800
Wire Wire Line
	7550 2700 7650 2700
Connection ~ 7550 2800
$Comp
L CAP C10
U 1 1 546C816B
P 8000 1300
F 0 "C10" V 8100 1450 50  0000 C CNN
F 1 "0.1uF LO ESR" V 8200 1300 50  0000 C CNN
F 2 "SM0603" H 8000 1300 60  0001 C CNN
F 3 "" H 8000 1300 60  0001 C CNN
F 4 "C1608X7S2A104M080AB" V 6000 1300 60  0001 C CNN "Field1"
F 5 "Digi-key" V 6000 1300 60  0001 C CNN "Field2"
	1    8000 1300
	1    0    0    -1  
$EndComp
$Comp
L CAP C9
U 1 1 546C8171
P 7600 1300
F 0 "C9" V 7700 1450 50  0000 C CNN
F 1 "0.1uF LO ESR" V 7800 1300 50  0000 C CNN
F 2 "SM0603" H 7600 1300 60  0001 C CNN
F 3 "" H 7600 1300 60  0001 C CNN
F 4 "C1608X7S2A104M080AB" V 6000 1300 60  0001 C CNN "Field1"
F 5 "Digi-key" V 6000 1300 60  0001 C CNN "Field2"
	1    7600 1300
	1    0    0    -1  
$EndComp
$Comp
L CAP C5
U 1 1 546C818B
P 6000 1300
F 0 "C5" V 6100 1450 50  0000 C CNN
F 1 "0.1uF LO ESR" V 6200 1300 50  0000 C CNN
F 2 "SM0603" H 6000 1300 60  0001 C CNN
F 3 "" H 6000 1300 60  0001 C CNN
F 4 "C1608X7S2A104M080AB" V 6000 1300 60  0001 C CNN "Field1"
F 5 "Digi-key" V 6000 1300 60  0001 C CNN "Field2"
	1    6000 1300
	1    0    0    -1  
$EndComp
$Comp
L CAP C7
U 1 1 546C8191
P 6800 1300
F 0 "C7" V 6900 1450 50  0000 C CNN
F 1 "0.1uF LO ESR" V 7000 1300 50  0000 C CNN
F 2 "SM0603" H 6800 1300 60  0001 C CNN
F 3 "" H 6800 1300 60  0001 C CNN
F 4 "C1608X7S2A104M080AB" V 6000 1300 60  0001 C CNN "Field1"
F 5 "Digi-key" V 6000 1300 60  0001 C CNN "Field2"
	1    6800 1300
	1    0    0    -1  
$EndComp
$Comp
L CAP C6
U 1 1 546C8197
P 6400 1300
F 0 "C6" V 6500 1450 50  0000 C CNN
F 1 "0.1uF LO ESR" V 6600 1300 50  0000 C CNN
F 2 "SM0603" H 6400 1300 60  0001 C CNN
F 3 "" H 6400 1300 60  0001 C CNN
F 4 "C1608X7S2A104M080AB" V 6000 1300 60  0001 C CNN "Field1"
F 5 "Digi-key" V 6000 1300 60  0001 C CNN "Field2"
	1    6400 1300
	1    0    0    -1  
$EndComp
Wire Wire Line
	6000 950  6000 1050
Wire Wire Line
	8800 1050 8800 1000
Wire Wire Line
	6000 1000 9000 1000
Connection ~ 6000 1000
Wire Wire Line
	6000 1550 6000 1650
Wire Wire Line
	8800 1550 8800 1600
Wire Wire Line
	8800 1600 6000 1600
Connection ~ 6000 1600
Wire Wire Line
	6400 1000 6400 1050
Connection ~ 6400 1000
Wire Wire Line
	6400 1550 6400 1600
Connection ~ 6400 1600
Wire Wire Line
	6800 1550 6800 1600
Connection ~ 6800 1600
Wire Wire Line
	6800 1050 6800 1000
Connection ~ 6800 1000
Wire Wire Line
	7200 1050 7200 1000
Connection ~ 7200 1000
Wire Wire Line
	7200 1550 7200 1600
Connection ~ 7200 1600
Wire Wire Line
	7600 1050 7600 1000
Connection ~ 7600 1000
Wire Wire Line
	7600 1550 7600 1600
Connection ~ 7600 1600
Wire Wire Line
	8000 1050 8000 1000
Connection ~ 8000 1000
Wire Wire Line
	8000 1550 8000 1600
Connection ~ 8000 1600
Wire Wire Line
	8400 1050 8400 1000
Connection ~ 8400 1000
Wire Wire Line
	8400 1550 8400 1600
Connection ~ 8400 1600
Wire Wire Line
	9000 1000 9000 2100
Connection ~ 8800 1000
Wire Wire Line
	8400 2100 8400 2000
Wire Wire Line
	7650 2000 9000 2000
Connection ~ 9000 2000
Wire Wire Line
	8900 2100 8900 2000
Connection ~ 8900 2000
Wire Wire Line
	8800 2100 8800 2000
Connection ~ 8800 2000
Wire Wire Line
	8700 2100 8700 2000
Connection ~ 8700 2000
Wire Wire Line
	8600 2100 8600 2000
Connection ~ 8600 2000
Wire Wire Line
	8500 2100 8500 2000
Connection ~ 8500 2000
Wire Wire Line
	7650 2000 7650 2600
Connection ~ 8400 2000
Wire Wire Line
	1850 3450 1850 3300
$Comp
L GND #PWR039
U 1 1 546EBEB9
P 650 4000
F 0 "#PWR039" H 650 4000 30  0001 C CNN
F 1 "GND" H 650 3930 30  0001 C CNN
F 2 "" H 650 4000 60  0001 C CNN
F 3 "" H 650 4000 60  0001 C CNN
	1    650  4000
	1    0    0    -1  
$EndComp
Wire Wire Line
	650  3950 650  4000
$Comp
L GND #PWR040
U 1 1 5480111B
P 3400 4100
F 0 "#PWR040" H 3400 4100 30  0001 C CNN
F 1 "GND" H 3400 4030 30  0001 C CNN
F 2 "" H 3400 4100 60  0000 C CNN
F 3 "" H 3400 4100 60  0000 C CNN
	1    3400 4100
	1    0    0    -1  
$EndComp
Wire Wire Line
	3400 4050 3400 4100
$Comp
L R R100
U 1 1 548A1EA6
P 350 4400
F 0 "R100" V 430 4400 50  0000 C CNN
F 1 "100" V 350 4400 50  0000 C CNN
F 2 "SM0402" H 350 4400 60  0001 C CNN
F 3 "" H 350 4400 60  0000 C CNN
	1    350  4400
	1    0    0    -1  
$EndComp
Wire Wire Line
	350  4150 650  4150
Wire Wire Line
	650  4150 650  4350
Wire Wire Line
	350  4650 650  4650
Wire Wire Line
	650  4650 650  4450
$Comp
L SFP_CAGE J5
U 1 1 565DDB78
P 1850 5650
F 0 "J5" H 2800 5650 60  0000 C CNN
F 1 "SFP_CAGE" H 1850 6050 60  0000 C CNN
F 2 "" H 1850 5650 60  0000 C CNN
F 3 "" H 1850 5650 60  0000 C CNN
F 4 "A120615-ND" H 1850 5650 60  0001 C CNN "Part #"
	1    1850 5650
	1    0    0    -1  
$EndComp
$EndSCHEMATC
