EESchema Schematic File Version 2
LIBS:sn65hvd3083edgsr
LIBS:conn
LIBS:power
LIBS:pspice
LIBS:zl40216
LIBS:sfp
LIBS:FIN1108
LIBS:sn65lvds389
LIBS:max5825baup
LIBS:tps72301dbvr
LIBS:ina195a
LIBS:tps78630kttt
LIBS:tps73501drbt
LIBS:lt3015eq
LIBS:lt1086cm-3
LIBS:tps72012drvt
LIBS:ina202a
LIBS:transistors
LIBS:2sk3019
LIBS:sn74hc05d
LIBS:ad7998
LIBS:ao3401a
LIBS:opa703
LIBS:6slx45fgg484pkg
LIBS:ERM8-RA
LIBS:cdclvd1204
LIBS:sy89835u
LIBS:zl40212
LIBS:opa4703ea
LIBS:tps73201qdbvrq1
LIBS:m25p32
LIBS:bav99
LIBS:si590
LIBS:iso7242c
LIBS:lmk00304
LIBS:pins_14x2
LIBS:ds18b20u
LIBS:2x14_conn
LIBS:led
LIBS:LogicBoard-cache
EELAYER 24 0
EELAYER END
$Descr A4 11693 8268
encoding utf-8
Sheet 22 23
Title ""
Date "1 dec 2015"
Rev ""
Comp ""
Comment1 ""
Comment2 ""
Comment3 ""
Comment4 ""
$EndDescr
Wire Wire Line
	2750 1150 2750 1200
Connection ~ 2050 1700
Wire Wire Line
	2050 1700 2050 1800
Connection ~ 2250 1700
Wire Wire Line
	2250 1700 2250 1800
Connection ~ 2450 1700
Wire Wire Line
	2450 1700 2450 1800
Connection ~ 1750 1700
Wire Wire Line
	1750 1700 1750 1800
Connection ~ 1550 1700
Wire Wire Line
	1550 1700 2550 1700
Wire Wire Line
	2550 1700 2550 1800
Connection ~ 4200 1900
Wire Wire Line
	4600 1900 4600 1800
Wire Wire Line
	2750 1900 4600 1900
Connection ~ 3400 1900
Wire Wire Line
	3400 1800 3400 1900
Wire Wire Line
	2750 1900 2750 1950
Wire Wire Line
	4200 1900 4200 1800
Connection ~ 3400 1200
Wire Wire Line
	3400 1200 3400 1300
Connection ~ 2750 1200
Wire Wire Line
	4200 1300 4200 1200
Wire Wire Line
	3800 1200 3800 1300
Connection ~ 3800 1200
Wire Wire Line
	3000 1200 3000 1300
Connection ~ 3000 1200
Wire Wire Line
	3000 1800 3000 1900
Connection ~ 3000 1900
Wire Wire Line
	3800 1800 3800 1900
Connection ~ 3800 1900
Wire Wire Line
	4600 1200 4600 1300
Connection ~ 4200 1200
Wire Wire Line
	1550 1200 4600 1200
Wire Wire Line
	1550 1200 1550 1800
Wire Wire Line
	1650 1800 1650 1700
Connection ~ 1650 1700
Wire Wire Line
	1850 1800 1850 1700
Connection ~ 1850 1700
Wire Wire Line
	2350 1800 2350 1700
Connection ~ 2350 1700
Wire Wire Line
	2150 1800 2150 1700
Connection ~ 2150 1700
Wire Wire Line
	1950 1800 1950 1700
Connection ~ 1950 1700
NoConn ~ 10250 3800
NoConn ~ 10150 3800
NoConn ~ 9950 3800
NoConn ~ 9850 3800
NoConn ~ 9750 3800
NoConn ~ 9350 3800
NoConn ~ 9150 3800
NoConn ~ 9050 3800
NoConn ~ 8950 3800
NoConn ~ 8850 3800
NoConn ~ 8750 3800
NoConn ~ 8650 3800
NoConn ~ 8550 3800
NoConn ~ 8350 3800
NoConn ~ 8150 3800
NoConn ~ 7950 3800
NoConn ~ 7850 3800
NoConn ~ 7750 3800
NoConn ~ 7550 3800
NoConn ~ 7450 3800
NoConn ~ 7350 3800
NoConn ~ 7150 3800
NoConn ~ 6950 3800
NoConn ~ 6850 3800
NoConn ~ 6750 3800
NoConn ~ 6650 3800
NoConn ~ 6550 3800
NoConn ~ 6450 3800
NoConn ~ 6350 3800
NoConn ~ 6250 3800
NoConn ~ 6150 3800
NoConn ~ 6050 3800
NoConn ~ 5750 3800
NoConn ~ 5550 3800
NoConn ~ 5350 3800
NoConn ~ 4950 3800
NoConn ~ 4650 3800
NoConn ~ 4550 3800
NoConn ~ 3850 3800
NoConn ~ 3750 3800
NoConn ~ 3650 3800
NoConn ~ 3550 3800
NoConn ~ 3450 3800
NoConn ~ 3350 3800
NoConn ~ 3250 3800
NoConn ~ 3150 3800
NoConn ~ 3050 3800
NoConn ~ 2950 3800
NoConn ~ 2850 3800
NoConn ~ 2750 3800
NoConn ~ 2650 3800
NoConn ~ 2550 3800
NoConn ~ 2450 3800
NoConn ~ 2350 3800
NoConn ~ 2250 3800
NoConn ~ 2150 3800
NoConn ~ 2050 3800
NoConn ~ 1950 3800
$Comp
L C C42
U 1 1 5467E719
P 4600 1550
F 0 "C42" V 4700 1700 50  0000 C CNN
F 1 "0.47uF LO ESR" V 4800 1500 50  0000 C CNN
F 2 "SM0402" H 4600 1550 60  0001 C CNN
F 3 "" H 4600 1550 60  0001 C CNN
F 4 "GRM155R60J474KE19D" V 8650 1700 60  0001 C CNN "Field1"
	1    4600 1550
	1    0    0    -1  
$EndComp
$Comp
L GND #PWR0139
U 1 1 5467E70A
P 2750 1950
F 0 "#PWR0139" H 2750 1950 30  0001 C CNN
F 1 "GND" H 2750 1880 30  0001 C CNN
F 2 "" H 2750 1950 60  0001 C CNN
F 3 "" H 2750 1950 60  0001 C CNN
	1    2750 1950
	1    0    0    -1  
$EndComp
$Comp
L C C40
U 1 1 5467E709
P 3800 1550
F 0 "C40" V 3900 1700 50  0000 C CNN
F 1 "0.47uF LO ESR" V 4000 1500 50  0000 C CNN
F 2 "SM0402" H 3800 1550 60  0001 C CNN
F 3 "" H 3800 1550 60  0001 C CNN
F 4 "GRM155R60J474KE19D" V 8650 1700 60  0001 C CNN "Field1"
	1    3800 1550
	1    0    0    -1  
$EndComp
$Comp
L C C41
U 1 1 5467E708
P 4200 1550
F 0 "C41" V 4300 1700 50  0000 C CNN
F 1 "0.47uF LO ESR" V 4400 1500 50  0000 C CNN
F 2 "SM0402" H 4200 1550 60  0001 C CNN
F 3 "" H 4200 1550 60  0001 C CNN
F 4 "GRM155R60J474KE19D" V 8650 1700 60  0001 C CNN "Field1"
	1    4200 1550
	1    0    0    -1  
$EndComp
$Comp
L C C39
U 1 1 5467E707
P 3400 1550
F 0 "C39" V 3500 1700 50  0000 C CNN
F 1 "4.7uF LO ESR" V 3600 1500 50  0000 C CNN
F 2 "SM0805" H 3400 1550 60  0001 C CNN
F 3 "" H 3400 1550 60  0001 C CNN
F 4 "LMK212B7475KG-T" V 7850 1700 60  0001 C CNN "Field1"
	1    3400 1550
	1    0    0    -1  
$EndComp
$Comp
L C C38
U 1 1 5467E706
P 3000 1550
F 0 "C38" V 3100 1700 50  0000 C CNN
F 1 "100uF LO ESR" V 3200 1500 50  0000 C CNN
F 2 "SM1210" H 3000 1550 60  0001 C CNN
F 3 "" H 3000 1550 60  0001 C CNN
F 4 "GRM32ER60J107ME20L" V 7450 1700 60  0001 C CNN "Field1"
	1    3000 1550
	1    0    0    -1  
$EndComp
$Comp
L +3.3V #PWR0140
U 1 1 5467E705
P 2750 1150
F 0 "#PWR0140" H 2750 1110 30  0001 C CNN
F 1 "+3.3V" H 2750 1260 30  0000 C CNN
F 2 "" H 2750 1150 60  0001 C CNN
F 3 "" H 2750 1150 60  0001 C CNN
	1    2750 1150
	1    0    0    -1  
$EndComp
Text HLabel 8450 3900 3    60   Input ~ 0
SC_IN
Text HLabel 8250 3900 3    60   Output ~ 0
SC_OUT
Text HLabel 9450 3900 3    60   Input ~ 0
_SC_PRESENT
Text HLabel 8050 3900 3    60   Output ~ 0
SC_OE
Text HLabel 5450 4700 3    60   Output ~ 0
DB_SCL
Text HLabel 5250 4700 3    60   BiDi ~ 0
DB_SDA
Text HLabel 5050 4700 3    60   Input ~ 0
DB_INT
Wire Wire Line
	9450 3900 9450 3800
Wire Wire Line
	8450 3800 8450 3900
Wire Wire Line
	8250 3800 8250 3900
Wire Wire Line
	8050 3800 8050 3900
Wire Wire Line
	7050 4000 7050 3800
Wire Wire Line
	7250 4000 7250 3800
Wire Wire Line
	5850 4000 5850 3800
Wire Wire Line
	7650 4000 7650 3800
Wire Wire Line
	5650 4000 5650 3800
Text HLabel 7050 4000 3    60   Output ~ 0
SFP_SCL
Text HLabel 7250 4000 3    60   BiDi ~ 0
SFP_SDA
Text HLabel 5850 4000 3    60   Input ~ 0
Present
Text HLabel 7650 4000 3    60   Output ~ 0
Tx_Disable
Text HLabel 5650 4000 3    60   Input ~ 0
LOS
$Comp
L 6SLX45FGG484PKG U16
U 3 1 546954D0
P 3150 3300
F 0 "U16" H 4350 5050 60  0000 C CNN
F 1 "6SLX45FGG484PKG" H 3200 5050 60  0000 C CNN
F 2 "XC6SLX45" H 3150 3300 60  0001 C CNN
F 3 "" H 3150 3300 60  0001 C CNN
	3    3150 3300
	0    -1   -1   0   
$EndComp
NoConn ~ 5150 3800
NoConn ~ 4750 3800
Wire Wire Line
	5050 4700 5050 3800
Wire Wire Line
	5250 4700 5250 3800
Wire Wire Line
	5450 4700 5450 3800
NoConn ~ 4450 3800
NoConn ~ 4350 3800
NoConn ~ 4250 3800
NoConn ~ 4150 3800
NoConn ~ 4050 3800
NoConn ~ 3950 3800
NoConn ~ 1850 3800
NoConn ~ 1750 3800
NoConn ~ 1650 3800
NoConn ~ 1550 3800
NoConn ~ 10050 3800
NoConn ~ 9650 3800
NoConn ~ 9550 3800
NoConn ~ 9250 3800
NoConn ~ 5950 3800
NoConn ~ 4850 3800
$EndSCHEMATC
