PCBNEW-LibModule-V1  Sun 23 Nov 2014 09:24:16 PM EST
# encoding utf-8
Units mm
$INDEX
iso7242c
$EndINDEX
$MODULE iso7242c
Po 0 0 0 15 547296C5 00000000 ~~
Li iso7242c
Sc 0
AR 
Op 0 0 0
T0 0.0254 -6.5786 1 1 0 0.15 N V 21 N "iso7242c"
T1 -0.0254 6.4008 1 1 0 0.15 N V 21 N "VAL**"
DC -2.7686 -4.4958 -2.3114 -4.2672 0.15 21
DS -3.75 -5.25 3.75 -5.25 0.15 21
DS -3.75 5.25 3.75 5.25 0.15 21
$PAD
Sh "16" R 2 0.6 0 0 0
Dr 0 0 0
At SMD N 00888000
Ne 0 ""
Po 4.65 -4.445
$EndPAD
$PAD
Sh "15" R 2 0.6 0 0 0
Dr 0 0 0
At SMD N 00888000
Ne 0 ""
Po 4.65 -3.175
$EndPAD
$PAD
Sh "14" R 2 0.6 0 0 0
Dr 0 0 0
At SMD N 00888000
Ne 0 ""
Po 4.65 -1.905
$EndPAD
$PAD
Sh "13" R 2 0.6 0 0 0
Dr 0 0 0
At SMD N 00888000
Ne 0 ""
Po 4.65 -0.635
$EndPAD
$PAD
Sh "12" R 2 0.6 0 0 0
Dr 0 0 0
At SMD N 00888000
Ne 0 ""
Po 4.65 0.635
$EndPAD
$PAD
Sh "11" R 2 0.6 0 0 0
Dr 0 0 0
At SMD N 00888000
Ne 0 ""
Po 4.65 1.905
$EndPAD
$PAD
Sh "10" R 2 0.6 0 0 0
Dr 0 0 0
At SMD N 00888000
Ne 0 ""
Po 4.65 3.175
$EndPAD
$PAD
Sh "9" R 2 0.6 0 0 0
Dr 0 0 0
At SMD N 00888000
Ne 0 ""
Po 4.65 4.445
$EndPAD
$PAD
Sh "8" R 2 0.6 0 0 0
Dr 0 0 0
At SMD N 00888000
Ne 0 ""
Po -4.65 4.445
$EndPAD
$PAD
Sh "7" R 2 0.6 0 0 0
Dr 0 0 0
At SMD N 00888000
Ne 0 ""
Po -4.65 3.175
$EndPAD
$PAD
Sh "6" R 2 0.6 0 0 0
Dr 0 0 0
At SMD N 00888000
Ne 0 ""
Po -4.65 1.905
$EndPAD
$PAD
Sh "5" R 2 0.6 0 0 0
Dr 0 0 0
At SMD N 00888000
Ne 0 ""
Po -4.65 0.635
$EndPAD
$PAD
Sh "4" R 2 0.6 0 0 0
Dr 0 0 0
At SMD N 00888000
Ne 0 ""
Po -4.65 -0.635
$EndPAD
$PAD
Sh "3" R 2 0.6 0 0 0
Dr 0 0 0
At SMD N 00888000
Ne 0 ""
Po -4.65 -1.905
$EndPAD
$PAD
Sh "2" R 2 0.6 0 0 0
Dr 0 0 0
At SMD N 00888000
Ne 0 ""
Po -4.65 -3.175
$EndPAD
$PAD
Sh "1" R 2 0.6 0 0 0
Dr 0 0 0
At SMD N 00888000
Ne 0 ""
Po -4.65 -4.445
$EndPAD
$EndMODULE iso7242c
$EndLIBRARY
