PCBNEW-LibModule-V1  Mon 25 Aug 2014 09:39:32 AM EDT
# encoding utf-8
Units mm
$INDEX
Si590
$EndINDEX
$MODULE Si590
Po 0 0 0 15 53FB3C8C 00000000 ~~
Li Si590
Sc 0
AR 
Op 0 0 0
T0 0 0 1 1 0 0.15 N V 21 N "Si590"
T1 0 -4.953 1 1 0 0.15 N V 21 N "VAL**"
DC -3.683 3.81 -3.7338 3.8862 0.15 21
DS -3.5 2.5 -3.5 -2.5 0.15 21
DS -3.5 -2.5 3.5 -2.5 0.15 21
DS 3.5 -2.5 3.5 2.5 0.15 21
DS 3.5 2.5 -3.5 2.5 0.15 21
$PAD
Sh "1" R 1.7 2.54 0 0 0
Dr 0 0 0
At SMD N 00888000
Ne 0 ""
Po -2.54 2.27
$EndPAD
$PAD
Sh "2" R 1.7 2.54 0 0 0
Dr 0 0 0
At SMD N 00888000
Ne 0 ""
Po 0 2.27
$EndPAD
$PAD
Sh "3" R 1.7 2.54 0 0 0
Dr 0 0 0
At SMD N 00888000
Ne 0 ""
Po 2.54 2.27
$EndPAD
$PAD
Sh "4" R 1.7 2.54 0 0 0
Dr 0 0 0
At SMD N 00888000
Ne 0 ""
Po 2.54 -2.27
$EndPAD
$PAD
Sh "5" R 1.7 2.54 0 0 0
Dr 0 0 0
At SMD N 00888000
Ne 0 ""
Po 0 -2.27
$EndPAD
$PAD
Sh "6" R 1.7 2.54 0 0 0
Dr 0 0 0
At SMD N 00888000
Ne 0 ""
Po -2.54 -2.27
$EndPAD
$EndMODULE Si590
$EndLIBRARY
