PCBNEW-LibModule-V1  Sun 23 Nov 2014 09:49:30 PM EST
# encoding utf-8
Units mm
$INDEX
sn65hvd3083edgsr
$EndINDEX
$MODULE sn65hvd3083edgsr
Po 0 0 0 15 54729CB3 00000000 ~~
Li sn65hvd3083edgsr
Sc 0
AR 
Op 0 0 0
T0 -0.0254 7.62 1 1 0 0.15 N V 21 N "sn65hvd3083edgsr"
T1 0.0254 -7.1882 1 1 0 0.15 N V 21 N "VAL**"
DC -1.1176 0.9906 -0.9652 0.762 0.15 21
DS 1.25 1.55 1.55 1.55 0.15 21
DS -1.55 1.55 -1.25 1.55 0.15 21
DS -1.55 -1.55 -1.25 -1.55 0.15 21
DS 1.55 -1.55 1.55 1.55 0.15 21
DS -1.55 -1.55 -1.55 1.55 0.15 21
DS 1.25 -1.55 1.55 -1.55 0.15 21
$PAD
Sh "2" R 0.3 1.45 0 0 0
Dr 0 0 0
At SMD N 00888000
Ne 0 ""
Po -0.5 2.2
$EndPAD
$PAD
Sh "4" R 0.3 1.45 0 0 0
Dr 0 0 0
At SMD N 00888000
Ne 0 ""
Po 0.5 2.2
$EndPAD
$PAD
Sh "5" R 0.3 1.45 0 0 0
Dr 0 0 0
At SMD N 00888000
Ne 0 ""
Po 1 2.2
$EndPAD
$PAD
Sh "3" R 0.3 1.45 0 0 0
Dr 0 0 0
At SMD N 00888000
Ne 0 ""
Po 0 2.2
$EndPAD
$PAD
Sh "8" R 0.3 1.45 0 0 0
Dr 0 0 0
At SMD N 00888000
Ne 0 ""
Po 0 -2.2
$EndPAD
$PAD
Sh "6" R 0.3 1.45 0 0 0
Dr 0 0 0
At SMD N 00888000
Ne 0 ""
Po 1 -2.2
$EndPAD
$PAD
Sh "7" R 0.3 1.45 0 0 0
Dr 0 0 0
At SMD N 00888000
Ne 0 ""
Po 0.5 -2.2
$EndPAD
$PAD
Sh "9" R 0.3 1.45 0 0 0
Dr 0 0 0
At SMD N 00888000
Ne 0 ""
Po -0.5 -2.2
$EndPAD
$PAD
Sh "10" R 0.3 1.45 0 0 0
Dr 0 0 0
At SMD N 00888000
Ne 0 ""
Po -1 -2.2
$EndPAD
$PAD
Sh "1" R 0.3 1.45 0 0 0
Dr 0 0 0
At SMD N 00888000
Ne 0 ""
Po -1 2.2
$EndPAD
$EndMODULE sn65hvd3083edgsr
$EndLIBRARY
