EESchema Schematic File Version 2
LIBS:sn65hvd3083edgsr
LIBS:conn
LIBS:power
LIBS:pspice
LIBS:zl40216
LIBS:sfp
LIBS:FIN1108
LIBS:sn65lvds389
LIBS:max5825baup
LIBS:tps72301dbvr
LIBS:ina195a
LIBS:tps78630kttt
LIBS:tps73501drbt
LIBS:lt3015eq
LIBS:lt1086cm-3
LIBS:tps72012drvt
LIBS:ina202a
LIBS:transistors
LIBS:2sk3019
LIBS:sn74hc05d
LIBS:ad7998
LIBS:ao3401a
LIBS:opa703
LIBS:6slx45fgg484pkg
LIBS:ERM8-RA
LIBS:cdclvd1204
LIBS:sy89835u
LIBS:zl40212
LIBS:opa4703ea
LIBS:tps73201qdbvrq1
LIBS:m25p32
LIBS:bav99
LIBS:si590
LIBS:iso7242c
LIBS:lmk00304
LIBS:pins_14x2
LIBS:ds18b20u
LIBS:2x14_conn
LIBS:led
LIBS:LogicBoard-cache
EELAYER 24 0
EELAYER END
$Descr A4 11693 8268
encoding utf-8
Sheet 21 23
Title ""
Date "1 dec 2015"
Rev ""
Comp ""
Comment1 ""
Comment2 ""
Comment3 ""
Comment4 ""
$EndDescr
Wire Wire Line
	2550 4650 2550 3600
Connection ~ 2550 1000
Wire Wire Line
	2550 1000 2550 1600
Connection ~ 2350 1000
Wire Wire Line
	2350 1000 2350 1600
Connection ~ 2150 1000
Wire Wire Line
	2150 1000 2150 1600
Connection ~ 1950 1000
Wire Wire Line
	1950 1000 1950 1600
Connection ~ 1750 1000
Wire Wire Line
	1750 1600 1750 1000
Connection ~ 4900 1000
Wire Wire Line
	5300 1000 5300 1100
Connection ~ 4100 1700
Wire Wire Line
	4100 1700 4100 1600
Wire Wire Line
	3450 1750 3450 1700
Wire Wire Line
	4900 1700 4900 1600
Connection ~ 4100 1000
Wire Wire Line
	4100 1000 4100 1100
Connection ~ 3450 1000
Wire Wire Line
	4900 1000 4900 1100
Wire Wire Line
	4500 1000 4500 1100
Connection ~ 4500 1000
Wire Wire Line
	3700 1000 3700 1100
Connection ~ 3700 1000
Wire Wire Line
	3700 1600 3700 1700
Connection ~ 3700 1700
Wire Wire Line
	4500 1700 4500 1600
Connection ~ 4500 1700
Wire Wire Line
	3450 1700 5300 1700
Wire Wire Line
	5300 1700 5300 1600
Connection ~ 4900 1700
Wire Wire Line
	1650 1600 1650 1000
Wire Wire Line
	1650 1000 5300 1000
Wire Wire Line
	1850 1600 1850 1000
Connection ~ 1850 1000
Wire Wire Line
	2050 1600 2050 1000
Connection ~ 2050 1000
Wire Wire Line
	2250 1600 2250 1000
Connection ~ 2250 1000
Wire Wire Line
	2450 1600 2450 1000
Connection ~ 2450 1000
Wire Wire Line
	2450 3600 2450 4650
NoConn ~ 9650 3600
NoConn ~ 9550 3600
NoConn ~ 9450 3600
NoConn ~ 9350 3600
NoConn ~ 9250 3600
NoConn ~ 9150 3600
NoConn ~ 9050 3600
NoConn ~ 8950 3600
NoConn ~ 8850 3600
NoConn ~ 8750 3600
NoConn ~ 8650 3600
NoConn ~ 8350 3600
NoConn ~ 8250 3600
NoConn ~ 8150 3600
NoConn ~ 8050 3600
NoConn ~ 7950 3600
NoConn ~ 7850 3600
NoConn ~ 6650 3600
NoConn ~ 6450 3600
NoConn ~ 6250 3600
NoConn ~ 6050 3600
NoConn ~ 5850 3600
NoConn ~ 5750 3600
NoConn ~ 5650 3600
NoConn ~ 5350 3600
NoConn ~ 5250 3600
NoConn ~ 5050 3600
NoConn ~ 4950 3600
NoConn ~ 4850 3600
NoConn ~ 4650 3600
NoConn ~ 4550 3600
NoConn ~ 4450 3600
NoConn ~ 4250 3600
NoConn ~ 4150 3600
NoConn ~ 4050 3600
NoConn ~ 3950 3600
NoConn ~ 3850 3600
NoConn ~ 3650 3600
NoConn ~ 3350 3600
NoConn ~ 3250 3600
NoConn ~ 3150 3600
NoConn ~ 3050 3600
NoConn ~ 2950 3600
NoConn ~ 2850 3600
NoConn ~ 2750 3600
NoConn ~ 2650 3600
NoConn ~ 2150 3600
NoConn ~ 2050 3600
NoConn ~ 1950 3600
NoConn ~ 1850 3600
NoConn ~ 1750 3600
NoConn ~ 1650 3600
$Comp
L C C65
U 1 1 5467E626
P 5300 1350
F 0 "C65" V 5400 1500 50  0000 C CNN
F 1 "0.47uF LO ESR" V 5550 1350 50  0000 C CNN
F 2 "SM0402" H 5300 1350 60  0001 C CNN
F 3 "" H 5300 1350 60  0001 C CNN
F 4 "GRM155R60J474KE19D" V 8650 1700 60  0001 C CNN "Field1"
	1    5300 1350
	1    0    0    -1  
$EndComp
$Comp
L GND #PWR0137
U 1 1 5467E5FC
P 3450 1750
F 0 "#PWR0137" H 3450 1750 30  0001 C CNN
F 1 "GND" H 3450 1680 30  0001 C CNN
F 2 "" H 3450 1750 60  0001 C CNN
F 3 "" H 3450 1750 60  0001 C CNN
	1    3450 1750
	1    0    0    -1  
$EndComp
$Comp
L C C63
U 1 1 5467E5FB
P 4500 1350
F 0 "C63" V 4600 1500 50  0000 C CNN
F 1 "0.47uF LO ESR" V 4700 1350 50  0000 C CNN
F 2 "SM0402" H 4500 1350 60  0001 C CNN
F 3 "" H 4500 1350 60  0001 C CNN
F 4 "GRM155R60J474KE19D" V 8650 1700 60  0001 C CNN "Field1"
	1    4500 1350
	1    0    0    -1  
$EndComp
$Comp
L C C64
U 1 1 5467E5FA
P 4900 1350
F 0 "C64" V 5000 1500 50  0000 C CNN
F 1 "0.47uF LO ESR" V 5100 1350 50  0000 C CNN
F 2 "SM0402" H 4900 1350 60  0001 C CNN
F 3 "" H 4900 1350 60  0001 C CNN
F 4 "GRM155R60J474KE19D" V 8650 1700 60  0001 C CNN "Field1"
	1    4900 1350
	1    0    0    -1  
$EndComp
$Comp
L C C62
U 1 1 5467E5F9
P 4100 1350
F 0 "C62" V 4200 1500 50  0000 C CNN
F 1 "4.7uF LO ESR" V 4300 1350 50  0000 C CNN
F 2 "SM0805" H 4100 1350 60  0001 C CNN
F 3 "" H 4100 1350 60  0001 C CNN
F 4 "LMK212B7475KG-T" V 7850 1700 60  0001 C CNN "Field1"
	1    4100 1350
	1    0    0    -1  
$EndComp
$Comp
L C C61
U 1 1 5467E5F8
P 3700 1350
F 0 "C61" V 3800 1500 50  0000 C CNN
F 1 "100uF LO ESR" V 3900 1350 50  0000 C CNN
F 2 "SM1210" H 3700 1350 60  0001 C CNN
F 3 "" H 3700 1350 60  0001 C CNN
F 4 "GRM32ER60J107ME20L" V 7450 1700 60  0001 C CNN "Field1"
	1    3700 1350
	1    0    0    -1  
$EndComp
$Comp
L +3.3V #PWR0138
U 1 1 5467E5F7
P 3450 1000
F 0 "#PWR0138" H 3450 960 30  0001 C CNN
F 1 "+3.3V" H 3450 1110 30  0000 C CNN
F 2 "" H 3450 1000 60  0001 C CNN
F 3 "" H 3450 1000 60  0001 C CNN
	1    3450 1000
	1    0    0    -1  
$EndComp
NoConn ~ 6850 3600
NoConn ~ 7050 3600
NoConn ~ 7250 3600
NoConn ~ 7450 3600
NoConn ~ 7650 3600
Text HLabel 5550 4250 3    60   Output ~ 0
EN-1V6
Wire Wire Line
	5150 3900 5150 3600
Wire Wire Line
	4350 3900 4350 3600
Entry Wire Line
	4350 3900 4450 4000
Entry Wire Line
	5050 4000 5150 3900
Text Label 5150 3900 1    60   ~ 0
TEMP1
Text Label 4350 3900 1    60   ~ 0
TEMP0
Text HLabel 5050 4300 3    60   BiDi ~ 0
TEMP[1..0]
$Comp
L 6SLX45FGG484PKG U16
U 1 1 546954CF
P 3250 3100
F 0 "U16" H 4450 4850 60  0000 C CNN
F 1 "6SLX45FGG484PKG" H 3300 4850 60  0000 C CNN
F 2 "XC6SLX45" H 3250 3100 60  0001 C CNN
F 3 "" H 3250 3100 60  0001 C CNN
	1    3250 3100
	0    -1   -1   0   
$EndComp
Wire Wire Line
	5550 3600 5550 4250
Wire Bus Line
	5050 4000 5050 4300
Wire Bus Line
	4450 4000 5050 4000
NoConn ~ 8450 3600
Wire Wire Line
	6950 3850 6950 3600
Wire Wire Line
	7150 3850 7150 3600
Wire Wire Line
	7350 3850 7350 3600
Wire Wire Line
	6150 3850 6150 3600
Wire Wire Line
	6750 3850 6750 3600
Wire Wire Line
	5950 3850 5950 3600
Wire Wire Line
	6550 3850 6550 3600
Wire Wire Line
	6350 3850 6350 3600
Text Label 5950 3850 1    60   ~ 0
TDO0
Text Label 7350 3850 1    60   ~ 0
TDO1
Text Label 6550 3850 1    60   ~ 0
TDI0
Text Label 7150 3850 1    60   ~ 0
TDI1
Text Label 6350 3850 1    60   ~ 0
TMS0
Text Label 6950 3850 1    60   ~ 0
TMS1
Text Label 6150 3850 1    60   ~ 0
TCK0
Text Label 6750 3850 1    60   ~ 0
TCK1
Text HLabel 6600 4200 0    60   Input ~ 0
TDO[1..0]
Text HLabel 6600 4300 0    60   Output ~ 0
TDI[1..0]
Text HLabel 6600 4400 0    60   Output ~ 0
TMS[1..0]
Text HLabel 6600 4500 0    60   Output ~ 0
TCK[1..0]
Text HLabel 2250 3800 3    60   Input ~ 0
TDC_P1
Text HLabel 2350 3800 3    60   Input ~ 0
TDC_N1
Text HLabel 3450 3800 3    60   Input ~ 0
TDC_P3
Text HLabel 3550 3800 3    60   Input ~ 0
TDC_N3
Wire Wire Line
	3550 3600 3550 3800
Wire Wire Line
	3450 3600 3450 3800
Wire Wire Line
	2350 3600 2350 3800
Wire Wire Line
	2250 3600 2250 3800
NoConn ~ 5450 3600
Wire Wire Line
	7550 3600 7550 4200
Wire Wire Line
	7750 3600 7750 4200
Wire Wire Line
	8550 3600 8550 4200
Text HLabel 7550 4200 3    60   Input ~ 0
TDC_TP_EN0
Text HLabel 7750 4200 3    60   Input ~ 0
TDC_TP0
Text HLabel 8550 4200 3    60   Input ~ 0
TDC_TP1
Text HLabel 2550 4650 3    60   Output ~ 0
TDC_I2C_CLK
Text HLabel 2450 4650 3    60   BiDi ~ 0
TDC_I2C_DATA
NoConn ~ 4750 3600
NoConn ~ 3750 3600
$EndSCHEMATC
