EESchema Schematic File Version 2
LIBS:sn65hvd3083edgsr
LIBS:conn
LIBS:power
LIBS:pspice
LIBS:zl40216
LIBS:sfp
LIBS:FIN1108
LIBS:sn65lvds389
LIBS:max5825baup
LIBS:tps72301dbvr
LIBS:ina195a
LIBS:tps78630kttt
LIBS:tps73501drbt
LIBS:lt3015eq
LIBS:lt1086cm-3
LIBS:tps72012drvt
LIBS:ina202a
LIBS:transistors
LIBS:2sk3019
LIBS:sn74hc05d
LIBS:ad7998
LIBS:ao3401a
LIBS:opa703
LIBS:6slx45fgg484pkg
LIBS:ERM8-RA
LIBS:cdclvd1204
LIBS:sy89835u
LIBS:zl40212
LIBS:opa4703ea
LIBS:tps73201qdbvrq1
LIBS:m25p32
LIBS:bav99
LIBS:si590
LIBS:iso7242c
LIBS:lmk00304
LIBS:pins_14x2
LIBS:ds18b20u
LIBS:2x14_conn
LIBS:led
EELAYER 27 0
EELAYER END
$Descr A4 11693 8268
encoding utf-8
Sheet 11 23
Title ""
Date "17 mar 2015"
Rev ""
Comp ""
Comment1 ""
Comment2 ""
Comment3 ""
Comment4 ""
$EndDescr
NoConn ~ 1150 1850
NoConn ~ 1050 1850
NoConn ~ 1650 1050
$Comp
L RJ45 J1
U 1 1 54418508
P 1100 1400
F 0 "J1" H 1550 1200 60  0000 C CNN
F 1 "A-2004-2-4-LPS-N-R" H 1100 1900 60  0000 C CNN
F 2 "" H 1100 1400 60  0001 C CNN
F 3 "" H 1100 1400 60  0001 C CNN
	1    1100 1400
	1    0    0    -1  
$EndComp
$Comp
L R R6
U 1 1 5441851C
P 3550 3650
F 0 "R6" V 3630 3650 50  0000 C CNN
F 1 "100" V 3550 3650 50  0000 C CNN
F 2 "" H 3550 3650 60  0001 C CNN
F 3 "" H 3550 3650 60  0001 C CNN
	1    3550 3650
	0    -1   -1   0   
$EndComp
$Comp
L R R8
U 1 1 54418577
P 2850 3950
F 0 "R8" V 2930 3950 50  0000 C CNN
F 1 "0" V 2850 3950 50  0000 C CNN
F 2 "" H 2850 3950 60  0001 C CNN
F 3 "" H 2850 3950 60  0001 C CNN
	1    2850 3950
	1    0    0    -1  
$EndComp
$Comp
L R R7
U 1 1 5441858B
P 2650 3850
F 0 "R7" V 2730 3850 50  0000 C CNN
F 1 "0" V 2650 3850 50  0000 C CNN
F 2 "" H 2650 3850 60  0001 C CNN
F 3 "" H 2650 3850 60  0001 C CNN
	1    2650 3850
	1    0    0    -1  
$EndComp
$Comp
L GND #PWR020
U 1 1 5441898A
P 8100 4750
F 0 "#PWR020" H 8100 4750 30  0001 C CNN
F 1 "GND" H 8100 4680 30  0001 C CNN
F 2 "" H 8100 4750 60  0001 C CNN
F 3 "" H 8100 4750 60  0001 C CNN
	1    8100 4750
	1    0    0    -1  
$EndComp
$Comp
L PWR_FLAG #FLG021
U 1 1 544189C5
P 1800 2050
F 0 "#FLG021" H 1800 2145 30  0001 C CNN
F 1 "PWR_FLAG" H 1800 2230 30  0000 C CNN
F 2 "" H 1800 2050 60  0001 C CNN
F 3 "" H 1800 2050 60  0001 C CNN
	1    1800 2050
	1    0    0    -1  
$EndComp
$Comp
L PWR_FLAG #FLG022
U 1 1 544189D9
P 1800 2650
F 0 "#FLG022" H 1800 2745 30  0001 C CNN
F 1 "PWR_FLAG" H 1800 2830 30  0000 C CNN
F 2 "" H 1800 2650 60  0001 C CNN
F 3 "" H 1800 2650 60  0001 C CNN
	1    1800 2650
	1    0    0    -1  
$EndComp
$Comp
L +3.3V #PWR023
U 1 1 544189ED
P 8200 2150
F 0 "#PWR023" H 8200 2110 30  0001 C CNN
F 1 "+3.3V" H 8200 2260 30  0000 C CNN
F 2 "" H 8200 2150 60  0001 C CNN
F 3 "" H 8200 2150 60  0001 C CNN
	1    8200 2150
	1    0    0    -1  
$EndComp
Text HLabel 9000 3350 2    60   Output ~ 0
SC_IN
Text HLabel 9000 3550 2    60   Input ~ 0
SC_OUT
$Comp
L C C4
U 1 1 5447163D
P 8600 2500
F 0 "C4" V 8700 2650 50  0000 C CNN
F 1 "0.1uF" V 8700 2350 50  0000 C CNN
F 2 "" H 8600 2500 60  0001 C CNN
F 3 "" H 8600 2500 60  0001 C CNN
	1    8600 2500
	1    0    0    -1  
$EndComp
$Comp
L GND #PWR024
U 1 1 54471651
P 8600 2800
F 0 "#PWR024" H 8600 2800 30  0001 C CNN
F 1 "GND" H 8600 2730 30  0001 C CNN
F 2 "" H 8600 2800 60  0001 C CNN
F 3 "" H 8600 2800 60  0001 C CNN
	1    8600 2800
	1    0    0    -1  
$EndComp
$Comp
L C C2
U 1 1 54471791
P 2100 2500
F 0 "C2" V 2200 2650 50  0000 C CNN
F 1 "0.1uF" V 2200 2350 50  0000 C CNN
F 2 "" H 2100 2500 60  0001 C CNN
F 3 "" H 2100 2500 60  0001 C CNN
	1    2100 2500
	1    0    0    -1  
$EndComp
$Comp
L C C3
U 1 1 54471921
P 2500 2500
F 0 "C3" V 2600 2650 50  0000 C CNN
F 1 "0.1uF" V 2600 2350 50  0000 C CNN
F 2 "" H 2500 2500 60  0001 C CNN
F 3 "" H 2500 2500 60  0001 C CNN
	1    2500 2500
	1    0    0    -1  
$EndComp
Text Notes 2250 4700 0    60   ~ 0
RS485 power Return
Text Notes 2500 2100 0    60   ~ 0
RS485 power supply
Wire Wire Line
	3950 3600 950  3600
Wire Wire Line
	3300 3600 3300 3650
Wire Wire Line
	3950 3700 2850 3700
Wire Wire Line
	3800 3700 3800 3650
Connection ~ 3800 3700
Connection ~ 3300 3600
Wire Wire Line
	3950 3950 3300 3950
Wire Wire Line
	3300 3950 3300 4200
Wire Wire Line
	3300 4200 850  4200
Wire Wire Line
	3950 3850 3250 3850
Wire Wire Line
	3250 3850 3250 4150
Wire Wire Line
	3250 4150 750  4150
Wire Wire Line
	2650 4150 2650 4100
Wire Wire Line
	750  4150 750  1850
Connection ~ 2650 4150
Wire Wire Line
	850  4200 850  1850
Connection ~ 2850 4200
Wire Wire Line
	2850 3700 2850 3650
Wire Wire Line
	950  3600 950  1850
Connection ~ 2650 3600
Wire Wire Line
	1350 2150 7700 2150
Wire Wire Line
	7800 4600 1450 4600
Connection ~ 4450 4600
Wire Wire Line
	8100 4750 8100 4600
Wire Wire Line
	8200 2150 8200 2500
Wire Wire Line
	8600 3550 9000 3550
Wire Wire Line
	8600 2800 8600 2750
Wire Wire Line
	8600 2250 8600 2200
Wire Wire Line
	8600 2200 8200 2200
Connection ~ 8200 2200
Wire Wire Line
	4950 4250 5400 4250
Wire Wire Line
	5400 4250 5400 4600
Connection ~ 5400 4600
Wire Wire Line
	2100 2250 2100 2150
Connection ~ 2100 2150
Wire Wire Line
	2500 2150 2500 2250
Connection ~ 2500 2150
Wire Wire Line
	2500 2750 2500 2800
Wire Wire Line
	2500 2800 1450 2800
Wire Wire Line
	2100 2750 2100 2800
Connection ~ 2100 2800
Wire Wire Line
	1350 2150 1350 1850
Wire Wire Line
	1450 4600 1450 1850
Wire Wire Line
	1250 1850 1250 3650
Wire Wire Line
	1800 2050 1800 2150
Connection ~ 1800 2150
Wire Wire Line
	1800 2650 1800 2800
Connection ~ 1800 2800
Connection ~ 7700 4600
$Comp
L SN65HVD3083EDGSR U4
U 1 1 544185F7
P 4450 3850
F 0 "U4" H 4650 3300 60  0000 C CNN
F 1 "SN65HVD3083EDGSR" H 3950 4400 60  0000 C CNN
F 2 "" H 4450 3850 60  0001 C CNN
F 3 "" H 4450 3850 60  0001 C CNN
	1    4450 3850
	-1   0    0    -1  
$EndComp
Wire Wire Line
	4950 3650 6250 3650
Wire Wire Line
	6250 3650 6250 3350
Wire Wire Line
	6250 3350 7300 3350
Wire Wire Line
	4950 3900 6500 3900
Wire Wire Line
	6500 3900 6500 3550
Wire Wire Line
	6500 3550 7300 3550
Wire Wire Line
	4950 4150 6750 4150
Wire Wire Line
	6750 4150 6750 3750
Wire Wire Line
	6750 3750 7300 3750
Text Notes 7100 1950 0    60   ~ 0
Switch to ISO7242C?
Wire Wire Line
	8600 3350 9000 3350
Wire Wire Line
	8200 4600 8200 4650
Wire Wire Line
	8200 4650 8100 4650
Connection ~ 8100 4650
Wire Wire Line
	7300 3150 7100 3150
Wire Wire Line
	7100 3150 7100 4600
Connection ~ 7100 4600
Text HLabel 9000 3150 2    60   Output ~ 0
_SC_PRESENT
Wire Wire Line
	8600 3150 9000 3150
Text HLabel 9000 3750 2    60   Input ~ 0
SC_OE
Wire Wire Line
	8600 3750 9000 3750
Text Notes 8800 2400 0    60   ~ 0
2mm max crom Vcc2
Text Notes 2700 2400 0    60   ~ 0
2mm max from Vcc1
$Comp
L +3.3V #PWR025
U 1 1 54480B53
P 9300 3950
F 0 "#PWR025" H 9300 3910 30  0001 C CNN
F 1 "+3.3V" H 9300 4060 30  0000 C CNN
F 2 "" H 9300 3950 60  0001 C CNN
F 3 "" H 9300 3950 60  0001 C CNN
	1    9300 3950
	1    0    0    -1  
$EndComp
$Comp
L R R9
U 1 1 54480BA7
P 8950 3950
F 0 "R9" V 9030 3950 50  0000 C CNN
F 1 "1k" V 8950 3950 50  0000 C CNN
F 2 "" H 8950 3950 60  0001 C CNN
F 3 "" H 8950 3950 60  0001 C CNN
	1    8950 3950
	0    -1   -1   0   
$EndComp
Wire Wire Line
	8600 3950 8700 3950
Wire Wire Line
	9200 3950 9300 3950
$Comp
L R R5
U 1 1 54480C8B
P 6950 2850
F 0 "R5" V 7030 2850 50  0000 C CNN
F 1 "1k" V 6950 2850 50  0000 C CNN
F 2 "" H 6950 2850 60  0001 C CNN
F 3 "" H 6950 2850 60  0001 C CNN
	1    6950 2850
	1    0    0    -1  
$EndComp
Wire Wire Line
	7300 3950 6950 3950
Wire Wire Line
	6950 3950 6950 3100
Wire Wire Line
	4450 2150 4450 3100
Connection ~ 4450 2150
Wire Wire Line
	7700 2150 7700 2500
Wire Wire Line
	6950 2600 6950 2150
Connection ~ 6950 2150
Connection ~ 1450 2800
Wire Wire Line
	1250 3650 2850 3650
Connection ~ 2850 3700
Text Notes 2150 1050 0    60   ~ 0
1 - TX-   or DATA-\n2 - TX+  or DATA-\n3 - RX+   or N.C.\n4 - N.C.\n5 - N.C.\n6 - RX-   or N.C.\n7 - +5V\n8 - GND
Text Notes 4700 3450 0    60   ~ 0
1 Mbps\n21mA
Text Notes 7300 2650 0    60   ~ 0
25Mbps\n15mA
Text Notes 8250 2750 0    60   ~ 0
12mA
$Comp
L ISO7242C U3
U 1 1 546C2932
P 7950 3550
F 0 "U3" H 8000 2500 60  0000 C CNN
F 1 "ISO7242C" H 7950 4150 60  0000 C CNN
F 2 "" H 7950 3550 60  0001 C CNN
F 3 "" H 7950 3550 60  0001 C CNN
	1    7950 3550
	1    0    0    -1  
$EndComp
Text Notes 9800 3150 0    60   ~ 0
When SC side is not powered,\nthe outputs go to a logic 1.\n_SC_PRESENT will be 0 when\n SC connected, 1 otherwise
$EndSCHEMATC
