PCBNEW-LibModule-V1  Mon 16 Jun 2014 04:26:38 PM EDT
# encoding utf-8
Units mm
$INDEX
A97943DKR-ND
$EndINDEX
$MODULE A97943DKR-ND
Po 0 0 0 15 539F52F0 00000000 ~~
Li A97943DKR-ND
Sc 0
AR /534D8F08/5356E834
Op 0 0 0
T0 0 6.985 1 1 0 0.15 N V 21 N "U10"
T1 0 -6.477 1 1 0 0.15 N V 21 N "A97943DKR-ND"
DS 3.99 -3.937 3.99 -2.88 0.15 21
DS 3.99 -2.88 3.85 -2.88 0.15 21
DS 3.85 2.88 4.39 2.88 0.15 21
DS 4.39 2.88 4.39 4.318 0.15 21
DS 3.85 -2.88 3.85 2.88 0.15 21
DS 4.39 4.34 5.75 4.34 0.15 21
DS 5.75 4.34 5.75 -3.94 0.15 21
DS 5.75 -3.94 3.99 -3.94 0.15 21
DS -3.85 2.88 -3.99 2.88 0.15 21
DS -3.99 2.88 -3.99 4.318 0.15 21
DS -3.85 -2.794 -4.39 -2.794 0.15 21
DS -4.39 -2.794 -4.39 -3.937 0.15 21
DS -5.65 4.34 -3.99 4.34 0.15 21
DS -3.85 2.88 -3.85 -2.794 0.15 21
DS -4.39 -3.94 -5.65 -3.94 0.15 21
DS -5.65 -3.94 -5.65 4.34 0.15 21
$PAD
Sh "11" R 0.5 2 0 0 0
Dr 0 0 0
At SMD N 00888000
Ne 13 "GND"
Po 3.2 -4.1
$EndPAD
$PAD
Sh "12" R 0.4 1.5 0 0 0
Dr 0 0 0
At SMD N 00888000
Ne 10 "/TCDS I/Os/SFP1_Rx_D-"
Po 2.4 -4.1
$EndPAD
$PAD
Sh "13" R 0.4 1.5 0 0 0
Dr 0 0 0
At SMD N 00888000
Ne 9 "/TCDS I/Os/SFP1_Rx_D+"
Po 1.6 -4.1
$EndPAD
$PAD
Sh "14" R 0.5 2 0 0 0
Dr 0 0 0
At SMD N 00888000
Ne 13 "GND"
Po 0.8 -4.1
$EndPAD
$PAD
Sh "15" R 0.5 2 0 0 0
Dr 0 0 0
At SMD N 00888000
Ne 7 "/Power/SFP1_Rx_Vcc"
Po 0 -4.1
$EndPAD
$PAD
Sh "16" R 0.5 2 0 0 0
Dr 0 0 0
At SMD N 00888000
Ne 8 "/Power/SFP1_Tx_Vcc"
Po -0.8 -4.1
$EndPAD
$PAD
Sh "17" R 0.5 2 0 0 0
Dr 0 0 0
At SMD N 00888000
Ne 13 "GND"
Po -1.6 -4.1
$EndPAD
$PAD
Sh "18" R 0.4 1.5 0 0 0
Dr 0 0 0
At SMD N 00888000
Ne 11 "/TCDS I/Os/SFP1_Tx_D+"
Po -2.4 -4.1
$EndPAD
$PAD
Sh "19" R 0.4 1.5 0 0 0
Dr 0 0 0
At SMD N 00888000
Ne 12 "/TCDS I/Os/SFP1_Tx_D-"
Po -3.2 -4.1
$EndPAD
$PAD
Sh "20" R 0.5 2 0 0 0
Dr 0 0 0
At SMD N 00888000
Ne 13 "GND"
Po -4 -4.1
$EndPAD
$PAD
Sh "" C 1.55 1.55 0 0 0
Dr 1.55 0 0
At HOLE N 00E0FFFF
Ne 0 ""
Po -4.8 0
$EndPAD
$PAD
Sh "" C 1.55 1.55 0 0 0
Dr 1.55 0 0
At HOLE N 00E0FFFF
Ne 0 ""
Po 4.8 0
$EndPAD
$PAD
Sh "1" R 0.5 2 0 0 0
Dr 0 0 0
At SMD N 00888000
Ne 13 "GND"
Po -3.6 4.1
$EndPAD
$PAD
Sh "2" R 0.5 2 0 0 0
Dr 0 0 0
At SMD N 00888000
Ne 6 "/FPGA Bank 1/SFP1_Tx_Fault"
Po -2.8 4.1
$EndPAD
$PAD
Sh "3" R 0.5 2 0 0 0
Dr 0 0 0
At SMD N 00888000
Ne 5 "/FPGA Bank 1/SFP1_Tx_Disable"
Po -2 4.1
$EndPAD
$PAD
Sh "4" R 0.5 2 0 0 0
Dr 0 0 0
At SMD N 00888000
Ne 4 "/FPGA Bank 1/SFP1_SDA"
Po -1.2 4.1
$EndPAD
$PAD
Sh "5" R 0.5 2 0 0 0
Dr 0 0 0
At SMD N 00888000
Ne 3 "/FPGA Bank 1/SFP1_SCL"
Po -0.4 4.1
$EndPAD
$PAD
Sh "6" R 0.5 2 0 0 0
Dr 0 0 0
At SMD N 00888000
Ne 2 "/FPGA Bank 1/SFP1_Present"
Po 0.4 4.1
$EndPAD
$PAD
Sh "7" R 0.5 2 0 0 0
Dr 0 0 0
At SMD N 00888000
Ne 14 "Net-<U10-Pad7>"
Po 1.2 4.1
$EndPAD
$PAD
Sh "8" R 0.5 2 0 0 0
Dr 0 0 0
At SMD N 00888000
Ne 1 "/FPGA Bank 1/SFP1_LOS"
Po 2 4.1
$EndPAD
$PAD
Sh "9" R 0.5 2 0 0 0
Dr 0 0 0
At SMD N 00888000
Ne 13 "GND"
Po 2.8 4.1
$EndPAD
$PAD
Sh "10" R 0.5 2 0 0 0
Dr 0 0 0
At SMD N 00888000
Ne 13 "GND"
Po 3.6 4.1
$EndPAD
$EndMODULE A97943DKR-ND
$EndLIBRARY
