EESchema Schematic File Version 2
LIBS:sn65hvd3083edgsr
LIBS:conn
LIBS:power
LIBS:pspice
LIBS:zl40216
LIBS:sfp
LIBS:FIN1108
LIBS:sn65lvds389
LIBS:max5825baup
LIBS:tps72301dbvr
LIBS:ina195a
LIBS:tps78630kttt
LIBS:tps73501drbt
LIBS:lt3015eq
LIBS:lt1086cm-3
LIBS:tps72012drvt
LIBS:ina202a
LIBS:transistors
LIBS:2sk3019
LIBS:sn74hc05d
LIBS:ad7998
LIBS:ao3401a
LIBS:opa703
LIBS:6slx45fgg484pkg
LIBS:ERM8-RA
LIBS:cdclvd1204
LIBS:sy89835u
LIBS:zl40212
LIBS:opa4703ea
LIBS:tps73201qdbvrq1
LIBS:m25p32
LIBS:bav99
LIBS:si590
LIBS:iso7242c
LIBS:lmk00304
LIBS:pins_14x2
LIBS:ds18b20u
LIBS:2x14_conn
LIBS:led
EELAYER 27 0
EELAYER END
$Descr A4 11693 8268
encoding utf-8
Sheet 13 23
Title ""
Date "17 mar 2015"
Rev ""
Comp ""
Comment1 ""
Comment2 ""
Comment3 ""
Comment4 ""
$EndDescr
Connection ~ 6500 3500
$Comp
L MAX5825BAUP+ U13
U 1 1 5451057D
P 8600 3750
F 0 "U13" H 9050 2950 60  0000 C CNN
F 1 "MAX5825BAUP+" V 8600 3750 60  0000 C CNN
F 2 "" H 8600 3750 60  0001 C CNN
F 3 "" H 8600 3750 60  0001 C CNN
	1    8600 3750
	1    0    0    -1  
$EndComp
$Comp
L GND #PWR069
U 1 1 54510A2C
P 2100 3650
F 0 "#PWR069" H 2100 3650 30  0001 C CNN
F 1 "GND" H 2100 3580 30  0001 C CNN
F 2 "" H 2100 3650 60  0001 C CNN
F 3 "" H 2100 3650 60  0001 C CNN
	1    2100 3650
	1    0    0    -1  
$EndComp
Wire Wire Line
	2650 3450 2100 3450
Wire Wire Line
	2100 3450 2100 3650
Wire Wire Line
	2650 3550 2100 3550
Connection ~ 2100 3550
$Comp
L GND #PWR070
U 1 1 54510A45
P 7200 3700
F 0 "#PWR070" H 7200 3700 30  0001 C CNN
F 1 "GND" H 7200 3630 30  0001 C CNN
F 2 "" H 7200 3700 60  0001 C CNN
F 3 "" H 7200 3700 60  0001 C CNN
	1    7200 3700
	1    0    0    -1  
$EndComp
Wire Wire Line
	7750 3600 7200 3600
Wire Wire Line
	7200 3600 7200 3700
$Comp
L R R39
U 1 1 54510A62
P 7100 1100
F 0 "R39" V 7000 1100 50  0000 C CNN
F 1 "4.7k" V 7100 1100 50  0000 C CNN
F 2 "" H 7100 1100 60  0001 C CNN
F 3 "" H 7100 1100 60  0001 C CNN
	1    7100 1100
	-1   0    0    1   
$EndComp
$Comp
L R R40
U 1 1 54510A76
P 7300 1100
F 0 "R40" V 7380 1100 50  0000 C CNN
F 1 "4.7k" V 7300 1100 50  0000 C CNN
F 2 "" H 7300 1100 60  0001 C CNN
F 3 "" H 7300 1100 60  0001 C CNN
	1    7300 1100
	1    0    0    -1  
$EndComp
Wire Wire Line
	6300 3500 7750 3500
Wire Wire Line
	2650 3250 2450 3250
Wire Wire Line
	2650 3350 2350 3350
$Comp
L R R41
U 1 1 54510B22
P 1600 3700
F 0 "R41" V 1680 3700 50  0000 C CNN
F 1 "4.7k" V 1600 3700 50  0000 C CNN
F 2 "" H 1600 3700 60  0001 C CNN
F 3 "" H 1600 3700 60  0001 C CNN
	1    1600 3700
	1    0    0    -1  
$EndComp
Wire Wire Line
	2650 3950 1600 3950
Wire Wire Line
	7750 3700 7600 3700
Wire Wire Line
	7600 3800 7750 3800
Connection ~ 7600 3700
$Comp
L R R42
U 1 1 54510BA0
P 6500 3750
F 0 "R42" V 6580 3750 50  0000 C CNN
F 1 "4.7k" V 6500 3750 50  0000 C CNN
F 2 "" H 6500 3750 60  0001 C CNN
F 3 "" H 6500 3750 60  0001 C CNN
	1    6500 3750
	1    0    0    -1  
$EndComp
Wire Wire Line
	7750 4000 6500 4000
Wire Wire Line
	2650 3650 2200 3650
Wire Wire Line
	2200 3650 2200 3750
Wire Wire Line
	2650 3750 1750 3750
Wire Wire Line
	1750 3750 1750 3250
Connection ~ 2200 3750
Wire Wire Line
	2650 4150 1400 4150
Wire Wire Line
	1400 4150 1400 3250
Wire Wire Line
	1400 3250 1750 3250
$Comp
L GND #PWR071
U 1 1 54510CDD
P 8600 4900
F 0 "#PWR071" H 8600 4900 30  0001 C CNN
F 1 "GND" H 8600 4830 30  0001 C CNN
F 2 "" H 8600 4900 60  0001 C CNN
F 3 "" H 8600 4900 60  0001 C CNN
	1    8600 4900
	1    0    0    -1  
$EndComp
$Comp
L GND #PWR072
U 1 1 54510CF1
P 3500 4800
F 0 "#PWR072" H 3500 4800 30  0001 C CNN
F 1 "GND" H 3500 4730 30  0001 C CNN
F 2 "" H 3500 4800 60  0001 C CNN
F 3 "" H 3500 4800 60  0001 C CNN
	1    3500 4800
	1    0    0    -1  
$EndComp
Wire Wire Line
	3500 4700 3500 4800
Wire Wire Line
	8600 4750 8600 4900
$Comp
L +3.3V #PWR073
U 1 1 54510D5C
P 3700 2000
F 0 "#PWR073" H 3700 1960 30  0001 C CNN
F 1 "+3.3V" H 3700 2110 30  0000 C CNN
F 2 "" H 3700 2000 60  0001 C CNN
F 3 "" H 3700 2000 60  0001 C CNN
	1    3700 2000
	1    0    0    -1  
$EndComp
Wire Wire Line
	3700 2000 3700 2700
Wire Wire Line
	3300 2700 3300 2500
Wire Wire Line
	3300 2500 3700 2500
Connection ~ 3700 2500
Wire Wire Line
	3500 2700 3500 2500
Connection ~ 3500 2500
$Comp
L C C27
U 1 1 54510E30
P 4400 2450
F 0 "C27" V 4500 2600 50  0000 C CNN
F 1 "0.1uF" V 4500 2300 50  0000 C CNN
F 2 "" H 4400 2450 60  0001 C CNN
F 3 "" H 4400 2450 60  0001 C CNN
	1    4400 2450
	1    0    0    -1  
$EndComp
$Comp
L C C26
U 1 1 54510E44
P 4000 2450
F 0 "C26" V 4100 2600 50  0000 C CNN
F 1 "4.7u" V 4100 2300 50  0000 C CNN
F 2 "" H 4000 2450 60  0001 C CNN
F 3 "" H 4000 2450 60  0001 C CNN
	1    4000 2450
	1    0    0    -1  
$EndComp
$Comp
L GND #PWR074
U 1 1 54510E62
P 4400 2800
F 0 "#PWR074" H 4400 2800 30  0001 C CNN
F 1 "GND" H 4400 2730 30  0001 C CNN
F 2 "" H 4400 2800 60  0001 C CNN
F 3 "" H 4400 2800 60  0001 C CNN
	1    4400 2800
	1    0    0    -1  
$EndComp
Wire Wire Line
	4000 2200 4000 2100
Wire Wire Line
	4400 2200 4400 2100
Connection ~ 3700 2100
$Comp
L +3.3V #PWR075
U 1 1 54510F6A
P 8800 2050
F 0 "#PWR075" H 8800 2010 30  0001 C CNN
F 1 "+3.3V" H 8800 2160 30  0000 C CNN
F 2 "" H 8800 2050 60  0001 C CNN
F 3 "" H 8800 2050 60  0001 C CNN
	1    8800 2050
	1    0    0    -1  
$EndComp
Wire Wire Line
	8800 2050 8800 2750
Wire Wire Line
	8400 2750 8400 2550
Wire Wire Line
	8400 2550 8800 2550
Connection ~ 8800 2550
Wire Wire Line
	8600 2750 8600 2550
Connection ~ 8600 2550
$Comp
L C C29
U 1 1 54510F76
P 9500 2500
F 0 "C29" V 9600 2650 50  0000 C CNN
F 1 "0.1uF" V 9600 2350 50  0000 C CNN
F 2 "" H 9500 2500 60  0001 C CNN
F 3 "" H 9500 2500 60  0001 C CNN
	1    9500 2500
	1    0    0    -1  
$EndComp
$Comp
L C C28
U 1 1 54510F7C
P 9100 2500
F 0 "C28" V 9200 2650 50  0000 C CNN
F 1 "4.7u" V 9200 2350 50  0000 C CNN
F 2 "" H 9100 2500 60  0001 C CNN
F 3 "" H 9100 2500 60  0001 C CNN
	1    9100 2500
	1    0    0    -1  
$EndComp
Wire Wire Line
	9100 2250 9100 2150
Wire Wire Line
	8800 2150 9500 2150
Wire Wire Line
	9500 2150 9500 2250
Connection ~ 8800 2150
$Comp
L GND #PWR076
U 1 1 54510F89
P 9500 2850
F 0 "#PWR076" H 9500 2850 30  0001 C CNN
F 1 "GND" H 9500 2780 30  0001 C CNN
F 2 "" H 9500 2850 60  0001 C CNN
F 3 "" H 9500 2850 60  0001 C CNN
	1    9500 2850
	1    0    0    -1  
$EndComp
$Comp
L +3.3V #PWR077
U 1 1 54511027
P 1400 3250
F 0 "#PWR077" H 1400 3210 30  0001 C CNN
F 1 "+3.3V" H 1400 3360 30  0000 C CNN
F 2 "" H 1400 3250 60  0001 C CNN
F 3 "" H 1400 3250 60  0001 C CNN
	1    1400 3250
	1    0    0    -1  
$EndComp
$Comp
L +3.3V #PWR078
U 1 1 5451102D
P 7300 850
F 0 "#PWR078" H 7300 810 30  0001 C CNN
F 1 "+3.3V" H 7300 960 30  0000 C CNN
F 2 "" H 7300 850 60  0001 C CNN
F 3 "" H 7300 850 60  0001 C CNN
	1    7300 850 
	1    0    0    -1  
$EndComp
$Comp
L +3.3V #PWR079
U 1 1 545111FD
P 6300 3400
F 0 "#PWR079" H 6300 3360 30  0001 C CNN
F 1 "+3.3V" H 6300 3510 30  0000 C CNN
F 2 "" H 6300 3400 60  0001 C CNN
F 3 "" H 6300 3400 60  0001 C CNN
	1    6300 3400
	1    0    0    -1  
$EndComp
Wire Wire Line
	6300 3400 6300 4200
Wire Wire Line
	6300 4200 7750 4200
Connection ~ 6300 3500
$Comp
L +3.3V #PWR080
U 1 1 545112C6
P 7100 850
F 0 "#PWR080" H 7100 810 30  0001 C CNN
F 1 "+3.3V" H 7100 960 30  0000 C CNN
F 2 "" H 7100 850 60  0001 C CNN
F 3 "" H 7100 850 60  0001 C CNN
	1    7100 850 
	1    0    0    -1  
$EndComp
Connection ~ 9100 2150
Wire Wire Line
	9500 2750 9500 2850
Wire Wire Line
	9100 2750 9100 2800
Wire Wire Line
	9100 2800 9500 2800
Connection ~ 9500 2800
Wire Wire Line
	4400 2100 3700 2100
Connection ~ 4000 2100
Wire Wire Line
	4000 2700 4000 2750
Wire Wire Line
	4000 2750 4400 2750
Wire Wire Line
	4400 2700 4400 2800
Connection ~ 4400 2750
$Comp
L MAX5825BAUP+ U12
U 1 1 5451055F
P 3500 3700
F 0 "U12" H 3950 2900 60  0000 C CNN
F 1 "MAX5825BAUP+" V 3500 3700 60  0000 C CNN
F 2 "" H 3500 3700 60  0001 C CNN
F 3 "" H 3500 3700 60  0001 C CNN
	1    3500 3700
	1    0    0    -1  
$EndComp
Wire Wire Line
	1600 3450 1600 3250
Connection ~ 1600 3250
Wire Wire Line
	7600 3700 7600 3900
Wire Wire Line
	7600 3900 6750 3900
Wire Wire Line
	6750 3900 6750 3500
Connection ~ 6750 3500
Connection ~ 7600 3800
Text HLabel 1500 1600 0    60   Input ~ 0
SCL_IN
Text HLabel 1500 1700 0    60   BiDi ~ 0
SDA_IN
Wire Wire Line
	1500 1700 7800 1700
Wire Wire Line
	1500 1600 7800 1600
Wire Wire Line
	2350 3350 2350 1700
Wire Wire Line
	2450 3250 2450 1600
Wire Wire Line
	7550 1600 7550 3300
Wire Wire Line
	7550 3300 7750 3300
Connection ~ 2450 1600
Wire Wire Line
	7750 3400 7450 3400
Wire Wire Line
	7450 3400 7450 1700
Connection ~ 2350 1700
Wire Wire Line
	7100 1350 7100 1700
Connection ~ 7100 1700
Wire Wire Line
	7300 1350 7300 1600
Connection ~ 7300 1600
Text HLabel 10200 1250 2    60   Output ~ 0
ASDQ_D[3..0]
Text HLabel 10200 1150 2    60   Output ~ 0
ASDQ_C[3..0]
Text Label 9450 3400 0    60   ~ 0
ASDQ_D3
Text Label 9450 3500 0    60   ~ 0
ASDQ_D2
Text Label 9450 3600 0    60   ~ 0
ASDQ_D1
Text Label 9450 3700 0    60   ~ 0
ASDQ_D0
Text Label 9450 3800 0    60   ~ 0
ASDQ_C3
Text Label 9450 3900 0    60   ~ 0
ASDQ_C2
Text Label 9450 4000 0    60   ~ 0
ASDQ_C1
Text Label 9450 4100 0    60   ~ 0
ASDQ_C0
Wire Wire Line
	9450 3400 9950 3400
Wire Wire Line
	9450 3500 9950 3500
Wire Wire Line
	9450 3600 9950 3600
Wire Wire Line
	9950 3700 9450 3700
Wire Wire Line
	9450 3800 9950 3800
Wire Wire Line
	9450 3900 9950 3900
Wire Wire Line
	9950 4000 9450 4000
Wire Wire Line
	9450 4100 9950 4100
Text HLabel 10200 1050 2    60   Output ~ 0
ASDQ_B[3..0]
Text HLabel 10200 950  2    60   Output ~ 0
ASDQ_A[3..0]
Text Label 4350 3350 0    60   ~ 0
ASDQ_B3
Text Label 4350 3450 0    60   ~ 0
ASDQ_B2
Text Label 4350 3550 0    60   ~ 0
ASDQ_B1
Text Label 4350 3650 0    60   ~ 0
ASDQ_B0
Text Label 4350 3750 0    60   ~ 0
ASDQ_A3
Text Label 4350 3850 0    60   ~ 0
ASDQ_A2
Text Label 4350 3950 0    60   ~ 0
ASDQ_A1
Text Label 4350 4050 0    60   ~ 0
ASDQ_A0
Wire Wire Line
	4350 3350 4850 3350
Wire Wire Line
	4350 3450 4850 3450
Wire Wire Line
	4350 3550 4850 3550
Wire Wire Line
	4850 3650 4350 3650
Wire Wire Line
	4350 3750 4850 3750
Wire Wire Line
	4350 3850 4850 3850
Wire Wire Line
	4850 3950 4350 3950
Wire Wire Line
	4350 4050 4850 4050
Text Notes 1350 2800 0    60   ~ 0
ASDQ A&B \ni2c addr:001 0000
Text Notes 6450 2800 0    60   ~ 0
ASDQ C&D \ni2c addr: 001 0011\n
Connection ~ 7550 1600
Connection ~ 7450 1700
$EndSCHEMATC
