/*
WARNING: Do NOT edit the input and output ports in this file in a text
editor if you plan to continue editing the block that represents it in
the Block Editor! File corruption is VERY likely to occur.
*/
/*
Copyright (C) 1991-2010 Altera Corporation
Your use of Altera Corporation's design tools, logic functions 
and other software and tools, and its AMPP partner logic 
functions, and any output files from any of the foregoing 
(including device programming or simulation files), and any 
associated documentation or information are expressly subject 
to the terms and conditions of the Altera Program License 
Subscription Agreement, Altera MegaCore Function License 
Agreement, or other applicable license agreement, including, 
without limitation, that your use is for the sole purpose of 
programming logic devices manufactured by Altera and sold by 
Altera or its authorized distributors.  Please refer to the 
applicable agreement for further details.
*/
//#pragma file_not_in_maxplusii_format
(header "graphic" (version "1.3"))
(properties
	(page_setup "header_footer\nDate: %D\n%f\nProject: %j\n\nPage %p of %P\nRevision: %a\nmargin\n0.2\n0.2\n0.2\n0.2\norientation\n2\npaper_size\n3\npaper_source\n15\nfit_page_wide\n1\nfit_page_tall\n1\n")
)
(pin
	(input)
	(rect 208 248 376 264)
	(text "INPUT" (rect 133 0 161 10)(font "Arial" (font_size 6)))
	(text "CK" (rect 5 0 20 12)(font "Arial" ))
	(pt 168 8)
	(drawing
		(line (pt 92 12)(pt 117 12)(line_width 1))
		(line (pt 92 4)(pt 117 4)(line_width 1))
		(line (pt 121 8)(pt 168 8)(line_width 1))
		(line (pt 92 12)(pt 92 4)(line_width 1))
		(line (pt 117 4)(pt 121 8)(line_width 1))
		(line (pt 117 12)(pt 121 8)(line_width 1))
	)
	(text "VCC" (rect 136 7 156 17)(font "Arial" (font_size 6)))
)
(pin
	(input)
	(rect 208 208 376 224)
	(text "INPUT" (rect 133 0 161 10)(font "Arial" (font_size 6)))
	(text "DF[15..0]" (rect 5 0 52 12)(font "Arial" ))
	(pt 168 8)
	(drawing
		(line (pt 92 12)(pt 117 12)(line_width 1))
		(line (pt 92 4)(pt 117 4)(line_width 1))
		(line (pt 121 8)(pt 168 8)(line_width 1))
		(line (pt 92 12)(pt 92 4)(line_width 1))
		(line (pt 117 4)(pt 121 8)(line_width 1))
		(line (pt 117 12)(pt 121 8)(line_width 1))
	)
	(text "VCC" (rect 136 7 156 17)(font "Arial" (font_size 6)))
)
(pin
	(input)
	(rect 208 168 376 184)
	(text "INPUT" (rect 133 0 161 10)(font "Arial" (font_size 6)))
	(text "LDF" (rect 5 0 26 12)(font "Arial" ))
	(pt 168 8)
	(drawing
		(line (pt 92 12)(pt 117 12)(line_width 1))
		(line (pt 92 4)(pt 117 4)(line_width 1))
		(line (pt 121 8)(pt 168 8)(line_width 1))
		(line (pt 92 12)(pt 92 4)(line_width 1))
		(line (pt 117 4)(pt 121 8)(line_width 1))
		(line (pt 117 12)(pt 121 8)(line_width 1))
	)
	(text "VCC" (rect 136 7 156 17)(font "Arial" (font_size 6)))
)
(pin
	(input)
	(rect 208 32 376 48)
	(text "INPUT" (rect 133 0 161 10)(font "Arial" (font_size 6)))
	(text "Feed1d" (rect 5 0 41 12)(font "Arial" ))
	(pt 168 8)
	(drawing
		(line (pt 92 12)(pt 117 12)(line_width 1))
		(line (pt 92 4)(pt 117 4)(line_width 1))
		(line (pt 121 8)(pt 168 8)(line_width 1))
		(line (pt 92 12)(pt 92 4)(line_width 1))
		(line (pt 117 4)(pt 121 8)(line_width 1))
		(line (pt 117 12)(pt 121 8)(line_width 1))
	)
	(text "VCC" (rect 136 7 156 17)(font "Arial" (font_size 6)))
)
(pin
	(input)
	(rect 208 96 376 112)
	(text "INPUT" (rect 133 0 161 10)(font "Arial" (font_size 6)))
	(text "WkReg" (rect 5 0 41 12)(font "Arial" ))
	(pt 168 8)
	(drawing
		(line (pt 92 12)(pt 117 12)(line_width 1))
		(line (pt 92 4)(pt 117 4)(line_width 1))
		(line (pt 121 8)(pt 168 8)(line_width 1))
		(line (pt 92 12)(pt 92 4)(line_width 1))
		(line (pt 117 4)(pt 121 8)(line_width 1))
		(line (pt 117 12)(pt 121 8)(line_width 1))
	)
	(text "VCC" (rect 136 7 156 17)(font "Arial" (font_size 6)))
)
(pin
	(output)
	(rect 1056 32 1232 48)
	(text "OUTPUT" (rect 1 0 39 10)(font "Arial" (font_size 6)))
	(text "QQ[15..0]" (rect 90 0 138 12)(font "Arial" ))
	(pt 0 8)
	(drawing
		(line (pt 0 8)(pt 52 8)(line_width 1))
		(line (pt 52 4)(pt 78 4)(line_width 1))
		(line (pt 52 12)(pt 78 12)(line_width 1))
		(line (pt 52 12)(pt 52 4)(line_width 1))
		(line (pt 78 4)(pt 82 8)(line_width 1))
		(line (pt 82 8)(pt 78 12)(line_width 1))
		(line (pt 78 12)(pt 82 8)(line_width 1))
	)
)
(symbol
	(rect 288 760 320 792)
	(text "GND" (rect 6 8 16 29)(font "Arial" (font_size 6))(vertical))
	(text "inst30" (rect -1 3 11 32)(font "Arial" )(vertical)(invisible))
	(port
		(pt 32 16)
		(output)
		(text "1" (rect 18 0 23 12)(font "Courier New" (bold))(invisible))
		(text "1" (rect 20 18 32 23)(font "Courier New" (bold))(vertical)(invisible))
		(line (pt 24 16)(pt 32 16)(line_width 1))
	)
	(drawing
		(line (pt 24 8)(pt 16 16)(line_width 1))
		(line (pt 16 16)(pt 24 24)(line_width 1))
		(line (pt 24 8)(pt 24 24)(line_width 1))
	)
	(rotate270)
)
(symbol
	(rect 976 16 1040 96)
	(text "DFFE" (rect 1 0 25 10)(font "Arial" (font_size 6)))
	(text "inst3" (rect 3 68 26 80)(font "Arial" ))
	(port
		(pt 32 0)
		(input)
		(text "PRN" (rect 24 13 41 25)(font "Courier New" (bold)))
		(text "PRN" (rect 24 11 41 23)(font "Courier New" (bold)))
		(line (pt 32 4)(pt 32 0)(line_width 1))
	)
	(port
		(pt 32 80)
		(input)
		(text "CLRN" (rect 21 59 44 71)(font "Courier New" (bold)))
		(text "CLRN" (rect 21 58 44 70)(font "Courier New" (bold)))
		(line (pt 32 80)(pt 32 76)(line_width 1))
	)
	(port
		(pt 0 24)
		(input)
		(text "D" (rect 14 20 19 32)(font "Courier New" (bold)))
		(text "D" (rect 14 20 19 32)(font "Courier New" (bold)))
		(line (pt 0 24)(pt 12 24)(line_width 1))
	)
	(port
		(pt 0 40)
		(input)
		(text "CLK" (rect 2 28 19 40)(font "Courier New" (bold))(invisible))
		(text "CLK" (rect 2 28 19 40)(font "Courier New" (bold))(invisible))
		(line (pt 0 40)(pt 12 40)(line_width 1))
	)
	(port
		(pt 0 56)
		(input)
		(text "ENA" (rect 14 50 31 62)(font "Courier New" (bold)))
		(text "ENA" (rect 14 50 31 62)(font "Courier New" (bold)))
		(line (pt 0 56)(pt 12 56)(line_width 1))
	)
	(port
		(pt 64 24)
		(output)
		(text "Q" (rect 44 20 49 32)(font "Courier New" (bold)))
		(text "Q" (rect 44 20 49 32)(font "Courier New" (bold)))
		(line (pt 53 24)(pt 64 24)(line_width 1))
	)
	(drawing
		(line (pt 12 68)(pt 52 68)(line_width 1))
		(line (pt 12 12)(pt 52 12)(line_width 1))
		(line (pt 52 68)(pt 52 12)(line_width 1))
		(line (pt 12 68)(pt 12 12)(line_width 1))
		(line (pt 12 34)(pt 19 41)(line_width 1))
		(line (pt 18 41)(pt 12 47)(line_width 1))
		(circle (rect 28 4 36 12)(line_width 1))
		(circle (rect 28 68 36 76)(line_width 1))
	)
)
(symbol
	(rect 864 144 928 192)
	(text "OR2" (rect 1 0 19 10)(font "Arial" (font_size 6)))
	(text "inst" (rect 3 37 20 49)(font "Arial" ))
	(port
		(pt 0 32)
		(input)
		(text "IN2" (rect 2 23 19 35)(font "Courier New" (bold))(invisible))
		(text "IN2" (rect 2 23 19 35)(font "Courier New" (bold))(invisible))
		(line (pt 0 32)(pt 15 32)(line_width 1))
	)
	(port
		(pt 0 16)
		(input)
		(text "IN1" (rect 2 7 19 19)(font "Courier New" (bold))(invisible))
		(text "IN1" (rect 2 7 19 19)(font "Courier New" (bold))(invisible))
		(line (pt 0 16)(pt 15 16)(line_width 1))
	)
	(port
		(pt 64 24)
		(output)
		(text "OUT" (rect 48 15 65 27)(font "Courier New" (bold))(invisible))
		(text "OUT" (rect 48 15 65 27)(font "Courier New" (bold))(invisible))
		(line (pt 48 24)(pt 64 24)(line_width 1))
	)
	(drawing
		(line (pt 14 36)(pt 25 36)(line_width 1))
		(line (pt 14 13)(pt 25 13)(line_width 1))
		(arc (pt 7 29)(pt 7 19)(rect -14 8 19 41)(line_width 1))
		(arc (pt 49 24)(pt 25 13)(rect -6 13 57 76)(line_width 1))
		(arc (pt 25 35)(pt 49 24)(rect -6 -27 57 36)(line_width 1))
	)
)
(symbol
	(rect 752 -8 904 72)
	(text "lpm_mux8" (rect 50 2 120 18)(font "Arial" (font_size 10)))
	(text "inst1" (rect 8 64 31 76)(font "Arial" ))
	(port
		(pt 0 40)
		(input)
		(text "data1x[15..0]" (rect 0 0 74 14)(font "Arial" (font_size 8)))
		(text "data1x[15..0]" (rect 4 27 78 41)(font "Arial" (font_size 8)))
		(line (pt 0 40)(pt 72 40)(line_width 3))
	)
	(port
		(pt 0 56)
		(input)
		(text "data0x[15..0]" (rect 0 0 74 14)(font "Arial" (font_size 8)))
		(text "data0x[15..0]" (rect 4 43 78 57)(font "Arial" (font_size 8)))
		(line (pt 0 56)(pt 72 56)(line_width 3))
	)
	(port
		(pt 80 80)
		(input)
		(text "sel" (rect 0 0 16 14)(font "Arial" (font_size 8)))
		(text "sel" (rect 84 67 100 81)(font "Arial" (font_size 8)))
		(line (pt 80 80)(pt 80 68)(line_width 1))
	)
	(port
		(pt 152 48)
		(output)
		(text "result[15..0]" (rect 0 0 67 14)(font "Arial" (font_size 8)))
		(text "result[15..0]" (rect 92 35 159 49)(font "Arial" (font_size 8)))
		(line (pt 152 48)(pt 88 48)(line_width 3))
	)
	(drawing
		(line (pt 72 24)(pt 72 72)(line_width 1))
		(line (pt 88 32)(pt 88 64)(line_width 1))
		(line (pt 72 24)(pt 88 32)(line_width 1))
		(line (pt 72 72)(pt 88 64)(line_width 1))
	)
)
(symbol
	(rect 512 -24 656 72)
	(text "lpm_shiftreg0" (rect 34 1 124 17)(font "Arial" (font_size 10)))
	(text "inst14" (rect 8 80 37 92)(font "Arial" ))
	(port
		(pt 0 32)
		(input)
		(text "clock" (rect 0 0 29 14)(font "Arial" (font_size 8)))
		(text "clock" (rect 26 26 55 40)(font "Arial" (font_size 8)))
		(line (pt 0 32)(pt 16 32)(line_width 1))
	)
	(port
		(pt 0 48)
		(input)
		(text "enable" (rect 0 0 37 14)(font "Arial" (font_size 8)))
		(text "enable" (rect 20 42 57 56)(font "Arial" (font_size 8)))
		(line (pt 0 48)(pt 16 48)(line_width 1))
	)
	(port
		(pt 0 64)
		(input)
		(text "shiftin" (rect 0 0 34 14)(font "Arial" (font_size 8)))
		(text "shiftin" (rect 20 58 54 72)(font "Arial" (font_size 8)))
		(line (pt 0 64)(pt 16 64)(line_width 1))
	)
	(port
		(pt 144 56)
		(output)
		(text "q[15..0]" (rect 0 0 42 14)(font "Arial" (font_size 8)))
		(text "q[15..0]" (rect 89 50 131 64)(font "Arial" (font_size 8)))
		(line (pt 144 56)(pt 128 56)(line_width 3))
	)
	(drawing
		(text "left shift" (rect 92 17 134 29)(font "Arial" ))
		(line (pt 16 16)(pt 128 16)(line_width 1))
		(line (pt 128 16)(pt 128 80)(line_width 1))
		(line (pt 128 80)(pt 16 80)(line_width 1))
		(line (pt 16 80)(pt 16 16)(line_width 1))
		(line (pt 16 26)(pt 22 32)(line_width 1))
		(line (pt 22 32)(pt 16 38)(line_width 1))
	)
)
(symbol
	(rect 512 80 576 160)
	(text "DFF" (rect 1 0 19 10)(font "Arial" (font_size 6)))
	(text "inst2" (rect 3 68 26 80)(font "Arial" ))
	(port
		(pt 32 80)
		(input)
		(text "CLRN" (rect 21 59 44 71)(font "Courier New" (bold)))
		(text "CLRN" (rect 21 58 44 70)(font "Courier New" (bold)))
		(line (pt 32 80)(pt 32 76)(line_width 1))
	)
	(port
		(pt 0 40)
		(input)
		(text "CLK" (rect 3 29 20 41)(font "Courier New" (bold))(invisible))
		(text "CLK" (rect 3 29 20 41)(font "Courier New" (bold))(invisible))
		(line (pt 0 40)(pt 12 40)(line_width 1))
	)
	(port
		(pt 0 24)
		(input)
		(text "D" (rect 14 20 19 32)(font "Courier New" (bold)))
		(text "D" (rect 14 20 19 32)(font "Courier New" (bold)))
		(line (pt 0 24)(pt 12 24)(line_width 1))
	)
	(port
		(pt 32 0)
		(input)
		(text "PRN" (rect 24 13 41 25)(font "Courier New" (bold)))
		(text "PRN" (rect 24 11 41 23)(font "Courier New" (bold)))
		(line (pt 32 4)(pt 32 0)(line_width 1))
	)
	(port
		(pt 64 24)
		(output)
		(text "Q" (rect 45 20 50 32)(font "Courier New" (bold)))
		(text "Q" (rect 45 20 50 32)(font "Courier New" (bold)))
		(line (pt 52 24)(pt 64 24)(line_width 1))
	)
	(drawing
		(line (pt 12 12)(pt 52 12)(line_width 1))
		(line (pt 12 68)(pt 52 68)(line_width 1))
		(line (pt 52 68)(pt 52 12)(line_width 1))
		(line (pt 12 68)(pt 12 12)(line_width 1))
		(line (pt 19 40)(pt 12 47)(line_width 1))
		(line (pt 12 32)(pt 20 40)(line_width 1))
		(circle (rect 28 4 36 12)(line_width 1))
		(circle (rect 28 68 36 76)(line_width 1))
	)
)
(connector
	(text "zzz[127..0]" (rect 339 760 390 772)(font "Arial" ))
	(pt 320 776)
	(pt 416 776)
	(bus)
)
(connector
	(pt 952 168)
	(pt 952 72)
)
(connector
	(pt 952 72)
	(pt 976 72)
)
(connector
	(pt 1040 40)
	(pt 1056 40)
	(bus)
)
(connector
	(pt 928 168)
	(pt 952 168)
)
(connector
	(pt 976 40)
	(pt 904 40)
	(bus)
)
(connector
	(text "CK" (rect 944 40 959 52)(font "Arial" ))
	(pt 976 56)
	(pt 936 56)
)
(connector
	(pt 376 176)
	(pt 864 176)
)
(connector
	(pt 752 32)
	(pt 656 32)
	(bus)
)
(connector
	(text "CK" (rect 488 -8 503 4)(font "Arial" ))
	(pt 456 8)
	(pt 512 8)
)
(connector
	(pt 512 24)
	(pt 432 24)
)
(connector
	(pt 512 40)
	(pt 376 40)
)
(connector
	(pt 688 216)
	(pt 688 48)
	(bus)
)
(connector
	(pt 752 48)
	(pt 688 48)
	(bus)
)
(connector
	(pt 376 216)
	(pt 688 216)
	(bus)
)
(connector
	(text "CK" (rect 480 104 495 116)(font "Arial" ))
	(pt 512 120)
	(pt 472 120)
)
(connector
	(pt 432 24)
	(pt 432 104)
)
(connector
	(pt 376 104)
	(pt 432 104)
)
(connector
	(pt 432 104)
	(pt 512 104)
)
(connector
	(pt 576 104)
	(pt 832 104)
)
(connector
	(pt 832 104)
	(pt 832 72)
)
(connector
	(pt 864 160)
	(pt 832 160)
)
(connector
	(pt 832 104)
	(pt 832 160)
)
(junction (pt 432 104))
(junction (pt 832 104))
