EESchema Schematic File Version 2
LIBS:TDC_Mother-rescue
LIBS:power
LIBS:transistors
LIBS:conn
LIBS:display
LIBS:contrib
LIBS:ep3c5u256_custom
LIBS:ERM8-RA
LIBS:30310-5002hb
LIBS:4816P-1-101LF
LIBS:FIN1108
LIBS:tps78630kttt
LIBS:tps79533
LIBS:+4
LIBS:640456-2
LIBS:micron
LIBS:tps73701drbt
LIBS:ws2812b
LIBS:fixed_conn
LIBS:ao3422
LIBS:my_discrete
LIBS:TMM-105-01
LIBS:my_power
LIBS:atmega168a-mm
LIBS:CAT16-101J4LF
LIBS:tmp36
LIBS:testpoint
LIBS:TDC_Mother-cache
EELAYER 25 0
EELAYER END
$Descr A 11000 8500
encoding utf-8
Sheet 2 14
Title ""
Date "9 oct 2015"
Rev ""
Comp ""
Comment1 ""
Comment2 ""
Comment3 ""
Comment4 ""
$EndDescr
$Comp
L LVDS_FIN1108 U2
U 1 1 544CF9BD
P 5200 4250
AR Path="/54603C99/544CF9BD" Ref="U2"  Part="1" 
AR Path="/546352F5/544CF9BD" Ref="U4"  Part="1" 
F 0 "U2" H 4600 2600 60  0000 C CNN
F 1 "LVDS_FIN1108" V 5200 4250 79  0000 C CNN
F 2 "FIN1108:FIN1108_RevB" H 4750 3850 60  0001 C CNN
F 3 "" H 4750 3850 60  0000 C CNN
F 4 "FIN1108MTDXTR-ND" H 5200 4250 60  0001 C CNN "Field1"
F 5 "Digi-Key" H 5200 4250 60  0001 C CNN "Field2"
	1    5200 4250
	1    0    0    -1  
$EndComp
Text HLabel 2100 2700 0    60   Input ~ 0
ASDQ_N[7..0]
Text HLabel 2100 2600 0    60   Input ~ 0
ASDQ_P[7..0]
Entry Wire Line
	8200 2850 8100 2950
Entry Wire Line
	8200 3450 8100 3550
Entry Wire Line
	8000 3350 7900 3450
Entry Wire Line
	8200 4050 8100 4150
Entry Wire Line
	8000 3950 7900 4050
Entry Wire Line
	8200 4650 8100 4750
Entry Wire Line
	8000 4550 7900 4650
Text HLabel 8400 2600 2    60   Input ~ 0
LVDS_P[7..0]
Text HLabel 8400 2700 2    60   Input ~ 0
LVDS_N[7..0]
NoConn ~ 4350 5350
$Comp
L +3.3V #PWR09
U 1 1 54B24748
P 5200 1450
AR Path="/54603C99/54B24748" Ref="#PWR09"  Part="1" 
AR Path="/546352F5/54B24748" Ref="#PWR014"  Part="1" 
F 0 "#PWR014" H 5200 1410 30  0001 C CNN
F 1 "+3.3V" H 5200 1560 30  0000 C CNN
F 2 "" H 5200 1450 60  0000 C CNN
F 3 "" H 5200 1450 60  0000 C CNN
	1    5200 1450
	1    0    0    -1  
$EndComp
Text Label 6100 2950 0    60   ~ 0
LVDS_P0
Text Label 6100 3150 0    60   ~ 0
LVDS_P1
Text Label 6100 3550 0    60   ~ 0
LVDS_P2
Text Label 6100 3750 0    60   ~ 0
LVDS_P3
Text Label 6100 4150 0    60   ~ 0
LVDS_P4
Text Label 6100 4350 0    60   ~ 0
LVDS_P5
Text Label 6100 4750 0    60   ~ 0
LVDS_P6
Text Label 6100 4950 0    60   ~ 0
LVDS_P7
Text Label 6100 2850 0    60   ~ 0
LVDS_N0
Text Label 6100 3250 0    60   ~ 0
LVDS_N1
Text Label 6100 3450 0    60   ~ 0
LVDS_N2
Text Label 6100 3850 0    60   ~ 0
LVDS_N3
Text Label 6100 4050 0    60   ~ 0
LVDS_N4
Text Label 6100 4450 0    60   ~ 0
LVDS_N5
Text Label 6100 4650 0    60   ~ 0
LVDS_N6
Text Label 6100 5050 0    60   ~ 0
LVDS_N7
Text Label 2550 2950 0    60   ~ 0
ASDQ_P0
Text Label 2550 3150 0    60   ~ 0
ASDQ_P1
Text Label 2550 3550 0    60   ~ 0
ASDQ_P2
Text Label 2550 3750 0    60   ~ 0
ASDQ_P3
Text Label 2550 4150 0    60   ~ 0
ASDQ_P4
Text Label 2550 4350 0    60   ~ 0
ASDQ_P5
Text Label 2550 4750 0    60   ~ 0
ASDQ_P6
Text Label 2550 4950 0    60   ~ 0
ASDQ_P7
Text Label 2550 2850 0    60   ~ 0
ASDQ_N0
Text Label 2550 3250 0    60   ~ 0
ASDQ_N1
Text Label 2550 3450 0    60   ~ 0
ASDQ_N2
Text Label 2550 3850 0    60   ~ 0
ASDQ_N3
Text Label 2550 4050 0    60   ~ 0
ASDQ_N4
Text Label 2550 4450 0    60   ~ 0
ASDQ_N5
Text Label 2550 4650 0    60   ~ 0
ASDQ_N6
Text Label 2550 5050 0    60   ~ 0
ASDQ_N7
$Comp
L GND #PWR010
U 1 1 5460C42A
P 5750 6450
AR Path="/54603C99/5460C42A" Ref="#PWR010"  Part="1" 
AR Path="/546352F5/5460C42A" Ref="#PWR015"  Part="1" 
F 0 "#PWR015" H 5750 6450 30  0001 C CNN
F 1 "GND" H 5750 6380 30  0001 C CNN
F 2 "" H 5750 6450 60  0000 C CNN
F 3 "" H 5750 6450 60  0000 C CNN
	1    5750 6450
	1    0    0    -1  
$EndComp
$Comp
L +3.3V #PWR011
U 1 1 54B2474A
P 6150 5250
AR Path="/54603C99/54B2474A" Ref="#PWR011"  Part="1" 
AR Path="/546352F5/54B2474A" Ref="#PWR016"  Part="1" 
F 0 "#PWR016" H 6150 5210 30  0001 C CNN
F 1 "+3.3V" H 6150 5360 30  0000 C CNN
F 2 "" H 6150 5250 60  0000 C CNN
F 3 "" H 6150 5250 60  0000 C CNN
	1    6150 5250
	1    0    0    -1  
$EndComp
$Comp
L C C3
U 1 1 5462AD4A
P 5700 1900
AR Path="/54603C99/5462AD4A" Ref="C3"  Part="1" 
AR Path="/546352F5/5462AD4A" Ref="C7"  Part="1" 
F 0 "C3" V 5650 2000 50  0000 C CNN
F 1 ".01uF" V 5650 1750 50  0000 C CNN
F 2 "libcms:SM0603_Capa" H 5700 1900 60  0001 C CNN
F 3 "" H 5700 1900 60  0000 C CNN
F 4 "399-1091-1-ND" V 5700 1900 60  0001 C CNN "Field1"
F 5 "Digi-Key" V 5700 1900 60  0001 C CNN "Field2"
	1    5700 1900
	0    -1   -1   0   
$EndComp
$Comp
L C C4
U 1 1 5462AE4E
P 5700 2250
AR Path="/54603C99/5462AE4E" Ref="C4"  Part="1" 
AR Path="/546352F5/5462AE4E" Ref="C8"  Part="1" 
F 0 "C4" V 5650 2350 50  0000 C CNN
F 1 ".01uF" V 5650 2100 50  0000 C CNN
F 2 "libcms:SM0603_Capa" H 5700 2250 60  0001 C CNN
F 3 "" H 5700 2250 60  0000 C CNN
F 4 "399-1091-1-ND" V 5700 2250 60  0001 C CNN "Field1"
F 5 "Digi-Key" V 5700 2250 60  0001 C CNN "Field2"
	1    5700 2250
	0    -1   -1   0   
$EndComp
$Comp
L C C2
U 1 1 5462AE54
P 4650 2250
AR Path="/54603C99/5462AE54" Ref="C2"  Part="1" 
AR Path="/546352F5/5462AE54" Ref="C6"  Part="1" 
F 0 "C2" V 4600 2350 50  0000 C CNN
F 1 ".01uF" V 4600 2100 50  0000 C CNN
F 2 "libcms:SM0603_Capa" H 4650 2250 60  0001 C CNN
F 3 "" H 4650 2250 60  0000 C CNN
F 4 "399-1091-1-ND" V 4650 2250 60  0001 C CNN "Field1"
F 5 "Digi-Key" V 4650 2250 60  0001 C CNN "Field2"
	1    4650 2250
	0    -1   -1   0   
$EndComp
$Comp
L C C1
U 1 1 5462AE5A
P 4650 1900
AR Path="/54603C99/5462AE5A" Ref="C1"  Part="1" 
AR Path="/546352F5/5462AE5A" Ref="C5"  Part="1" 
F 0 "C1" V 4600 2000 50  0000 C CNN
F 1 ".01uF" V 4600 1750 50  0000 C CNN
F 2 "libcms:SM0603_Capa" H 4650 1900 60  0001 C CNN
F 3 "" H 4650 1900 60  0000 C CNN
F 4 "399-1091-1-ND" V 4650 1900 60  0001 C CNN "Field1"
F 5 "Digi-Key" V 4650 1900 60  0001 C CNN "Field2"
	1    4650 1900
	0    -1   -1   0   
$EndComp
$Comp
L GND #PWR012
U 1 1 5462B475
P 6050 2500
AR Path="/54603C99/5462B475" Ref="#PWR012"  Part="1" 
AR Path="/546352F5/5462B475" Ref="#PWR017"  Part="1" 
F 0 "#PWR017" H 6050 2500 30  0001 C CNN
F 1 "GND" H 6050 2430 30  0001 C CNN
F 2 "" H 6050 2500 60  0000 C CNN
F 3 "" H 6050 2500 60  0000 C CNN
	1    6050 2500
	1    0    0    -1  
$EndComp
$Comp
L GND #PWR013
U 1 1 5462B482
P 4300 2500
AR Path="/54603C99/5462B482" Ref="#PWR013"  Part="1" 
AR Path="/546352F5/5462B482" Ref="#PWR018"  Part="1" 
F 0 "#PWR018" H 4300 2500 30  0001 C CNN
F 1 "GND" H 4300 2430 30  0001 C CNN
F 2 "" H 4300 2500 60  0000 C CNN
F 3 "" H 4300 2500 60  0000 C CNN
	1    4300 2500
	1    0    0    -1  
$EndComp
Wire Bus Line
	2100 2700 2300 2700
Wire Wire Line
	2550 2850 4350 2850
Wire Wire Line
	2400 2950 4350 2950
Wire Wire Line
	2400 3150 4350 3150
Wire Wire Line
	2550 3450 4350 3450
Wire Wire Line
	2400 3550 4350 3550
Wire Wire Line
	2400 3750 4350 3750
Wire Wire Line
	2550 3850 4350 3850
Wire Wire Line
	2550 4050 4350 4050
Wire Wire Line
	2400 4150 4350 4150
Wire Wire Line
	2400 4350 4350 4350
Wire Wire Line
	2550 4450 4350 4450
Wire Wire Line
	2550 4650 4350 4650
Wire Wire Line
	2400 4750 4350 4750
Wire Wire Line
	2550 5050 4350 5050
Wire Bus Line
	8400 2700 8200 2700
Wire Bus Line
	8400 2600 8000 2600
Wire Wire Line
	7900 2850 6050 2850
Wire Wire Line
	8100 2950 6050 2950
Wire Wire Line
	6050 3150 8100 3150
Wire Wire Line
	7900 3450 6050 3450
Wire Wire Line
	8100 3550 6050 3550
Wire Wire Line
	6050 3750 8100 3750
Wire Wire Line
	7900 4050 6050 4050
Wire Wire Line
	8100 4150 6050 4150
Wire Wire Line
	6050 4350 8100 4350
Wire Wire Line
	7900 4650 6050 4650
Wire Wire Line
	8100 4750 6050 4750
Wire Wire Line
	6050 4950 8100 4950
Wire Wire Line
	7900 5050 6050 5050
Wire Bus Line
	8000 2600 8000 5000
Wire Wire Line
	5000 6300 5000 6150
Wire Wire Line
	5400 6300 5400 6150
Connection ~ 5200 6300
Wire Wire Line
	5300 6300 5300 6150
Connection ~ 5300 6300
Wire Wire Line
	5100 6300 5100 6150
Connection ~ 5100 6300
Connection ~ 5000 6300
Wire Wire Line
	6150 6300 5000 6300
Wire Bus Line
	2450 2600 2450 5000
Wire Bus Line
	2450 2600 2100 2600
Wire Wire Line
	6050 5450 6150 5450
Wire Wire Line
	6150 5450 6150 6300
Wire Wire Line
	6050 5550 6150 5550
Connection ~ 6150 5550
Wire Wire Line
	6050 5650 6150 5650
Connection ~ 6150 5650
Wire Wire Line
	6050 5750 6150 5750
Connection ~ 6150 5750
Connection ~ 5400 6300
Wire Wire Line
	5200 6150 5200 6300
Connection ~ 5750 6300
Wire Wire Line
	5750 6300 5750 6450
Wire Wire Line
	5000 2350 5000 2250
Wire Wire Line
	4850 2250 5500 2250
Wire Wire Line
	5100 2350 5100 1900
Wire Wire Line
	4850 1900 5500 1900
Wire Wire Line
	5300 1900 5300 2350
Wire Wire Line
	5400 2250 5400 2350
Wire Wire Line
	4300 1900 4450 1900
Connection ~ 4300 1900
Wire Wire Line
	4300 2250 4450 2250
Connection ~ 4300 2250
Wire Wire Line
	5900 1900 6050 1900
Wire Wire Line
	6050 1900 6050 2500
Wire Wire Line
	5900 2250 6050 2250
Connection ~ 6050 2250
Connection ~ 5100 1900
Connection ~ 5200 1900
Connection ~ 5200 2250
Connection ~ 5000 2250
Connection ~ 5400 2250
Connection ~ 5300 1900
$Comp
L 4816P-1-101LF U1
U 1 1 5480C3B8
P 3650 3250
AR Path="/54603C99/5480C3B8" Ref="U1"  Part="1" 
AR Path="/546352F5/5480C3B8" Ref="U3"  Part="1" 
F 0 "U1" H 3400 3750 60  0000 C CNN
F 1 "4816P-1-101LF" H 3700 3850 60  0000 C CNN
F 2 "integrated_tdc_pcblib:4816P-1-101LF" H 3650 3250 60  0001 C CNN
F 3 "" H 3650 3250 60  0000 C CNN
F 4 "4816P-1-101LFTR-ND" H 3650 3250 60  0001 C CNN "Field1"
F 5 "Digi-Key" H 3650 3250 60  0001 C CNN "Field2"
	1    3650 3250
	1    0    0    -1  
$EndComp
Wire Wire Line
	2400 4950 4350 4950
Wire Wire Line
	3050 3150 3050 3200
Connection ~ 3050 3150
Wire Wire Line
	4250 3250 4250 3200
Connection ~ 4250 3250
Wire Wire Line
	3050 3750 3050 3800
Connection ~ 3050 3750
Wire Wire Line
	3050 4350 3050 4400
Connection ~ 3050 4350
Wire Wire Line
	3050 4950 3050 5000
Connection ~ 3050 4950
Wire Wire Line
	4250 5050 4250 5000
Connection ~ 4250 5050
Wire Wire Line
	4250 4450 4250 4400
Connection ~ 4250 4450
Wire Wire Line
	4250 3850 4250 3800
Connection ~ 4250 3850
Entry Wire Line
	2300 2850 2400 2950
Entry Wire Line
	2300 3050 2400 3150
Entry Wire Line
	2300 3450 2400 3550
Entry Wire Line
	2300 3650 2400 3750
Entry Wire Line
	2300 4050 2400 4150
Entry Wire Line
	2300 4250 2400 4350
Entry Wire Line
	2300 4650 2400 4750
Entry Wire Line
	2300 4850 2400 4950
Entry Wire Line
	2450 2750 2550 2850
Entry Wire Line
	2450 3200 2550 3300
Wire Wire Line
	2550 3250 4350 3250
Wire Wire Line
	2550 3250 2550 3300
Entry Wire Line
	2450 3350 2550 3450
Entry Wire Line
	2450 3800 2550 3900
Entry Wire Line
	2450 3950 2550 4050
Entry Wire Line
	2450 4400 2550 4500
Entry Wire Line
	2450 4550 2550 4650
Wire Wire Line
	2550 3850 2550 3900
Wire Wire Line
	2550 4450 2550 4500
Entry Wire Line
	2450 5000 2550 5100
Wire Wire Line
	2550 5050 2550 5100
Wire Bus Line
	2300 2700 2300 4850
Entry Wire Line
	7900 2850 8000 2750
Entry Wire Line
	8100 3150 8200 3050
Wire Wire Line
	7900 3250 7900 3300
Wire Wire Line
	6050 3250 7900 3250
Entry Wire Line
	7900 3300 8000 3200
Entry Wire Line
	8100 3750 8200 3650
Entry Wire Line
	7900 3900 8000 3800
Wire Wire Line
	7900 3850 7900 3900
Wire Wire Line
	7900 3850 6050 3850
Entry Wire Line
	8100 4350 8200 4250
Entry Wire Line
	7900 4500 8000 4400
Wire Wire Line
	7900 4450 7900 4500
Entry Wire Line
	8100 4950 8200 4850
Wire Wire Line
	7900 5050 7900 5100
Entry Wire Line
	7900 5100 8000 5000
Wire Bus Line
	8200 2700 8200 4850
Wire Wire Line
	3050 4700 3050 4750
Connection ~ 3050 4750
Wire Wire Line
	3050 4100 3050 4150
Connection ~ 3050 4150
Wire Wire Line
	3050 3500 3050 3550
Connection ~ 3050 3550
Wire Wire Line
	3050 2900 3050 2950
Connection ~ 3050 2950
Wire Wire Line
	4250 2900 4250 2850
Connection ~ 4250 2850
Wire Wire Line
	4250 3500 4250 3450
Connection ~ 4250 3450
Wire Wire Line
	4250 4100 4250 4050
Connection ~ 4250 4050
Wire Wire Line
	4250 4700 4250 4650
Connection ~ 4250 4650
Wire Wire Line
	6950 2500 6900 2500
Wire Wire Line
	7350 2500 7400 2500
Wire Wire Line
	7350 2400 7450 2400
Wire Wire Line
	7350 2300 7500 2300
Wire Wire Line
	6150 5250 6150 5350
Connection ~ 6150 5350
Wire Wire Line
	7900 4450 6050 4450
Wire Wire Line
	6950 2400 6850 2400
Wire Wire Line
	6950 2300 6800 2300
Wire Wire Line
	6800 2300 6800 2950
Connection ~ 6800 2950
Wire Wire Line
	6850 2400 6850 3150
Connection ~ 6850 3150
Wire Wire Line
	6900 2500 6900 3550
Connection ~ 6900 3550
Wire Wire Line
	6950 2600 6950 3750
Connection ~ 6950 3750
Wire Wire Line
	7500 2300 7500 2850
Connection ~ 7500 2850
Wire Wire Line
	7450 2400 7450 3250
Connection ~ 7450 3250
Wire Wire Line
	7400 2500 7400 3450
Connection ~ 7400 3450
Wire Wire Line
	7350 2600 7350 3850
Connection ~ 7350 3850
Wire Wire Line
	7000 5250 7000 4150
Connection ~ 7000 4150
Wire Wire Line
	7000 5350 6950 5350
Wire Wire Line
	6950 5350 6950 4350
Connection ~ 6950 4350
Wire Wire Line
	7000 5450 6900 5450
Wire Wire Line
	6900 5450 6900 4750
Connection ~ 6900 4750
Wire Wire Line
	7000 5550 6850 5550
Wire Wire Line
	6850 5550 6850 4950
Connection ~ 6850 4950
Wire Wire Line
	7400 5250 7400 4050
Connection ~ 7400 4050
Wire Wire Line
	7400 5350 7450 5350
Wire Wire Line
	7450 5350 7450 4450
Connection ~ 7450 4450
Wire Wire Line
	7400 5450 7500 5450
Wire Wire Line
	7500 5450 7500 4650
Connection ~ 7500 4650
Wire Wire Line
	7400 5550 7550 5550
Wire Wire Line
	7550 5550 7550 5050
Connection ~ 7550 5050
Wire Wire Line
	6150 5350 6050 5350
Wire Wire Line
	4300 1900 4300 2500
Wire Wire Line
	5200 1450 5200 2350
$Comp
L R_PACK4 RP3
U 1 1 56630CDF
P 7150 2650
AR Path="/546352F5/56630CDF" Ref="RP3"  Part="1" 
AR Path="/54603C99/56630CDF" Ref="RP1"  Part="1" 
F 0 "RP1" H 7150 3100 40  0000 C CNN
F 1 "R_PACK4" H 7150 2600 40  0000 C CNN
F 2 "CAT16-J4:ResPack-CAT16-J4" H 7150 2650 60  0001 C CNN
F 3 "" H 7150 2650 60  0000 C CNN
F 4 "CAT16-101J4LF" H 7150 2650 60  0001 C CNN "Field1"
F 5 "DigiKey" H 7150 2650 60  0001 C CNN "Field2"
	1    7150 2650
	1    0    0    -1  
$EndComp
$Comp
L R_PACK4 RP2
U 1 1 56630E63
P 7200 5600
AR Path="/54603C99/56630E63" Ref="RP2"  Part="1" 
AR Path="/546352F5/56630E63" Ref="RP4"  Part="1" 
F 0 "RP2" H 7200 6050 40  0000 C CNN
F 1 "R_PACK4" H 7200 5550 40  0000 C CNN
F 2 "CAT16-J4:ResPack-CAT16-J4" H 7200 5600 60  0001 C CNN
F 3 "" H 7200 5600 60  0000 C CNN
F 4 "CAT16-101J4LF" H 7200 5600 60  0001 C CNN "Field1"
F 5 "DigiKey" H 7200 5600 60  0001 C CNN "Field2"
	1    7200 5600
	1    0    0    -1  
$EndComp
$EndSCHEMATC
