(module TMM-105-01 (layer F.Cu) (tedit 5633DD90)
  (fp_text reference REF** (at -3 2 90) (layer F.SilkS)
    (effects (font (size 1 1) (thickness 0.15)))
  )
  (fp_text value TMM-105-01 (at 3.9 -2.8) (layer F.Fab)
    (effects (font (size 1 1) (thickness 0.15)))
  )
  (fp_line (start -1.25 -1) (end -1.25 5.25) (layer F.SilkS) (width 0.15))
  (fp_line (start 9.25 -1) (end 9.25 5.25) (layer F.SilkS) (width 0.15))
  (pad 1 smd rect (at 0 0) (size 1.02 3.215) (layers F.Cu F.Paste F.Mask))
  (pad 2 smd rect (at 0 4.445) (size 1.02 3.215) (layers F.Cu F.Paste F.Mask))
  (pad 3 smd rect (at 2 0) (size 1.02 3.215) (layers F.Cu F.Paste F.Mask))
  (pad 4 smd rect (at 2 4.445) (size 1.02 3.215) (layers F.Cu F.Paste F.Mask))
  (pad 5 smd rect (at 4 0) (size 1.02 3.215) (layers F.Cu F.Paste F.Mask))
  (pad 6 smd rect (at 4 4.445) (size 1.02 3.215) (layers F.Cu F.Paste F.Mask))
  (pad 7 smd rect (at 6 0) (size 1.02 3.215) (layers F.Cu F.Paste F.Mask))
  (pad 8 smd rect (at 6 4.445) (size 1.02 3.215) (layers F.Cu F.Paste F.Mask))
  (pad 9 smd rect (at 8 0) (size 1.02 3.215) (layers F.Cu F.Paste F.Mask))
  (pad 10 smd rect (at 8 4.445) (size 1.02 3.215) (layers F.Cu F.Paste F.Mask))
)
