EESchema Schematic File Version 2
LIBS:TDC_Mother-rescue
LIBS:power
LIBS:transistors
LIBS:conn
LIBS:display
LIBS:contrib
LIBS:ep3c5u256_custom
LIBS:ERM8-RA
LIBS:30310-5002hb
LIBS:4816P-1-101LF
LIBS:FIN1108
LIBS:tps78630kttt
LIBS:tps79533
LIBS:+4
LIBS:640456-2
LIBS:micron
LIBS:tps73701drbt
LIBS:ws2812b
LIBS:fixed_conn
LIBS:ao3422
LIBS:my_discrete
LIBS:TMM-105-01
LIBS:my_power
LIBS:atmega168a-mm
LIBS:CAT16-101J4LF
LIBS:tmp36
LIBS:testpoint
LIBS:TDC_Mother-cache
EELAYER 25 0
EELAYER END
$Descr A 11000 8500
encoding utf-8
Sheet 4 14
Title ""
Date "9 oct 2015"
Rev ""
Comp ""
Comment1 ""
Comment2 ""
Comment3 ""
Comment4 ""
$EndDescr
$Comp
L LVDS_FIN1108 U6
U 1 1 54B24747
P 5300 4150
AR Path="/546358D0/54B24747" Ref="U6"  Part="1" 
AR Path="/54635FFB/54B24747" Ref="U8"  Part="1" 
F 0 "U8" H 4700 2500 60  0000 C CNN
F 1 "LVDS_FIN1108" V 5300 4150 79  0000 C CNN
F 2 "FIN1108:FIN1108_RevB" H 4850 3750 60  0001 C CNN
F 3 "" H 4850 3750 60  0000 C CNN
F 4 "FIN1108MTDXTR-ND" H 5300 4150 60  0001 C CNN "Field1"
F 5 "Digi-Key" H 5300 4150 60  0001 C CNN "Field2"
	1    5300 4150
	1    0    0    -1  
$EndComp
Text HLabel 2200 2600 0    60   Input ~ 0
ASDQ_N[7..0]
Text HLabel 2200 2500 0    60   Input ~ 0
ASDQ_P[7..0]
Entry Wire Line
	8600 2750 8500 2850
Entry Wire Line
	8600 3350 8500 3450
Entry Wire Line
	8400 3250 8300 3350
Entry Wire Line
	8600 3950 8500 4050
Entry Wire Line
	8400 3850 8300 3950
Entry Wire Line
	8600 4550 8500 4650
Entry Wire Line
	8400 4450 8300 4550
Text HLabel 8800 2500 2    60   Input ~ 0
LVDS_P[7..0]
Text HLabel 8800 2600 2    60   Input ~ 0
LVDS_N[7..0]
NoConn ~ 4450 5250
$Comp
L +3.3V #PWR019
U 1 1 545F526C
P 5300 1350
AR Path="/546358D0/545F526C" Ref="#PWR019"  Part="1" 
AR Path="/54635FFB/545F526C" Ref="#PWR024"  Part="1" 
F 0 "#PWR024" H 5300 1310 30  0001 C CNN
F 1 "+3.3V" H 5300 1460 30  0000 C CNN
F 2 "" H 5300 1350 60  0000 C CNN
F 3 "" H 5300 1350 60  0000 C CNN
	1    5300 1350
	1    0    0    -1  
$EndComp
Text Label 6200 4950 0    60   ~ 0
LVDS_P0
Text Label 6200 4550 0    60   ~ 0
LVDS_P1
Text Label 6200 4350 0    60   ~ 0
LVDS_P2
Text Label 6200 3950 0    60   ~ 0
LVDS_P3
Text Label 6200 3750 0    60   ~ 0
LVDS_P4
Text Label 6200 3350 0    60   ~ 0
LVDS_P5
Text Label 6200 3150 0    60   ~ 0
LVDS_P6
Text Label 6200 2750 0    60   ~ 0
LVDS_P7
Text Label 6200 4850 0    60   ~ 0
LVDS_N0
Text Label 6200 4650 0    60   ~ 0
LVDS_N1
Text Label 6200 4250 0    60   ~ 0
LVDS_N2
Text Label 6200 4050 0    60   ~ 0
LVDS_N3
Text Label 6200 3650 0    60   ~ 0
LVDS_N4
Text Label 6200 3450 0    60   ~ 0
LVDS_N5
Text Label 6200 3050 0    60   ~ 0
LVDS_N6
Text Label 6200 2850 0    60   ~ 0
LVDS_N7
Text Label 2650 4950 0    60   ~ 0
ASDQ_P0
Text Label 2650 4550 0    60   ~ 0
ASDQ_P1
Text Label 2650 4350 0    60   ~ 0
ASDQ_P2
Text Label 2650 3950 0    60   ~ 0
ASDQ_P3
Text Label 2650 3750 0    60   ~ 0
ASDQ_P4
Text Label 2650 3350 0    60   ~ 0
ASDQ_P5
Text Label 2650 3150 0    60   ~ 0
ASDQ_P6
Text Label 2650 2750 0    60   ~ 0
ASDQ_P7
Text Label 2650 4850 0    60   ~ 0
ASDQ_N0
Text Label 2650 4650 0    60   ~ 0
ASDQ_N1
Text Label 2650 4250 0    60   ~ 0
ASDQ_N2
Text Label 2650 4050 0    60   ~ 0
ASDQ_N3
Text Label 2650 3650 0    60   ~ 0
ASDQ_N4
Text Label 2650 3450 0    60   ~ 0
ASDQ_N5
Text Label 2650 3050 0    60   ~ 0
ASDQ_N6
Text Label 2650 2850 0    60   ~ 0
ASDQ_N7
$Comp
L GND #PWR020
U 1 1 54B24749
P 5850 6350
AR Path="/546358D0/54B24749" Ref="#PWR020"  Part="1" 
AR Path="/54635FFB/54B24749" Ref="#PWR025"  Part="1" 
F 0 "#PWR025" H 5850 6350 30  0001 C CNN
F 1 "GND" H 5850 6280 30  0001 C CNN
F 2 "" H 5850 6350 60  0000 C CNN
F 3 "" H 5850 6350 60  0000 C CNN
	1    5850 6350
	1    0    0    -1  
$EndComp
$Comp
L +3.3V #PWR021
U 1 1 5460C437
P 6400 5200
AR Path="/546358D0/5460C437" Ref="#PWR021"  Part="1" 
AR Path="/54635FFB/5460C437" Ref="#PWR026"  Part="1" 
F 0 "#PWR026" H 6400 5160 30  0001 C CNN
F 1 "+3.3V" H 6400 5310 30  0000 C CNN
F 2 "" H 6400 5200 60  0000 C CNN
F 3 "" H 6400 5200 60  0000 C CNN
	1    6400 5200
	1    0    0    -1  
$EndComp
$Comp
L C C11
U 1 1 54B2474B
P 5800 1800
AR Path="/546358D0/54B2474B" Ref="C11"  Part="1" 
AR Path="/54635FFB/54B2474B" Ref="C15"  Part="1" 
F 0 "C15" V 5750 1900 50  0000 C CNN
F 1 ".01uF" V 5750 1650 50  0000 C CNN
F 2 "libcms:SM0603_Capa" H 5800 1800 60  0001 C CNN
F 3 "" H 5800 1800 60  0000 C CNN
F 4 "399-1091-1-ND" V 5800 1800 60  0001 C CNN "Field1"
F 5 "Digi-Key" V 5800 1800 60  0001 C CNN "Field2"
	1    5800 1800
	0    -1   -1   0   
$EndComp
$Comp
L C C12
U 1 1 54B2474C
P 5800 2150
AR Path="/546358D0/54B2474C" Ref="C12"  Part="1" 
AR Path="/54635FFB/54B2474C" Ref="C16"  Part="1" 
F 0 "C16" V 5750 2250 50  0000 C CNN
F 1 ".01uF" V 5750 2000 50  0000 C CNN
F 2 "libcms:SM0603_Capa" H 5800 2150 60  0001 C CNN
F 3 "" H 5800 2150 60  0000 C CNN
F 4 "399-1091-1-ND" V 5800 2150 60  0001 C CNN "Field1"
F 5 "Digi-Key" V 5800 2150 60  0001 C CNN "Field2"
	1    5800 2150
	0    -1   -1   0   
$EndComp
$Comp
L C C10
U 1 1 54B2474D
P 4750 2150
AR Path="/546358D0/54B2474D" Ref="C10"  Part="1" 
AR Path="/54635FFB/54B2474D" Ref="C14"  Part="1" 
F 0 "C14" V 4700 2250 50  0000 C CNN
F 1 ".01uF" V 4700 2000 50  0000 C CNN
F 2 "libcms:SM0603_Capa" H 4750 2150 60  0001 C CNN
F 3 "" H 4750 2150 60  0000 C CNN
F 4 "399-1091-1-ND" V 4750 2150 60  0001 C CNN "Field1"
F 5 "Digi-Key" V 4750 2150 60  0001 C CNN "Field2"
	1    4750 2150
	0    -1   -1   0   
$EndComp
$Comp
L C C9
U 1 1 54B2474E
P 4750 1800
AR Path="/546358D0/54B2474E" Ref="C9"  Part="1" 
AR Path="/54635FFB/54B2474E" Ref="C13"  Part="1" 
F 0 "C13" V 4700 1900 50  0000 C CNN
F 1 ".01uF" V 4700 1650 50  0000 C CNN
F 2 "libcms:SM0603_Capa" H 4750 1800 60  0001 C CNN
F 3 "" H 4750 1800 60  0000 C CNN
F 4 "399-1091-1-ND" V 4750 1800 60  0001 C CNN "Field1"
F 5 "Digi-Key" V 4750 1800 60  0001 C CNN "Field2"
	1    4750 1800
	0    -1   -1   0   
$EndComp
$Comp
L GND #PWR022
U 1 1 54B24750
P 6150 2400
AR Path="/546358D0/54B24750" Ref="#PWR022"  Part="1" 
AR Path="/54635FFB/54B24750" Ref="#PWR027"  Part="1" 
F 0 "#PWR027" H 6150 2400 30  0001 C CNN
F 1 "GND" H 6150 2330 30  0001 C CNN
F 2 "" H 6150 2400 60  0000 C CNN
F 3 "" H 6150 2400 60  0000 C CNN
	1    6150 2400
	1    0    0    -1  
$EndComp
$Comp
L GND #PWR023
U 1 1 54B24751
P 4400 2400
AR Path="/546358D0/54B24751" Ref="#PWR023"  Part="1" 
AR Path="/54635FFB/54B24751" Ref="#PWR028"  Part="1" 
F 0 "#PWR028" H 4400 2400 30  0001 C CNN
F 1 "GND" H 4400 2330 30  0001 C CNN
F 2 "" H 4400 2400 60  0000 C CNN
F 3 "" H 4400 2400 60  0000 C CNN
	1    4400 2400
	1    0    0    -1  
$EndComp
$Comp
L 4816P-1-101LF U5
U 1 1 54B24752
P 3750 3150
AR Path="/546358D0/54B24752" Ref="U5"  Part="1" 
AR Path="/54635FFB/54B24752" Ref="U7"  Part="1" 
F 0 "U7" H 3750 1300 60  0000 C CNN
F 1 "4816P-1-101LF" H 3750 3600 60  0000 C CNN
F 2 "integrated_tdc_pcblib:4816P-1-101LF" H 3750 3150 60  0001 C CNN
F 3 "" H 3750 3150 60  0000 C CNN
F 4 "4816P-1-101LFTR-ND" H 3750 3150 60  0001 C CNN "Field1"
F 5 "Digi-Key" H 3750 3150 60  0001 C CNN "Field2"
	1    3750 3150
	1    0    0    -1  
$EndComp
Entry Wire Line
	2400 2750 2500 2850
Entry Wire Line
	2400 2950 2500 3050
Entry Wire Line
	2400 3350 2500 3450
Entry Wire Line
	2400 3550 2500 3650
Entry Wire Line
	2400 3950 2500 4050
Entry Wire Line
	2400 4150 2500 4250
Entry Wire Line
	2400 4550 2500 4650
Entry Wire Line
	2400 4750 2500 4850
Entry Wire Line
	2550 2650 2650 2750
Entry Wire Line
	2550 3100 2650 3200
Entry Wire Line
	2550 3250 2650 3350
Entry Wire Line
	2550 3700 2650 3800
Entry Wire Line
	2550 3850 2650 3950
Entry Wire Line
	2550 4300 2650 4400
Entry Wire Line
	2550 4450 2650 4550
Entry Wire Line
	2550 4900 2650 5000
Entry Wire Line
	8300 2750 8400 2650
Entry Wire Line
	8500 3050 8600 2950
Entry Wire Line
	8300 3200 8400 3100
Entry Wire Line
	8500 3650 8600 3550
Entry Wire Line
	8300 3800 8400 3700
Entry Wire Line
	8500 4250 8600 4150
Entry Wire Line
	8300 4400 8400 4300
Entry Wire Line
	8500 4850 8600 4750
Entry Wire Line
	8300 5000 8400 4900
Wire Bus Line
	2200 2600 2400 2600
Wire Wire Line
	2650 2750 4450 2750
Wire Wire Line
	2500 2850 4450 2850
Wire Wire Line
	2500 3050 4450 3050
Wire Wire Line
	2650 3350 4450 3350
Wire Wire Line
	2500 3450 4450 3450
Wire Wire Line
	2500 3650 4450 3650
Wire Wire Line
	2650 3750 4450 3750
Wire Wire Line
	2650 3950 4450 3950
Wire Wire Line
	2500 4050 4450 4050
Wire Wire Line
	2500 4250 4450 4250
Wire Wire Line
	2650 4350 4450 4350
Wire Wire Line
	2650 4550 4450 4550
Wire Wire Line
	2500 4650 4450 4650
Wire Wire Line
	2650 4950 4450 4950
Wire Bus Line
	8800 2600 8600 2600
Wire Bus Line
	8800 2500 8400 2500
Wire Wire Line
	6150 2750 8300 2750
Wire Wire Line
	6150 2850 8500 2850
Wire Wire Line
	6150 3050 8500 3050
Wire Wire Line
	6150 3350 8300 3350
Wire Wire Line
	6150 3450 8500 3450
Wire Wire Line
	6150 3650 8500 3650
Wire Wire Line
	8500 4050 6150 4050
Wire Wire Line
	6150 4250 8500 4250
Wire Wire Line
	8300 4350 6150 4350
Wire Wire Line
	8300 4550 6150 4550
Wire Wire Line
	8500 4650 6150 4650
Wire Wire Line
	6150 4850 8500 4850
Wire Wire Line
	8300 4950 6150 4950
Wire Bus Line
	8400 2500 8400 4900
Wire Wire Line
	5100 6200 5100 6050
Wire Wire Line
	5500 6200 5500 6050
Connection ~ 5300 6200
Wire Wire Line
	5400 6200 5400 6050
Connection ~ 5400 6200
Wire Wire Line
	5200 6200 5200 6050
Connection ~ 5200 6200
Connection ~ 5100 6200
Wire Wire Line
	6250 6200 5100 6200
Wire Wire Line
	6150 5250 6400 5250
Wire Bus Line
	2550 2500 2550 4900
Wire Bus Line
	2550 2500 2200 2500
Wire Wire Line
	6150 5350 6250 5350
Wire Wire Line
	6250 5350 6250 6200
Wire Wire Line
	6150 5450 6250 5450
Connection ~ 6250 5450
Wire Wire Line
	6150 5550 6250 5550
Connection ~ 6250 5550
Wire Wire Line
	6150 5650 6250 5650
Connection ~ 6250 5650
Connection ~ 5500 6200
Wire Wire Line
	5300 6050 5300 6200
Connection ~ 5850 6200
Wire Wire Line
	6400 5250 6400 5200
Wire Wire Line
	5850 6200 5850 6350
Wire Wire Line
	5100 2250 5100 2150
Wire Wire Line
	4950 2150 5600 2150
Wire Wire Line
	5200 2250 5200 1800
Wire Wire Line
	4950 1800 5600 1800
Wire Wire Line
	5300 1350 5300 2250
Wire Wire Line
	5400 1800 5400 2250
Wire Wire Line
	5500 2150 5500 2250
Wire Wire Line
	4400 1800 4550 1800
Connection ~ 4400 1800
Wire Wire Line
	4400 2150 4550 2150
Connection ~ 4400 2150
Wire Wire Line
	6000 1800 6150 1800
Wire Wire Line
	6150 1800 6150 2400
Wire Wire Line
	6000 2150 6150 2150
Connection ~ 6150 2150
Connection ~ 5200 1800
Connection ~ 5300 1800
Connection ~ 5300 2150
Connection ~ 5100 2150
Connection ~ 5500 2150
Connection ~ 5400 1800
Wire Wire Line
	2500 4850 4450 4850
Wire Wire Line
	3150 2750 3150 2800
Connection ~ 3150 2750
Wire Wire Line
	4350 2850 4350 2800
Connection ~ 4350 2850
Wire Wire Line
	3150 3350 3150 3400
Connection ~ 3150 3350
Wire Wire Line
	3150 3950 3150 4000
Connection ~ 3150 3950
Wire Wire Line
	3150 4550 3150 4600
Connection ~ 3150 4550
Wire Wire Line
	4350 4650 4350 4600
Connection ~ 4350 4650
Wire Wire Line
	4350 4050 4350 4000
Connection ~ 4350 4050
Wire Wire Line
	4350 3450 4350 3400
Connection ~ 4350 3450
Wire Wire Line
	2650 3150 4450 3150
Wire Wire Line
	2650 3150 2650 3200
Wire Wire Line
	2650 3750 2650 3800
Wire Wire Line
	2650 4350 2650 4400
Wire Wire Line
	2650 4950 2650 5000
Wire Bus Line
	2400 2600 2400 4750
Wire Wire Line
	8300 3150 8300 3200
Wire Wire Line
	6150 3150 8300 3150
Wire Wire Line
	8300 3750 8300 3800
Wire Wire Line
	6150 3750 8300 3750
Wire Wire Line
	8300 4350 8300 4400
Wire Wire Line
	8300 4950 8300 5000
Wire Bus Line
	8600 2600 8600 4750
Wire Wire Line
	4350 4900 4350 4850
Connection ~ 4350 4850
Wire Wire Line
	3150 4900 3150 4950
Connection ~ 3150 4950
Wire Wire Line
	3150 4300 3150 4350
Connection ~ 3150 4350
Wire Wire Line
	3150 3700 3150 3750
Connection ~ 3150 3750
Wire Wire Line
	3150 3100 3150 3150
Connection ~ 3150 3150
Wire Wire Line
	4350 3100 4350 3050
Connection ~ 4350 3050
Wire Wire Line
	4350 3700 4350 3650
Connection ~ 4350 3650
Wire Wire Line
	4350 4300 4350 4250
Connection ~ 4350 4250
Wire Wire Line
	8300 3950 6150 3950
Wire Wire Line
	7200 2350 7150 2350
Wire Wire Line
	7100 2250 7200 2250
Wire Wire Line
	7200 2150 7050 2150
Wire Wire Line
	7600 2350 7650 2350
Wire Wire Line
	7600 2250 7700 2250
Wire Wire Line
	7600 2150 7750 2150
Wire Wire Line
	7250 5350 7200 5350
Wire Wire Line
	7250 5450 7150 5450
Wire Wire Line
	7250 5550 7100 5550
Wire Wire Line
	7650 5350 7700 5350
Wire Wire Line
	7650 5450 7750 5450
Wire Wire Line
	7650 5550 7800 5550
Wire Wire Line
	7200 2450 7200 2750
Connection ~ 7200 2750
Wire Wire Line
	7150 2350 7150 3150
Connection ~ 7150 3150
Wire Wire Line
	7100 2250 7100 3350
Connection ~ 7100 3350
Wire Wire Line
	7050 2150 7050 3750
Connection ~ 7050 3750
Wire Wire Line
	7600 2450 7600 2850
Connection ~ 7600 2850
Wire Wire Line
	7650 2350 7650 3050
Connection ~ 7650 3050
Wire Wire Line
	7700 2250 7700 3450
Connection ~ 7700 3450
Wire Wire Line
	7750 2150 7750 3650
Connection ~ 7750 3650
Wire Wire Line
	7100 5550 7100 3950
Connection ~ 7100 3950
Wire Wire Line
	7150 5450 7150 4350
Connection ~ 7150 4350
Wire Wire Line
	7200 5350 7200 4550
Connection ~ 7200 4550
Wire Wire Line
	7250 5250 7250 4950
Connection ~ 7250 4950
Wire Wire Line
	7650 5250 7650 4850
Connection ~ 7650 4850
Wire Wire Line
	7700 5350 7700 4650
Connection ~ 7700 4650
Wire Wire Line
	7750 5450 7750 4250
Connection ~ 7750 4250
Wire Wire Line
	7800 5550 7800 4050
Connection ~ 7800 4050
Wire Wire Line
	4400 1800 4400 2400
$Comp
L R_PACK4 RP5
U 1 1 56632730
P 7400 2500
AR Path="/546358D0/56632730" Ref="RP5"  Part="1" 
AR Path="/54635FFB/56632730" Ref="RP7"  Part="1" 
F 0 "RP7" H 7400 2950 40  0000 C CNN
F 1 "R_PACK4" H 7400 2450 40  0000 C CNN
F 2 "CAT16-J4:ResPack-CAT16-J4" H 7400 2500 60  0001 C CNN
F 3 "" H 7400 2500 60  0000 C CNN
F 4 "CAT16-101J4LF" H 7400 2500 60  0001 C CNN "Field1"
F 5 "DigiKey" H 7400 2500 60  0001 C CNN "Field2"
	1    7400 2500
	1    0    0    -1  
$EndComp
$Comp
L R_PACK4 RP6
U 1 1 566327A4
P 7450 5600
AR Path="/546358D0/566327A4" Ref="RP6"  Part="1" 
AR Path="/54635FFB/566327A4" Ref="RP8"  Part="1" 
F 0 "RP8" H 7450 6050 40  0000 C CNN
F 1 "R_PACK4" H 7450 5550 40  0000 C CNN
F 2 "CAT16-J4:ResPack-CAT16-J4" H 7450 5600 60  0001 C CNN
F 3 "" H 7450 5600 60  0000 C CNN
F 4 "CAT16-101J4LF" H 7450 5600 60  0001 C CNN "Field1"
F 5 "DigiKey" H 7450 5600 60  0001 C CNN "Field2"
	1    7450 5600
	1    0    0    -1  
$EndComp
$EndSCHEMATC
