EESchema Schematic File Version 2
LIBS:TDC_Mother-rescue
LIBS:power
LIBS:transistors
LIBS:conn
LIBS:display
LIBS:contrib
LIBS:ep3c5u256_custom
LIBS:ERM8-RA
LIBS:30310-5002hb
LIBS:4816P-1-101LF
LIBS:FIN1108
LIBS:tps78630kttt
LIBS:tps79533
LIBS:+4
LIBS:640456-2
LIBS:micron
LIBS:tps73701drbt
LIBS:ws2812b
LIBS:fixed_conn
LIBS:ao3422
LIBS:my_discrete
LIBS:TMM-105-01
LIBS:my_power
LIBS:atmega168a-mm
LIBS:CAT16-101J4LF
LIBS:tmp36
LIBS:testpoint
LIBS:TDC_Mother-cache
EELAYER 25 0
EELAYER END
$Descr A 11000 8500
encoding utf-8
Sheet 6 14
Title ""
Date "9 oct 2015"
Rev ""
Comp ""
Comment1 ""
Comment2 ""
Comment3 ""
Comment4 ""
$EndDescr
Text Notes 2850 1450 0    60   ~ 0
3.3V Regulator\n1.5A Limit\n1A Out (estimated)
$Comp
L GND #PWR029
U 1 1 560E884B
P 3150 2950
F 0 "#PWR029" H 3150 2950 30  0001 C CNN
F 1 "GND" H 3150 2880 30  0001 C CNN
F 2 "" H 3150 2950 60  0000 C CNN
F 3 "" H 3150 2950 60  0000 C CNN
	1    3150 2950
	1    0    0    -1  
$EndComp
$Comp
L GND #PWR030
U 1 1 560E8857
P 1950 2950
F 0 "#PWR030" H 1950 2950 30  0001 C CNN
F 1 "GND" H 1950 2880 30  0001 C CNN
F 2 "" H 1950 2950 60  0000 C CNN
F 3 "" H 1950 2950 60  0000 C CNN
	1    1950 2950
	1    0    0    -1  
$EndComp
$Comp
L C C21
U 1 1 560E885F
P 4550 2300
F 0 "C21" H 4550 2400 40  0000 L CNN
F 1 "2.2uF" H 4556 2215 40  0000 L CNN
F 2 "libcms:SM0603_Capa" H 4588 2150 30  0001 C CNN
F 3 "~" H 4550 2300 60  0000 C CNN
F 4 "587-1263-1-ND" H 4550 2300 60  0001 C CNN "Field1"
F 5 "Digi-Key" H 4550 2300 60  0001 C CNN "Field2"
	1    4550 2300
	1    0    0    -1  
$EndComp
$Comp
L GND #PWR031
U 1 1 560E8884
P 4550 2950
F 0 "#PWR031" H 4550 2950 30  0001 C CNN
F 1 "GND" H 4550 2880 30  0001 C CNN
F 2 "" H 4550 2950 60  0000 C CNN
F 3 "" H 4550 2950 60  0000 C CNN
	1    4550 2950
	1    0    0    -1  
$EndComp
$Comp
L C C17
U 1 1 560E888C
P 1950 2350
F 0 "C17" H 1950 2450 40  0000 L CNN
F 1 "2.2uF" H 1956 2265 40  0000 L CNN
F 2 "libcms:SM0603_Capa" H 1988 2200 30  0001 C CNN
F 3 "~" H 1950 2350 60  0000 C CNN
F 4 "587-1263-1-ND" H 1950 2350 60  0001 C CNN "Field1"
F 5 "Digi-Key" H 1950 2350 60  0001 C CNN "Field2"
	1    1950 2350
	1    0    0    -1  
$EndComp
$Comp
L +5V #PWR032
U 1 1 560E88C4
P 1950 2000
F 0 "#PWR032" H 1950 2090 20  0001 C CNN
F 1 "+5V" H 1950 2090 30  0000 C CNN
F 2 "" H 1950 2000 60  0000 C CNN
F 3 "" H 1950 2000 60  0000 C CNN
	1    1950 2000
	1    0    0    -1  
$EndComp
Text Notes 5450 1000 0    200  ~ 40
Power
$Comp
L TPS78633KTTT U11
U 1 1 56159722
P 3150 1900
F 0 "U11" H 3500 1400 60  0000 C CNN
F 1 "TPS78633KTTT" H 3150 1900 60  0000 C CNN
F 2 "integrated_tdc_pcblib:TPS78601KTTT" H 3150 1900 60  0001 C CNN
F 3 "" H 3150 1900 60  0000 C CNN
F 4 "296-14426-1-ND" H 3150 1900 60  0001 C CNN "Field1"
F 5 "Digikey" H 3150 1900 60  0001 C CNN "Field2"
	1    3150 1900
	1    0    0    -1  
$EndComp
$Comp
L GND #PWR033
U 1 1 561597EA
P 4100 2950
F 0 "#PWR033" H 4100 2950 30  0001 C CNN
F 1 "GND" H 4100 2880 30  0001 C CNN
F 2 "" H 4100 2950 60  0000 C CNN
F 3 "" H 4100 2950 60  0000 C CNN
	1    4100 2950
	1    0    0    -1  
$EndComp
$Comp
L +3.3V #PWR034
U 1 1 56159823
P 4550 1650
F 0 "#PWR034" H 4550 1610 30  0001 C CNN
F 1 "+3.3V" H 4550 1760 30  0000 C CNN
F 2 "" H 4550 1650 60  0000 C CNN
F 3 "" H 4550 1650 60  0000 C CNN
	1    4550 1650
	1    0    0    -1  
$EndComp
Text Notes 650  1200 0    80   ~ 0
3.3V supplies:\nLVDS buffers (300 mA)\nTDC I/O's (11 mA)\nMCU (5 mA)\nBoard (450 mA)
$Comp
L +3.3V #PWR035
U 1 1 5615A40B
P 6600 1600
F 0 "#PWR035" H 6600 1560 30  0001 C CNN
F 1 "+3.3V" H 6600 1710 30  0000 C CNN
F 2 "" H 6600 1600 60  0000 C CNN
F 3 "" H 6600 1600 60  0000 C CNN
	1    6600 1600
	1    0    0    -1  
$EndComp
$Comp
L C C24
U 1 1 5615A424
P 6600 2050
F 0 "C24" H 6600 2150 40  0000 L CNN
F 1 "1uF" H 6606 1965 40  0000 L CNN
F 2 "libcms:SM0402" H 6638 1900 30  0001 C CNN
F 3 "~" H 6600 2050 60  0000 C CNN
F 4 "490-9665-1-ND" H 6600 2050 60  0001 C CNN "Field1"
F 5 "Digi-Key" H 6600 2050 60  0001 C CNN "Field2"
	1    6600 2050
	1    0    0    -1  
$EndComp
$Comp
L R R12
U 1 1 5615A541
P 8550 2000
F 0 "R12" V 8630 2000 40  0000 C CNN
F 1 "39.2k" V 8557 2001 40  0000 C CNN
F 2 "libcms:SM0402_r" V 8480 2000 30  0001 C CNN
F 3 "~" H 8550 2000 30  0000 C CNN
F 4 "YAG1418CT-ND" V 8550 2000 60  0001 C CNN "Field1"
F 5 "Digikey" V 8550 2000 60  0001 C CNN "Field2"
	1    8550 2000
	1    0    0    -1  
$EndComp
$Comp
L GND #PWR036
U 1 1 5615A695
P 8550 3000
F 0 "#PWR036" H 8550 3000 30  0001 C CNN
F 1 "GND" H 8550 2930 30  0001 C CNN
F 2 "" H 8550 3000 60  0000 C CNN
F 3 "" H 8550 3000 60  0000 C CNN
	1    8550 3000
	1    0    0    -1  
$EndComp
$Comp
L GND #PWR037
U 1 1 5615A69B
P 6600 2600
F 0 "#PWR037" H 6600 2600 30  0001 C CNN
F 1 "GND" H 6600 2530 30  0001 C CNN
F 2 "" H 6600 2600 60  0000 C CNN
F 3 "" H 6600 2600 60  0000 C CNN
	1    6600 2600
	1    0    0    -1  
$EndComp
$Comp
L GND #PWR038
U 1 1 5615A6E5
P 7600 2650
F 0 "#PWR038" H 7600 2650 30  0001 C CNN
F 1 "GND" H 7600 2580 30  0001 C CNN
F 2 "" H 7600 2650 60  0000 C CNN
F 3 "" H 7600 2650 60  0000 C CNN
	1    7600 2650
	1    0    0    -1  
$EndComp
$Comp
L +2.5V #PWR039
U 1 1 5615A7BE
P 8900 1600
F 0 "#PWR039" H 8900 1550 20  0001 C CNN
F 1 "+2.5V" H 8900 1700 30  0000 C CNN
F 2 "" H 8900 1600 60  0000 C CNN
F 3 "" H 8900 1600 60  0000 C CNN
	1    8900 1600
	1    0    0    -1  
$EndComp
$Comp
L C C29
U 1 1 5615A7CD
P 8900 2050
F 0 "C29" H 8900 2150 40  0000 L CNN
F 1 "1uF" H 8906 1965 40  0000 L CNN
F 2 "libcms:SM0402" H 8938 1900 30  0001 C CNN
F 3 "~" H 8900 2050 60  0000 C CNN
F 4 "490-9665-1-ND" H 8900 2050 60  0001 C CNN "Field1"
F 5 "Digi-Key" H 8900 2050 60  0001 C CNN "Field2"
	1    8900 2050
	1    0    0    -1  
$EndComp
$Comp
L GND #PWR040
U 1 1 5615A8A7
P 8900 2600
F 0 "#PWR040" H 8900 2600 30  0001 C CNN
F 1 "GND" H 8900 2530 30  0001 C CNN
F 2 "" H 8900 2600 60  0000 C CNN
F 3 "" H 8900 2600 60  0000 C CNN
	1    8900 2600
	1    0    0    -1  
$EndComp
Text Notes 7250 1350 0    60   ~ 0
2.5V Regulator for both TDC LVDS banks\n1A Limit\n0.112A Out (measured)
Text Notes 2500 5700 0    60   ~ 0
2.5V Regulator for TDC2 PLL VCCA \n1A Limit\n0.021A Out (measured)
Text Notes 2500 3550 0    60   ~ 0
2.5V Regulator for TDC1 PLL VCCA \n1A Limit\n0.021A Out (measured)
$Comp
L GND #PWR041
U 1 1 5615A966
P 4550 4900
F 0 "#PWR041" H 4550 4900 30  0001 C CNN
F 1 "GND" H 4550 4830 30  0001 C CNN
F 2 "" H 4550 4900 60  0000 C CNN
F 3 "" H 4550 4900 60  0000 C CNN
	1    4550 4900
	1    0    0    -1  
$EndComp
$Comp
L C C22
U 1 1 5615A95D
P 4550 4350
F 0 "C22" H 4550 4450 40  0000 L CNN
F 1 "1uF" H 4556 4265 40  0000 L CNN
F 2 "libcms:SM0402" H 4588 4200 30  0001 C CNN
F 3 "~" H 4550 4350 60  0000 C CNN
F 4 "490-9665-1-ND" H 4550 4350 60  0001 C CNN "Field1"
F 5 "Digi-Key" H 4550 4350 60  0001 C CNN "Field2"
	1    4550 4350
	1    0    0    -1  
$EndComp
$Comp
L GND #PWR042
U 1 1 5615A94A
P 3250 4950
F 0 "#PWR042" H 3250 4950 30  0001 C CNN
F 1 "GND" H 3250 4880 30  0001 C CNN
F 2 "" H 3250 4950 60  0000 C CNN
F 3 "" H 3250 4950 60  0000 C CNN
	1    3250 4950
	1    0    0    -1  
$EndComp
$Comp
L GND #PWR043
U 1 1 5615A943
P 2250 4900
F 0 "#PWR043" H 2250 4900 30  0001 C CNN
F 1 "GND" H 2250 4830 30  0001 C CNN
F 2 "" H 2250 4900 60  0000 C CNN
F 3 "" H 2250 4900 60  0000 C CNN
	1    2250 4900
	1    0    0    -1  
$EndComp
$Comp
L GND #PWR044
U 1 1 5615A93D
P 4200 5300
F 0 "#PWR044" H 4200 5300 30  0001 C CNN
F 1 "GND" H 4200 5230 30  0001 C CNN
F 2 "" H 4200 5300 60  0000 C CNN
F 3 "" H 4200 5300 60  0000 C CNN
	1    4200 5300
	1    0    0    -1  
$EndComp
$Comp
L C C18
U 1 1 5615A91F
P 2250 4350
F 0 "C18" H 2250 4450 40  0000 L CNN
F 1 "1uF" H 2256 4265 40  0000 L CNN
F 2 "libcms:SM0402" H 2288 4200 30  0001 C CNN
F 3 "~" H 2250 4350 60  0000 C CNN
F 4 "490-9665-1-ND" H 2250 4350 60  0001 C CNN "Field1"
F 5 "Digi-Key" H 2250 4350 60  0001 C CNN "Field2"
	1    2250 4350
	1    0    0    -1  
$EndComp
$Comp
L +3.3V #PWR045
U 1 1 5615A917
P 2250 3900
F 0 "#PWR045" H 2250 3860 30  0001 C CNN
F 1 "+3.3V" H 2250 4010 30  0000 C CNN
F 2 "" H 2250 3900 60  0000 C CNN
F 3 "" H 2250 3900 60  0000 C CNN
	1    2250 3900
	1    0    0    -1  
$EndComp
$Comp
L TPS73701DRBT U9
U 1 1 5615AA9F
P 2950 4350
F 0 "U9" H 3000 4300 60  0000 C CNN
F 1 "TPS73701DRBT" H 3250 4750 60  0000 C CNN
F 2 "integrated_tdc_pcblib:TPS737-VSON8" H 1400 5750 60  0001 C CNN
F 3 "~" H 1400 5750 60  0000 C CNN
F 4 "296-27067-1-ND" H 2950 4350 60  0001 C CNN "Field1"
F 5 "Digikey" H 2950 4350 60  0001 C CNN "Field2"
	1    2950 4350
	1    0    0    -1  
$EndComp
$Comp
L GND #PWR046
U 1 1 5615AAB7
P 4550 7100
F 0 "#PWR046" H 4550 7100 30  0001 C CNN
F 1 "GND" H 4550 7030 30  0001 C CNN
F 2 "" H 4550 7100 60  0000 C CNN
F 3 "" H 4550 7100 60  0000 C CNN
	1    4550 7100
	1    0    0    -1  
$EndComp
$Comp
L C C23
U 1 1 5615AAC3
P 4550 6550
F 0 "C23" H 4550 6650 40  0000 L CNN
F 1 "1uF" H 4556 6465 40  0000 L CNN
F 2 "libcms:SM0402" H 4588 6400 30  0001 C CNN
F 3 "~" H 4550 6550 60  0000 C CNN
F 4 "490-9665-1-ND" H 4550 6550 60  0001 C CNN "Field1"
F 5 "Digi-Key" H 4550 6550 60  0001 C CNN "Field2"
	1    4550 6550
	1    0    0    -1  
$EndComp
$Comp
L GND #PWR047
U 1 1 5615AACF
P 3250 7150
F 0 "#PWR047" H 3250 7150 30  0001 C CNN
F 1 "GND" H 3250 7080 30  0001 C CNN
F 2 "" H 3250 7150 60  0000 C CNN
F 3 "" H 3250 7150 60  0000 C CNN
	1    3250 7150
	1    0    0    -1  
$EndComp
$Comp
L GND #PWR048
U 1 1 5615AAD6
P 2250 7100
F 0 "#PWR048" H 2250 7100 30  0001 C CNN
F 1 "GND" H 2250 7030 30  0001 C CNN
F 2 "" H 2250 7100 60  0000 C CNN
F 3 "" H 2250 7100 60  0000 C CNN
	1    2250 7100
	1    0    0    -1  
$EndComp
$Comp
L GND #PWR049
U 1 1 5615AADC
P 4200 7500
F 0 "#PWR049" H 4200 7500 30  0001 C CNN
F 1 "GND" H 4200 7430 30  0001 C CNN
F 2 "" H 4200 7500 60  0000 C CNN
F 3 "" H 4200 7500 60  0000 C CNN
	1    4200 7500
	1    0    0    -1  
$EndComp
$Comp
L R R11
U 1 1 5615AAEA
P 4200 7100
F 0 "R11" V 4280 7100 40  0000 C CNN
F 1 "36.5k" V 4207 7101 40  0000 C CNN
F 2 "libcms:SM0402_r" V 4130 7100 30  0001 C CNN
F 3 "~" H 4200 7100 30  0000 C CNN
F 4 "A102815CT-ND" V 4200 7100 60  0001 C CNN "Field1"
F 5 "Digikey" V 4200 7100 60  0001 C CNN "Field2"
	1    4200 7100
	1    0    0    -1  
$EndComp
$Comp
L C C19
U 1 1 5615AB00
P 2250 6550
F 0 "C19" H 2250 6650 40  0000 L CNN
F 1 "1uF" H 2256 6465 40  0000 L CNN
F 2 "libcms:SM0402" H 2288 6400 30  0001 C CNN
F 3 "~" H 2250 6550 60  0000 C CNN
F 4 "490-9665-1-ND" H 2250 6550 60  0001 C CNN "Field1"
F 5 "Digi-Key" H 2250 6550 60  0001 C CNN "Field2"
	1    2250 6550
	1    0    0    -1  
$EndComp
$Comp
L +3.3V #PWR050
U 1 1 5615AB06
P 2250 6100
F 0 "#PWR050" H 2250 6060 30  0001 C CNN
F 1 "+3.3V" H 2250 6210 30  0000 C CNN
F 2 "" H 2250 6100 60  0000 C CNN
F 3 "" H 2250 6100 60  0000 C CNN
	1    2250 6100
	1    0    0    -1  
$EndComp
Text Notes 6850 3550 0    60   ~ 0
1.2V Regulator for TDC1 VCC_INT/PLL VCCD\n1A Limit\n0.132A Out (measured)
$Comp
L GND #PWR051
U 1 1 5615AB1C
P 8450 4900
F 0 "#PWR051" H 8450 4900 30  0001 C CNN
F 1 "GND" H 8450 4830 30  0001 C CNN
F 2 "" H 8450 4900 60  0000 C CNN
F 3 "" H 8450 4900 60  0000 C CNN
	1    8450 4900
	1    0    0    -1  
$EndComp
$Comp
L C C27
U 1 1 5615AB28
P 8450 4350
F 0 "C27" H 8450 4450 40  0000 L CNN
F 1 "1uF" H 8456 4265 40  0000 L CNN
F 2 "libcms:SM0402" H 8488 4200 30  0001 C CNN
F 3 "~" H 8450 4350 60  0000 C CNN
F 4 "490-9665-1-ND" H 8450 4350 60  0001 C CNN "Field1"
F 5 "Digi-Key" H 8450 4350 60  0001 C CNN "Field2"
	1    8450 4350
	1    0    0    -1  
$EndComp
$Comp
L GND #PWR052
U 1 1 5615AB34
P 7600 4950
F 0 "#PWR052" H 7600 4950 30  0001 C CNN
F 1 "GND" H 7600 4880 30  0001 C CNN
F 2 "" H 7600 4950 60  0000 C CNN
F 3 "" H 7600 4950 60  0000 C CNN
	1    7600 4950
	1    0    0    -1  
$EndComp
$Comp
L GND #PWR053
U 1 1 5615AB3B
P 6600 4900
F 0 "#PWR053" H 6600 4900 30  0001 C CNN
F 1 "GND" H 6600 4830 30  0001 C CNN
F 2 "" H 6600 4900 60  0000 C CNN
F 3 "" H 6600 4900 60  0000 C CNN
	1    6600 4900
	1    0    0    -1  
$EndComp
$Comp
L C C25
U 1 1 5615AB65
P 6600 4350
F 0 "C25" H 6600 4450 40  0000 L CNN
F 1 "1uF" H 6606 4265 40  0000 L CNN
F 2 "libcms:SM0402" H 6638 4200 30  0001 C CNN
F 3 "~" H 6600 4350 60  0000 C CNN
F 4 "490-9665-1-ND" H 6600 4350 60  0001 C CNN "Field1"
F 5 "Digi-Key" H 6600 4350 60  0001 C CNN "Field2"
	1    6600 4350
	1    0    0    -1  
$EndComp
$Comp
L +3.3V #PWR054
U 1 1 5615AB6B
P 6600 3900
F 0 "#PWR054" H 6600 3860 30  0001 C CNN
F 1 "+3.3V" H 6600 4010 30  0000 C CNN
F 2 "" H 6600 3900 60  0000 C CNN
F 3 "" H 6600 3900 60  0000 C CNN
	1    6600 3900
	1    0    0    -1  
$EndComp
$Comp
L R R14
U 1 1 5615AC20
P 8800 4050
F 0 "R14" V 8880 4050 40  0000 C CNN
F 1 "0" V 8807 4051 40  0000 C CNN
F 2 "libcms:SM1206" V 8730 4050 30  0001 C CNN
F 3 "~" H 8800 4050 30  0000 C CNN
F 4 "541-0.0ECT-ND" V 8800 4050 60  0001 C CNN "Field1"
F 5 "Digikey" V 8800 4050 60  0001 C CNN "Field2"
	1    8800 4050
	0    -1   -1   0   
$EndComp
Text Notes 8650 4300 0    60   ~ 0
1206 package \nfor inductance
Text Notes 6850 5700 0    60   ~ 0
1.2V Regulator for TDC2 VCC_INT/PLL VCCD\n1A Limit\n0.132A Out (measured)
$Comp
L GND #PWR055
U 1 1 5615AED1
P 8450 7150
F 0 "#PWR055" H 8450 7150 30  0001 C CNN
F 1 "GND" H 8450 7080 30  0001 C CNN
F 2 "" H 8450 7150 60  0000 C CNN
F 3 "" H 8450 7150 60  0000 C CNN
	1    8450 7150
	1    0    0    -1  
$EndComp
$Comp
L C C28
U 1 1 5615AEDB
P 8450 6600
F 0 "C28" H 8450 6700 40  0000 L CNN
F 1 "1uF" H 8456 6515 40  0000 L CNN
F 2 "libcms:SM0402" H 8488 6450 30  0001 C CNN
F 3 "~" H 8450 6600 60  0000 C CNN
F 4 "490-9665-1-ND" H 8450 6600 60  0001 C CNN "Field1"
F 5 "Digi-Key" H 8450 6600 60  0001 C CNN "Field2"
	1    8450 6600
	1    0    0    -1  
$EndComp
$Comp
L GND #PWR056
U 1 1 5615AEE6
P 7600 7200
F 0 "#PWR056" H 7600 7200 30  0001 C CNN
F 1 "GND" H 7600 7130 30  0001 C CNN
F 2 "" H 7600 7200 60  0000 C CNN
F 3 "" H 7600 7200 60  0000 C CNN
	1    7600 7200
	1    0    0    -1  
$EndComp
$Comp
L GND #PWR057
U 1 1 5615AEED
P 6600 7150
F 0 "#PWR057" H 6600 7150 30  0001 C CNN
F 1 "GND" H 6600 7080 30  0001 C CNN
F 2 "" H 6600 7150 60  0000 C CNN
F 3 "" H 6600 7150 60  0000 C CNN
	1    6600 7150
	1    0    0    -1  
$EndComp
$Comp
L C C26
U 1 1 5615AEFC
P 6600 6600
F 0 "C26" H 6600 6700 40  0000 L CNN
F 1 "1uF" H 6606 6515 40  0000 L CNN
F 2 "libcms:SM0402" H 6638 6450 30  0001 C CNN
F 3 "~" H 6600 6600 60  0000 C CNN
F 4 "490-9665-1-ND" H 6600 6600 60  0001 C CNN "Field1"
F 5 "Digi-Key" H 6600 6600 60  0001 C CNN "Field2"
	1    6600 6600
	1    0    0    -1  
$EndComp
$Comp
L +3.3V #PWR058
U 1 1 5615AF02
P 6600 6150
F 0 "#PWR058" H 6600 6110 30  0001 C CNN
F 1 "+3.3V" H 6600 6260 30  0000 C CNN
F 2 "" H 6600 6150 60  0000 C CNN
F 3 "" H 6600 6150 60  0000 C CNN
	1    6600 6150
	1    0    0    -1  
$EndComp
Text Notes 8650 6550 0    60   ~ 0
1206 package \nfor inductance
Text HLabel 4550 3900 2    60   Input ~ 0
VCCA1
Text HLabel 4550 6100 2    60   Input ~ 0
VCCA2
Text HLabel 8450 3800 2    60   Input ~ 0
VCC_INT1
Text HLabel 9150 3800 2    60   Input ~ 0
VCCD1
Text HLabel 8450 6050 2    60   Input ~ 0
VCC_INT2
Text HLabel 9150 6050 2    60   Input ~ 0
VCCD2
Wire Wire Line
	3100 2550 3100 2600
Wire Wire Line
	3100 2600 3200 2600
Wire Wire Line
	3200 2600 3200 2550
Wire Wire Line
	3150 2600 3150 2950
Connection ~ 3150 2600
Wire Wire Line
	1950 2050 2400 2050
Connection ~ 4550 1750
Wire Wire Line
	3900 1750 4550 1750
Connection ~ 1950 2050
Wire Wire Line
	1950 2000 1950 2150
Wire Wire Line
	1950 2550 1950 2950
Wire Wire Line
	4550 1650 4550 2100
Wire Wire Line
	4550 2500 4550 2950
Connection ~ 2250 2050
Wire Wire Line
	3900 2050 4100 2050
Wire Wire Line
	4100 2050 4100 2100
Wire Wire Line
	4100 2500 4100 2950
Wire Wire Line
	6600 1600 6600 1850
Wire Wire Line
	6600 1750 7000 1750
Connection ~ 6600 1750
Wire Wire Line
	7000 1950 6850 1950
Wire Wire Line
	6850 1950 6850 1750
Connection ~ 6850 1750
Wire Wire Line
	8200 1750 8900 1750
Wire Wire Line
	8200 1950 8200 2300
Wire Wire Line
	8200 2300 8550 2300
Wire Wire Line
	8550 2250 8550 2350
Connection ~ 8550 2300
Wire Wire Line
	8550 2850 8550 3000
Wire Wire Line
	6600 2250 6600 2600
Wire Wire Line
	7550 2350 7550 2600
Wire Wire Line
	7550 2600 7650 2600
Wire Wire Line
	7600 2600 7600 2650
Wire Wire Line
	7650 2600 7650 2350
Connection ~ 7600 2600
Wire Wire Line
	8900 1600 8900 1850
Connection ~ 8550 1750
Connection ~ 8900 1750
Wire Wire Line
	8900 2250 8900 2600
Wire Wire Line
	4550 4550 4550 4900
Connection ~ 4550 4050
Connection ~ 4200 4050
Wire Wire Line
	4550 3900 4550 4150
Connection ~ 3250 4900
Wire Wire Line
	3300 4900 3300 4650
Wire Wire Line
	3250 4900 3250 4950
Wire Wire Line
	3200 4900 3300 4900
Wire Wire Line
	3200 4650 3200 4900
Wire Wire Line
	2250 4550 2250 4900
Wire Wire Line
	4200 5150 4200 5300
Connection ~ 4200 4600
Wire Wire Line
	4200 4550 4200 4650
Wire Wire Line
	3850 4600 4200 4600
Wire Wire Line
	3850 4250 3850 4600
Wire Wire Line
	3850 4050 4550 4050
Connection ~ 2500 4050
Wire Wire Line
	2500 4250 2500 4050
Wire Wire Line
	2650 4250 2500 4250
Connection ~ 2250 4050
Wire Wire Line
	2250 4050 2650 4050
Wire Wire Line
	2250 3900 2250 4150
Wire Wire Line
	4550 6750 4550 7100
Connection ~ 4550 6250
Connection ~ 4200 6250
Wire Wire Line
	4550 6100 4550 6350
Connection ~ 3250 7100
Wire Wire Line
	3300 7100 3300 6850
Wire Wire Line
	3250 7100 3250 7150
Wire Wire Line
	3200 7100 3300 7100
Wire Wire Line
	3200 6850 3200 7100
Wire Wire Line
	2250 6750 2250 7100
Wire Wire Line
	4200 7350 4200 7500
Connection ~ 4200 6800
Wire Wire Line
	4200 6750 4200 6850
Wire Wire Line
	3850 6800 4200 6800
Wire Wire Line
	3850 6450 3850 6800
Wire Wire Line
	3850 6250 4550 6250
Connection ~ 2500 6250
Wire Wire Line
	2500 6450 2500 6250
Wire Wire Line
	2650 6450 2500 6450
Connection ~ 2250 6250
Wire Wire Line
	2250 6250 2650 6250
Wire Wire Line
	2250 6100 2250 6350
Wire Wire Line
	8450 4550 8450 4900
Connection ~ 8450 4050
Wire Wire Line
	8450 3800 8450 4150
Connection ~ 7600 4900
Wire Wire Line
	7650 4900 7650 4650
Wire Wire Line
	7600 4900 7600 4950
Wire Wire Line
	7550 4900 7650 4900
Wire Wire Line
	7550 4650 7550 4900
Wire Wire Line
	6600 4550 6600 4900
Wire Wire Line
	8200 4050 8550 4050
Connection ~ 6850 4050
Wire Wire Line
	6850 4250 6850 4050
Wire Wire Line
	7000 4250 6850 4250
Connection ~ 6600 4050
Wire Wire Line
	6600 4050 7000 4050
Wire Wire Line
	6600 3900 6600 4150
Wire Wire Line
	8200 4250 8300 4250
Wire Wire Line
	8300 4250 8300 4050
Connection ~ 8300 4050
Wire Wire Line
	9150 4050 9050 4050
Wire Wire Line
	9150 3800 9150 4050
Wire Wire Line
	8450 6800 8450 7150
Connection ~ 8450 6300
Wire Wire Line
	8450 6050 8450 6400
Connection ~ 7600 7150
Wire Wire Line
	7650 7150 7650 6900
Wire Wire Line
	7600 7150 7600 7200
Wire Wire Line
	7550 7150 7650 7150
Wire Wire Line
	7550 6900 7550 7150
Wire Wire Line
	6600 6800 6600 7150
Wire Wire Line
	8200 6300 8550 6300
Connection ~ 6850 6300
Wire Wire Line
	6850 6500 6850 6300
Wire Wire Line
	7000 6500 6850 6500
Connection ~ 6600 6300
Wire Wire Line
	6600 6300 7000 6300
Wire Wire Line
	6600 6150 6600 6400
Wire Wire Line
	8200 6500 8300 6500
Wire Wire Line
	8300 6500 8300 6300
Connection ~ 8300 6300
Wire Wire Line
	9150 6300 9050 6300
Wire Wire Line
	9150 6050 9150 6300
$Comp
L TPS73701DRBT U13
U 1 1 5618742B
P 7300 4350
F 0 "U13" H 7350 4300 60  0000 C CNN
F 1 "TPS73701DRBT" H 7600 4750 60  0000 C CNN
F 2 "integrated_tdc_pcblib:TPS737-VSON8" H 5750 5750 60  0001 C CNN
F 3 "~" H 5750 5750 60  0000 C CNN
F 4 "296-27067-1-ND" H 7300 4350 60  0001 C CNN "Field1"
F 5 "Digikey" H 7300 4350 60  0001 C CNN "Field2"
	1    7300 4350
	1    0    0    -1  
$EndComp
$Comp
L TPS73701DRBT U14
U 1 1 56187433
P 7300 6600
F 0 "U14" H 7350 6550 60  0000 C CNN
F 1 "TPS73701DRBT" H 7600 7000 60  0000 C CNN
F 2 "integrated_tdc_pcblib:TPS737-VSON8" H 5750 8000 60  0001 C CNN
F 3 "~" H 5750 8000 60  0000 C CNN
F 4 "296-27067-1-ND" H 7300 6600 60  0001 C CNN "Field1"
F 5 "Digikey" H 7300 6600 60  0001 C CNN "Field2"
	1    7300 6600
	1    0    0    -1  
$EndComp
$Comp
L TPS73701DRBT U10
U 1 1 5618743B
P 2950 6550
F 0 "U10" H 3000 6500 60  0000 C CNN
F 1 "TPS73701DRBT" H 3250 6950 60  0000 C CNN
F 2 "integrated_tdc_pcblib:TPS737-VSON8" H 1400 7950 60  0001 C CNN
F 3 "~" H 1400 7950 60  0000 C CNN
F 4 "296-27067-1-ND" H 2950 6550 60  0001 C CNN "Field1"
F 5 "Digikey" H 2950 6550 60  0001 C CNN "Field2"
	1    2950 6550
	1    0    0    -1  
$EndComp
$Comp
L TPS73701DRBT U12
U 1 1 56187443
P 7300 2050
F 0 "U12" H 7350 2000 60  0000 C CNN
F 1 "TPS73701DRBT" H 7600 2450 60  0000 C CNN
F 2 "integrated_tdc_pcblib:TPS737-VSON8" H 5750 3450 60  0001 C CNN
F 3 "~" H 5750 3450 60  0000 C CNN
F 4 "296-27067-1-ND" H 7300 2050 60  0001 C CNN "Field1"
F 5 "Digikey" H 7300 2050 60  0001 C CNN "Field2"
	1    7300 2050
	1    0    0    -1  
$EndComp
Wire Wire Line
	2250 1750 2250 2050
Wire Wire Line
	2400 1750 2250 1750
$Comp
L C C20
U 1 1 562C9C92
P 4100 2300
F 0 "C20" H 4100 2400 40  0000 L CNN
F 1 "0.1uF" H 4106 2215 40  0000 L CNN
F 2 "libcms:SM0603_Capa" H 4138 2150 30  0001 C CNN
F 3 "~" H 4100 2300 60  0000 C CNN
F 4 "490-9730-1-ND" H 4100 2300 60  0001 C CNN "Field1"
F 5 "Digikey" H 4100 2300 60  0001 C CNN "Field2"
	1    4100 2300
	1    0    0    -1  
$EndComp
$Comp
L R R8
U 1 1 562D5557
P 4200 4300
F 0 "R8" V 4280 4300 40  0000 C CNN
F 1 "39.2k" V 4207 4301 40  0000 C CNN
F 2 "libcms:SM0402_r" V 4130 4300 30  0001 C CNN
F 3 "~" H 4200 4300 30  0000 C CNN
F 4 "YAG1418CT-ND" V 4200 4300 60  0001 C CNN "Field1"
F 5 "Digikey" V 4200 4300 60  0001 C CNN "Field2"
	1    4200 4300
	1    0    0    -1  
$EndComp
$Comp
L R R10
U 1 1 562D56F1
P 4200 6500
F 0 "R10" V 4280 6500 40  0000 C CNN
F 1 "39.2k" V 4207 6501 40  0000 C CNN
F 2 "libcms:SM0402_r" V 4130 6500 30  0001 C CNN
F 3 "~" H 4200 6500 30  0000 C CNN
F 4 "YAG1418CT-ND" V 4200 6500 60  0001 C CNN "Field1"
F 5 "Digikey" V 4200 6500 60  0001 C CNN "Field2"
	1    4200 6500
	1    0    0    -1  
$EndComp
$Comp
L R R9
U 1 1 562D5D11
P 4200 4900
F 0 "R9" V 4280 4900 40  0000 C CNN
F 1 "36.5k" V 4207 4901 40  0000 C CNN
F 2 "libcms:SM0402_r" V 4130 4900 30  0001 C CNN
F 3 "~" H 4200 4900 30  0000 C CNN
F 4 "A102815CT-ND" V 4200 4900 60  0001 C CNN "Field1"
F 5 "Digikey" V 4200 4900 60  0001 C CNN "Field2"
	1    4200 4900
	1    0    0    -1  
$EndComp
$Comp
L R R13
U 1 1 562D5E0F
P 8550 2600
F 0 "R13" V 8630 2600 40  0000 C CNN
F 1 "36.5k" V 8557 2601 40  0000 C CNN
F 2 "libcms:SM0402_r" V 8480 2600 30  0001 C CNN
F 3 "~" H 8550 2600 30  0000 C CNN
F 4 "A102815CT-ND" V 8550 2600 60  0001 C CNN "Field1"
F 5 "Digikey" V 8550 2600 60  0001 C CNN "Field2"
	1    8550 2600
	1    0    0    -1  
$EndComp
$Comp
L R R15
U 1 1 562D6201
P 8800 6300
F 0 "R15" V 8880 6300 40  0000 C CNN
F 1 "0" V 8807 6301 40  0000 C CNN
F 2 "libcms:SM1206" V 8730 6300 30  0001 C CNN
F 3 "~" H 8800 6300 30  0000 C CNN
F 4 "541-0.0ECT-ND" V 8800 6300 60  0001 C CNN "Field1"
F 5 "Digikey" V 8800 6300 60  0001 C CNN "Field2"
	1    8800 6300
	0    -1   -1   0   
$EndComp
$EndSCHEMATC
