/*
WARNING: Do NOT edit the input and output ports in this file in a text
editor if you plan to continue editing the block that represents it in
the Block Editor! File corruption is VERY likely to occur.
*/
/*
Copyright (C) 1991-2013 Altera Corporation
Your use of Altera Corporation's design tools, logic functions 
and other software and tools, and its AMPP partner logic 
functions, and any output files from any of the foregoing 
(including device programming or simulation files), and any 
associated documentation or information are expressly subject 
to the terms and conditions of the Altera Program License 
Subscription Agreement, Altera MegaCore Function License 
Agreement, or other applicable license agreement, including, 
without limitation, that your use is for the sole purpose of 
programming logic devices manufactured by Altera and sold by 
Altera or its authorized distributors.  Please refer to the 
applicable agreement for further details.
*/
//#pragma file_not_in_maxplusii_format
(header "graphic" (version "1.4"))
(properties
	(page_setup "header_footer\nDate: %D\n%f\nProject: %j\n\nPage %p of %P\nRevision: %a\nmargin\n0.2\n0.2\n0.2\n0.2\norientation\n2\npaper_size\n3\npaper_source\n15\nfit_page_wide\n1\nfit_page_tall\n1\n")
)
(pin
	(input)
	(rect -600 632 -424 648)
	(text "INPUT" (rect 133 0 161 9)(font "Arial" (font_size 6)))
	(text "CK200" (rect 9 0 42 10)(font "Arial" ))
	(pt 176 8)
	(drawing
		(line (pt 92 12)(pt 117 12))
		(line (pt 92 4)(pt 117 4))
		(line (pt 121 8)(pt 176 8))
		(line (pt 92 12)(pt 92 4))
		(line (pt 117 4)(pt 121 8))
		(line (pt 117 12)(pt 121 8))
	)
	(text "VCC" (rect 136 7 156 16)(font "Arial" (font_size 6)))
)
(pin
	(input)
	(rect -592 40 -416 56)
	(text "INPUT" (rect 133 0 161 9)(font "Arial" (font_size 6)))
	(text "TKTC[23..0]" (rect 9 0 68 10)(font "Arial" ))
	(pt 176 8)
	(drawing
		(line (pt 92 12)(pt 117 12))
		(line (pt 92 4)(pt 117 4))
		(line (pt 121 8)(pt 176 8))
		(line (pt 92 12)(pt 92 4))
		(line (pt 117 4)(pt 121 8))
		(line (pt 117 12)(pt 121 8))
	)
	(text "VCC" (rect 136 7 156 16)(font "Arial" (font_size 6)))
)
(pin
	(input)
	(rect -600 608 -424 624)
	(text "INPUT" (rect 133 0 161 9)(font "Arial" (font_size 6)))
	(text "TK10sh" (rect 9 0 45 10)(font "Arial" ))
	(pt 176 8)
	(drawing
		(line (pt 92 12)(pt 117 12))
		(line (pt 92 4)(pt 117 4))
		(line (pt 121 8)(pt 176 8))
		(line (pt 92 12)(pt 92 4))
		(line (pt 117 4)(pt 121 8))
		(line (pt 117 12)(pt 121 8))
	)
	(text "VCC" (rect 136 7 156 16)(font "Arial" (font_size 6)))
)
(pin
	(input)
	(rect -600 576 -424 592)
	(text "INPUT" (rect 133 0 161 9)(font "Arial" (font_size 6)))
	(text "OutST" (rect 9 0 39 10)(font "Arial" ))
	(pt 176 8)
	(drawing
		(line (pt 92 12)(pt 117 12))
		(line (pt 92 4)(pt 117 4))
		(line (pt 121 8)(pt 176 8))
		(line (pt 92 12)(pt 92 4))
		(line (pt 117 4)(pt 121 8))
		(line (pt 117 12)(pt 121 8))
	)
	(text "VCC" (rect 136 7 156 16)(font "Arial" (font_size 6)))
)
(pin
	(input)
	(rect -600 544 -424 560)
	(text "INPUT" (rect 133 0 161 9)(font "Arial" (font_size 6)))
	(text "KeepScalar" (rect 9 0 64 10)(font "Arial" ))
	(pt 176 8)
	(drawing
		(line (pt 92 12)(pt 117 12))
		(line (pt 92 4)(pt 117 4))
		(line (pt 121 8)(pt 176 8))
		(line (pt 92 12)(pt 92 4))
		(line (pt 117 4)(pt 121 8))
		(line (pt 117 12)(pt 121 8))
	)
	(text "VCC" (rect 136 7 156 16)(font "Arial" (font_size 6)))
)
(pin
	(input)
	(rect -600 520 -424 536)
	(text "INPUT" (rect 133 0 161 9)(font "Arial" (font_size 6)))
	(text "Init1x" (rect 9 0 36 10)(font "Arial" ))
	(pt 176 8)
	(drawing
		(line (pt 92 12)(pt 117 12))
		(line (pt 92 4)(pt 117 4))
		(line (pt 121 8)(pt 176 8))
		(line (pt 92 12)(pt 92 4))
		(line (pt 117 4)(pt 121 8))
		(line (pt 117 12)(pt 121 8))
	)
	(text "VCC" (rect 136 7 156 16)(font "Arial" (font_size 6)))
)
(pin
	(input)
	(rect -592 -32 -416 -16)
	(text "INPUT" (rect 133 0 161 9)(font "Arial" (font_size 6)))
	(text "TimeData[11..0]" (rect 9 0 88 10)(font "Arial" ))
	(pt 176 8)
	(drawing
		(line (pt 92 12)(pt 117 12))
		(line (pt 92 4)(pt 117 4))
		(line (pt 121 8)(pt 176 8))
		(line (pt 92 12)(pt 92 4))
		(line (pt 117 4)(pt 121 8))
		(line (pt 117 12)(pt 121 8))
	)
	(text "VCC" (rect 136 7 156 16)(font "Arial" (font_size 6)))
)
(pin
	(input)
	(rect -592 -16 -416 0)
	(text "INPUT" (rect 133 0 161 9)(font "Arial" (font_size 6)))
	(text "ScalarData[7..0]" (rect 9 0 89 10)(font "Arial" ))
	(pt 176 8)
	(drawing
		(line (pt 92 12)(pt 117 12))
		(line (pt 92 4)(pt 117 4))
		(line (pt 121 8)(pt 176 8))
		(line (pt 92 12)(pt 92 4))
		(line (pt 117 4)(pt 121 8))
		(line (pt 117 12)(pt 121 8))
	)
	(text "VCC" (rect 136 7 156 16)(font "Arial" (font_size 6)))
)
(pin
	(input)
	(rect -600 448 -424 464)
	(text "INPUT" (rect 133 0 161 9)(font "Arial" (font_size 6)))
	(text "HitOK" (rect 9 0 39 10)(font "Arial" ))
	(pt 176 8)
	(drawing
		(line (pt 92 12)(pt 117 12))
		(line (pt 92 4)(pt 117 4))
		(line (pt 121 8)(pt 176 8))
		(line (pt 92 12)(pt 92 4))
		(line (pt 117 4)(pt 121 8))
		(line (pt 117 12)(pt 121 8))
	)
	(text "VCC" (rect 136 7 156 16)(font "Arial" (font_size 6)))
)
(pin
	(input)
	(rect -592 0 -416 16)
	(text "INPUT" (rect 133 0 161 9)(font "Arial" (font_size 6)))
	(text "RegData[31..0]" (rect 9 0 84 10)(font "Arial" ))
	(pt 176 8)
	(drawing
		(line (pt 92 12)(pt 117 12))
		(line (pt 92 4)(pt 117 4))
		(line (pt 121 8)(pt 176 8))
		(line (pt 92 12)(pt 92 4))
		(line (pt 117 4)(pt 121 8))
		(line (pt 117 12)(pt 121 8))
	)
	(text "VCC" (rect 136 7 156 16)(font "Arial" (font_size 6)))
)
(pin
	(input)
	(rect 1816 1352 1992 1368)
	(text "INPUT" (rect 133 0 161 9)(font "Arial" (font_size 6)))
	(text "Idle_char_sw" (rect 9 0 72 10)(font "Arial" ))
	(pt 176 8)
	(drawing
		(line (pt 92 12)(pt 117 12))
		(line (pt 92 4)(pt 117 4))
		(line (pt 121 8)(pt 176 8))
		(line (pt 92 12)(pt 92 4))
		(line (pt 117 4)(pt 121 8))
		(line (pt 117 12)(pt 121 8))
	)
	(text "GND" (rect 136 7 157 16)(font "Arial" (font_size 6)))
)
(pin
	(input)
	(rect 1584 224 1760 240)
	(text "INPUT" (rect 133 0 161 9)(font "Arial" (font_size 6)))
	(text "VERSION[31..0]" (rect 9 0 90 10)(font "Arial" ))
	(pt 176 8)
	(drawing
		(line (pt 92 12)(pt 117 12))
		(line (pt 92 4)(pt 117 4))
		(line (pt 121 8)(pt 176 8))
		(line (pt 92 12)(pt 92 4))
		(line (pt 117 4)(pt 121 8))
		(line (pt 117 12)(pt 121 8))
	)
	(text "VCC" (rect 136 7 156 16)(font "Arial" (font_size 6)))
)
(pin
	(output)
	(rect 2280 288 2456 304)
	(text "OUTPUT" (rect 1 0 39 9)(font "Arial" (font_size 6)))
	(text "QMB[31..0]" (rect 90 0 145 10)(font "Arial" ))
	(pt 0 8)
	(drawing
		(line (pt 0 8)(pt 52 8))
		(line (pt 52 4)(pt 78 4))
		(line (pt 52 12)(pt 78 12))
		(line (pt 52 12)(pt 52 4))
		(line (pt 78 4)(pt 82 8))
		(line (pt 82 8)(pt 78 12))
		(line (pt 78 12)(pt 82 8))
	)
)
(pin
	(output)
	(rect 2392 1280 2568 1296)
	(text "OUTPUT" (rect 1 0 39 9)(font "Arial" (font_size 6)))
	(text "Dout[8..0]" (rect 90 0 139 10)(font "Arial" ))
	(pt 0 8)
	(drawing
		(line (pt 0 8)(pt 52 8))
		(line (pt 52 4)(pt 78 4))
		(line (pt 52 12)(pt 78 12))
		(line (pt 52 12)(pt 52 4))
		(line (pt 78 4)(pt 82 8))
		(line (pt 82 8)(pt 78 12))
		(line (pt 78 12)(pt 82 8))
	)
)
(pin
	(output)
	(rect 1568 -120 1744 -104)
	(text "OUTPUT" (rect 1 0 39 9)(font "Arial" (font_size 6)))
	(text "BuffCnt[15..0]" (rect 90 0 161 10)(font "Arial" ))
	(pt 0 8)
	(drawing
		(line (pt 0 8)(pt 52 8))
		(line (pt 52 4)(pt 78 4))
		(line (pt 52 12)(pt 78 12))
		(line (pt 52 12)(pt 52 4))
		(line (pt 78 4)(pt 82 8))
		(line (pt 82 8)(pt 78 12))
		(line (pt 78 12)(pt 82 8))
	)
)
(pin
	(output)
	(rect 2408 1424 2584 1440)
	(text "OUTPUT" (rect 1 0 39 9)(font "Arial" (font_size 6)))
	(text "BUSY" (rect 90 0 120 10)(font "Arial" ))
	(pt 0 8)
	(drawing
		(line (pt 0 8)(pt 52 8))
		(line (pt 52 4)(pt 78 4))
		(line (pt 52 12)(pt 78 12))
		(line (pt 52 12)(pt 52 4))
		(line (pt 78 4)(pt 82 8))
		(line (pt 82 8)(pt 78 12))
		(line (pt 78 12)(pt 82 8))
	)
)
(symbol
	(rect -560 656 -544 688)
	(text "VCC" (rect 0 5 9 25)(font "Arial" (font_size 6))(vertical))
	(text "inst28" (rect 5 0 15 29)(font "Arial" )(vertical)(invisible))
	(port
		(pt 16 16)
		(output)
		(text "1" (rect 19 7 24 18)(font "Courier New" (bold))(invisible))
		(text "1" (rect 7 8 18 13)(font "Courier New" (bold))(vertical)(invisible))
		(line (pt 16 16)(pt 8 16))
	)
	(drawing
		(line (pt 8 24)(pt 8 8))
	)
	(rotate90)
)
(symbol
	(rect -576 704 -544 736)
	(text "GND" (rect 7 8 16 29)(font "Arial" (font_size 6))(vertical))
	(text "inst29" (rect 1 3 11 32)(font "Arial" )(vertical)(invisible))
	(port
		(pt 32 16)
		(output)
		(text "1" (rect 18 0 23 11)(font "Courier New" (bold))(invisible))
		(text "1" (rect 21 18 32 23)(font "Courier New" (bold))(vertical)(invisible))
		(line (pt 24 16)(pt 32 16))
	)
	(drawing
		(line (pt 24 8)(pt 16 16))
		(line (pt 16 16)(pt 24 24))
		(line (pt 24 8)(pt 24 24))
	)
	(rotate270)
)
(symbol
	(rect -520 192 -472 224)
	(text "WIRE" (rect 1 0 24 9)(font "Arial" (font_size 6)))
	(text "inst1" (rect 3 21 26 31)(font "Arial" ))
	(port
		(pt 0 16)
		(input)
		(text "IN" (rect 2 7 13 18)(font "Courier New" (bold))(invisible))
		(text "IN" (rect 2 7 13 18)(font "Courier New" (bold))(invisible))
		(line (pt 0 16)(pt 14 16))
	)
	(port
		(pt 48 16)
		(output)
		(text "OUT" (rect 32 7 49 18)(font "Courier New" (bold))(invisible))
		(text "OUT" (rect 32 7 46 18)(font "Courier New" (bold))(invisible))
		(line (pt 32 16)(pt 48 16))
	)
	(drawing
		(line (pt 14 7)(pt 32 16))
		(line (pt 14 25)(pt 14 7))
		(line (pt 14 25)(pt 32 16))
	)
)
(symbol
	(rect -520 232 -472 264)
	(text "WIRE" (rect 1 0 24 9)(font "Arial" (font_size 6)))
	(text "inst17" (rect 3 21 32 31)(font "Arial" ))
	(port
		(pt 0 16)
		(input)
		(text "IN" (rect 2 7 13 18)(font "Courier New" (bold))(invisible))
		(text "IN" (rect 2 7 13 18)(font "Courier New" (bold))(invisible))
		(line (pt 0 16)(pt 14 16))
	)
	(port
		(pt 48 16)
		(output)
		(text "OUT" (rect 32 7 49 18)(font "Courier New" (bold))(invisible))
		(text "OUT" (rect 32 7 46 18)(font "Courier New" (bold))(invisible))
		(line (pt 32 16)(pt 48 16))
	)
	(drawing
		(line (pt 14 7)(pt 32 16))
		(line (pt 14 25)(pt 14 7))
		(line (pt 14 25)(pt 32 16))
	)
)
(symbol
	(rect -520 272 -472 304)
	(text "WIRE" (rect 1 0 24 9)(font "Arial" (font_size 6)))
	(text "inst22" (rect 3 21 32 31)(font "Arial" ))
	(port
		(pt 0 16)
		(input)
		(text "IN" (rect 2 7 13 18)(font "Courier New" (bold))(invisible))
		(text "IN" (rect 2 7 13 18)(font "Courier New" (bold))(invisible))
		(line (pt 0 16)(pt 14 16))
	)
	(port
		(pt 48 16)
		(output)
		(text "OUT" (rect 32 7 49 18)(font "Courier New" (bold))(invisible))
		(text "OUT" (rect 32 7 46 18)(font "Courier New" (bold))(invisible))
		(line (pt 32 16)(pt 48 16))
	)
	(drawing
		(line (pt 14 7)(pt 32 16))
		(line (pt 14 25)(pt 14 7))
		(line (pt 14 25)(pt 32 16))
	)
)
(symbol
	(rect -520 112 -472 144)
	(text "WIRE" (rect 1 0 24 9)(font "Arial" (font_size 6)))
	(text "inst23" (rect 3 21 32 31)(font "Arial" ))
	(port
		(pt 0 16)
		(input)
		(text "IN" (rect 2 7 13 18)(font "Courier New" (bold))(invisible))
		(text "IN" (rect 2 7 13 18)(font "Courier New" (bold))(invisible))
		(line (pt 0 16)(pt 14 16))
	)
	(port
		(pt 48 16)
		(output)
		(text "OUT" (rect 32 7 49 18)(font "Courier New" (bold))(invisible))
		(text "OUT" (rect 32 7 46 18)(font "Courier New" (bold))(invisible))
		(line (pt 32 16)(pt 48 16))
	)
	(drawing
		(line (pt 14 7)(pt 32 16))
		(line (pt 14 25)(pt 14 7))
		(line (pt 14 25)(pt 32 16))
	)
)
(symbol
	(rect -240 -64 -192 -32)
	(text "WIRE" (rect 1 0 24 9)(font "Arial" (font_size 6)))
	(text "inst" (rect 3 21 20 31)(font "Arial" ))
	(port
		(pt 0 16)
		(input)
		(text "IN" (rect 2 7 13 18)(font "Courier New" (bold))(invisible))
		(text "IN" (rect 2 7 13 18)(font "Courier New" (bold))(invisible))
		(line (pt 0 16)(pt 14 16))
	)
	(port
		(pt 48 16)
		(output)
		(text "OUT" (rect 32 7 49 18)(font "Courier New" (bold))(invisible))
		(text "OUT" (rect 32 7 46 18)(font "Courier New" (bold))(invisible))
		(line (pt 32 16)(pt 48 16))
	)
	(drawing
		(line (pt 14 7)(pt 32 16))
		(line (pt 14 25)(pt 14 7))
		(line (pt 14 25)(pt 32 16))
	)
)
(symbol
	(rect -520 72 -472 104)
	(text "WIRE" (rect 1 0 24 9)(font "Arial" (font_size 6)))
	(text "inst24" (rect 3 21 32 31)(font "Arial" ))
	(port
		(pt 0 16)
		(input)
		(text "IN" (rect 2 7 13 18)(font "Courier New" (bold))(invisible))
		(text "IN" (rect 2 7 13 18)(font "Courier New" (bold))(invisible))
		(line (pt 0 16)(pt 14 16))
	)
	(port
		(pt 48 16)
		(output)
		(text "OUT" (rect 32 7 49 18)(font "Courier New" (bold))(invisible))
		(text "OUT" (rect 32 7 46 18)(font "Courier New" (bold))(invisible))
		(line (pt 32 16)(pt 48 16))
	)
	(drawing
		(line (pt 14 7)(pt 32 16))
		(line (pt 14 25)(pt 14 7))
		(line (pt 14 25)(pt 32 16))
	)
)
(symbol
	(rect -272 -24 -208 56)
	(text "DFFE" (rect 1 0 25 9)(font "Arial" (font_size 6)))
	(text "inst2" (rect 3 68 26 78)(font "Arial" ))
	(port
		(pt 32 0)
		(input)
		(text "PRN" (rect 24 13 41 24)(font "Courier New" (bold)))
		(text "PRN" (rect 24 11 41 22)(font "Courier New" (bold)))
		(line (pt 32 4)(pt 32 0))
	)
	(port
		(pt 32 80)
		(input)
		(text "CLRN" (rect 21 59 44 70)(font "Courier New" (bold)))
		(text "CLRN" (rect 21 58 44 69)(font "Courier New" (bold)))
		(line (pt 32 80)(pt 32 76))
	)
	(port
		(pt 0 24)
		(input)
		(text "D" (rect 14 20 19 31)(font "Courier New" (bold)))
		(text "D" (rect 14 20 19 31)(font "Courier New" (bold)))
		(line (pt 0 24)(pt 12 24))
	)
	(port
		(pt 0 40)
		(input)
		(text "CLK" (rect 2 28 19 39)(font "Courier New" (bold))(invisible))
		(text "CLK" (rect 2 28 19 39)(font "Courier New" (bold))(invisible))
		(line (pt 0 40)(pt 12 40))
	)
	(port
		(pt 0 56)
		(input)
		(text "ENA" (rect 14 50 31 61)(font "Courier New" (bold)))
		(text "ENA" (rect 14 50 31 61)(font "Courier New" (bold)))
		(line (pt 0 56)(pt 12 56))
	)
	(port
		(pt 64 24)
		(output)
		(text "Q" (rect 44 20 49 31)(font "Courier New" (bold)))
		(text "Q" (rect 44 20 48 31)(font "Courier New" (bold)))
		(line (pt 53 24)(pt 64 24))
	)
	(drawing
		(line (pt 12 68)(pt 52 68))
		(line (pt 12 12)(pt 52 12))
		(line (pt 52 68)(pt 52 12))
		(line (pt 12 68)(pt 12 12))
		(line (pt 12 34)(pt 19 41))
		(line (pt 18 41)(pt 12 47))
		(circle (rect 28 4 36 12))
		(circle (rect 28 68 36 76))
	)
)
(symbol
	(rect 192 128 256 208)
	(text "DFF" (rect 1 0 19 9)(font "Arial" (font_size 6)))
	(text "inst4" (rect 3 68 26 78)(font "Arial" ))
	(port
		(pt 32 80)
		(input)
		(text "CLRN" (rect 21 59 44 70)(font "Courier New" (bold)))
		(text "CLRN" (rect 21 58 44 69)(font "Courier New" (bold)))
		(line (pt 32 80)(pt 32 76))
	)
	(port
		(pt 0 40)
		(input)
		(text "CLK" (rect 3 29 20 40)(font "Courier New" (bold))(invisible))
		(text "CLK" (rect 3 29 20 40)(font "Courier New" (bold))(invisible))
		(line (pt 0 40)(pt 12 40))
	)
	(port
		(pt 0 24)
		(input)
		(text "D" (rect 14 20 19 31)(font "Courier New" (bold)))
		(text "D" (rect 14 20 19 31)(font "Courier New" (bold)))
		(line (pt 0 24)(pt 12 24))
	)
	(port
		(pt 32 0)
		(input)
		(text "PRN" (rect 24 13 41 24)(font "Courier New" (bold)))
		(text "PRN" (rect 24 11 41 22)(font "Courier New" (bold)))
		(line (pt 32 4)(pt 32 0))
	)
	(port
		(pt 64 24)
		(output)
		(text "Q" (rect 45 20 50 31)(font "Courier New" (bold)))
		(text "Q" (rect 43 20 47 31)(font "Courier New" (bold)))
		(line (pt 52 24)(pt 64 24))
	)
	(drawing
		(line (pt 12 12)(pt 52 12))
		(line (pt 12 68)(pt 52 68))
		(line (pt 52 68)(pt 52 12))
		(line (pt 12 68)(pt 12 12))
		(line (pt 19 40)(pt 12 47))
		(line (pt 12 32)(pt 20 40))
		(circle (rect 28 4 36 12))
		(circle (rect 28 68 36 76))
	)
)
(symbol
	(rect 192 224 256 304)
	(text "DFF" (rect 1 0 19 9)(font "Arial" (font_size 6)))
	(text "inst5" (rect 3 68 26 78)(font "Arial" ))
	(port
		(pt 32 80)
		(input)
		(text "CLRN" (rect 21 59 44 70)(font "Courier New" (bold)))
		(text "CLRN" (rect 21 58 44 69)(font "Courier New" (bold)))
		(line (pt 32 80)(pt 32 76))
	)
	(port
		(pt 0 40)
		(input)
		(text "CLK" (rect 3 29 20 40)(font "Courier New" (bold))(invisible))
		(text "CLK" (rect 3 29 20 40)(font "Courier New" (bold))(invisible))
		(line (pt 0 40)(pt 12 40))
	)
	(port
		(pt 0 24)
		(input)
		(text "D" (rect 14 20 19 31)(font "Courier New" (bold)))
		(text "D" (rect 14 20 19 31)(font "Courier New" (bold)))
		(line (pt 0 24)(pt 12 24))
	)
	(port
		(pt 32 0)
		(input)
		(text "PRN" (rect 24 13 41 24)(font "Courier New" (bold)))
		(text "PRN" (rect 24 11 41 22)(font "Courier New" (bold)))
		(line (pt 32 4)(pt 32 0))
	)
	(port
		(pt 64 24)
		(output)
		(text "Q" (rect 45 20 50 31)(font "Courier New" (bold)))
		(text "Q" (rect 43 20 47 31)(font "Courier New" (bold)))
		(line (pt 52 24)(pt 64 24))
	)
	(drawing
		(line (pt 12 12)(pt 52 12))
		(line (pt 12 68)(pt 52 68))
		(line (pt 52 68)(pt 52 12))
		(line (pt 12 68)(pt 12 12))
		(line (pt 19 40)(pt 12 47))
		(line (pt 12 32)(pt 20 40))
		(circle (rect 28 4 36 12))
		(circle (rect 28 68 36 76))
	)
)
(symbol
	(rect 200 48 248 80)
	(text "WIRE" (rect 1 0 24 9)(font "Arial" (font_size 6)))
	(text "inst25" (rect 3 21 32 31)(font "Arial" ))
	(port
		(pt 0 16)
		(input)
		(text "IN" (rect 2 7 13 18)(font "Courier New" (bold))(invisible))
		(text "IN" (rect 2 7 13 18)(font "Courier New" (bold))(invisible))
		(line (pt 0 16)(pt 14 16))
	)
	(port
		(pt 48 16)
		(output)
		(text "OUT" (rect 32 7 49 18)(font "Courier New" (bold))(invisible))
		(text "OUT" (rect 32 7 46 18)(font "Courier New" (bold))(invisible))
		(line (pt 32 16)(pt 48 16))
	)
	(drawing
		(line (pt 14 7)(pt 32 16))
		(line (pt 14 25)(pt 14 7))
		(line (pt 14 25)(pt 32 16))
	)
)
(symbol
	(rect 192 320 256 400)
	(text "DFF" (rect 1 0 19 9)(font "Arial" (font_size 6)))
	(text "inst6" (rect 3 68 26 78)(font "Arial" ))
	(port
		(pt 32 80)
		(input)
		(text "CLRN" (rect 21 59 44 70)(font "Courier New" (bold)))
		(text "CLRN" (rect 21 58 44 69)(font "Courier New" (bold)))
		(line (pt 32 80)(pt 32 76))
	)
	(port
		(pt 0 40)
		(input)
		(text "CLK" (rect 3 29 20 40)(font "Courier New" (bold))(invisible))
		(text "CLK" (rect 3 29 20 40)(font "Courier New" (bold))(invisible))
		(line (pt 0 40)(pt 12 40))
	)
	(port
		(pt 0 24)
		(input)
		(text "D" (rect 14 20 19 31)(font "Courier New" (bold)))
		(text "D" (rect 14 20 19 31)(font "Courier New" (bold)))
		(line (pt 0 24)(pt 12 24))
	)
	(port
		(pt 32 0)
		(input)
		(text "PRN" (rect 24 13 41 24)(font "Courier New" (bold)))
		(text "PRN" (rect 24 11 41 22)(font "Courier New" (bold)))
		(line (pt 32 4)(pt 32 0))
	)
	(port
		(pt 64 24)
		(output)
		(text "Q" (rect 45 20 50 31)(font "Courier New" (bold)))
		(text "Q" (rect 43 20 47 31)(font "Courier New" (bold)))
		(line (pt 52 24)(pt 64 24))
	)
	(drawing
		(line (pt 12 12)(pt 52 12))
		(line (pt 12 68)(pt 52 68))
		(line (pt 52 68)(pt 52 12))
		(line (pt 12 68)(pt 12 12))
		(line (pt 19 40)(pt 12 47))
		(line (pt 12 32)(pt 20 40))
		(circle (rect 28 4 36 12))
		(circle (rect 28 68 36 76))
	)
)
(symbol
	(rect 192 424 256 504)
	(text "DFF" (rect 1 0 19 9)(font "Arial" (font_size 6)))
	(text "inst9" (rect 3 68 26 78)(font "Arial" ))
	(port
		(pt 32 80)
		(input)
		(text "CLRN" (rect 21 59 44 70)(font "Courier New" (bold)))
		(text "CLRN" (rect 21 58 44 69)(font "Courier New" (bold)))
		(line (pt 32 80)(pt 32 76))
	)
	(port
		(pt 0 40)
		(input)
		(text "CLK" (rect 3 29 20 40)(font "Courier New" (bold))(invisible))
		(text "CLK" (rect 3 29 20 40)(font "Courier New" (bold))(invisible))
		(line (pt 0 40)(pt 12 40))
	)
	(port
		(pt 0 24)
		(input)
		(text "D" (rect 14 20 19 31)(font "Courier New" (bold)))
		(text "D" (rect 14 20 19 31)(font "Courier New" (bold)))
		(line (pt 0 24)(pt 12 24))
	)
	(port
		(pt 32 0)
		(input)
		(text "PRN" (rect 24 13 41 24)(font "Courier New" (bold)))
		(text "PRN" (rect 24 11 41 22)(font "Courier New" (bold)))
		(line (pt 32 4)(pt 32 0))
	)
	(port
		(pt 64 24)
		(output)
		(text "Q" (rect 45 20 50 31)(font "Courier New" (bold)))
		(text "Q" (rect 43 20 47 31)(font "Courier New" (bold)))
		(line (pt 52 24)(pt 64 24))
	)
	(drawing
		(line (pt 12 12)(pt 52 12))
		(line (pt 12 68)(pt 52 68))
		(line (pt 52 68)(pt 52 12))
		(line (pt 12 68)(pt 12 12))
		(line (pt 19 40)(pt 12 47))
		(line (pt 12 32)(pt 20 40))
		(circle (rect 28 4 36 12))
		(circle (rect 28 68 36 76))
	)
)
(symbol
	(rect 672 -72 736 -24)
	(text "AND2" (rect 1 0 25 9)(font "Arial" (font_size 6)))
	(text "inst12" (rect 3 37 32 47)(font "Arial" ))
	(port
		(pt 0 16)
		(input)
		(text "IN1" (rect 2 7 19 18)(font "Courier New" (bold))(invisible))
		(text "IN1" (rect 2 7 19 18)(font "Courier New" (bold))(invisible))
		(line (pt 0 16)(pt 14 16))
	)
	(port
		(pt 0 32)
		(input)
		(text "IN2" (rect 2 23 19 34)(font "Courier New" (bold))(invisible))
		(text "IN2" (rect 2 23 19 34)(font "Courier New" (bold))(invisible))
		(line (pt 0 32)(pt 14 32))
	)
	(port
		(pt 64 24)
		(output)
		(text "OUT" (rect 48 15 65 26)(font "Courier New" (bold))(invisible))
		(text "OUT" (rect 48 15 62 26)(font "Courier New" (bold))(invisible))
		(line (pt 42 24)(pt 64 24))
	)
	(drawing
		(line (pt 14 12)(pt 30 12))
		(line (pt 14 37)(pt 31 37))
		(line (pt 14 12)(pt 14 37))
		(arc (pt 31 37)(pt 30 12)(rect 18 12 43 37))
	)
)
(symbol
	(rect -584 1016 -424 1112)
	(text "lpm_add_sub2" (rect 38 1 137 16)(font "Arial" (font_size 10)))
	(text "inst14" (rect 8 80 37 90)(font "Arial" ))
	(port
		(pt 0 40)
		(input)
		(text "dataa[31..0]" (rect 0 0 67 11)(font "Arial" (font_size 8)))
		(text "dataa[31..0]" (rect 4 27 71 38)(font "Arial" (font_size 8)))
		(line (pt 0 40)(pt 64 40)(line_width 3))
	)
	(port
		(pt 0 72)
		(input)
		(text "datab[31..0]" (rect 0 0 67 11)(font "Arial" (font_size 8)))
		(text "datab[31..0]" (rect 4 59 71 70)(font "Arial" (font_size 8)))
		(line (pt 0 72)(pt 64 72)(line_width 3))
	)
	(port
		(pt 160 56)
		(output)
		(text "result[31..0]" (rect 0 0 64 11)(font "Arial" (font_size 8)))
		(text "result[31..0]" (rect 100 43 154 54)(font "Arial" (font_size 8)))
		(line (pt 160 56)(pt 96 56)(line_width 3))
	)
	(drawing
		(text "A" (rect 66 34 74 45)(font "Arial" (font_size 8)))
		(text "B" (rect 66 66 74 77)(font "Arial" (font_size 8)))
		(text "A+B" (rect 73 50 96 61)(font "Arial" (font_size 8)))
		(line (pt 64 32)(pt 96 40))
		(line (pt 96 40)(pt 96 72))
		(line (pt 96 72)(pt 64 80))
		(line (pt 64 80)(pt 64 32))
	)
)
(symbol
	(rect -360 1048 -296 1128)
	(text "DFF" (rect 1 0 19 9)(font "Arial" (font_size 6)))
	(text "inst15" (rect 3 68 32 78)(font "Arial" ))
	(port
		(pt 32 80)
		(input)
		(text "CLRN" (rect 21 59 44 70)(font "Courier New" (bold)))
		(text "CLRN" (rect 21 58 44 69)(font "Courier New" (bold)))
		(line (pt 32 80)(pt 32 76))
	)
	(port
		(pt 0 40)
		(input)
		(text "CLK" (rect 3 29 20 40)(font "Courier New" (bold))(invisible))
		(text "CLK" (rect 3 29 20 40)(font "Courier New" (bold))(invisible))
		(line (pt 0 40)(pt 12 40))
	)
	(port
		(pt 0 24)
		(input)
		(text "D" (rect 14 20 19 31)(font "Courier New" (bold)))
		(text "D" (rect 14 20 19 31)(font "Courier New" (bold)))
		(line (pt 0 24)(pt 12 24))
	)
	(port
		(pt 32 0)
		(input)
		(text "PRN" (rect 24 13 41 24)(font "Courier New" (bold)))
		(text "PRN" (rect 24 11 41 22)(font "Courier New" (bold)))
		(line (pt 32 4)(pt 32 0))
	)
	(port
		(pt 64 24)
		(output)
		(text "Q" (rect 45 20 50 31)(font "Courier New" (bold)))
		(text "Q" (rect 43 20 47 31)(font "Courier New" (bold)))
		(line (pt 52 24)(pt 64 24))
	)
	(drawing
		(line (pt 12 12)(pt 52 12))
		(line (pt 12 68)(pt 52 68))
		(line (pt 52 68)(pt 52 12))
		(line (pt 12 68)(pt 12 12))
		(line (pt 19 40)(pt 12 47))
		(line (pt 12 32)(pt 20 40))
		(circle (rect 28 4 36 12))
		(circle (rect 28 68 36 76))
	)
)
(symbol
	(rect 592 1320 744 1400)
	(text "lpm_mux5" (rect 50 2 120 17)(font "Arial" (font_size 10)))
	(text "inst19" (rect 8 64 37 74)(font "Arial" ))
	(port
		(pt 0 40)
		(input)
		(text "data1x[10..0]" (rect 0 0 73 11)(font "Arial" (font_size 8)))
		(text "data1x[10..0]" (rect 4 27 77 38)(font "Arial" (font_size 8)))
		(line (pt 0 40)(pt 72 40)(line_width 3))
	)
	(port
		(pt 0 56)
		(input)
		(text "data0x[10..0]" (rect 0 0 73 11)(font "Arial" (font_size 8)))
		(text "data0x[10..0]" (rect 4 43 77 54)(font "Arial" (font_size 8)))
		(line (pt 0 56)(pt 72 56)(line_width 3))
	)
	(port
		(pt 80 80)
		(input)
		(text "sel" (rect 0 0 15 11)(font "Arial" (font_size 8)))
		(text "sel" (rect 84 67 99 78)(font "Arial" (font_size 8)))
		(line (pt 80 80)(pt 80 68))
	)
	(port
		(pt 152 48)
		(output)
		(text "result[10..0]" (rect 0 0 64 11)(font "Arial" (font_size 8)))
		(text "result[10..0]" (rect 92 35 146 46)(font "Arial" (font_size 8)))
		(line (pt 152 48)(pt 88 48)(line_width 3))
	)
	(drawing
		(line (pt 72 24)(pt 72 72))
		(line (pt 88 32)(pt 88 64))
		(line (pt 72 24)(pt 88 32))
		(line (pt 72 72)(pt 88 64))
	)
)
(symbol
	(rect 896 1136 976 1216)
	(text "lpm_mux0" (rect 10 2 80 17)(font "Arial" (font_size 10)))
	(text "inst20" (rect 8 64 37 74)(font "Arial" ))
	(port
		(pt 0 40)
		(input)
		(text "data1" (rect 0 0 31 11)(font "Arial" (font_size 8)))
		(text "data1" (rect 4 27 35 38)(font "Arial" (font_size 8)))
		(line (pt 0 40)(pt 32 40))
	)
	(port
		(pt 0 56)
		(input)
		(text "data0" (rect 0 0 31 11)(font "Arial" (font_size 8)))
		(text "data0" (rect 4 43 35 54)(font "Arial" (font_size 8)))
		(line (pt 0 56)(pt 32 56))
	)
	(port
		(pt 40 80)
		(input)
		(text "sel" (rect 0 0 15 11)(font "Arial" (font_size 8)))
		(text "sel" (rect 44 67 59 78)(font "Arial" (font_size 8)))
		(line (pt 40 80)(pt 40 68))
	)
	(port
		(pt 80 48)
		(output)
		(text "result" (rect 0 0 29 11)(font "Arial" (font_size 8)))
		(text "result" (rect 50 35 74 46)(font "Arial" (font_size 8)))
		(line (pt 80 48)(pt 48 48))
	)
	(drawing
		(line (pt 32 24)(pt 32 72))
		(line (pt 48 32)(pt 48 64))
		(line (pt 32 24)(pt 48 32))
		(line (pt 32 72)(pt 48 64))
	)
)
(symbol
	(rect 792 -160 936 -16)
	(text "lpm_counter6" (rect 33 1 125 16)(font "Arial" (font_size 10)))
	(text "inst11" (rect 8 128 37 138)(font "Arial" ))
	(port
		(pt 0 32)
		(input)
		(text "sload" (rect 0 0 29 11)(font "Arial" (font_size 8)))
		(text "sload" (rect 20 26 49 37)(font "Arial" (font_size 8)))
		(line (pt 0 32)(pt 16 32))
	)
	(port
		(pt 0 48)
		(input)
		(text "data[11..0]" (rect 0 0 60 11)(font "Arial" (font_size 8)))
		(text "data[11..0]" (rect 20 42 80 53)(font "Arial" (font_size 8)))
		(line (pt 0 48)(pt 16 48)(line_width 3))
	)
	(port
		(pt 0 80)
		(input)
		(text "clock" (rect 0 0 30 11)(font "Arial" (font_size 8)))
		(text "clock" (rect 26 74 56 85)(font "Arial" (font_size 8)))
		(line (pt 0 80)(pt 16 80))
	)
	(port
		(pt 0 112)
		(input)
		(text "cnt_en" (rect 0 0 38 11)(font "Arial" (font_size 8)))
		(text "cnt_en" (rect 20 106 58 117)(font "Arial" (font_size 8)))
		(line (pt 0 112)(pt 16 112))
	)
	(port
		(pt 144 80)
		(output)
		(text "q[11..0]" (rect 0 0 42 11)(font "Arial" (font_size 8)))
		(text "q[11..0]" (rect 88 74 123 85)(font "Arial" (font_size 8)))
		(line (pt 144 80)(pt 128 80)(line_width 3))
	)
	(drawing
		(text "up counter" (rect 84 17 135 27)(font "Arial" ))
		(line (pt 16 16)(pt 128 16))
		(line (pt 128 16)(pt 128 128))
		(line (pt 128 128)(pt 16 128))
		(line (pt 16 128)(pt 16 16))
		(line (pt 16 74)(pt 22 80))
		(line (pt 22 80)(pt 16 86))
	)
)
(symbol
	(rect 608 768 752 896)
	(text "lpm_counter7" (rect 33 1 125 16)(font "Arial" (font_size 10)))
	(text "inst26" (rect 8 112 37 122)(font "Arial" ))
	(port
		(pt 0 32)
		(input)
		(text "sset" (rect 0 0 20 11)(font "Arial" (font_size 8)))
		(text "sset" (rect 20 26 40 37)(font "Arial" (font_size 8)))
		(line (pt 0 32)(pt 16 32))
	)
	(port
		(pt 0 64)
		(input)
		(text "clock" (rect 0 0 30 11)(font "Arial" (font_size 8)))
		(text "clock" (rect 26 58 56 69)(font "Arial" (font_size 8)))
		(line (pt 0 64)(pt 16 64))
	)
	(port
		(pt 0 96)
		(input)
		(text "cnt_en" (rect 0 0 38 11)(font "Arial" (font_size 8)))
		(text "cnt_en" (rect 20 90 58 101)(font "Arial" (font_size 8)))
		(line (pt 0 96)(pt 16 96))
	)
	(port
		(pt 144 80)
		(output)
		(text "q[13..0]" (rect 0 0 42 11)(font "Arial" (font_size 8)))
		(text "q[13..0]" (rect 88 74 123 85)(font "Arial" (font_size 8)))
		(line (pt 144 80)(pt 128 80)(line_width 3))
	)
	(drawing
		(text "up counter" (rect 84 17 135 27)(font "Arial" ))
		(text "sset 8192" (rect 87 27 135 37)(font "Arial" ))
		(line (pt 16 16)(pt 128 16))
		(line (pt 128 16)(pt 128 112))
		(line (pt 128 112)(pt 16 112))
		(line (pt 16 112)(pt 16 16))
		(line (pt 16 58)(pt 22 64))
		(line (pt 22 64)(pt 16 70))
	)
)
(symbol
	(rect 2032 808 2168 920)
	(text "lpm_mux6" (rect 42 2 112 17)(font "Arial" (font_size 10)))
	(text "inst27" (rect 8 96 37 106)(font "Arial" ))
	(port
		(pt 0 40)
		(input)
		(text "data3x[7..0]" (rect 0 0 66 11)(font "Arial" (font_size 8)))
		(text "data3x[7..0]" (rect 4 27 70 38)(font "Arial" (font_size 8)))
		(line (pt 0 40)(pt 64 40)(line_width 3))
	)
	(port
		(pt 0 56)
		(input)
		(text "data2x[7..0]" (rect 0 0 66 11)(font "Arial" (font_size 8)))
		(text "data2x[7..0]" (rect 4 43 70 54)(font "Arial" (font_size 8)))
		(line (pt 0 56)(pt 64 56)(line_width 3))
	)
	(port
		(pt 0 72)
		(input)
		(text "data1x[7..0]" (rect 0 0 66 11)(font "Arial" (font_size 8)))
		(text "data1x[7..0]" (rect 4 59 70 70)(font "Arial" (font_size 8)))
		(line (pt 0 72)(pt 64 72)(line_width 3))
	)
	(port
		(pt 0 88)
		(input)
		(text "data0x[7..0]" (rect 0 0 66 11)(font "Arial" (font_size 8)))
		(text "data0x[7..0]" (rect 4 75 70 86)(font "Arial" (font_size 8)))
		(line (pt 0 88)(pt 64 88)(line_width 3))
	)
	(port
		(pt 72 112)
		(input)
		(text "sel[1..0]" (rect 0 0 43 11)(font "Arial" (font_size 8)))
		(text "sel[1..0]" (rect 76 99 119 110)(font "Arial" (font_size 8)))
		(line (pt 72 112)(pt 72 100)(line_width 3))
	)
	(port
		(pt 136 64)
		(output)
		(text "result[7..0]" (rect 0 0 57 11)(font "Arial" (font_size 8)))
		(text "result[7..0]" (rect 82 51 130 62)(font "Arial" (font_size 8)))
		(line (pt 136 64)(pt 80 64)(line_width 3))
	)
	(drawing
		(line (pt 64 24)(pt 64 104))
		(line (pt 80 32)(pt 80 96))
		(line (pt 64 24)(pt 80 32))
		(line (pt 64 104)(pt 80 96))
	)
)
(symbol
	(rect 1888 944 1952 1024)
	(text "DFF" (rect 1 0 19 9)(font "Arial" (font_size 6)))
	(text "inst18" (rect 3 68 32 78)(font "Arial" ))
	(port
		(pt 32 80)
		(input)
		(text "CLRN" (rect 21 59 44 70)(font "Courier New" (bold)))
		(text "CLRN" (rect 21 58 44 69)(font "Courier New" (bold)))
		(line (pt 32 80)(pt 32 76))
	)
	(port
		(pt 0 40)
		(input)
		(text "CLK" (rect 3 29 20 40)(font "Courier New" (bold))(invisible))
		(text "CLK" (rect 3 29 20 40)(font "Courier New" (bold))(invisible))
		(line (pt 0 40)(pt 12 40))
	)
	(port
		(pt 0 24)
		(input)
		(text "D" (rect 14 20 19 31)(font "Courier New" (bold)))
		(text "D" (rect 14 20 19 31)(font "Courier New" (bold)))
		(line (pt 0 24)(pt 12 24))
	)
	(port
		(pt 32 0)
		(input)
		(text "PRN" (rect 24 13 41 24)(font "Courier New" (bold)))
		(text "PRN" (rect 24 11 41 22)(font "Courier New" (bold)))
		(line (pt 32 4)(pt 32 0))
	)
	(port
		(pt 64 24)
		(output)
		(text "Q" (rect 45 20 50 31)(font "Courier New" (bold)))
		(text "Q" (rect 43 20 47 31)(font "Courier New" (bold)))
		(line (pt 52 24)(pt 64 24))
	)
	(drawing
		(line (pt 12 12)(pt 52 12))
		(line (pt 12 68)(pt 52 68))
		(line (pt 52 68)(pt 52 12))
		(line (pt 12 68)(pt 12 12))
		(line (pt 19 40)(pt 12 47))
		(line (pt 12 32)(pt 20 40))
		(circle (rect 28 4 36 12))
		(circle (rect 28 68 36 76))
	)
)
(symbol
	(rect 2000 944 2064 1024)
	(text "DFF" (rect 1 0 19 9)(font "Arial" (font_size 6)))
	(text "inst30" (rect 3 68 32 78)(font "Arial" ))
	(port
		(pt 32 80)
		(input)
		(text "CLRN" (rect 21 59 44 70)(font "Courier New" (bold)))
		(text "CLRN" (rect 21 58 44 69)(font "Courier New" (bold)))
		(line (pt 32 80)(pt 32 76))
	)
	(port
		(pt 0 40)
		(input)
		(text "CLK" (rect 3 29 20 40)(font "Courier New" (bold))(invisible))
		(text "CLK" (rect 3 29 20 40)(font "Courier New" (bold))(invisible))
		(line (pt 0 40)(pt 12 40))
	)
	(port
		(pt 0 24)
		(input)
		(text "D" (rect 14 20 19 31)(font "Courier New" (bold)))
		(text "D" (rect 14 20 19 31)(font "Courier New" (bold)))
		(line (pt 0 24)(pt 12 24))
	)
	(port
		(pt 32 0)
		(input)
		(text "PRN" (rect 24 13 41 24)(font "Courier New" (bold)))
		(text "PRN" (rect 24 11 41 22)(font "Courier New" (bold)))
		(line (pt 32 4)(pt 32 0))
	)
	(port
		(pt 64 24)
		(output)
		(text "Q" (rect 45 20 50 31)(font "Courier New" (bold)))
		(text "Q" (rect 43 20 47 31)(font "Courier New" (bold)))
		(line (pt 52 24)(pt 64 24))
	)
	(drawing
		(line (pt 12 12)(pt 52 12))
		(line (pt 12 68)(pt 52 68))
		(line (pt 52 68)(pt 52 12))
		(line (pt 12 68)(pt 12 12))
		(line (pt 19 40)(pt 12 47))
		(line (pt 12 32)(pt 20 40))
		(circle (rect 28 4 36 12))
		(circle (rect 28 68 36 76))
	)
)
(symbol
	(rect 1864 656 1928 704)
	(text "BAND2" (rect 1 0 31 9)(font "Arial" (font_size 6)))
	(text "inst32" (rect 3 37 32 47)(font "Arial" ))
	(port
		(pt 0 16)
		(input)
		(text "IN1" (rect 2 7 19 18)(font "Courier New" (bold))(invisible))
		(text "IN1" (rect 2 7 19 18)(font "Courier New" (bold))(invisible))
		(line (pt 0 16)(pt 9 16))
	)
	(port
		(pt 0 32)
		(input)
		(text "IN2" (rect 2 23 19 34)(font "Courier New" (bold))(invisible))
		(text "IN2" (rect 2 23 19 34)(font "Courier New" (bold))(invisible))
		(line (pt 0 32)(pt 9 32))
	)
	(port
		(pt 64 24)
		(output)
		(text "OUT" (rect 48 15 65 26)(font "Courier New" (bold))(invisible))
		(text "OUT" (rect 48 15 62 26)(font "Courier New" (bold))(invisible))
		(line (pt 44 24)(pt 64 24))
	)
	(drawing
		(line (pt 17 12)(pt 32 12))
		(line (pt 32 37)(pt 17 37))
		(line (pt 17 12)(pt 17 37))
		(arc (pt 32 36)(pt 32 12)(rect 20 12 45 37))
		(circle (rect 9 12 17 20))
		(circle (rect 9 28 17 36))
	)
)
(symbol
	(rect 1960 576 2024 656)
	(text "AND4" (rect 1 0 25 9)(font "Arial" (font_size 6)))
	(text "inst33" (rect 3 69 32 79)(font "Arial" ))
	(port
		(pt 0 16)
		(input)
		(text "IN1" (rect 2 7 19 18)(font "Courier New" (bold))(invisible))
		(text "IN1" (rect 2 7 19 18)(font "Courier New" (bold))(invisible))
		(line (pt 0 16)(pt 18 16))
	)
	(port
		(pt 0 32)
		(input)
		(text "IN2" (rect 2 23 19 34)(font "Courier New" (bold))(invisible))
		(text "IN2" (rect 2 23 19 34)(font "Courier New" (bold))(invisible))
		(line (pt 0 32)(pt 18 32))
	)
	(port
		(pt 0 48)
		(input)
		(text "IN3" (rect 2 39 19 50)(font "Courier New" (bold))(invisible))
		(text "IN3" (rect 2 39 19 50)(font "Courier New" (bold))(invisible))
		(line (pt 0 48)(pt 18 48))
	)
	(port
		(pt 0 64)
		(input)
		(text "IN4" (rect 2 55 19 66)(font "Courier New" (bold))(invisible))
		(text "IN4" (rect 2 55 19 66)(font "Courier New" (bold))(invisible))
		(line (pt 0 64)(pt 18 64))
	)
	(port
		(pt 64 40)
		(output)
		(text "OUT" (rect 48 31 65 42)(font "Courier New" (bold))(invisible))
		(text "OUT" (rect 48 31 62 42)(font "Courier New" (bold))(invisible))
		(line (pt 46 40)(pt 64 40))
	)
	(drawing
		(line (pt 18 28)(pt 34 28))
		(line (pt 18 52)(pt 18 28))
		(line (pt 18 67)(pt 18 13))
		(line (pt 34 53)(pt 18 53))
		(arc (pt 34 52)(pt 34 28)(rect 22 28 47 53))
	)
)
(symbol
	(rect 2184 592 2248 672)
	(text "DFF" (rect 1 0 19 9)(font "Arial" (font_size 6)))
	(text "inst35" (rect 3 68 32 78)(font "Arial" ))
	(port
		(pt 32 80)
		(input)
		(text "CLRN" (rect 21 59 44 70)(font "Courier New" (bold)))
		(text "CLRN" (rect 21 58 44 69)(font "Courier New" (bold)))
		(line (pt 32 80)(pt 32 76))
	)
	(port
		(pt 0 40)
		(input)
		(text "CLK" (rect 3 29 20 40)(font "Courier New" (bold))(invisible))
		(text "CLK" (rect 3 29 20 40)(font "Courier New" (bold))(invisible))
		(line (pt 0 40)(pt 12 40))
	)
	(port
		(pt 0 24)
		(input)
		(text "D" (rect 14 20 19 31)(font "Courier New" (bold)))
		(text "D" (rect 14 20 19 31)(font "Courier New" (bold)))
		(line (pt 0 24)(pt 12 24))
	)
	(port
		(pt 32 0)
		(input)
		(text "PRN" (rect 24 13 41 24)(font "Courier New" (bold)))
		(text "PRN" (rect 24 11 41 22)(font "Courier New" (bold)))
		(line (pt 32 4)(pt 32 0))
	)
	(port
		(pt 64 24)
		(output)
		(text "Q" (rect 45 20 50 31)(font "Courier New" (bold)))
		(text "Q" (rect 43 20 47 31)(font "Courier New" (bold)))
		(line (pt 52 24)(pt 64 24))
	)
	(drawing
		(line (pt 12 12)(pt 52 12))
		(line (pt 12 68)(pt 52 68))
		(line (pt 52 68)(pt 52 12))
		(line (pt 12 68)(pt 12 12))
		(line (pt 19 40)(pt 12 47))
		(line (pt 12 32)(pt 20 40))
		(circle (rect 28 4 36 12))
		(circle (rect 28 68 36 76))
	)
)
(symbol
	(rect 2072 592 2136 672)
	(text "DFF" (rect 1 0 19 9)(font "Arial" (font_size 6)))
	(text "inst36" (rect 3 68 32 78)(font "Arial" ))
	(port
		(pt 32 80)
		(input)
		(text "CLRN" (rect 21 59 44 70)(font "Courier New" (bold)))
		(text "CLRN" (rect 21 58 44 69)(font "Courier New" (bold)))
		(line (pt 32 80)(pt 32 76))
	)
	(port
		(pt 0 40)
		(input)
		(text "CLK" (rect 3 29 20 40)(font "Courier New" (bold))(invisible))
		(text "CLK" (rect 3 29 20 40)(font "Courier New" (bold))(invisible))
		(line (pt 0 40)(pt 12 40))
	)
	(port
		(pt 0 24)
		(input)
		(text "D" (rect 14 20 19 31)(font "Courier New" (bold)))
		(text "D" (rect 14 20 19 31)(font "Courier New" (bold)))
		(line (pt 0 24)(pt 12 24))
	)
	(port
		(pt 32 0)
		(input)
		(text "PRN" (rect 24 13 41 24)(font "Courier New" (bold)))
		(text "PRN" (rect 24 11 41 22)(font "Courier New" (bold)))
		(line (pt 32 4)(pt 32 0))
	)
	(port
		(pt 64 24)
		(output)
		(text "Q" (rect 45 20 50 31)(font "Courier New" (bold)))
		(text "Q" (rect 43 20 47 31)(font "Courier New" (bold)))
		(line (pt 52 24)(pt 64 24))
	)
	(drawing
		(line (pt 12 12)(pt 52 12))
		(line (pt 12 68)(pt 52 68))
		(line (pt 52 68)(pt 52 12))
		(line (pt 12 68)(pt 12 12))
		(line (pt 19 40)(pt 12 47))
		(line (pt 12 32)(pt 20 40))
		(circle (rect 28 4 36 12))
		(circle (rect 28 68 36 76))
	)
)
(symbol
	(rect 2000 1040 2064 1120)
	(text "DFF" (rect 1 0 19 9)(font "Arial" (font_size 6)))
	(text "inst38" (rect 3 68 32 78)(font "Arial" ))
	(port
		(pt 32 80)
		(input)
		(text "CLRN" (rect 21 59 44 70)(font "Courier New" (bold)))
		(text "CLRN" (rect 21 58 44 69)(font "Courier New" (bold)))
		(line (pt 32 80)(pt 32 76))
	)
	(port
		(pt 0 40)
		(input)
		(text "CLK" (rect 3 29 20 40)(font "Courier New" (bold))(invisible))
		(text "CLK" (rect 3 29 20 40)(font "Courier New" (bold))(invisible))
		(line (pt 0 40)(pt 12 40))
	)
	(port
		(pt 0 24)
		(input)
		(text "D" (rect 14 20 19 31)(font "Courier New" (bold)))
		(text "D" (rect 14 20 19 31)(font "Courier New" (bold)))
		(line (pt 0 24)(pt 12 24))
	)
	(port
		(pt 32 0)
		(input)
		(text "PRN" (rect 24 13 41 24)(font "Courier New" (bold)))
		(text "PRN" (rect 24 11 41 22)(font "Courier New" (bold)))
		(line (pt 32 4)(pt 32 0))
	)
	(port
		(pt 64 24)
		(output)
		(text "Q" (rect 45 20 50 31)(font "Courier New" (bold)))
		(text "Q" (rect 43 20 47 31)(font "Courier New" (bold)))
		(line (pt 52 24)(pt 64 24))
	)
	(drawing
		(line (pt 12 12)(pt 52 12))
		(line (pt 12 68)(pt 52 68))
		(line (pt 52 68)(pt 52 12))
		(line (pt 12 68)(pt 12 12))
		(line (pt 19 40)(pt 12 47))
		(line (pt 12 32)(pt 20 40))
		(circle (rect 28 4 36 12))
		(circle (rect 28 68 36 76))
	)
)
(symbol
	(rect 1888 1040 1952 1120)
	(text "DFF" (rect 1 0 19 9)(font "Arial" (font_size 6)))
	(text "inst39" (rect 3 68 32 78)(font "Arial" ))
	(port
		(pt 32 80)
		(input)
		(text "CLRN" (rect 21 59 44 70)(font "Courier New" (bold)))
		(text "CLRN" (rect 21 58 44 69)(font "Courier New" (bold)))
		(line (pt 32 80)(pt 32 76))
	)
	(port
		(pt 0 40)
		(input)
		(text "CLK" (rect 3 29 20 40)(font "Courier New" (bold))(invisible))
		(text "CLK" (rect 3 29 20 40)(font "Courier New" (bold))(invisible))
		(line (pt 0 40)(pt 12 40))
	)
	(port
		(pt 0 24)
		(input)
		(text "D" (rect 14 20 19 31)(font "Courier New" (bold)))
		(text "D" (rect 14 20 19 31)(font "Courier New" (bold)))
		(line (pt 0 24)(pt 12 24))
	)
	(port
		(pt 32 0)
		(input)
		(text "PRN" (rect 24 13 41 24)(font "Courier New" (bold)))
		(text "PRN" (rect 24 11 41 22)(font "Courier New" (bold)))
		(line (pt 32 4)(pt 32 0))
	)
	(port
		(pt 64 24)
		(output)
		(text "Q" (rect 45 20 50 31)(font "Courier New" (bold)))
		(text "Q" (rect 43 20 47 31)(font "Courier New" (bold)))
		(line (pt 52 24)(pt 64 24))
	)
	(drawing
		(line (pt 12 12)(pt 52 12))
		(line (pt 12 68)(pt 52 68))
		(line (pt 52 68)(pt 52 12))
		(line (pt 12 68)(pt 12 12))
		(line (pt 19 40)(pt 12 47))
		(line (pt 12 32)(pt 20 40))
		(circle (rect 28 4 36 12))
		(circle (rect 28 68 36 76))
	)
)
(symbol
	(rect 440 880 504 960)
	(text "AND4" (rect 1 0 25 9)(font "Arial" (font_size 6)))
	(text "inst40" (rect 3 69 32 79)(font "Arial" ))
	(port
		(pt 0 16)
		(input)
		(text "IN1" (rect 2 7 19 18)(font "Courier New" (bold))(invisible))
		(text "IN1" (rect 2 7 19 18)(font "Courier New" (bold))(invisible))
		(line (pt 0 16)(pt 18 16))
	)
	(port
		(pt 0 32)
		(input)
		(text "IN2" (rect 2 23 19 34)(font "Courier New" (bold))(invisible))
		(text "IN2" (rect 2 23 19 34)(font "Courier New" (bold))(invisible))
		(line (pt 0 32)(pt 18 32))
	)
	(port
		(pt 0 48)
		(input)
		(text "IN3" (rect 2 39 19 50)(font "Courier New" (bold))(invisible))
		(text "IN3" (rect 2 39 19 50)(font "Courier New" (bold))(invisible))
		(line (pt 0 48)(pt 18 48))
	)
	(port
		(pt 0 64)
		(input)
		(text "IN4" (rect 2 55 19 66)(font "Courier New" (bold))(invisible))
		(text "IN4" (rect 2 55 19 66)(font "Courier New" (bold))(invisible))
		(line (pt 0 64)(pt 18 64))
	)
	(port
		(pt 64 40)
		(output)
		(text "OUT" (rect 48 31 65 42)(font "Courier New" (bold))(invisible))
		(text "OUT" (rect 48 31 62 42)(font "Courier New" (bold))(invisible))
		(line (pt 46 40)(pt 64 40))
	)
	(drawing
		(line (pt 18 28)(pt 34 28))
		(line (pt 18 52)(pt 18 28))
		(line (pt 18 67)(pt 18 13))
		(line (pt 34 53)(pt 18 53))
		(arc (pt 34 52)(pt 34 28)(rect 22 28 47 53))
	)
)
(symbol
	(rect 696 912 744 944)
	(text "NOT" (rect 1 0 21 9)(font "Arial" (font_size 6)))
	(text "inst45" (rect 3 21 32 31)(font "Arial" ))
	(port
		(pt 0 16)
		(input)
		(text "IN" (rect 2 7 13 18)(font "Courier New" (bold))(invisible))
		(text "IN" (rect 2 7 13 18)(font "Courier New" (bold))(invisible))
		(line (pt 0 16)(pt 13 16))
	)
	(port
		(pt 48 16)
		(output)
		(text "OUT" (rect 32 7 49 18)(font "Courier New" (bold))(invisible))
		(text "OUT" (rect 32 7 46 18)(font "Courier New" (bold))(invisible))
		(line (pt 39 16)(pt 48 16))
	)
	(drawing
		(line (pt 13 25)(pt 13 7))
		(line (pt 13 7)(pt 31 16))
		(line (pt 13 25)(pt 31 16))
		(circle (rect 31 12 39 20))
	)
)
(symbol
	(rect 440 1000 504 1112)
	(text "AND6" (rect 1 0 25 9)(font "Arial" (font_size 6)))
	(text "inst46" (rect 3 101 32 111)(font "Arial" ))
	(port
		(pt 0 48)
		(input)
		(text "IN3" (rect 2 39 19 50)(font "Courier New" (bold))(invisible))
		(text "IN3" (rect 2 39 19 50)(font "Courier New" (bold))(invisible))
		(line (pt 0 48)(pt 18 48))
	)
	(port
		(pt 0 16)
		(input)
		(text "IN1" (rect 2 7 19 18)(font "Courier New" (bold))(invisible))
		(text "IN1" (rect 2 7 19 18)(font "Courier New" (bold))(invisible))
		(line (pt 0 16)(pt 18 16))
	)
	(port
		(pt 0 32)
		(input)
		(text "IN2" (rect 2 23 19 34)(font "Courier New" (bold))(invisible))
		(text "IN2" (rect 2 23 19 34)(font "Courier New" (bold))(invisible))
		(line (pt 0 32)(pt 18 32))
	)
	(port
		(pt 0 64)
		(input)
		(text "IN4" (rect 2 55 19 66)(font "Courier New" (bold))(invisible))
		(text "IN4" (rect 2 55 19 66)(font "Courier New" (bold))(invisible))
		(line (pt 0 64)(pt 18 64))
	)
	(port
		(pt 0 80)
		(input)
		(text "IN5" (rect 2 71 19 82)(font "Courier New" (bold))(invisible))
		(text "IN5" (rect 2 71 19 82)(font "Courier New" (bold))(invisible))
		(line (pt 0 80)(pt 18 80))
	)
	(port
		(pt 0 96)
		(input)
		(text "IN6" (rect 2 87 19 98)(font "Courier New" (bold))(invisible))
		(text "IN6" (rect 2 87 19 98)(font "Courier New" (bold))(invisible))
		(line (pt 0 96)(pt 18 96))
	)
	(port
		(pt 64 56)
		(output)
		(text "OUT" (rect 48 47 65 58)(font "Courier New" (bold))(invisible))
		(text "OUT" (rect 48 47 62 58)(font "Courier New" (bold))(invisible))
		(line (pt 46 56)(pt 64 56))
	)
	(drawing
		(line (pt 18 43)(pt 33 43))
		(line (pt 18 99)(pt 18 13))
		(line (pt 18 70)(pt 34 70))
		(arc (pt 34 69)(pt 33 43)(rect 20 43 47 70))
	)
)
(symbol
	(rect 704 1120 768 1168)
	(text "NAND2" (rect 1 0 32 9)(font "Arial" (font_size 6)))
	(text "inst49" (rect 3 37 32 47)(font "Arial" ))
	(port
		(pt 0 32)
		(input)
		(text "IN2" (rect 2 23 19 34)(font "Courier New" (bold))(invisible))
		(text "IN2" (rect 2 23 19 34)(font "Courier New" (bold))(invisible))
		(line (pt 0 32)(pt 15 32))
	)
	(port
		(pt 0 16)
		(input)
		(text "IN1" (rect 2 7 19 18)(font "Courier New" (bold))(invisible))
		(text "IN1" (rect 2 7 19 18)(font "Courier New" (bold))(invisible))
		(line (pt 0 16)(pt 15 16))
	)
	(port
		(pt 64 24)
		(output)
		(text "OUT" (rect 48 15 65 26)(font "Courier New" (bold))(invisible))
		(text "OUT" (rect 48 15 62 26)(font "Courier New" (bold))(invisible))
		(line (pt 52 24)(pt 64 24))
	)
	(drawing
		(line (pt 15 37)(pt 32 37))
		(line (pt 15 12)(pt 32 12))
		(line (pt 15 36)(pt 15 12))
		(arc (pt 32 36)(pt 32 12)(rect 20 12 45 37))
		(circle (rect 44 20 52 28))
	)
)
(symbol
	(rect 720 1072 768 1104)
	(text "NOT" (rect 1 0 21 9)(font "Arial" (font_size 6)))
	(text "inst50" (rect 3 21 32 31)(font "Arial" ))
	(port
		(pt 0 16)
		(input)
		(text "IN" (rect 2 7 13 18)(font "Courier New" (bold))(invisible))
		(text "IN" (rect 2 7 13 18)(font "Courier New" (bold))(invisible))
		(line (pt 0 16)(pt 13 16))
	)
	(port
		(pt 48 16)
		(output)
		(text "OUT" (rect 32 7 49 18)(font "Courier New" (bold))(invisible))
		(text "OUT" (rect 32 7 46 18)(font "Courier New" (bold))(invisible))
		(line (pt 39 16)(pt 48 16))
	)
	(drawing
		(line (pt 13 25)(pt 13 7))
		(line (pt 13 7)(pt 31 16))
		(line (pt 13 25)(pt 31 16))
		(circle (rect 31 12 39 20))
	)
)
(symbol
	(rect -520 152 -472 184)
	(text "NOT" (rect 1 0 21 9)(font "Arial" (font_size 6)))
	(text "inst52" (rect 3 21 32 31)(font "Arial" ))
	(port
		(pt 0 16)
		(input)
		(text "IN" (rect 2 7 13 18)(font "Courier New" (bold))(invisible))
		(text "IN" (rect 2 7 13 18)(font "Courier New" (bold))(invisible))
		(line (pt 0 16)(pt 13 16))
	)
	(port
		(pt 48 16)
		(output)
		(text "OUT" (rect 32 7 49 18)(font "Courier New" (bold))(invisible))
		(text "OUT" (rect 32 7 46 18)(font "Courier New" (bold))(invisible))
		(line (pt 39 16)(pt 48 16))
	)
	(drawing
		(line (pt 13 25)(pt 13 7))
		(line (pt 13 7)(pt 31 16))
		(line (pt 13 25)(pt 31 16))
		(circle (rect 31 12 39 20))
	)
)
(symbol
	(rect 792 1184 856 1232)
	(text "AND2" (rect 1 0 25 9)(font "Arial" (font_size 6)))
	(text "inst53" (rect 3 37 32 47)(font "Arial" ))
	(port
		(pt 0 16)
		(input)
		(text "IN1" (rect 2 7 19 18)(font "Courier New" (bold))(invisible))
		(text "IN1" (rect 2 7 19 18)(font "Courier New" (bold))(invisible))
		(line (pt 0 16)(pt 14 16))
	)
	(port
		(pt 0 32)
		(input)
		(text "IN2" (rect 2 23 19 34)(font "Courier New" (bold))(invisible))
		(text "IN2" (rect 2 23 19 34)(font "Courier New" (bold))(invisible))
		(line (pt 0 32)(pt 14 32))
	)
	(port
		(pt 64 24)
		(output)
		(text "OUT" (rect 48 15 65 26)(font "Courier New" (bold))(invisible))
		(text "OUT" (rect 48 15 62 26)(font "Courier New" (bold))(invisible))
		(line (pt 42 24)(pt 64 24))
	)
	(drawing
		(line (pt 14 12)(pt 30 12))
		(line (pt 14 37)(pt 31 37))
		(line (pt 14 12)(pt 14 37))
		(arc (pt 31 37)(pt 30 12)(rect 18 12 43 37))
	)
)
(symbol
	(rect 1864 472 1928 584)
	(text "AND6" (rect 1 0 25 9)(font "Arial" (font_size 6)))
	(text "inst16" (rect 3 101 32 111)(font "Arial" ))
	(port
		(pt 0 48)
		(input)
		(text "IN3" (rect 2 39 19 50)(font "Courier New" (bold))(invisible))
		(text "IN3" (rect 2 39 19 50)(font "Courier New" (bold))(invisible))
		(line (pt 0 48)(pt 18 48))
	)
	(port
		(pt 0 16)
		(input)
		(text "IN1" (rect 2 7 19 18)(font "Courier New" (bold))(invisible))
		(text "IN1" (rect 2 7 19 18)(font "Courier New" (bold))(invisible))
		(line (pt 0 16)(pt 18 16))
	)
	(port
		(pt 0 32)
		(input)
		(text "IN2" (rect 2 23 19 34)(font "Courier New" (bold))(invisible))
		(text "IN2" (rect 2 23 19 34)(font "Courier New" (bold))(invisible))
		(line (pt 0 32)(pt 18 32))
	)
	(port
		(pt 0 64)
		(input)
		(text "IN4" (rect 2 55 19 66)(font "Courier New" (bold))(invisible))
		(text "IN4" (rect 2 55 19 66)(font "Courier New" (bold))(invisible))
		(line (pt 0 64)(pt 18 64))
	)
	(port
		(pt 0 80)
		(input)
		(text "IN5" (rect 2 71 19 82)(font "Courier New" (bold))(invisible))
		(text "IN5" (rect 2 71 19 82)(font "Courier New" (bold))(invisible))
		(line (pt 0 80)(pt 18 80))
	)
	(port
		(pt 0 96)
		(input)
		(text "IN6" (rect 2 87 19 98)(font "Courier New" (bold))(invisible))
		(text "IN6" (rect 2 87 19 98)(font "Courier New" (bold))(invisible))
		(line (pt 0 96)(pt 18 96))
	)
	(port
		(pt 64 56)
		(output)
		(text "OUT" (rect 48 47 65 58)(font "Courier New" (bold))(invisible))
		(text "OUT" (rect 48 47 62 58)(font "Courier New" (bold))(invisible))
		(line (pt 46 56)(pt 64 56))
	)
	(drawing
		(line (pt 18 43)(pt 33 43))
		(line (pt 18 99)(pt 18 13))
		(line (pt 18 70)(pt 34 70))
		(arc (pt 34 69)(pt 33 43)(rect 20 43 47 70))
	)
)
(symbol
	(rect 312 432 376 480)
	(text "AND2" (rect 1 0 25 9)(font "Arial" (font_size 6)))
	(text "inst21" (rect 3 37 32 47)(font "Arial" ))
	(port
		(pt 0 16)
		(input)
		(text "IN1" (rect 2 7 19 18)(font "Courier New" (bold))(invisible))
		(text "IN1" (rect 2 7 19 18)(font "Courier New" (bold))(invisible))
		(line (pt 0 16)(pt 14 16))
	)
	(port
		(pt 0 32)
		(input)
		(text "IN2" (rect 2 23 19 34)(font "Courier New" (bold))(invisible))
		(text "IN2" (rect 2 23 19 34)(font "Courier New" (bold))(invisible))
		(line (pt 0 32)(pt 14 32))
	)
	(port
		(pt 64 24)
		(output)
		(text "OUT" (rect 48 15 65 26)(font "Courier New" (bold))(invisible))
		(text "OUT" (rect 48 15 62 26)(font "Courier New" (bold))(invisible))
		(line (pt 42 24)(pt 64 24))
	)
	(drawing
		(line (pt 14 12)(pt 30 12))
		(line (pt 14 37)(pt 31 37))
		(line (pt 14 12)(pt 14 37))
		(arc (pt 31 37)(pt 30 12)(rect 18 12 43 37))
	)
)
(symbol
	(rect -208 1032 -56 1112)
	(text "lpm_mux7" (rect 50 2 120 17)(font "Arial" (font_size 10)))
	(text "inst31" (rect 8 64 37 74)(font "Arial" ))
	(port
		(pt 0 40)
		(input)
		(text "data1x[31..0]" (rect 0 0 73 11)(font "Arial" (font_size 8)))
		(text "data1x[31..0]" (rect 4 27 77 38)(font "Arial" (font_size 8)))
		(line (pt 0 40)(pt 72 40)(line_width 3))
	)
	(port
		(pt 0 56)
		(input)
		(text "data0x[31..0]" (rect 0 0 73 11)(font "Arial" (font_size 8)))
		(text "data0x[31..0]" (rect 4 43 77 54)(font "Arial" (font_size 8)))
		(line (pt 0 56)(pt 72 56)(line_width 3))
	)
	(port
		(pt 80 80)
		(input)
		(text "sel" (rect 0 0 15 11)(font "Arial" (font_size 8)))
		(text "sel" (rect 84 67 99 78)(font "Arial" (font_size 8)))
		(line (pt 80 80)(pt 80 68))
	)
	(port
		(pt 152 48)
		(output)
		(text "result[31..0]" (rect 0 0 64 11)(font "Arial" (font_size 8)))
		(text "result[31..0]" (rect 92 35 146 46)(font "Arial" (font_size 8)))
		(line (pt 152 48)(pt 88 48)(line_width 3))
	)
	(drawing
		(line (pt 72 24)(pt 72 72))
		(line (pt 88 32)(pt 88 64))
		(line (pt 72 24)(pt 88 32))
		(line (pt 72 72)(pt 88 64))
	)
)
(symbol
	(rect -24 1064 40 1112)
	(text "AND2" (rect 1 0 25 9)(font "Arial" (font_size 6)))
	(text "inst54" (rect 3 37 32 47)(font "Arial" ))
	(port
		(pt 0 16)
		(input)
		(text "IN1" (rect 2 7 19 18)(font "Courier New" (bold))(invisible))
		(text "IN1" (rect 2 7 19 18)(font "Courier New" (bold))(invisible))
		(line (pt 0 16)(pt 14 16))
	)
	(port
		(pt 0 32)
		(input)
		(text "IN2" (rect 2 23 19 34)(font "Courier New" (bold))(invisible))
		(text "IN2" (rect 2 23 19 34)(font "Courier New" (bold))(invisible))
		(line (pt 0 32)(pt 14 32))
	)
	(port
		(pt 64 24)
		(output)
		(text "OUT" (rect 48 15 65 26)(font "Courier New" (bold))(invisible))
		(text "OUT" (rect 48 15 62 26)(font "Courier New" (bold))(invisible))
		(line (pt 42 24)(pt 64 24))
	)
	(drawing
		(line (pt 14 12)(pt 30 12))
		(line (pt 14 37)(pt 31 37))
		(line (pt 14 12)(pt 14 37))
		(arc (pt 31 37)(pt 30 12)(rect 18 12 43 37))
	)
)
(symbol
	(rect -104 1144 -56 1176)
	(text "NOT" (rect 1 0 21 9)(font "Arial" (font_size 6)))
	(text "inst34" (rect 3 21 32 31)(font "Arial" ))
	(port
		(pt 0 16)
		(input)
		(text "IN" (rect 2 7 13 18)(font "Courier New" (bold))(invisible))
		(text "IN" (rect 2 7 13 18)(font "Courier New" (bold))(invisible))
		(line (pt 0 16)(pt 13 16))
	)
	(port
		(pt 48 16)
		(output)
		(text "OUT" (rect 32 7 49 18)(font "Courier New" (bold))(invisible))
		(text "OUT" (rect 32 7 46 18)(font "Courier New" (bold))(invisible))
		(line (pt 39 16)(pt 48 16))
	)
	(drawing
		(line (pt 13 25)(pt 13 7))
		(line (pt 13 7)(pt 31 16))
		(line (pt 13 25)(pt 31 16))
		(circle (rect 31 12 39 20))
	)
)
(symbol
	(rect 1464 -128 1512 -96)
	(text "WIRE" (rect 1 0 24 9)(font "Arial" (font_size 6)))
	(text "inst37" (rect 3 21 32 31)(font "Arial" ))
	(port
		(pt 0 16)
		(input)
		(text "IN" (rect 2 7 13 18)(font "Courier New" (bold))(invisible))
		(text "IN" (rect 2 7 13 18)(font "Courier New" (bold))(invisible))
		(line (pt 0 16)(pt 14 16))
	)
	(port
		(pt 48 16)
		(output)
		(text "OUT" (rect 32 7 49 18)(font "Courier New" (bold))(invisible))
		(text "OUT" (rect 32 7 46 18)(font "Courier New" (bold))(invisible))
		(line (pt 32 16)(pt 48 16))
	)
	(drawing
		(line (pt 14 7)(pt 32 16))
		(line (pt 14 25)(pt 14 7))
		(line (pt 14 25)(pt 32 16))
	)
)
(symbol
	(rect -32 424 32 472)
	(text "AND2" (rect 1 0 25 9)(font "Arial" (font_size 6)))
	(text "inst42" (rect 3 37 32 47)(font "Arial" ))
	(port
		(pt 0 16)
		(input)
		(text "IN1" (rect 2 7 19 18)(font "Courier New" (bold))(invisible))
		(text "IN1" (rect 2 7 19 18)(font "Courier New" (bold))(invisible))
		(line (pt 0 16)(pt 14 16))
	)
	(port
		(pt 0 32)
		(input)
		(text "IN2" (rect 2 23 19 34)(font "Courier New" (bold))(invisible))
		(text "IN2" (rect 2 23 19 34)(font "Courier New" (bold))(invisible))
		(line (pt 0 32)(pt 14 32))
	)
	(port
		(pt 64 24)
		(output)
		(text "OUT" (rect 48 15 65 26)(font "Courier New" (bold))(invisible))
		(text "OUT" (rect 48 15 62 26)(font "Courier New" (bold))(invisible))
		(line (pt 42 24)(pt 64 24))
	)
	(drawing
		(line (pt 14 12)(pt 30 12))
		(line (pt 14 37)(pt 31 37))
		(line (pt 14 12)(pt 14 37))
		(arc (pt 31 37)(pt 30 12)(rect 18 12 43 37))
	)
)
(symbol
	(rect 440 1120 504 1264)
	(text "AND8" (rect 1 0 25 9)(font "Arial" (font_size 6)))
	(text "inst8" (rect 3 133 26 143)(font "Arial" ))
	(port
		(pt 0 16)
		(input)
		(text "IN1" (rect 2 7 19 18)(font "Courier New" (bold))(invisible))
		(text "IN1" (rect 2 7 19 18)(font "Courier New" (bold))(invisible))
		(line (pt 0 16)(pt 18 16))
	)
	(port
		(pt 0 48)
		(input)
		(text "IN3" (rect 2 39 19 50)(font "Courier New" (bold))(invisible))
		(text "IN3" (rect 2 39 19 50)(font "Courier New" (bold))(invisible))
		(line (pt 0 48)(pt 18 48))
	)
	(port
		(pt 0 32)
		(input)
		(text "IN2" (rect 2 23 19 34)(font "Courier New" (bold))(invisible))
		(text "IN2" (rect 2 23 19 34)(font "Courier New" (bold))(invisible))
		(line (pt 0 32)(pt 18 32))
	)
	(port
		(pt 0 64)
		(input)
		(text "IN4" (rect 2 55 19 66)(font "Courier New" (bold))(invisible))
		(text "IN4" (rect 2 55 19 66)(font "Courier New" (bold))(invisible))
		(line (pt 0 64)(pt 18 64))
	)
	(port
		(pt 0 112)
		(input)
		(text "IN7" (rect 2 103 19 114)(font "Courier New" (bold))(invisible))
		(text "IN7" (rect 2 103 19 114)(font "Courier New" (bold))(invisible))
		(line (pt 0 112)(pt 18 112))
	)
	(port
		(pt 0 96)
		(input)
		(text "IN6" (rect 2 87 19 98)(font "Courier New" (bold))(invisible))
		(text "IN6" (rect 2 87 19 98)(font "Courier New" (bold))(invisible))
		(line (pt 0 96)(pt 18 96))
	)
	(port
		(pt 0 128)
		(input)
		(text "IN8" (rect 2 119 19 130)(font "Courier New" (bold))(invisible))
		(text "IN8" (rect 2 119 19 130)(font "Courier New" (bold))(invisible))
		(line (pt 0 128)(pt 18 128))
	)
	(port
		(pt 0 80)
		(input)
		(text "IN5" (rect 2 71 19 82)(font "Courier New" (bold))(invisible))
		(text "IN5" (rect 2 71 19 82)(font "Courier New" (bold))(invisible))
		(line (pt 0 80)(pt 18 80))
	)
	(port
		(pt 64 72)
		(output)
		(text "OUT" (rect 48 63 65 74)(font "Courier New" (bold))(invisible))
		(text "OUT" (rect 48 63 62 74)(font "Courier New" (bold))(invisible))
		(line (pt 46 72)(pt 64 72))
	)
	(drawing
		(line (pt 18 131)(pt 18 13))
		(line (pt 18 59)(pt 33 59))
		(line (pt 18 86)(pt 33 86))
		(arc (pt 33 85)(pt 33 59)(rect 20 59 47 86))
	)
)
(symbol
	(rect 696 1224 760 1272)
	(text "NAND2" (rect 1 0 32 9)(font "Arial" (font_size 6)))
	(text "inst51" (rect 3 37 32 47)(font "Arial" ))
	(port
		(pt 0 32)
		(input)
		(text "IN2" (rect 2 23 19 34)(font "Courier New" (bold))(invisible))
		(text "IN2" (rect 2 23 19 34)(font "Courier New" (bold))(invisible))
		(line (pt 0 32)(pt 15 32))
	)
	(port
		(pt 0 16)
		(input)
		(text "IN1" (rect 2 7 19 18)(font "Courier New" (bold))(invisible))
		(text "IN1" (rect 2 7 19 18)(font "Courier New" (bold))(invisible))
		(line (pt 0 16)(pt 15 16))
	)
	(port
		(pt 64 24)
		(output)
		(text "OUT" (rect 48 15 65 26)(font "Courier New" (bold))(invisible))
		(text "OUT" (rect 48 15 62 26)(font "Courier New" (bold))(invisible))
		(line (pt 52 24)(pt 64 24))
	)
	(drawing
		(line (pt 15 37)(pt 32 37))
		(line (pt 15 12)(pt 32 12))
		(line (pt 15 36)(pt 15 12))
		(arc (pt 32 36)(pt 32 12)(rect 20 12 45 37))
		(circle (rect 44 20 52 28))
	)
)
(symbol
	(rect -320 248 -160 344)
	(text "lpm_add_sub3" (rect 39 0 138 15)(font "Arial" (font_size 10)))
	(text "inst7" (rect 8 80 31 90)(font "Arial" ))
	(port
		(pt 0 40)
		(input)
		(text "dataa[2..0]" (rect 0 0 60 11)(font "Arial" (font_size 8)))
		(text "dataa[2..0]" (rect 4 26 64 37)(font "Arial" (font_size 8)))
		(line (pt 0 40)(pt 64 40)(line_width 3))
	)
	(port
		(pt 0 72)
		(input)
		(text "datab[2..0]" (rect 0 0 60 11)(font "Arial" (font_size 8)))
		(text "datab[2..0]" (rect 4 58 64 69)(font "Arial" (font_size 8)))
		(line (pt 0 72)(pt 64 72)(line_width 3))
	)
	(port
		(pt 160 56)
		(output)
		(text "result[2..0]" (rect 0 0 57 11)(font "Arial" (font_size 8)))
		(text "result[2..0]" (rect 106 42 163 53)(font "Arial" (font_size 8)))
		(line (pt 160 56)(pt 96 56)(line_width 3))
	)
	(drawing
		(text "A-B" (rect 77 51 97 62)(font "Arial" (font_size 8)))
		(text "A" (rect 64 35 72 46)(font "Arial" (font_size 8)))
		(text "B" (rect 65 67 73 78)(font "Arial" (font_size 8)))
		(line (pt 64 32)(pt 64 80))
		(line (pt 64 32)(pt 96 40))
		(line (pt 64 80)(pt 96 72))
		(line (pt 96 40)(pt 96 72))
		(line (pt 0 0)(pt 162 0))
		(line (pt 162 0)(pt 162 98))
		(line (pt 0 98)(pt 162 98))
		(line (pt 0 0)(pt 0 98))
	)
)
(symbol
	(rect -32 96 128 192)
	(text "lpm_add_sub4" (rect 39 0 138 15)(font "Arial" (font_size 10)))
	(text "inst10" (rect 8 80 37 90)(font "Arial" ))
	(port
		(pt 0 40)
		(input)
		(text "dataa[16..0]" (rect 0 0 67 11)(font "Arial" (font_size 8)))
		(text "dataa[16..0]" (rect 4 26 71 37)(font "Arial" (font_size 8)))
		(line (pt 0 40)(pt 64 40)(line_width 3))
	)
	(port
		(pt 0 72)
		(input)
		(text "datab[16..0]" (rect 0 0 67 11)(font "Arial" (font_size 8)))
		(text "datab[16..0]" (rect 4 58 71 69)(font "Arial" (font_size 8)))
		(line (pt 0 72)(pt 64 72)(line_width 3))
	)
	(port
		(pt 160 56)
		(output)
		(text "result[16..0]" (rect 0 0 64 11)(font "Arial" (font_size 8)))
		(text "result[16..0]" (rect 100 42 164 53)(font "Arial" (font_size 8)))
		(line (pt 160 56)(pt 96 56)(line_width 3))
	)
	(drawing
		(text "A-B" (rect 77 51 97 62)(font "Arial" (font_size 8)))
		(text "A" (rect 64 35 72 46)(font "Arial" (font_size 8)))
		(text "B" (rect 65 67 73 78)(font "Arial" (font_size 8)))
		(line (pt 64 32)(pt 64 80))
		(line (pt 64 32)(pt 96 40))
		(line (pt 64 80)(pt 96 72))
		(line (pt 96 40)(pt 96 72))
		(line (pt 0 0)(pt 162 0))
		(line (pt 162 0)(pt 162 98))
		(line (pt 0 98)(pt 162 98))
		(line (pt 0 0)(pt 0 98))
	)
)
(symbol
	(rect 808 1008 872 1120)
	(text "AND6" (rect 1 0 25 9)(font "Arial" (font_size 6)))
	(text "inst47" (rect 3 101 32 111)(font "Arial" ))
	(port
		(pt 0 48)
		(input)
		(text "IN3" (rect 2 39 19 50)(font "Courier New" (bold))(invisible))
		(text "IN3" (rect 2 39 19 50)(font "Courier New" (bold))(invisible))
		(line (pt 0 48)(pt 18 48))
	)
	(port
		(pt 0 16)
		(input)
		(text "IN1" (rect 2 7 19 18)(font "Courier New" (bold))(invisible))
		(text "IN1" (rect 2 7 19 18)(font "Courier New" (bold))(invisible))
		(line (pt 0 16)(pt 18 16))
	)
	(port
		(pt 0 32)
		(input)
		(text "IN2" (rect 2 23 19 34)(font "Courier New" (bold))(invisible))
		(text "IN2" (rect 2 23 19 34)(font "Courier New" (bold))(invisible))
		(line (pt 0 32)(pt 18 32))
	)
	(port
		(pt 0 64)
		(input)
		(text "IN4" (rect 2 55 19 66)(font "Courier New" (bold))(invisible))
		(text "IN4" (rect 2 55 19 66)(font "Courier New" (bold))(invisible))
		(line (pt 0 64)(pt 18 64))
	)
	(port
		(pt 0 80)
		(input)
		(text "IN5" (rect 2 71 19 82)(font "Courier New" (bold))(invisible))
		(text "IN5" (rect 2 71 19 82)(font "Courier New" (bold))(invisible))
		(line (pt 0 80)(pt 18 80))
	)
	(port
		(pt 0 96)
		(input)
		(text "IN6" (rect 2 87 19 98)(font "Courier New" (bold))(invisible))
		(text "IN6" (rect 2 87 19 98)(font "Courier New" (bold))(invisible))
		(line (pt 0 96)(pt 18 96))
	)
	(port
		(pt 64 56)
		(output)
		(text "OUT" (rect 48 47 65 58)(font "Courier New" (bold))(invisible))
		(text "OUT" (rect 48 47 62 58)(font "Courier New" (bold))(invisible))
		(line (pt 46 56)(pt 64 56))
	)
	(drawing
		(line (pt 18 43)(pt 33 43))
		(line (pt 18 99)(pt 18 13))
		(line (pt 18 70)(pt 34 70))
		(arc (pt 34 69)(pt 33 43)(rect 20 43 47 70))
	)
)
(symbol
	(rect 1352 -168 1400 -136)
	(text "NOT" (rect 1 0 21 9)(font "Arial" (font_size 6)))
	(text "inst3" (rect 3 21 26 31)(font "Arial" ))
	(port
		(pt 0 16)
		(input)
		(text "IN" (rect 2 7 13 18)(font "Courier New" (bold))(invisible))
		(text "IN" (rect 2 7 13 18)(font "Courier New" (bold))(invisible))
		(line (pt 0 16)(pt 13 16))
	)
	(port
		(pt 48 16)
		(output)
		(text "OUT" (rect 32 7 49 18)(font "Courier New" (bold))(invisible))
		(text "OUT" (rect 32 7 46 18)(font "Courier New" (bold))(invisible))
		(line (pt 39 16)(pt 48 16))
	)
	(drawing
		(line (pt 13 25)(pt 13 7))
		(line (pt 13 7)(pt 31 16))
		(line (pt 13 25)(pt 31 16))
		(circle (rect 31 12 39 20))
	)
)
(symbol
	(rect 2232 848 2296 928)
	(text "DFF" (rect 1 0 19 9)(font "Arial" (font_size 6)))
	(text "inst43" (rect 3 68 32 78)(font "Arial" ))
	(port
		(pt 32 80)
		(input)
		(text "CLRN" (rect 21 59 44 70)(font "Courier New" (bold)))
		(text "CLRN" (rect 21 58 44 69)(font "Courier New" (bold)))
		(line (pt 32 80)(pt 32 76))
	)
	(port
		(pt 0 40)
		(input)
		(text "CLK" (rect 3 29 20 40)(font "Courier New" (bold))(invisible))
		(text "CLK" (rect 3 29 20 40)(font "Courier New" (bold))(invisible))
		(line (pt 0 40)(pt 12 40))
	)
	(port
		(pt 0 24)
		(input)
		(text "D" (rect 14 20 19 31)(font "Courier New" (bold)))
		(text "D" (rect 14 20 19 31)(font "Courier New" (bold)))
		(line (pt 0 24)(pt 12 24))
	)
	(port
		(pt 32 0)
		(input)
		(text "PRN" (rect 24 13 41 24)(font "Courier New" (bold)))
		(text "PRN" (rect 24 11 41 22)(font "Courier New" (bold)))
		(line (pt 32 4)(pt 32 0))
	)
	(port
		(pt 64 24)
		(output)
		(text "Q" (rect 45 20 50 31)(font "Courier New" (bold)))
		(text "Q" (rect 43 20 47 31)(font "Courier New" (bold)))
		(line (pt 52 24)(pt 64 24))
	)
	(drawing
		(line (pt 12 12)(pt 52 12))
		(line (pt 12 68)(pt 52 68))
		(line (pt 52 68)(pt 52 12))
		(line (pt 12 68)(pt 12 12))
		(line (pt 19 40)(pt 12 47))
		(line (pt 12 32)(pt 20 40))
		(circle (rect 28 4 36 12))
		(circle (rect 28 68 36 76))
	)
)
(symbol
	(rect 2296 592 2360 672)
	(text "DFF" (rect 1 0 19 9)(font "Arial" (font_size 6)))
	(text "inst44" (rect 3 68 32 78)(font "Arial" ))
	(port
		(pt 32 80)
		(input)
		(text "CLRN" (rect 21 59 44 70)(font "Courier New" (bold)))
		(text "CLRN" (rect 21 58 44 69)(font "Courier New" (bold)))
		(line (pt 32 80)(pt 32 76))
	)
	(port
		(pt 0 40)
		(input)
		(text "CLK" (rect 3 29 20 40)(font "Courier New" (bold))(invisible))
		(text "CLK" (rect 3 29 20 40)(font "Courier New" (bold))(invisible))
		(line (pt 0 40)(pt 12 40))
	)
	(port
		(pt 0 24)
		(input)
		(text "D" (rect 14 20 19 31)(font "Courier New" (bold)))
		(text "D" (rect 14 20 19 31)(font "Courier New" (bold)))
		(line (pt 0 24)(pt 12 24))
	)
	(port
		(pt 32 0)
		(input)
		(text "PRN" (rect 24 13 41 24)(font "Courier New" (bold)))
		(text "PRN" (rect 24 11 41 22)(font "Courier New" (bold)))
		(line (pt 32 4)(pt 32 0))
	)
	(port
		(pt 64 24)
		(output)
		(text "Q" (rect 45 20 50 31)(font "Courier New" (bold)))
		(text "Q" (rect 43 20 47 31)(font "Courier New" (bold)))
		(line (pt 52 24)(pt 64 24))
	)
	(drawing
		(line (pt 12 12)(pt 52 12))
		(line (pt 12 68)(pt 52 68))
		(line (pt 52 68)(pt 52 12))
		(line (pt 12 68)(pt 12 12))
		(line (pt 19 40)(pt 12 47))
		(line (pt 12 32)(pt 20 40))
		(circle (rect 28 4 36 12))
		(circle (rect 28 68 36 76))
	)
)
(symbol
	(rect 2232 1040 2296 1120)
	(text "DFF" (rect 1 0 19 9)(font "Arial" (font_size 6)))
	(text "inst48" (rect 3 68 32 78)(font "Arial" ))
	(port
		(pt 32 80)
		(input)
		(text "CLRN" (rect 21 59 44 70)(font "Courier New" (bold)))
		(text "CLRN" (rect 21 58 44 69)(font "Courier New" (bold)))
		(line (pt 32 80)(pt 32 76))
	)
	(port
		(pt 0 40)
		(input)
		(text "CLK" (rect 3 29 20 40)(font "Courier New" (bold))(invisible))
		(text "CLK" (rect 3 29 20 40)(font "Courier New" (bold))(invisible))
		(line (pt 0 40)(pt 12 40))
	)
	(port
		(pt 0 24)
		(input)
		(text "D" (rect 14 20 19 31)(font "Courier New" (bold)))
		(text "D" (rect 14 20 19 31)(font "Courier New" (bold)))
		(line (pt 0 24)(pt 12 24))
	)
	(port
		(pt 32 0)
		(input)
		(text "PRN" (rect 24 13 41 24)(font "Courier New" (bold)))
		(text "PRN" (rect 24 11 41 22)(font "Courier New" (bold)))
		(line (pt 32 4)(pt 32 0))
	)
	(port
		(pt 64 24)
		(output)
		(text "Q" (rect 45 20 50 31)(font "Courier New" (bold)))
		(text "Q" (rect 43 20 47 31)(font "Courier New" (bold)))
		(line (pt 52 24)(pt 64 24))
	)
	(drawing
		(line (pt 12 12)(pt 52 12))
		(line (pt 12 68)(pt 52 68))
		(line (pt 52 68)(pt 52 12))
		(line (pt 12 68)(pt 12 12))
		(line (pt 19 40)(pt 12 47))
		(line (pt 12 32)(pt 20 40))
		(circle (rect 28 4 36 12))
		(circle (rect 28 68 36 76))
	)
)
(symbol
	(rect 1424 8 1680 200)
	(text "lpm_ram_dp0" (rect 89 1 181 16)(font "Arial" (font_size 10)))
	(text "inst13" (rect 8 176 37 186)(font "Arial" ))
	(port
		(pt 0 32)
		(input)
		(text "data_a[31..0]" (rect 0 0 74 11)(font "Arial" (font_size 8)))
		(text "data_a[31..0]" (rect 4 19 78 30)(font "Arial" (font_size 8)))
		(line (pt 0 32)(pt 112 32)(line_width 3))
	)
	(port
		(pt 0 48)
		(input)
		(text "address_a[10..0]" (rect 0 0 90 11)(font "Arial" (font_size 8)))
		(text "address_a[10..0]" (rect 4 35 94 46)(font "Arial" (font_size 8)))
		(line (pt 0 48)(pt 112 48)(line_width 3))
	)
	(port
		(pt 0 64)
		(input)
		(text "wren_a" (rect 0 0 40 11)(font "Arial" (font_size 8)))
		(text "wren_a" (rect 4 51 44 62)(font "Arial" (font_size 8)))
		(line (pt 0 64)(pt 112 64))
	)
	(port
		(pt 0 96)
		(input)
		(text "data_b[31..0]" (rect 0 0 74 11)(font "Arial" (font_size 8)))
		(text "data_b[31..0]" (rect 4 83 78 94)(font "Arial" (font_size 8)))
		(line (pt 0 96)(pt 112 96)(line_width 3))
	)
	(port
		(pt 0 112)
		(input)
		(text "address_b[10..0]" (rect 0 0 90 11)(font "Arial" (font_size 8)))
		(text "address_b[10..0]" (rect 4 99 94 110)(font "Arial" (font_size 8)))
		(line (pt 0 112)(pt 112 112)(line_width 3))
	)
	(port
		(pt 0 128)
		(input)
		(text "wren_b" (rect 0 0 40 11)(font "Arial" (font_size 8)))
		(text "wren_b" (rect 4 115 44 126)(font "Arial" (font_size 8)))
		(line (pt 0 128)(pt 112 128))
	)
	(port
		(pt 0 160)
		(input)
		(text "clock" (rect 0 0 30 11)(font "Arial" (font_size 8)))
		(text "clock" (rect 4 147 34 158)(font "Arial" (font_size 8)))
		(line (pt 0 160)(pt 176 160))
	)
	(port
		(pt 256 32)
		(output)
		(text "q_a[31..0]" (rect 0 0 56 11)(font "Arial" (font_size 8)))
		(text "q_a[31..0]" (rect 205 19 252 30)(font "Arial" (font_size 8)))
		(line (pt 256 32)(pt 192 32)(line_width 3))
	)
	(port
		(pt 256 96)
		(output)
		(text "q_b[31..0]" (rect 0 0 56 11)(font "Arial" (font_size 8)))
		(text "q_b[31..0]" (rect 205 83 252 94)(font "Arial" (font_size 8)))
		(line (pt 256 96)(pt 192 96)(line_width 3))
	)
	(drawing
		(text "2048 Word(s)" (rect 136 56 146 122)(font "Arial" )(vertical))
		(text "RAM" (rect 149 74 159 97)(font "Arial" )(vertical))
		(text "Block Type: M9K" (rect 41 172 125 182)(font "Arial" ))
		(line (pt 128 24)(pt 168 24))
		(line (pt 168 24)(pt 168 144))
		(line (pt 168 144)(pt 128 144))
		(line (pt 128 144)(pt 128 24))
		(line (pt 112 27)(pt 120 27))
		(line (pt 120 27)(pt 120 39))
		(line (pt 120 39)(pt 112 39))
		(line (pt 112 39)(pt 112 27))
		(line (pt 112 34)(pt 114 36))
		(line (pt 114 36)(pt 112 38))
		(line (pt 104 36)(pt 112 36))
		(line (pt 120 32)(pt 128 32)(line_width 3))
		(line (pt 112 43)(pt 120 43))
		(line (pt 120 43)(pt 120 55))
		(line (pt 120 55)(pt 112 55))
		(line (pt 112 55)(pt 112 43))
		(line (pt 112 50)(pt 114 52))
		(line (pt 114 52)(pt 112 54))
		(line (pt 104 52)(pt 112 52))
		(line (pt 120 48)(pt 128 48)(line_width 3))
		(line (pt 112 59)(pt 120 59))
		(line (pt 120 59)(pt 120 71))
		(line (pt 120 71)(pt 112 71))
		(line (pt 112 71)(pt 112 59))
		(line (pt 112 66)(pt 114 68))
		(line (pt 114 68)(pt 112 70))
		(line (pt 104 68)(pt 112 68))
		(line (pt 120 64)(pt 128 64))
		(line (pt 112 91)(pt 120 91))
		(line (pt 120 91)(pt 120 103))
		(line (pt 120 103)(pt 112 103))
		(line (pt 112 103)(pt 112 91))
		(line (pt 112 98)(pt 114 100))
		(line (pt 114 100)(pt 112 102))
		(line (pt 104 100)(pt 112 100))
		(line (pt 120 96)(pt 128 96)(line_width 3))
		(line (pt 112 107)(pt 120 107))
		(line (pt 120 107)(pt 120 119))
		(line (pt 120 119)(pt 112 119))
		(line (pt 112 119)(pt 112 107))
		(line (pt 112 114)(pt 114 116))
		(line (pt 114 116)(pt 112 118))
		(line (pt 104 116)(pt 112 116))
		(line (pt 120 112)(pt 128 112)(line_width 3))
		(line (pt 112 123)(pt 120 123))
		(line (pt 120 123)(pt 120 135))
		(line (pt 120 135)(pt 112 135))
		(line (pt 112 135)(pt 112 123))
		(line (pt 112 130)(pt 114 132))
		(line (pt 114 132)(pt 112 134))
		(line (pt 104 132)(pt 112 132))
		(line (pt 120 128)(pt 128 128))
		(line (pt 104 36)(pt 104 161))
		(line (pt 176 36)(pt 176 161))
		(line (pt 184 27)(pt 192 27))
		(line (pt 192 27)(pt 192 39))
		(line (pt 192 39)(pt 184 39))
		(line (pt 184 39)(pt 184 27))
		(line (pt 184 34)(pt 186 36))
		(line (pt 186 36)(pt 184 38))
		(line (pt 176 36)(pt 184 36))
		(line (pt 168 32)(pt 184 32)(line_width 3))
		(line (pt 184 91)(pt 192 91))
		(line (pt 192 91)(pt 192 103))
		(line (pt 192 103)(pt 184 103))
		(line (pt 184 103)(pt 184 91))
		(line (pt 184 98)(pt 186 100))
		(line (pt 186 100)(pt 184 102))
		(line (pt 176 100)(pt 184 100))
		(line (pt 168 96)(pt 184 96)(line_width 3))
	)
)
(symbol
	(rect 2232 1240 2376 1320)
	(text "lpm_mux9" (rect 43 0 113 15)(font "Arial" (font_size 10)))
	(text "inst55" (rect 8 66 37 76)(font "Arial" ))
	(port
		(pt 0 40)
		(input)
		(text "data1x[8..0]" (rect 0 0 66 11)(font "Arial" (font_size 8)))
		(text "data1x[8..0]" (rect 4 27 70 38)(font "Arial" (font_size 8)))
		(line (pt 0 40)(pt 64 40)(line_width 3))
	)
	(port
		(pt 0 56)
		(input)
		(text "data0x[8..0]" (rect 0 0 66 11)(font "Arial" (font_size 8)))
		(text "data0x[8..0]" (rect 4 43 70 54)(font "Arial" (font_size 8)))
		(line (pt 0 56)(pt 64 56)(line_width 3))
	)
	(port
		(pt 72 80)
		(input)
		(text "sel" (rect 0 0 11 15)(font "Arial" (font_size 8))(vertical))
		(text "sel" (rect 66 50 77 65)(font "Arial" (font_size 8))(vertical))
		(line (pt 72 80)(pt 72 68))
	)
	(port
		(pt 144 48)
		(output)
		(text "result[8..0]" (rect 0 0 57 11)(font "Arial" (font_size 8)))
		(text "result[8..0]" (rect 90 35 147 46)(font "Arial" (font_size 8)))
		(line (pt 144 48)(pt 80 48)(line_width 3))
	)
	(drawing
		(line (pt 64 24)(pt 64 72))
		(line (pt 64 24)(pt 80 32))
		(line (pt 64 72)(pt 80 64))
		(line (pt 80 32)(pt 80 64))
		(line (pt 0 0)(pt 146 0))
		(line (pt 146 0)(pt 146 82))
		(line (pt 0 82)(pt 146 82))
		(line (pt 0 0)(pt 0 82))
		(line (pt 0 0)(pt 0 0))
		(line (pt 0 0)(pt 0 0))
		(line (pt 0 0)(pt 0 0))
		(line (pt 0 0)(pt 0 0))
	)
)
(symbol
	(rect 1928 1248 2072 1328)
	(text "lpm_mux11" (rect 40 0 119 15)(font "Arial" (font_size 10)))
	(text "inst41" (rect 8 66 37 76)(font "Arial" ))
	(port
		(pt 0 40)
		(input)
		(text "data1x[8..0]" (rect 0 0 66 11)(font "Arial" (font_size 8)))
		(text "data1x[8..0]" (rect 4 27 70 38)(font "Arial" (font_size 8)))
		(line (pt 0 40)(pt 64 40)(line_width 3))
	)
	(port
		(pt 0 56)
		(input)
		(text "data0x[8..0]" (rect 0 0 66 11)(font "Arial" (font_size 8)))
		(text "data0x[8..0]" (rect 4 43 70 54)(font "Arial" (font_size 8)))
		(line (pt 0 56)(pt 64 56)(line_width 3))
	)
	(port
		(pt 72 80)
		(input)
		(text "sel" (rect 0 0 11 15)(font "Arial" (font_size 8))(vertical))
		(text "sel" (rect 66 50 77 65)(font "Arial" (font_size 8))(vertical))
		(line (pt 72 80)(pt 72 68))
	)
	(port
		(pt 144 48)
		(output)
		(text "result[8..0]" (rect 0 0 57 11)(font "Arial" (font_size 8)))
		(text "result[8..0]" (rect 90 35 147 46)(font "Arial" (font_size 8)))
		(line (pt 144 48)(pt 80 48)(line_width 3))
	)
	(drawing
		(line (pt 64 24)(pt 64 72))
		(line (pt 64 24)(pt 80 32))
		(line (pt 64 72)(pt 80 64))
		(line (pt 80 32)(pt 80 64))
		(line (pt 0 0)(pt 146 0))
		(line (pt 146 0)(pt 146 82))
		(line (pt 0 82)(pt 146 82))
		(line (pt 0 0)(pt 0 82))
		(line (pt 0 0)(pt 0 0))
		(line (pt 0 0)(pt 0 0))
		(line (pt 0 0)(pt 0 0))
		(line (pt 0 0)(pt 0 0))
	)
)
(symbol
	(rect 2144 1408 2208 1456)
	(text "AND2" (rect 1 0 25 9)(font "Arial" (font_size 6)))
	(text "inst57" (rect 3 37 32 47)(font "Arial" ))
	(port
		(pt 0 16)
		(input)
		(text "IN1" (rect 2 7 19 18)(font "Courier New" (bold))(invisible))
		(text "IN1" (rect 2 7 19 18)(font "Courier New" (bold))(invisible))
		(line (pt 0 16)(pt 14 16))
	)
	(port
		(pt 0 32)
		(input)
		(text "IN2" (rect 2 23 19 34)(font "Courier New" (bold))(invisible))
		(text "IN2" (rect 2 23 19 34)(font "Courier New" (bold))(invisible))
		(line (pt 0 32)(pt 14 32))
	)
	(port
		(pt 64 24)
		(output)
		(text "OUT" (rect 48 15 65 26)(font "Courier New" (bold))(invisible))
		(text "OUT" (rect 48 15 62 26)(font "Courier New" (bold))(invisible))
		(line (pt 42 24)(pt 64 24))
	)
	(drawing
		(line (pt 14 12)(pt 30 12))
		(line (pt 14 37)(pt 31 37))
		(line (pt 14 12)(pt 14 37))
		(arc (pt 31 37)(pt 30 12)(rect 18 12 43 37))
	)
)
(symbol
	(rect 1936 1448 2064 1544)
	(text "lpm_compare0" (rect 22 0 122 15)(font "Arial" (font_size 10)))
	(text "inst56" (rect 8 82 37 92)(font "Arial" ))
	(port
		(pt 0 48)
		(input)
		(text "dataa[11..0]" (rect 0 0 67 11)(font "Arial" (font_size 8)))
		(text "dataa[11..0]" (rect 20 42 87 53)(font "Arial" (font_size 8)))
		(line (pt 0 48)(pt 16 48)(line_width 3))
	)
	(port
		(pt 0 64)
		(input)
		(text "datab[11..0]" (rect 0 0 67 11)(font "Arial" (font_size 8)))
		(text "datab[11..0]" (rect 20 58 87 69)(font "Arial" (font_size 8)))
		(line (pt 0 64)(pt 16 64)(line_width 3))
	)
	(port
		(pt 128 56)
		(output)
		(text "alb" (rect 0 0 17 11)(font "Arial" (font_size 8)))
		(text "alb" (rect 95 50 112 61)(font "Arial" (font_size 8)))
		(line (pt 128 56)(pt 112 56))
	)
	(drawing
		(text "unsigned compare" (rect 36 27 125 37)(font "Arial" ))
		(line (pt 16 16)(pt 16 80))
		(line (pt 16 16)(pt 112 16))
		(line (pt 16 80)(pt 112 80))
		(line (pt 112 16)(pt 112 80))
		(line (pt 0 0)(pt 129 0))
		(line (pt 129 0)(pt 129 98))
		(line (pt 0 98)(pt 129 98))
		(line (pt 0 0)(pt 0 98))
		(line (pt 0 0)(pt 0 0))
		(line (pt 0 0)(pt 0 0))
		(line (pt 0 0)(pt 0 0))
		(line (pt 0 0)(pt 0 0))
	)
)
(symbol
	(rect 1760 176 1904 256)
	(text "lpm_mux12" (rect 40 0 119 15)(font "Arial" (font_size 10)))
	(text "inst60" (rect 8 66 37 76)(font "Arial" ))
	(port
		(pt 0 40)
		(input)
		(text "data1x[31..0]" (rect 0 0 73 11)(font "Arial" (font_size 8)))
		(text "data1x[31..0]" (rect 4 29 77 40)(font "Arial" (font_size 8)))
		(line (pt 0 40)(pt 64 40)(line_width 3))
	)
	(port
		(pt 0 56)
		(input)
		(text "data0x[31..0]" (rect 0 0 73 11)(font "Arial" (font_size 8)))
		(text "data0x[31..0]" (rect 4 45 77 56)(font "Arial" (font_size 8)))
		(line (pt 0 56)(pt 64 56)(line_width 3))
	)
	(port
		(pt 72 80)
		(input)
		(text "sel" (rect 0 0 11 15)(font "Arial" (font_size 8))(vertical))
		(text "sel" (rect 67 52 78 67)(font "Arial" (font_size 8))(vertical))
		(line (pt 72 80)(pt 72 68))
	)
	(port
		(pt 144 48)
		(output)
		(text "result[31..0]" (rect 0 0 64 11)(font "Arial" (font_size 8)))
		(text "result[31..0]" (rect 86 37 150 48)(font "Arial" (font_size 8)))
		(line (pt 144 48)(pt 80 48)(line_width 3))
	)
	(drawing
		(line (pt 64 24)(pt 64 72))
		(line (pt 64 24)(pt 80 32))
		(line (pt 64 72)(pt 80 64))
		(line (pt 80 32)(pt 80 64))
		(line (pt 0 0)(pt 146 0))
		(line (pt 146 0)(pt 146 82))
		(line (pt 0 82)(pt 146 82))
		(line (pt 0 0)(pt 0 82))
		(line (pt 0 0)(pt 0 0))
		(line (pt 0 0)(pt 0 0))
		(line (pt 0 0)(pt 0 0))
		(line (pt 0 0)(pt 0 0))
	)
)
(symbol
	(rect 1696 264 1824 360)
	(text "lpm_compare5" (rect 22 0 122 15)(font "Arial" (font_size 10)))
	(text "inst66" (rect 8 82 37 92)(font "Arial" ))
	(port
		(pt 0 48)
		(input)
		(text "dataa[10..0]" (rect 0 0 67 11)(font "Arial" (font_size 8)))
		(text "dataa[10..0]" (rect 20 43 87 54)(font "Arial" (font_size 8)))
		(line (pt 0 48)(pt 16 48)(line_width 3))
	)
	(port
		(pt 128 56)
		(output)
		(text "aneb" (rect 0 0 28 11)(font "Arial" (font_size 8)))
		(text "aneb" (rect 85 51 113 62)(font "Arial" (font_size 8)))
		(line (pt 128 56)(pt 112 56))
	)
	(drawing
		(text "datab[]=7" (rect 20 59 73 70)(font "Arial" (font_size 8)))
		(text "compare" (rect 76 27 118 37)(font "Arial" ))
		(line (pt 16 16)(pt 16 80))
		(line (pt 16 16)(pt 112 16))
		(line (pt 16 80)(pt 112 80))
		(line (pt 112 16)(pt 112 80))
		(line (pt 0 0)(pt 129 0))
		(line (pt 129 0)(pt 129 98))
		(line (pt 0 98)(pt 129 98))
		(line (pt 0 0)(pt 0 98))
		(line (pt 0 0)(pt 0 0))
		(line (pt 0 0)(pt 0 0))
		(line (pt 0 0)(pt 0 0))
		(line (pt 0 0)(pt 0 0))
	)
)
(connector
	(text "vvv[127..0]" (rect -525 656 -466 666)(font "Arial" ))
	(pt -544 672)
	(pt -448 672)
	(bus)
)
(connector
	(text "zzz[127..0]" (rect -525 704 -474 714)(font "Arial" ))
	(pt -544 720)
	(pt -448 720)
	(bus)
)
(connector
	(text "notFull,AA[10..0]" (rect 951 -96 1033 -86)(font "Arial" ))
	(pt 936 -80)
	(pt 1040 -80)
	(bus)
)
(connector
	(text "Init1x" (rect 752 -144 779 -134)(font "Arial" ))
	(pt 744 -128)
	(pt 792 -128)
)
(connector
	(text "TC[20..0]" (rect -464 112 -418 122)(font "Arial" ))
	(pt -472 128)
	(pt -424 128)
	(bus)
)
(connector
	(text "TKTC[20..0]" (rect -584 112 -525 122)(font "Arial" ))
	(pt -592 128)
	(pt -520 128)
	(bus)
)
(connector
	(text "TKTC[3..0]" (rect -584 72 -531 82)(font "Arial" ))
	(pt -592 88)
	(pt -520 88)
	(bus)
)
(connector
	(text "CH[3..0]" (rect -464 72 -422 82)(font "Arial" ))
	(pt -472 88)
	(pt -424 88)
	(bus)
)
(connector
	(text "TC[20..4]" (rect -312 -16 -266 -6)(font "Arial" ))
	(pt -320 0)
	(pt -272 0)
	(bus)
)
(connector
	(text "TCQ[20..4]" (rect -200 -16 -146 -6)(font "Arial" ))
	(pt -144 0)
	(pt -208 0)
	(bus)
)
(connector
	(text "TCHit[6..0],TFine[2..0],TFineEdge,TFineV" (rect -179 -64 25 -54)(font "Arial" ))
	(pt -192 -48)
	(pt 8 -48)
	(bus)
)
(connector
	(text "TimeData[11..0]" (rect -368 -64 -289 -54)(font "Arial" ))
	(pt -384 -48)
	(pt -240 -48)
	(bus)
)
(connector
	(text "CK200" (rect -312 0 -279 10)(font "Arial" ))
	(pt -320 16)
	(pt -272 16)
)
(connector
	(text "TK16" (rect -312 16 -288 26)(font "Arial" ))
	(pt -320 32)
	(pt -272 32)
)
(connector
	(pt 792 -48)
	(pt 736 -48)
)
(connector
	(text "WRA" (rect 624 -72 649 -62)(font "Arial" ))
	(pt 616 -56)
	(pt 672 -56)
)
(connector
	(text "notFull" (rect 632 -56 665 -46)(font "Arial" ))
	(pt 624 -40)
	(pt 672 -40)
)
(connector
	(text "CK200" (rect 752 -96 785 -86)(font "Arial" ))
	(pt 744 -80)
	(pt 792 -80)
)
(connector
	(text "vvv[11],zzz[10..6],vvv[5],zzz[4..0]" (rect 603 -128 774 -118)(font "Arial" ))
	(pt 592 -112)
	(pt 792 -112)
	(bus)
)
(connector
	(text "CK200" (rect 568 816 601 826)(font "Arial" ))
	(pt 560 832)
	(pt 608 832)
)
(connector
	(text "OutST" (rect 568 784 598 794)(font "Arial" ))
	(pt 560 800)
	(pt 608 800)
)
(connector
	(text "OKcntB,ABx[10..0],BSEL[1..0]" (rect 759 832 908 842)(font "Arial" ))
	(pt 752 848)
	(pt 896 848)
	(bus)
)
(connector
	(text "ABx[10..0]" (rect 631 912 682 922)(font "Arial" ))
	(pt 696 928)
	(pt 624 928)
	(bus)
)
(connector
	(text "ABxN[10..0]" (rect 751 912 811 922)(font "Arial" ))
	(pt 816 928)
	(pt 744 928)
	(bus)
)
(connector
	(text "ABxLo32wd" (rect 512 1040 568 1050)(font "Arial" ))
	(pt 560 1056)
	(pt 504 1056)
)
(connector
	(text "ABxN[10]" (rect 400 1000 447 1010)(font "Arial" ))
	(pt 400 1016)
	(pt 440 1016)
)
(connector
	(text "ABxN[9]" (rect 400 1016 441 1026)(font "Arial" ))
	(pt 400 1032)
	(pt 440 1032)
)
(connector
	(text "ABxN[8]" (rect 400 1032 441 1042)(font "Arial" ))
	(pt 400 1048)
	(pt 440 1048)
)
(connector
	(text "ABxN[7]" (rect 400 1048 441 1058)(font "Arial" ))
	(pt 400 1064)
	(pt 440 1064)
)
(connector
	(text "ABxN[6]" (rect 400 1064 441 1074)(font "Arial" ))
	(pt 400 1080)
	(pt 440 1080)
)
(connector
	(text "ABxN[5]" (rect 400 1080 441 1090)(font "Arial" ))
	(pt 400 1096)
	(pt 440 1096)
)
(connector
	(text "TC[20..0]" (rect -560 152 -514 162)(font "Arial" ))
	(pt -568 168)
	(pt -520 168)
	(bus)
)
(connector
	(text "TKTC[23]" (rect -568 192 -522 202)(font "Arial" ))
	(pt -576 208)
	(pt -520 208)
)
(connector
	(text "TKTC[22]" (rect -568 232 -522 242)(font "Arial" ))
	(pt -576 248)
	(pt -520 248)
)
(connector
	(text "TKTC[21]" (rect -568 272 -522 282)(font "Arial" ))
	(pt -576 288)
	(pt -520 288)
)
(connector
	(text "TK16" (rect -464 232 -440 242)(font "Arial" ))
	(pt -472 248)
	(pt -424 248)
)
(connector
	(text "TK4" (rect -464 272 -446 282)(font "Arial" ))
	(pt -472 288)
	(pt -424 288)
)
(connector
	(text "TK128" (rect -464 192 -434 202)(font "Arial" ))
	(pt -424 208)
	(pt -472 208)
)
(connector
	(text "nTC[20..0]" (rect -464 152 -413 162)(font "Arial" ))
	(pt -472 168)
	(pt -424 168)
	(bus)
)
(connector
	(text "INCcntB" (rect 561 848 603 858)(font "Arial" ))
	(pt 560 864)
	(pt 608 864)
)
(connector
	(text "TK10sh" (rect 392 880 428 890)(font "Arial" ))
	(pt 384 896)
	(pt 440 896)
)
(connector
	(text "OKcntB" (rect 392 896 429 906)(font "Arial" ))
	(pt 384 912)
	(pt 440 912)
)
(connector
	(text "OKcntB2Q" (rect 392 912 443 922)(font "Arial" ))
	(pt 384 928)
	(pt 440 928)
)
(connector
	(text "OKcntB2Q" (rect 392 928 443 938)(font "Arial" ))
	(pt 384 944)
	(pt 440 944)
)
(connector
	(text "INCcntB" (rect 505 904 547 914)(font "Arial" ))
	(pt 504 920)
	(pt 552 920)
)
(connector
	(text "CK200" (rect 2144 616 2177 626)(font "Arial" ))
	(pt 2184 632)
	(pt 2144 632)
)
(connector
	(text "CK200" (rect 2032 616 2065 626)(font "Arial" ))
	(pt 2072 632)
	(pt 2032 632)
)
(connector
	(pt 2136 616)
	(pt 2184 616)
)
(connector
	(pt 2024 616)
	(pt 2072 616)
)
(connector
	(pt 1960 592)
	(pt 1944 592)
)
(connector
	(text "BSEL[1]" (rect 1808 656 1848 666)(font "Arial" ))
	(pt 1864 672)
	(pt 1808 672)
)
(connector
	(text "BSEL[0]" (rect 1808 672 1848 682)(font "Arial" ))
	(pt 1864 688)
	(pt 1808 688)
)
(connector
	(pt 1960 624)
	(pt 1944 624)
)
(connector
	(pt 1944 680)
	(pt 1928 680)
)
(connector
	(pt 1960 640)
	(pt 1944 640)
)
(connector
	(text "QMB[31..24]" (rect 1962 832 2023 842)(font "Arial" ))
	(pt 2032 848)
	(pt 1944 848)
	(bus)
)
(connector
	(text "QMB[15..8]" (rect 1962 864 2017 874)(font "Arial" ))
	(pt 2032 880)
	(pt 1944 880)
	(bus)
)
(connector
	(text "QMB[7..0]" (rect 1962 880 2011 890)(font "Arial" ))
	(pt 2032 896)
	(pt 1944 896)
	(bus)
)
(connector
	(pt 2104 968)
	(pt 2064 968)
	(bus)
)
(connector
	(text "Yout[7..0]" (rect 2176 856 2225 866)(font "Arial" ))
	(pt 2168 872)
	(pt 2232 872)
	(bus)
)
(connector
	(text "CK200" (rect 1960 1064 1993 1074)(font "Arial" ))
	(pt 1960 1080)
	(pt 2000 1080)
)
(connector
	(pt 1952 1064)
	(pt 2000 1064)
)
(connector
	(text "CK200" (rect 1848 1064 1881 1074)(font "Arial" ))
	(pt 1848 1080)
	(pt 1888 1080)
)
(connector
	(text "CK200" (rect 1968 968 2001 978)(font "Arial" ))
	(pt 2000 984)
	(pt 1960 984)
)
(connector
	(pt 2000 968)
	(pt 1952 968)
	(bus)
)
(connector
	(text "BSEL[1..0]" (rect 1823 952 1876 962)(font "Arial" ))
	(pt 1808 968)
	(pt 1888 968)
	(bus)
)
(connector
	(text "CK200" (rect 1856 968 1889 978)(font "Arial" ))
	(pt 1888 984)
	(pt 1848 984)
)
(connector
	(text "OKcntB" (rect 1816 1048 1853 1058)(font "Arial" ))
	(pt 1888 1064)
	(pt 1808 1064)
)
(connector
	(pt 2104 920)
	(pt 2104 968)
	(bus)
)
(connector
	(pt 1944 592)
	(pt 1944 528)
)
(connector
	(pt 1944 528)
	(pt 1928 528)
)
(connector
	(text "ABxLo32wd" (rect 1808 472 1864 482)(font "Arial" ))
	(pt 1864 488)
	(pt 1800 488)
)
(connector
	(text "ABxN[4]" (rect 1800 488 1841 498)(font "Arial" ))
	(pt 1864 504)
	(pt 1800 504)
)
(connector
	(text "ABxN[3]" (rect 1800 504 1841 514)(font "Arial" ))
	(pt 1864 520)
	(pt 1800 520)
)
(connector
	(text "ABxN[2]" (rect 1800 520 1841 530)(font "Arial" ))
	(pt 1864 536)
	(pt 1800 536)
)
(connector
	(text "ABxN[1]" (rect 1800 536 1841 546)(font "Arial" ))
	(pt 1864 552)
	(pt 1800 552)
)
(connector
	(text "ABxN[0]" (rect 1800 552 1841 562)(font "Arial" ))
	(pt 1864 568)
	(pt 1800 568)
)
(connector
	(text "QMB[23..16]" (rect 1962 848 2023 858)(font "Arial" ))
	(pt 1944 864)
	(pt 2032 864)
	(bus)
)
(connector
	(text "OKcntB" (rect 1872 592 1909 602)(font "Arial" ))
	(pt 1864 608)
	(pt 1960 608)
)
(connector
	(text "CK200" (rect 1384 152 1417 162)(font "Arial" ))
	(pt 1376 168)
	(pt 1424 168)
)
(connector
	(text "MDA[31..0]" (rect 1328 24 1383 34)(font "Arial" ))
	(pt 1424 40)
	(pt 1320 40)
	(bus)
)
(connector
	(text "AA[10..0]" (rect 1335 40 1381 50)(font "Arial" ))
	(pt 1320 56)
	(pt 1424 56)
	(bus)
)
(connector
	(text "WRA" (rect 1376 56 1401 66)(font "Arial" ))
	(pt 1368 72)
	(pt 1424 72)
)
(connector
	(text "AB[10..0]" (rect 1335 104 1381 114)(font "Arial" ))
	(pt 1320 120)
	(pt 1424 120)
	(bus)
)
(connector
	(text "QMB[31..0]" (rect 1922 208 1977 218)(font "Arial" ))
	(pt 1992 224)
	(pt 1904 224)
	(bus)
)
(connector
	(text "MDB[31..0]" (rect 1328 88 1383 98)(font "Arial" ))
	(pt 1424 104)
	(pt 1320 104)
	(bus)
)
(connector
	(pt -128 1128)
	(pt -128 1112)
)
(connector
	(pt -56 1080)
	(pt -24 1080)
	(bus)
)
(connector
	(text "OKcntB" (rect -152 1144 -115 1154)(font "Arial" ))
	(pt -160 1160)
	(pt -104 1160)
)
(connector
	(pt -56 1160)
	(pt -40 1160)
)
(connector
	(pt -40 1096)
	(pt -40 1160)
)
(connector
	(pt -40 1096)
	(pt -24 1096)
)
(connector
	(text "MDB[31..0]" (rect 48 1072 103 1082)(font "Arial" ))
	(pt 112 1088)
	(pt 40 1088)
	(bus)
)
(connector
	(text "TFineV" (rect -80 424 -46 434)(font "Arial" ))
	(pt -32 440)
	(pt -88 440)
)
(connector
	(text "ABxN[10]" (rect 400 1120 447 1130)(font "Arial" ))
	(pt 400 1136)
	(pt 440 1136)
)
(connector
	(text "ABxN[9]" (rect 400 1136 441 1146)(font "Arial" ))
	(pt 400 1152)
	(pt 440 1152)
)
(connector
	(text "ABxN[8]" (rect 400 1152 441 1162)(font "Arial" ))
	(pt 400 1168)
	(pt 440 1168)
)
(connector
	(text "ABxN[7]" (rect 400 1168 441 1178)(font "Arial" ))
	(pt 400 1184)
	(pt 440 1184)
)
(connector
	(text "ABxN[6]" (rect 400 1184 441 1194)(font "Arial" ))
	(pt 400 1200)
	(pt 440 1200)
)
(connector
	(text "ABxLo16wd" (rect 512 1176 568 1186)(font "Arial" ))
	(pt 560 1192)
	(pt 504 1192)
)
(connector
	(pt -232 1088)
	(pt -208 1088)
	(bus)
)
(connector
	(pt -208 1072)
	(pt -296 1072)
	(bus)
)
(connector
	(text "QMB[31..0]" (rect -654 1040 -599 1050)(font "Arial" ))
	(pt -704 1056)
	(pt -584 1056)
	(bus)
)
(connector
	(text "zzz[31..8],ScalarData[7..0]" (rect -707 1072 -578 1082)(font "Arial" ))
	(pt -584 1088)
	(pt -704 1088)
	(bus)
)
(connector
	(text "CK200" (rect -400 1072 -367 1082)(font "Arial" ))
	(pt -408 1088)
	(pt -360 1088)
)
(connector
	(pt -424 1072)
	(pt -360 1072)
	(bus)
)
(connector
	(pt -232 1088)
	(pt -232 1032)
	(bus)
)
(connector
	(text "nTC[6]" (rect -160 1112 -127 1122)(font "Arial" ))
	(pt -128 1128)
	(pt -168 1128)
)
(connector
	(text "MDA[31..29]" (rect 256 48 317 58)(font "Arial" ))
	(pt 352 64)
	(pt 248 64)
	(bus)
)
(connector
	(text "MDA[27..24]" (rect 264 328 325 338)(font "Arial" ))
	(pt 256 344)
	(pt 360 344)
	(bus)
)
(connector
	(text "WRA" (rect 384 440 409 450)(font "Arial" ))
	(pt 376 456)
	(pt 432 456)
)
(connector
	(text "CK200" (rect 152 152 185 162)(font "Arial" ))
	(pt 144 168)
	(pt 192 168)
)
(connector
	(text "CK200" (rect 152 248 185 258)(font "Arial" ))
	(pt 144 264)
	(pt 192 264)
)
(connector
	(text "zzz[31..30],vvv[29]" (rect 107 48 202 58)(font "Arial" ))
	(pt 88 64)
	(pt 200 64)
	(bus)
)
(connector
	(text "CK200" (rect 152 344 185 354)(font "Arial" ))
	(pt 144 360)
	(pt 192 360)
)
(connector
	(text "CH[3..0]" (rect 104 328 146 338)(font "Arial" ))
	(pt 80 344)
	(pt 192 344)
	(bus)
)
(connector
	(text "CK200" (rect 152 448 185 458)(font "Arial" ))
	(pt 144 464)
	(pt 192 464)
)
(connector
	(pt 32 448)
	(pt 192 448)
)
(connector
	(pt 256 448)
	(pt 312 448)
)
(connector
	(text "notFull" (rect 272 448 305 458)(font "Arial" ))
	(pt 264 464)
	(pt 312 464)
)
(connector
	(pt 192 152)
	(pt 128 152)
	(bus)
)
(connector
	(text "TCQ[6..4]" (rect -376 272 -328 282)(font "Arial" ))
	(pt -320 288)
	(pt -392 288)
	(bus)
)
(connector
	(text "TCHit[6..4]" (rect -379 304 -325 314)(font "Arial" ))
	(pt -320 320)
	(pt -392 320)
	(bus)
)
(connector
	(text "DTCHit[6..4]" (rect -147 288 -85 298)(font "Arial" ))
	(pt -88 304)
	(pt -160 304)
	(bus)
)
(connector
	(text "zzz[20..7],DTCHit[6..4]" (rect -139 152 -27 162)(font "Arial" ))
	(pt -32 168)
	(pt -152 168)
	(bus)
)
(connector
	(text "MDA[23..7]" (rect 264 136 319 146)(font "Arial" ))
	(pt 360 152)
	(pt 256 152)
	(bus)
)
(connector
	(text "TCHit[3..0],TFine[2..0],TFineEdge" (rect -35 224 131 234)(font "Arial" ))
	(pt -56 248)
	(pt 192 248)
	(bus)
)
(connector
	(text "MDA[6..0],MDA[28]" (rect 264 232 359 242)(font "Arial" ))
	(pt 360 248)
	(pt 256 248)
	(bus)
)
(connector
	(text "TCQ[20..4]" (rect -120 120 -66 130)(font "Arial" ))
	(pt -152 136)
	(pt -32 136)
	(bus)
)
(connector
	(text "ABxN[5]" (rect 400 1200 441 1210)(font "Arial" ))
	(pt 400 1216)
	(pt 440 1216)
)
(connector
	(text "ABxN[4]" (rect 400 1216 441 1226)(font "Arial" ))
	(pt 400 1232)
	(pt 440 1232)
)
(connector
	(text "ABxN[4]" (rect 400 1232 441 1242)(font "Arial" ))
	(pt 400 1248)
	(pt 440 1248)
)
(connector
	(text "WRB" (rect 984 1168 1009 1178)(font "Arial" ))
	(pt 976 1184)
	(pt 1032 1184)
)
(connector
	(pt 936 1240)
	(pt 936 1216)
)
(connector
	(text "OKcntB" (rect 880 1224 917 1234)(font "Arial" ))
	(pt 872 1240)
	(pt 936 1240)
)
(connector
	(pt 880 1176)
	(pt 896 1176)
)
(connector
	(pt 808 1072)
	(pt 792 1072)
)
(connector
	(pt 792 1072)
	(pt 792 1088)
)
(connector
	(pt 792 1104)
	(pt 808 1104)
)
(connector
	(pt 792 1104)
	(pt 792 1144)
)
(connector
	(text "INCcntB" (rect 761 1040 803 1050)(font "Arial" ))
	(pt 760 1056)
	(pt 808 1056)
)
(connector
	(text "ABxLo32wd" (rect 648 1136 704 1146)(font "Arial" ))
	(pt 640 1152)
	(pt 704 1152)
)
(connector
	(text "KeepScalar" (rect 648 1120 703 1130)(font "Arial" ))
	(pt 640 1136)
	(pt 704 1136)
)
(connector
	(text "ABxLo16wd" (rect 664 1072 720 1082)(font "Arial" ))
	(pt 656 1088)
	(pt 720 1088)
)
(connector
	(pt 880 1064)
	(pt 880 1176)
)
(connector
	(pt 872 1064)
	(pt 880 1064)
)
(connector
	(text "BSEL[1]" (rect 752 1008 792 1018)(font "Arial" ))
	(pt 808 1024)
	(pt 752 1024)
)
(connector
	(text "BSEL[0]" (rect 752 1024 792 1034)(font "Arial" ))
	(pt 808 1040)
	(pt 752 1040)
)
(connector
	(pt 768 1144)
	(pt 792 1144)
)
(connector
	(pt 776 1248)
	(pt 760 1248)
)
(connector
	(text "TC[6]" (rect 664 1224 691 1234)(font "Arial" ))
	(pt 696 1240)
	(pt 656 1240)
)
(connector
	(text "TC[5]" (rect 664 1240 691 1250)(font "Arial" ))
	(pt 696 1256)
	(pt 656 1256)
)
(connector
	(pt 864 1192)
	(pt 864 1208)
)
(connector
	(pt 896 1192)
	(pt 864 1192)
)
(connector
	(pt 864 1208)
	(pt 856 1208)
)
(connector
	(pt 776 1216)
	(pt 792 1216)
)
(connector
	(pt 776 1248)
	(pt 776 1216)
)
(connector
	(text "TK4" (rect 752 1184 770 1194)(font "Arial" ))
	(pt 744 1200)
	(pt 792 1200)
)
(connector
	(text "AB[10..0]" (rect 759 1352 805 1362)(font "Arial" ))
	(pt 744 1368)
	(pt 848 1368)
	(bus)
)
(connector
	(pt 672 1424)
	(pt 672 1400)
)
(connector
	(text "OKcntB" (rect 624 1408 661 1418)(font "Arial" ))
	(pt 616 1424)
	(pt 672 1424)
)
(connector
	(text "zzz[10..5],nTC[6..2]" (rect 472 1360 567 1370)(font "Arial" ))
	(pt 448 1376)
	(pt 592 1376)
	(bus)
)
(connector
	(text "ABx[10..0]" (rect 503 1344 554 1354)(font "Arial" ))
	(pt 448 1360)
	(pt 592 1360)
	(bus)
)
(connector
	(text "notFull" (rect 1312 -168 1345 -158)(font "Arial" ))
	(pt 1304 -152)
	(pt 1352 -152)
)
(connector
	(text "isFull[15..0]" (rect 1407 -168 1464 -158)(font "Arial" ))
	(pt 1464 -152)
	(pt 1400 -152)
	(bus)
)
(connector
	(text "vvv[15..14],isFull[13..11],AA[10..0]" (rect 1215 -64 1390 -54)(font "Arial" ))
	(pt 1208 -48)
	(pt 1368 -48)
	(bus)
)
(connector
	(text "CK200" (rect 2192 872 2225 882)(font "Arial" ))
	(pt 2192 888)
	(pt 2232 888)
)
(connector
	(text "YoutQ[7..0]" (rect 2304 856 2361 866)(font "Arial" ))
	(pt 2296 872)
	(pt 2360 872)
	(bus)
)
(connector
	(text "CK200" (rect 2256 616 2289 626)(font "Arial" ))
	(pt 2256 632)
	(pt 2296 632)
)
(connector
	(text "KCD" (rect 2264 600 2287 610)(font "Arial" ))
	(pt 2248 616)
	(pt 2296 616)
)
(connector
	(text "KCDQ" (rect 2376 600 2407 610)(font "Arial" ))
	(pt 2360 616)
	(pt 2408 616)
)
(connector
	(text "CK200" (rect 2192 1064 2225 1074)(font "Arial" ))
	(pt 2192 1080)
	(pt 2232 1080)
)
(connector
	(text "OKcntB2Q" (rect 2096 1048 2147 1058)(font "Arial" ))
	(pt 2064 1064)
	(pt 2232 1064)
)
(connector
	(text "OKcntB3Q" (rect 2304 1048 2355 1058)(font "Arial" ))
	(pt 2360 1064)
	(pt 2296 1064)
)
(connector
	(pt 2376 1288)
	(pt 2392 1288)
	(bus)
)
(connector
	(text "RegData[31..0]" (rect -344 1016 -269 1026)(font "Arial" ))
	(pt -232 1032)
	(pt -352 1032)
	(bus)
)
(connector
	(text "KCDQ,YoutQ[7..0]" (rect 2088 1264 2181 1274)(font "Arial" ))
	(pt 2232 1280)
	(pt 2088 1280)
	(bus)
)
(connector
	(text "vvv[8..7],zzz[6],vvv[5..2],zzz[1..0]" (rect 1794 1288 1966 1298)(font "Arial" ))
	(pt 1928 1304)
	(pt 1784 1304)
	(bus)
)
(connector
	(text "zzz[8..0]" (rect 1794 1272 1834 1282)(font "Arial" ))
	(pt 1928 1288)
	(pt 1784 1288)
	(bus)
)
(connector
	(pt 2072 1296)
	(pt 2232 1296)
	(bus)
)
(connector
	(pt 1992 1360)
	(pt 2000 1360)
)
(connector
	(pt 2000 1360)
	(pt 2000 1328)
)
(connector
	(text "WRB" (rect 1376 120 1401 130)(font "Arial" ))
	(pt 1368 136)
	(pt 1424 136)
)
(connector
	(pt 1944 624)
	(pt 1944 640)
)
(connector
	(pt 1944 640)
	(pt 1944 680)
)
(connector
	(pt 768 1088)
	(pt 792 1088)
)
(connector
	(pt 792 1088)
	(pt 808 1088)
)
(connector
	(text "zzz[15..12],isFull[11],AA[10..0]" (rect 1311 -128 1460 -118)(font "Arial" ))
	(pt 1304 -112)
	(pt 1464 -112)
	(bus)
)
(connector
	(pt 2064 1504)
	(pt 2104 1504)
)
(connector
	(pt 2104 1504)
	(pt 2104 1440)
)
(connector
	(text "SpillSize[15..0]" (rect 1512 -120 1583 -110)(font "Arial" ))
	(pt 1568 -112)
	(pt 1512 -112)
	(bus)
)
(connector
	(text "OKcntB3Q" (rect 2072 1408 2123 1418)(font "Arial" ))
	(pt 2048 1424)
	(pt 2144 1424)
)
(connector
	(pt 2104 1440)
	(pt 2144 1440)
)
(connector
	(pt 2304 1432)
	(pt 2304 1320)
)
(connector
	(text "SpillSize[11..0]" (rect 1848 1504 1919 1514)(font "Arial" ))
	(pt 1936 1512)
	(pt 1840 1512)
	(bus)
)
(connector
	(text "zzz[11] , AB[10..0]" (rect 1848 1488 1937 1498)(font "Arial" ))
	(pt 1840 1496)
	(pt 1936 1496)
	(bus)
)
(connector
	(pt 2208 1432)
	(pt 2304 1432)
)
(connector
	(pt 2304 1432)
	(pt 2408 1432)
)
(connector
	(pt 1760 216)
	(pt 1720 216)
	(bus)
)
(connector
	(pt 1720 216)
	(pt 1720 104)
	(bus)
)
(connector
	(pt 1680 104)
	(pt 1720 104)
	(bus)
)
(connector
	(pt 1824 320)
	(pt 1832 320)
)
(connector
	(pt 1832 320)
	(pt 1832 256)
)
(connector
	(text "AB[10..0]" (rect 1607 296 1653 306)(font "Arial" ))
	(pt 1592 312)
	(pt 1696 312)
	(bus)
)
(connector
	(pt -432 456)
	(pt -424 456)
)
(connector
	(pt -424 456)
	(pt -32 456)
)
(junction (pt 1944 640))
(junction (pt -424 456))
(junction (pt 792 1088))
(junction (pt 2304 1432))
(text "memory map:" (rect 1424 -80 1500 -69)(font "Arial" (font_size 8)))
(text "0-7: ID range: Kcode(3C), \"g-2TDC\",version date" (rect 1424 -64 1691 -53)(font "Arial" (font_size 8)))
(text "8-15: register 7-0 values: register 0 is the final word count." (rect 1424 -48 1743 -37)(font "Arial" (font_size 8)))
(text "16-31: Scalar 15-0 values" (rect 1424 -32 1566 -21)(font "Arial" (font_size 8)))
(text "32-2048: TDC Hit Data" (rect 1424 -16 1550 -5)(font "Arial" (font_size 8)))
(text "Registers for @ 160 ns (32 clock ticks)" (rect -136 1008 71 1019)(font "Arial" (font_size 8)))
(text "8b10b K+byte stream" (rect 1800 1176 1918 1187)(font "Arial" (font_size 8)))
(text "8b10b data stream" (rect 1816 776 1919 787)(font "Arial" (font_size 8)))
(text "8B10b K-bit stream" (rect 1792 432 1898 443)(font "Arial" (font_size 8)))
(text "Address for hits" (rect 960 -152 1042 -141)(font "Arial" (font_size 8)))
(text "Starts at 32 (after header)" (rect 960 -144 1100 -133)(font "Arial" (font_size 8)))
(text "Controls max hit count" (rect 960 -136 1085 -125)(font "Arial" (font_size 8)))
(text "Generate register and scalar data" (rect -488 896 -303 907)(font "Arial" (font_size 8)))
(text "Generate register and scalar addresses" (rect 696 696 909 707)(font "Arial" (font_size 8)))
(text "ALSO generate the word -> byte sequencer for 8b serialization (BSEL)" (rect 696 728 1084 739)(font "Arial" (font_size 8)))
(text "Hit word 31..29: valid hit bits " (rect 256 24 417 35)(font "Arial" (font_size 8)))
(text "Hit word 27..24: channel number" (rect 264 304 446 315)(font "Arial" (font_size 8)))
(text "Hit word 28: Edge type" (rect 264 184 390 195)(font "Arial" (font_size 8)))
(text "Hit word 2..0: Fine timing bits" (rect 264 216 426 227)(font "Arial" (font_size 8)))
(text "Start the output stream" (rect 696 672 822 683)(font "Arial" (font_size 8)))
(text "start output stream" (rect 480 760 581 771)(font "Arial" (font_size 8)))
(text "Stop counter after 8192 counts" (rect 384 856 556 867)(font "Arial" (font_size 8)))
(text "Current address is below 32 words" (rect 416 984 601 995)(font "Arial" (font_size 8)))
(text "Current address is below 16 words" (rect 400 1264 585 1275)(font "Arial" (font_size 8)))
(text "If we are counting" (rect 912 992 1012 1003)(font "Arial" (font_size 8)))
(text "And we are on the 4th byte" (rect 912 1008 1061 1019)(font "Arial" (font_size 8)))
(text "Current address is greater than the 16th word" (rect 912 1024 1158 1035)(font "Arial" (font_size 8)))
(text "Current address is greater than the 32nd word or we aren't keeping the scalars" (rect 912 1040 1339 1051)(font "Arial" (font_size 8)))
