(module so-8W (layer F.Cu) (tedit 562A897F)
  (descr SO-8W)
  (attr smd)
  (fp_text reference U? (at 3.302 1.27 90) (layer F.SilkS)
    (effects (font (size 1 1) (thickness 0.2)))
  )
  (fp_text value VAL*** (at 0 -0.635) (layer F.SilkS)
    (effects (font (size 0.7493 0.7493) (thickness 0.14986)))
  )
  (fp_line (start -2.413 -1.9812) (end -2.413 1.9812) (layer F.SilkS) (width 0.127))
  (fp_line (start -2.413 1.9812) (end 2.413 1.9812) (layer F.SilkS) (width 0.127))
  (fp_line (start 2.413 1.9812) (end 2.413 -1.9812) (layer F.SilkS) (width 0.127))
  (fp_line (start 2.413 -1.9812) (end -2.413 -1.9812) (layer F.SilkS) (width 0.127))
  (fp_circle (center -3.2764 2.6446) (end -3.5558 3.0256) (layer F.SilkS) (width 0.127))
  (pad 1 smd rect (at -1.905 3.95) (size 0.635 1.8) (layers F.Cu F.Paste F.Mask))
  (pad 2 smd rect (at -0.635 3.95) (size 0.635 1.8) (layers F.Cu F.Paste F.Mask))
  (pad 3 smd rect (at 0.635 3.95) (size 0.635 1.8) (layers F.Cu F.Paste F.Mask))
  (pad 4 smd rect (at 1.905 3.95) (size 0.635 1.8) (layers F.Cu F.Paste F.Mask))
  (pad 5 smd rect (at 1.905 -3.75) (size 0.635 1.8) (layers F.Cu F.Paste F.Mask))
  (pad 6 smd rect (at 0.635 -3.75) (size 0.635 1.8) (layers F.Cu F.Paste F.Mask))
  (pad 7 smd rect (at -0.635 -3.75) (size 0.635 1.8) (layers F.Cu F.Paste F.Mask))
  (pad 8 smd rect (at -1.905 -3.75) (size 0.635 1.8) (layers F.Cu F.Paste F.Mask))
  (model smd/smd_dil/so-8.wrl
    (at (xyz 0 0 0))
    (scale (xyz 1 1 1))
    (rotate (xyz 0 0 0))
  )
)
