PCBNEW-LibModule-V1  Fri 21 Nov 2014 03:53:39 PM EST
# encoding utf-8
Units mm
$INDEX
TPS78601KTTT
$EndINDEX
$MODULE TPS78601KTTT
Po 0 0 0 15 546FA64E 00000000 ~~
Li TPS78601KTTT
Sc 0
AR /545B1C94
Op 0 0 0
T0 0 -11.6 1 1 0 0.15 N V 21 N "U1"
T1 0 14.9 1 1 0 0.15 N V 21 N "TPS78601KTTT"
DS -5.335 4.825 -5.335 0 0.15 21
DS 5.335 4.825 -5.335 4.825 0.15 21
DS 5.335 4.825 5.335 0 0.15 21
$PAD
Sh "5" R 1 3.4 0 0 0
Dr 0 0 0
At SMD N 00888000
Ne 5 "N-0000041"
Po 3.4 10.6
.LocalClearance 0.07
$EndPAD
$PAD
Sh "3" R 1 3.4 0 0 0
Dr 0 0 0
At SMD N 00888000
Ne 4 "GND"
Po 0 10.6
.LocalClearance 0.07
$EndPAD
$PAD
Sh "4" R 1 3.4 0 0 0
Dr 0 0 0
At SMD N 00888000
Ne 1 "+4V"
Po 1.7 10.6
.LocalClearance 0.07
$EndPAD
$PAD
Sh "2" R 1 3.4 0 0 0
Dr 0 0 0
At SMD N 00888000
Ne 2 "+5V"
Po -1.7 10.6
.LocalClearance 0.07
$EndPAD
$PAD
Sh "tab" R 10.7 8.6 0 0 0
Dr 0 0 0
At SMD N 00888000
Ne 0 ""
Po 0 -4.3
$EndPAD
$PAD
Sh "1" R 1 3.4 0 0 0
Dr 0 0 0
At SMD N 00888000
Ne 3 "/TDC_En"
Po -3.4 10.6
.LocalClearance 0.07
$EndPAD
$EndMODULE TPS78601KTTT
$EndLIBRARY
