EESchema Schematic File Version 2
LIBS:TDC_Mother-rescue
LIBS:power
LIBS:transistors
LIBS:conn
LIBS:display
LIBS:contrib
LIBS:ep3c5u256_custom
LIBS:ERM8-RA
LIBS:30310-5002hb
LIBS:4816P-1-101LF
LIBS:FIN1108
LIBS:tps78630kttt
LIBS:tps79533
LIBS:+4
LIBS:640456-2
LIBS:micron
LIBS:tps73701drbt
LIBS:ws2812b
LIBS:fixed_conn
LIBS:ao3422
LIBS:my_discrete
LIBS:TMM-105-01
LIBS:my_power
LIBS:atmega168a-mm
LIBS:CAT16-101J4LF
LIBS:tmp36
LIBS:testpoint
LIBS:TDC_Mother-cache
EELAYER 25 0
EELAYER END
$Descr A 11000 8500
encoding utf-8
Sheet 9 14
Title ""
Date "9 oct 2015"
Rev ""
Comp ""
Comment1 ""
Comment2 ""
Comment3 ""
Comment4 ""
$EndDescr
Text HLabel 7050 2500 2    60   Input ~ 0
TMS
Text HLabel 7050 2700 2    60   Input ~ 0
TDI
Text HLabel 7050 2600 2    60   Input ~ 0
TDO
Text HLabel 7050 2800 2    60   Input ~ 0
TCK
Text HLabel 7050 1800 2    60   Input ~ 0
DATA0
Text HLabel 7050 2200 2    60   Input ~ 0
nCE
Text HLabel 7050 1300 2    60   Input ~ 0
DCLK
Text HLabel 7050 4250 2    60   Input ~ 0
CONF_DONE
Text HLabel 7050 2100 2    60   Input ~ 0
nCONFIG
Wire Wire Line
	6750 4250 7050 4250
Wire Wire Line
	6750 2500 7050 2500
Wire Wire Line
	7050 2700 6750 2700
Wire Wire Line
	7050 2800 6750 2800
Wire Wire Line
	6750 1800 7050 1800
Wire Wire Line
	6750 2100 7050 2100
Wire Wire Line
	6750 1300 7050 1300
Wire Wire Line
	6750 2200 7050 2200
Text HLabel 7050 2000 2    60   Input ~ 0
nSTATUS
Wire Wire Line
	6750 2000 7050 2000
$Comp
L C C66
U 1 1 560EB64F
P 7250 6000
AR Path="/5461E2FD/5604C950/560EB64F" Ref="C66"  Part="1" 
AR Path="/5611711C/5604C950/560EB64F" Ref="C111"  Part="1" 
F 0 "C111" H 7250 6100 40  0000 L CNN
F 1 "1uF" H 7256 5915 40  0000 L CNN
F 2 "libcms:SM0402" H 7288 5850 30  0001 C CNN
F 3 "~" H 7250 6000 60  0000 C CNN
F 4 "490-9665-1-ND" H 7250 6000 60  0001 C CNN "Field1"
F 5 "Digikey" H 7250 6000 60  0001 C CNN "Field2"
	1    7250 6000
	1    0    0    -1  
$EndComp
Wire Wire Line
	7250 5650 7250 5800
Wire Wire Line
	7650 5550 7650 5800
Wire Wire Line
	6950 6200 7650 6200
Connection ~ 6950 6200
Connection ~ 7250 6200
$Comp
L GND #PWR076
U 1 1 560EB937
P 6950 6300
AR Path="/5461E2FD/5604C950/560EB937" Ref="#PWR076"  Part="1" 
AR Path="/5611711C/5604C950/560EB937" Ref="#PWR0104"  Part="1" 
F 0 "#PWR0104" H 6950 6300 30  0001 C CNN
F 1 "GND" H 6950 6230 30  0001 C CNN
F 2 "" H 6950 6300 60  0000 C CNN
F 3 "" H 6950 6300 60  0000 C CNN
	1    6950 6300
	1    0    0    -1  
$EndComp
Text HLabel 4400 5050 0    60   Input ~ 0
nCEO
Wire Wire Line
	6750 4550 7000 4550
Wire Wire Line
	7000 4550 7000 4850
Wire Wire Line
	6750 4650 7000 4650
Connection ~ 7000 4650
Wire Wire Line
	6750 4750 7000 4750
Connection ~ 7000 4750
$Comp
L GND #PWR077
U 1 1 560F384D
P 7000 4850
AR Path="/5461E2FD/5604C950/560F384D" Ref="#PWR077"  Part="1" 
AR Path="/5611711C/5604C950/560F384D" Ref="#PWR0105"  Part="1" 
F 0 "#PWR0105" H 7000 4850 30  0001 C CNN
F 1 "GND" H 7000 4780 30  0001 C CNN
F 2 "" H 7000 4850 60  0000 C CNN
F 3 "" H 7000 4850 60  0000 C CNN
	1    7000 4850
	1    0    0    -1  
$EndComp
Text HLabel 4400 4450 0    60   Input ~ 0
TDC_TX
Text HLabel 4400 4550 0    60   Input ~ 0
TDC_RX
Wire Wire Line
	4400 4450 4750 4450
Wire Wire Line
	4400 4550 4750 4550
Text HLabel 7250 5650 2    60   Input ~ 0
VCCA
Text HLabel 7650 5550 2    60   Input ~ 0
VCCD
Wire Wire Line
	6750 5750 6950 5750
Wire Wire Line
	6950 5750 6950 6300
Wire Wire Line
	6750 5550 7650 5550
Wire Wire Line
	7250 5650 6750 5650
NoConn ~ 6750 1400
NoConn ~ 6750 1600
NoConn ~ 4750 1200
NoConn ~ 4750 1300
NoConn ~ 4750 1600
NoConn ~ 4750 1700
NoConn ~ 4750 1900
NoConn ~ 4750 2000
NoConn ~ 4750 2200
NoConn ~ 4750 2300
NoConn ~ 4750 2500
NoConn ~ 4750 2600
NoConn ~ 4750 2700
NoConn ~ 4750 2800
NoConn ~ 4750 2900
NoConn ~ 4750 3200
NoConn ~ 4750 4050
NoConn ~ 4750 4150
NoConn ~ 4750 4850
NoConn ~ 4750 5450
NoConn ~ 4750 5750
NoConn ~ 4750 5950
NoConn ~ 4750 6150
NoConn ~ 4750 6250
NoConn ~ 4750 6350
Wire Wire Line
	6750 2600 7050 2600
$Comp
L EP3C5U256_CUSTOM U15
U 1 1 5622185F
P 5750 2200
AR Path="/5461E2FD/5604C950/5622185F" Ref="U15"  Part="1" 
AR Path="/5611711C/5604C950/5622185F" Ref="U21"  Part="1" 
F 0 "U21" H 5750 2700 60  0000 C CNN
F 1 "EP3C5U256_CUSTOM" V 5750 2000 60  0000 C CNN
F 2 "integrated_tdc_pcblib:UBGA-256" H 5750 2200 60  0001 C CNN
F 3 "" H 5750 2200 60  0000 C CNN
	1    5750 2200
	1    0    0    -1  
$EndComp
$Comp
L EP3C5U256_CUSTOM U15
U 6 1 562218C2
P 5750 5250
AR Path="/5461E2FD/5604C950/562218C2" Ref="U15"  Part="6" 
AR Path="/5611711C/5604C950/562218C2" Ref="U21"  Part="6" 
F 0 "U21" H 5750 5750 60  0000 C CNN
F 1 "EP3C5U256_CUSTOM" V 5750 5050 60  0000 C CNN
F 2 "integrated_tdc_pcblib:UBGA-256" H 5750 5250 60  0001 C CNN
F 3 "" H 5750 5250 60  0000 C CNN
	6    5750 5250
	1    0    0    -1  
$EndComp
Wire Wire Line
	4750 5050 4400 5050
Text Notes 5600 3500 0    60   ~ 0
Bank 1
Text Notes 5550 6650 0    60   ~ 0
Bank 6
$Comp
L C C67
U 1 1 562D02E3
P 7650 6000
AR Path="/5461E2FD/5604C950/562D02E3" Ref="C67"  Part="1" 
AR Path="/5611711C/5604C950/562D02E3" Ref="C112"  Part="1" 
F 0 "C112" H 7650 6100 40  0000 L CNN
F 1 "1uF" H 7656 5915 40  0000 L CNN
F 2 "libcms:SM0402" H 7688 5850 30  0001 C CNN
F 3 "~" H 7650 6000 60  0000 C CNN
F 4 "490-9665-1-ND" H 7650 6000 60  0001 C CNN "Field1"
F 5 "Digikey" H 7650 6000 60  0001 C CNN "Field2"
	1    7650 6000
	1    0    0    -1  
$EndComp
Text HLabel 4400 5650 0    60   Input ~ 0
Slow_Control_TX
Text HLabel 4400 5150 0    60   Input ~ 0
Slow_Control_RX
Wire Wire Line
	4400 5150 4750 5150
Wire Wire Line
	4400 5650 4750 5650
Text HLabel 4400 4750 0    60   Input ~ 0
BOARD_ID1
Wire Wire Line
	4400 4750 4750 4750
Text HLabel 3300 5350 0    60   Input ~ 0
INIT_DONE
Wire Wire Line
	3300 5350 4750 5350
$Comp
L +3.3V #PWR078
U 1 1 5674CA63
P 3450 4750
AR Path="/5461E2FD/5604C950/5674CA63" Ref="#PWR078"  Part="1" 
AR Path="/5611711C/5604C950/5674CA63" Ref="#PWR0106"  Part="1" 
F 0 "#PWR0106" H 3450 4710 30  0001 C CNN
F 1 "+3.3V" H 3450 4860 30  0000 C CNN
F 2 "" H 3450 4750 60  0000 C CNN
F 3 "" H 3450 4750 60  0000 C CNN
	1    3450 4750
	1    0    0    -1  
$EndComp
Wire Wire Line
	3450 4750 3450 4800
$Comp
L R R25
U 1 1 5674CA6C
P 3450 5050
AR Path="/5461E2FD/5604C950/5674CA6C" Ref="R25"  Part="1" 
AR Path="/5611711C/5604C950/5674CA6C" Ref="R26"  Part="1" 
F 0 "R26" V 3530 5050 40  0000 C CNN
F 1 "10k" V 3457 5051 40  0000 C CNN
F 2 "libcms:SM0603_Resistor" V 3380 5050 30  0001 C CNN
F 3 "~" H 3450 5050 30  0000 C CNN
F 4 "RHM10.0KHCT-ND" V 3450 5050 60  0001 C CNN "Field1"
F 5 "Digikey" V 3450 5050 60  0001 C CNN "Field2"
	1    3450 5050
	1    0    0    -1  
$EndComp
Wire Wire Line
	3450 5300 3450 5350
Connection ~ 3450 5350
$EndSCHEMATC
