EESchema Schematic File Version 2
LIBS:TDC_Mother-rescue
LIBS:power
LIBS:transistors
LIBS:conn
LIBS:display
LIBS:contrib
LIBS:ep3c5u256_custom
LIBS:ERM8-RA
LIBS:30310-5002hb
LIBS:4816P-1-101LF
LIBS:FIN1108
LIBS:tps78630kttt
LIBS:tps79533
LIBS:+4
LIBS:640456-2
LIBS:micron
LIBS:tps73701drbt
LIBS:ws2812b
LIBS:fixed_conn
LIBS:ao3422
LIBS:my_discrete
LIBS:TMM-105-01
LIBS:my_power
LIBS:atmega168a-mm
LIBS:CAT16-101J4LF
LIBS:tmp36
LIBS:testpoint
LIBS:TDC_Mother-cache
EELAYER 25 0
EELAYER END
$Descr A 11000 8500
encoding utf-8
Sheet 14 14
Title ""
Date "9 oct 2015"
Rev ""
Comp ""
Comment1 ""
Comment2 ""
Comment3 ""
Comment4 ""
$EndDescr
Text HLabel 5950 3450 2    60   Input ~ 0
UART_RX
Text HLabel 5950 3550 2    60   Input ~ 0
UART_TX
Text HLabel 8000 3300 2    60   Input ~ 0
MCU_RESET
Text Label 6100 2150 2    60   ~ 0
MOSI
Text Label 6100 2250 2    60   ~ 0
MISO
Text Label 6100 2350 2    60   ~ 0
SCK
Text Label 10150 4400 2    60   ~ 0
MOSI
Text Label 10150 4500 2    60   ~ 0
MISO
Text Label 10150 4600 2    60   ~ 0
SCK
Text Label 10150 4700 2    60   ~ 0
~CS
$Comp
L +3.3V #PWR0107
U 1 1 560F370F
P 8150 4150
F 0 "#PWR0107" H 8150 4110 30  0001 C CNN
F 1 "+3.3V" H 8150 4260 30  0000 C CNN
F 2 "" H 8150 4150 60  0000 C CNN
F 3 "" H 8150 4150 60  0000 C CNN
	1    8150 4150
	1    0    0    -1  
$EndComp
$Comp
L GND #PWR0108
U 1 1 560F3BE9
P 8150 5100
F 0 "#PWR0108" H 8150 5100 30  0001 C CNN
F 1 "GND" H 8150 5030 30  0001 C CNN
F 2 "" H 8150 5100 60  0000 C CNN
F 3 "" H 8150 5100 60  0000 C CNN
	1    8150 5100
	1    0    0    -1  
$EndComp
$Comp
L +3.3V #PWR0109
U 1 1 560F442E
P 6850 2700
F 0 "#PWR0109" H 6850 2660 30  0001 C CNN
F 1 "+3.3V" H 6850 2810 30  0000 C CNN
F 2 "" H 6850 2700 60  0000 C CNN
F 3 "" H 6850 2700 60  0000 C CNN
	1    6850 2700
	1    0    0    -1  
$EndComp
Text Label 6400 3300 2    60   ~ 0
~RESET
Text Label 6450 2050 2    60   ~ 0
~CS
$Comp
L GND #PWR0110
U 1 1 560F45AF
P 2750 2500
F 0 "#PWR0110" H 2750 2500 30  0001 C CNN
F 1 "GND" H 2750 2430 30  0001 C CNN
F 2 "" H 2750 2500 60  0000 C CNN
F 3 "" H 2750 2500 60  0000 C CNN
	1    2750 2500
	1    0    0    -1  
$EndComp
$Comp
L GND #PWR0111
U 1 1 560F4708
P 3400 4300
F 0 "#PWR0111" H 3400 4300 30  0001 C CNN
F 1 "GND" H 3400 4230 30  0001 C CNN
F 2 "" H 3400 4300 60  0000 C CNN
F 3 "" H 3400 4300 60  0000 C CNN
	1    3400 4300
	1    0    0    -1  
$EndComp
Text HLabel 5900 2550 2    60   Input ~ 0
DATA0
Text HLabel 5950 3850 2    60   Input ~ 0
DCLK
Text HLabel 5950 3950 2    60   Input ~ 0
nCONFIG
Text HLabel 6900 4050 2    60   Input ~ 0
nSTATUS
Text HLabel 6900 4150 2    60   Input ~ 0
CONF_DONE
$Comp
L +3.3V #PWR0112
U 1 1 560F50FC
P 6550 3450
F 0 "#PWR0112" H 6550 3410 30  0001 C CNN
F 1 "+3.3V" H 6550 3560 30  0000 C CNN
F 2 "" H 6550 3450 60  0000 C CNN
F 3 "" H 6550 3450 60  0000 C CNN
	1    6550 3450
	1    0    0    -1  
$EndComp
$Comp
L +3.3V #PWR0113
U 1 1 560F5109
P 6750 3550
F 0 "#PWR0113" H 6750 3510 30  0001 C CNN
F 1 "+3.3V" H 6750 3660 30  0000 C CNN
F 2 "" H 6750 3550 60  0000 C CNN
F 3 "" H 6750 3550 60  0000 C CNN
	1    6750 3550
	1    0    0    -1  
$EndComp
Text Label 9750 1850 2    60   ~ 0
MOSI
Text Label 8100 1750 0    60   ~ 0
MISO
Text Label 8100 1850 0    60   ~ 0
SCK
Text Label 8100 1950 0    60   ~ 0
~RESET
$Comp
L GND #PWR0114
U 1 1 56124EE1
P 8450 5100
F 0 "#PWR0114" H 8450 5100 30  0001 C CNN
F 1 "GND" H 8450 5030 30  0001 C CNN
F 2 "" H 8450 5100 60  0000 C CNN
F 3 "" H 8450 5100 60  0000 C CNN
	1    8450 5100
	1    0    0    -1  
$EndComp
$Comp
L +3.3V #PWR0115
U 1 1 561246CE
P 2450 1700
F 0 "#PWR0115" H 2450 1660 30  0001 C CNN
F 1 "+3.3V" H 2450 1810 30  0000 C CNN
F 2 "" H 2450 1700 60  0000 C CNN
F 3 "" H 2450 1700 60  0000 C CNN
	1    2450 1700
	1    0    0    -1  
$EndComp
$Comp
L R R20
U 1 1 5615721E
P 6700 1750
F 0 "R20" V 6780 1750 40  0000 C CNN
F 1 "10k" V 6707 1751 40  0000 C CNN
F 2 "libcms:SM0603_Resistor" V 6630 1750 30  0001 C CNN
F 3 "~" H 6700 1750 30  0000 C CNN
F 4 "RHM10.0KHCT-ND" V 6700 1750 60  0001 C CNN "Field1"
F 5 "Digikey" V 6700 1750 60  0001 C CNN "Field2"
	1    6700 1750
	1    0    0    -1  
$EndComp
$Comp
L +3.3V #PWR0116
U 1 1 56157224
P 6700 1450
F 0 "#PWR0116" H 6700 1410 30  0001 C CNN
F 1 "+3.3V" H 6700 1560 30  0000 C CNN
F 2 "" H 6700 1450 60  0000 C CNN
F 3 "" H 6700 1450 60  0000 C CNN
	1    6700 1450
	1    0    0    -1  
$EndComp
Text Label 5700 2700 2    60   ~ 0
LED
$Comp
L +3.3V #PWR0117
U 1 1 5615E57A
P 9850 1650
F 0 "#PWR0117" H 9850 1610 30  0001 C CNN
F 1 "+3.3V" H 9850 1760 30  0000 C CNN
F 2 "" H 9850 1650 60  0000 C CNN
F 3 "" H 9850 1650 60  0000 C CNN
	1    9850 1650
	1    0    0    -1  
$EndComp
Text HLabel 5650 1950 2    60   Input ~ 0
TDC1_TX
Text HLabel 5650 1850 2    60   Input ~ 0
TDC1_RX
Text HLabel 5950 3750 2    60   Input ~ 0
TDC2_TX
Text HLabel 5950 3650 2    60   Input ~ 0
TDC2_RX
Text HLabel 6150 3000 2    60   Input ~ 0
INIT_DONE_2
Text HLabel 6150 3100 2    60   Input ~ 0
INIT_DONE_1
$Comp
L WS2812B U17
U 1 1 5629D723
P 4100 5900
F 0 "U17" H 4150 6350 60  0000 C CNN
F 1 "WS2812B" H 4300 5850 60  0000 C CNN
F 2 "integrated_tdc_pcblib:WS2812B" H 2400 7000 60  0001 C CNN
F 3 "" H 2400 7000 60  0000 C CNN
F 4 "1528-1104-ND" H 4100 5900 60  0001 C CNN "Field1"
F 5 "Digikey" H 4100 5900 60  0001 C CNN "Field2"
	1    4100 5900
	1    0    0    -1  
$EndComp
$Comp
L GND #PWR0118
U 1 1 5629F568
P 3750 6350
F 0 "#PWR0118" H 3750 6350 30  0001 C CNN
F 1 "GND" H 3750 6280 30  0001 C CNN
F 2 "" H 3750 6350 60  0000 C CNN
F 3 "" H 3750 6350 60  0000 C CNN
	1    3750 6350
	1    0    0    -1  
$EndComp
$Comp
L GND #PWR0119
U 1 1 5629F5BF
P 5100 6350
F 0 "#PWR0119" H 5100 6350 30  0001 C CNN
F 1 "GND" H 5100 6280 30  0001 C CNN
F 2 "" H 5100 6350 60  0000 C CNN
F 3 "" H 5100 6350 60  0000 C CNN
	1    5100 6350
	1    0    0    -1  
$EndComp
$Comp
L GND #PWR0120
U 1 1 5629F60F
P 6450 6350
F 0 "#PWR0120" H 6450 6350 30  0001 C CNN
F 1 "GND" H 6450 6280 30  0001 C CNN
F 2 "" H 6450 6350 60  0000 C CNN
F 3 "" H 6450 6350 60  0000 C CNN
	1    6450 6350
	1    0    0    -1  
$EndComp
Wire Wire Line
	5500 3300 7000 3300
Wire Wire Line
	6100 2150 5500 2150
Wire Wire Line
	6100 2250 5500 2250
Wire Wire Line
	6100 2350 5500 2350
Wire Wire Line
	8150 4300 8500 4300
Wire Wire Line
	8150 4150 8150 4400
Connection ~ 8150 4300
Wire Wire Line
	8500 4550 8450 4550
Wire Wire Line
	8450 4300 8450 4650
Connection ~ 8450 4300
Wire Wire Line
	8450 4650 8500 4650
Connection ~ 8450 4550
Wire Wire Line
	9700 4400 10150 4400
Wire Wire Line
	9700 4500 10150 4500
Wire Wire Line
	9700 4600 10150 4600
Wire Wire Line
	9700 4700 10150 4700
Wire Wire Line
	5500 3450 5950 3450
Wire Wire Line
	5500 3550 5950 3550
Wire Wire Line
	6850 2700 6850 2750
Wire Wire Line
	5500 2050 6700 2050
Wire Wire Line
	2450 1850 3600 1850
Wire Wire Line
	3050 1900 3050 1850
Connection ~ 3050 1850
Wire Wire Line
	2750 2300 2750 2500
Wire Wire Line
	3050 2400 3050 2300
Wire Wire Line
	2450 2400 3050 2400
Wire Wire Line
	3600 4050 3400 4050
Wire Wire Line
	3400 3950 3400 4300
Wire Wire Line
	3400 4150 3600 4150
Connection ~ 3400 4150
Wire Wire Line
	5500 3750 5950 3750
Wire Wire Line
	5500 3850 5950 3850
Wire Wire Line
	5500 3950 5950 3950
Wire Wire Line
	5500 4050 6900 4050
Wire Wire Line
	5500 4150 6900 4150
Wire Wire Line
	6850 3250 6850 3300
Connection ~ 6850 3300
Wire Wire Line
	6550 3450 6550 3500
Wire Wire Line
	6750 3550 6750 3600
Wire Wire Line
	6750 4100 6750 4150
Connection ~ 6750 4150
Wire Wire Line
	6550 4000 6550 4050
Connection ~ 6550 4050
Wire Wire Line
	5700 2700 5500 2700
Wire Wire Line
	5500 2800 5700 2800
Wire Wire Line
	5500 2900 5700 2900
Wire Wire Line
	5500 3000 6150 3000
Connection ~ 2750 1850
Wire Wire Line
	3600 2150 3400 2150
Wire Wire Line
	3400 1850 3400 2450
Connection ~ 3400 1850
Wire Wire Line
	2450 1700 2450 1900
Wire Wire Line
	2450 2400 2450 2300
Connection ~ 2750 2400
Wire Wire Line
	3400 2450 3600 2450
Connection ~ 3400 2150
Wire Wire Line
	8150 4800 8150 5100
Wire Wire Line
	8500 4900 8450 4900
Wire Wire Line
	8450 4900 8450 5100
Connection ~ 2450 1850
Wire Wire Line
	2750 1900 2750 1850
Wire Wire Line
	6700 1450 6700 1500
Wire Wire Line
	6700 2050 6700 2000
Wire Wire Line
	5500 3100 6150 3100
Wire Wire Line
	5500 3200 5850 3200
Wire Wire Line
	5500 2550 5900 2550
Wire Wire Line
	8500 1750 8100 1750
Wire Wire Line
	8500 1850 8100 1850
Wire Wire Line
	8500 1950 8100 1950
Wire Wire Line
	9300 1850 9750 1850
Wire Wire Line
	9300 1750 9850 1750
Wire Wire Line
	9850 1750 9850 1650
Wire Wire Line
	5950 3650 5500 3650
Wire Wire Line
	5850 2450 5500 2450
Wire Wire Line
	5650 1850 5500 1850
Wire Wire Line
	5650 1950 5500 1950
Wire Wire Line
	3750 5900 3750 5800
Wire Wire Line
	3750 5800 3900 5800
Wire Wire Line
	6050 5600 6550 5600
Wire Wire Line
	3350 5600 3900 5600
Wire Wire Line
	3750 6300 3750 6350
Wire Wire Line
	6450 6300 6450 6350
$Comp
L GND #PWR0121
U 1 1 5629F9D8
P 4850 5900
F 0 "#PWR0121" H 4850 5900 30  0001 C CNN
F 1 "GND" H 4850 5830 30  0001 C CNN
F 2 "" H 4850 5900 60  0000 C CNN
F 3 "" H 4850 5900 60  0000 C CNN
	1    4850 5900
	1    0    0    -1  
$EndComp
$Comp
L GND #PWR0122
U 1 1 5629FA16
P 6150 5900
F 0 "#PWR0122" H 6150 5900 30  0001 C CNN
F 1 "GND" H 6150 5830 30  0001 C CNN
F 2 "" H 6150 5900 60  0000 C CNN
F 3 "" H 6150 5900 60  0000 C CNN
	1    6150 5900
	1    0    0    -1  
$EndComp
$Comp
L GND #PWR0123
U 1 1 5629FA54
P 7550 5900
F 0 "#PWR0123" H 7550 5900 30  0001 C CNN
F 1 "GND" H 7550 5830 30  0001 C CNN
F 2 "" H 7550 5900 60  0000 C CNN
F 3 "" H 7550 5900 60  0000 C CNN
	1    7550 5900
	1    0    0    -1  
$EndComp
$Comp
L +5V #PWR0124
U 1 1 562A0744
P 3750 5800
F 0 "#PWR0124" H 3750 5890 20  0001 C CNN
F 1 "+5V" H 3750 5890 30  0000 C CNN
F 2 "" H 3750 5800 60  0000 C CNN
F 3 "" H 3750 5800 60  0000 C CNN
	1    3750 5800
	1    0    0    -1  
$EndComp
Wire Wire Line
	4850 5900 4850 5800
Wire Wire Line
	4850 5800 4750 5800
Wire Wire Line
	6150 5900 6150 5800
Wire Wire Line
	6150 5800 6050 5800
Wire Wire Line
	7550 5900 7550 5800
Wire Wire Line
	7550 5800 7400 5800
Wire Wire Line
	5100 5900 5100 5800
Wire Wire Line
	5100 5800 5200 5800
Wire Wire Line
	6450 5900 6450 5800
Wire Wire Line
	6450 5800 6550 5800
Wire Wire Line
	5100 6350 5100 6300
$Comp
L +5V #PWR0125
U 1 1 562A0F97
P 5100 5800
F 0 "#PWR0125" H 5100 5890 20  0001 C CNN
F 1 "+5V" H 5100 5890 30  0000 C CNN
F 2 "" H 5100 5800 60  0000 C CNN
F 3 "" H 5100 5800 60  0000 C CNN
	1    5100 5800
	1    0    0    -1  
$EndComp
$Comp
L +5V #PWR0126
U 1 1 562A0FD5
P 6450 5800
F 0 "#PWR0126" H 6450 5890 20  0001 C CNN
F 1 "+5V" H 6450 5890 30  0000 C CNN
F 2 "" H 6450 5800 60  0000 C CNN
F 3 "" H 6450 5800 60  0000 C CNN
	1    6450 5800
	1    0    0    -1  
$EndComp
$Comp
L +5V #PWR0127
U 1 1 562A1013
P 3350 4950
F 0 "#PWR0127" H 3350 5040 20  0001 C CNN
F 1 "+5V" H 3350 5040 30  0000 C CNN
F 2 "" H 3350 4950 60  0000 C CNN
F 3 "" H 3350 4950 60  0000 C CNN
	1    3350 4950
	1    0    0    -1  
$EndComp
Wire Wire Line
	3350 5100 3350 4950
Wire Wire Line
	3350 5600 3350 5800
Wire Wire Line
	3350 6200 3350 6350
$Comp
L GND #PWR0128
U 1 1 562A19D7
P 3350 6350
F 0 "#PWR0128" H 3350 6350 30  0001 C CNN
F 1 "GND" H 3350 6280 30  0001 C CNN
F 2 "" H 3350 6350 60  0000 C CNN
F 3 "" H 3350 6350 60  0000 C CNN
	1    3350 6350
	1    0    0    -1  
$EndComp
Wire Wire Line
	2550 6000 3050 6000
Wire Wire Line
	2700 6000 2700 6100
Connection ~ 2700 6000
Wire Wire Line
	2700 6600 2700 6650
$Comp
L GND #PWR0129
U 1 1 562A1C42
P 2700 6650
F 0 "#PWR0129" H 2700 6650 30  0001 C CNN
F 1 "GND" H 2700 6580 30  0001 C CNN
F 2 "" H 2700 6650 60  0000 C CNN
F 3 "" H 2700 6650 60  0000 C CNN
	1    2700 6650
	1    0    0    -1  
$EndComp
Text Label 1850 6000 0    60   ~ 0
LED
Text Label 5700 2800 2    60   ~ 0
TP1
Text Label 5700 2900 2    60   ~ 0
TP2
Text Label 5550 3450 0    60   ~ 0
UART_RX
Text Label 5550 3550 0    60   ~ 0
UART_TX
Text Label 2050 2750 2    60   ~ 0
UART_RX
Text Label 2050 2650 2    60   ~ 0
UART_TX
Text Label 2050 3850 2    60   ~ 0
TP1
Text Label 2050 3750 2    60   ~ 0
TP2
NoConn ~ 7400 5600
$Comp
L R R16
U 1 1 562C443C
P 2300 6000
F 0 "R16" V 2380 6000 40  0000 C CNN
F 1 "100" V 2307 6001 40  0000 C CNN
F 2 "libcms:SM0603_Resistor" V 2230 6000 30  0001 C CNN
F 3 "~" H 2300 6000 30  0000 C CNN
F 4 "RHM100CFCT-ND" V 2300 6000 60  0001 C CNN "Field1"
F 5 "Digi-Key" V 2300 6000 60  0001 C CNN "Field2"
	1    2300 6000
	0    1    1    0   
$EndComp
Wire Wire Line
	2050 6000 1850 6000
$Comp
L WS2812B U18
U 1 1 562CAA84
P 5400 5900
F 0 "U18" H 5450 6350 60  0000 C CNN
F 1 "WS2812B" H 5600 5850 60  0000 C CNN
F 2 "integrated_tdc_pcblib:WS2812B" H 3700 7000 60  0001 C CNN
F 3 "" H 3700 7000 60  0000 C CNN
F 4 "1528-1104-ND" H 5400 5900 60  0001 C CNN "Field1"
F 5 "Digikey" H 5400 5900 60  0001 C CNN "Field2"
	1    5400 5900
	1    0    0    -1  
$EndComp
$Comp
L WS2812B U19
U 1 1 562CAB27
P 6750 5900
F 0 "U19" H 6800 6350 60  0000 C CNN
F 1 "WS2812B" H 6950 5850 60  0000 C CNN
F 2 "integrated_tdc_pcblib:WS2812B" H 5050 7000 60  0001 C CNN
F 3 "" H 5050 7000 60  0000 C CNN
F 4 "1528-1104-ND" H 6750 5900 60  0001 C CNN "Field1"
F 5 "Digikey" H 6750 5900 60  0001 C CNN "Field2"
	1    6750 5900
	1    0    0    -1  
$EndComp
$Comp
L C C68
U 1 1 562CBEF4
P 2450 2100
F 0 "C68" H 2450 2200 40  0000 L CNN
F 1 "0.1uF" H 2456 2015 40  0000 L CNN
F 2 "libcms:SM0402" H 2488 1950 30  0001 C CNN
F 3 "~" H 2450 2100 60  0000 C CNN
F 4 "490-9730-1-ND" H 2450 2100 60  0001 C CNN "Field1"
F 5 "Digikey" H 2450 2100 60  0001 C CNN "Field2"
	1    2450 2100
	1    0    0    -1  
$EndComp
$Comp
L C C69
U 1 1 562CC105
P 2750 2100
F 0 "C69" H 2750 2200 40  0000 L CNN
F 1 "0.1uF" H 2756 2015 40  0000 L CNN
F 2 "libcms:SM0402" H 2788 1950 30  0001 C CNN
F 3 "~" H 2750 2100 60  0000 C CNN
F 4 "490-9730-1-ND" H 2750 2100 60  0001 C CNN "Field1"
F 5 "Digikey" H 2750 2100 60  0001 C CNN "Field2"
	1    2750 2100
	1    0    0    -1  
$EndComp
$Comp
L C C70
U 1 1 562CC1B1
P 3050 2100
F 0 "C70" H 3050 2200 40  0000 L CNN
F 1 "0.1uF" H 3056 2015 40  0000 L CNN
F 2 "libcms:SM0402" H 3088 1950 30  0001 C CNN
F 3 "~" H 3050 2100 60  0000 C CNN
F 4 "490-9730-1-ND" H 3050 2100 60  0001 C CNN "Field1"
F 5 "Digikey" H 3050 2100 60  0001 C CNN "Field2"
	1    3050 2100
	1    0    0    -1  
$EndComp
$Comp
L C C71
U 1 1 562CC5FB
P 3750 6100
F 0 "C71" H 3750 6200 40  0000 L CNN
F 1 "0.1uF" H 3756 6015 40  0000 L CNN
F 2 "libcms:SM0603_Capa" H 3788 5950 30  0001 C CNN
F 3 "~" H 3750 6100 60  0000 C CNN
F 4 "490-9730-1-ND" H 3750 6100 60  0001 C CNN "Field1"
F 5 "Digikey" H 3750 6100 60  0001 C CNN "Field2"
	1    3750 6100
	1    0    0    -1  
$EndComp
$Comp
L C C72
U 1 1 562CC781
P 5100 6100
F 0 "C72" H 5100 6200 40  0000 L CNN
F 1 "0.1uF" H 5106 6015 40  0000 L CNN
F 2 "libcms:SM0603_Capa" H 5138 5950 30  0001 C CNN
F 3 "~" H 5100 6100 60  0000 C CNN
F 4 "490-9730-1-ND" H 5100 6100 60  0001 C CNN "Field1"
F 5 "Digikey" H 5100 6100 60  0001 C CNN "Field2"
	1    5100 6100
	1    0    0    -1  
$EndComp
$Comp
L C C73
U 1 1 562CC806
P 6450 6100
F 0 "C73" H 6450 6200 40  0000 L CNN
F 1 "0.1uF" H 6456 6015 40  0000 L CNN
F 2 "libcms:SM0603_Capa" H 6488 5950 30  0001 C CNN
F 3 "~" H 6450 6100 60  0000 C CNN
F 4 "490-9730-1-ND" H 6450 6100 60  0001 C CNN "Field1"
F 5 "Digikey" H 6450 6100 60  0001 C CNN "Field2"
	1    6450 6100
	1    0    0    -1  
$EndComp
$Comp
L R R21
U 1 1 562DA345
P 6850 3000
F 0 "R21" V 6930 3000 40  0000 C CNN
F 1 "10k" V 6857 3001 40  0000 C CNN
F 2 "libcms:SM0603_Resistor" V 6780 3000 30  0001 C CNN
F 3 "~" H 6850 3000 30  0000 C CNN
F 4 "RHM10.0KHCT-ND" V 6850 3000 60  0001 C CNN "Field1"
F 5 "Digikey" V 6850 3000 60  0001 C CNN "Field2"
	1    6850 3000
	1    0    0    -1  
$EndComp
$Comp
L R R22
U 1 1 562DA3F5
P 6750 3850
F 0 "R22" V 6830 3850 40  0000 C CNN
F 1 "10k" V 6757 3851 40  0000 C CNN
F 2 "libcms:SM0603_Resistor" V 6680 3850 30  0001 C CNN
F 3 "~" H 6750 3850 30  0000 C CNN
F 4 "RHM10.0KHCT-ND" V 6750 3850 60  0001 C CNN "Field1"
F 5 "Digikey" V 6750 3850 60  0001 C CNN "Field2"
	1    6750 3850
	1    0    0    -1  
$EndComp
$Comp
L R R19
U 1 1 562DA46A
P 6550 3750
F 0 "R19" V 6630 3750 40  0000 C CNN
F 1 "10k" V 6557 3751 40  0000 C CNN
F 2 "libcms:SM0603_Resistor" V 6480 3750 30  0001 C CNN
F 3 "~" H 6550 3750 30  0000 C CNN
F 4 "RHM10.0KHCT-ND" V 6550 3750 60  0001 C CNN "Field1"
F 5 "Digikey" V 6550 3750 60  0001 C CNN "Field2"
	1    6550 3750
	1    0    0    -1  
$EndComp
$Comp
L R R17
U 1 1 562DA4CA
P 2700 6350
F 0 "R17" V 2780 6350 40  0000 C CNN
F 1 "10k" V 2707 6351 40  0000 C CNN
F 2 "libcms:SM0603_Resistor" V 2630 6350 30  0001 C CNN
F 3 "~" H 2700 6350 30  0000 C CNN
F 4 "RHM10.0KHCT-ND" V 2700 6350 60  0001 C CNN "Field1"
F 5 "Digikey" V 2700 6350 60  0001 C CNN "Field2"
	1    2700 6350
	1    0    0    -1  
$EndComp
$Comp
L R R18
U 1 1 562DA6D6
P 3350 5350
F 0 "R18" V 3430 5350 40  0000 C CNN
F 1 "1k" V 3357 5351 40  0000 C CNN
F 2 "libcms:SM0603_Resistor" V 3280 5350 30  0001 C CNN
F 3 "~" H 3350 5350 30  0000 C CNN
F 4 "RHM1.00KCFCT-ND" V 3350 5350 60  0001 C CNN "Field1"
F 5 "Digikey" V 3350 5350 60  0001 C CNN "Field2"
	1    3350 5350
	1    0    0    -1  
$EndComp
$Comp
L C C74
U 1 1 562DAF33
P 8150 4600
F 0 "C74" H 8150 4700 40  0000 L CNN
F 1 "0.1uF" H 8156 4515 40  0000 L CNN
F 2 "libcms:SM0603_Capa" H 8188 4450 30  0001 C CNN
F 3 "~" H 8150 4600 60  0000 C CNN
F 4 "490-9730-1-ND" H 8150 4600 60  0001 C CNN "Field1"
F 5 "Digikey" H 8150 4600 60  0001 C CNN "Field2"
	1    8150 4600
	1    0    0    -1  
$EndComp
$Comp
L AO3422 Q1
U 1 1 562DEAA1
P 3250 6000
F 0 "Q1" H 3260 6170 60  0000 R CNN
F 1 "AO3422" H 3260 5850 60  0000 R CNN
F 2 "libcms:SOT23" H 3250 6000 60  0001 C CNN
F 3 "" H 3250 6000 60  0000 C CNN
F 4 "785-1015-1-ND" H 3250 6000 60  0001 C CNN "Field1"
F 5 "Digi-Key" H 3250 6000 60  0001 C CNN "Field2"
	1    3250 6000
	1    0    0    -1  
$EndComp
$Comp
L M25P32 U20
U 1 1 562E0036
P 8800 4950
F 0 "U20" H 8850 5750 60  0000 C CNN
F 1 "M25P32" H 9000 4900 60  0000 C CNN
F 2 "integrated_tdc_pcblib:so-8W" H 13450 6250 60  0001 C CNN
F 3 "" H 13450 6250 60  0000 C CNN
F 4 "557-1635-1-ND" H 8800 4950 60  0001 C CNN "Field1"
F 5 "Digikey" H 8800 4950 60  0001 C CNN "Field2"
	1    8800 4950
	1    0    0    -1  
$EndComp
Wire Wire Line
	4750 5600 5200 5600
Wire Wire Line
	1400 3850 2050 3850
Wire Wire Line
	1400 2750 2050 2750
Wire Wire Line
	9300 1950 9400 1950
Wire Wire Line
	9300 2050 9850 2050
$Comp
L ATMEGA328P-MM U16
U 1 1 564FAE3E
P 4500 2950
F 0 "U16" H 3750 4200 40  0000 L BNN
F 1 "ATMEGA328P-MM" H 4850 1550 40  0000 L BNN
F 2 "ATMega328:ATMega328" H 4500 2950 30  0000 C CIN
F 3 "" H 4500 2950 60  0000 C CNN
F 4 "ATMEGA328P-MMHRCT-ND" H 4500 2950 60  0001 C CNN "Field1"
F 5 "Digi-Key" H 4500 2950 60  0001 C CNN "Field2"
	1    4500 2950
	1    0    0    -1  
$EndComp
Wire Wire Line
	3400 3950 3600 3950
Connection ~ 3400 4050
Wire Wire Line
	1400 2850 2150 2850
$Comp
L +3.3V #PWR0130
U 1 1 565CC0DF
P 2150 2850
F 0 "#PWR0130" H 2150 2810 30  0001 C CNN
F 1 "+3.3V" H 2150 2960 30  0000 C CNN
F 2 "" H 2150 2850 60  0000 C CNN
F 3 "" H 2150 2850 60  0000 C CNN
	1    2150 2850
	-1   0    0    -1  
$EndComp
$Comp
L C C117
U 1 1 566BC7FB
P 8150 6250
F 0 "C117" H 8150 6350 40  0000 L CNN
F 1 "0.1uF" H 8156 6165 40  0000 L CNN
F 2 "libcms:SM0402" H 8188 6100 30  0001 C CNN
F 3 "~" H 8150 6250 60  0000 C CNN
F 4 "490-9730-1-ND" H 8150 6250 60  0001 C CNN "Field1"
F 5 "Digikey" H 8150 6250 60  0001 C CNN "Field2"
	1    8150 6250
	1    0    0    -1  
$EndComp
Wire Wire Line
	8150 6050 8550 6050
Wire Wire Line
	8150 6500 8150 6450
Wire Wire Line
	8550 6500 8550 6250
$Comp
L +3.3V #PWR0131
U 1 1 566BD6DD
P 8150 6000
F 0 "#PWR0131" H 8150 5960 30  0001 C CNN
F 1 "+3.3V" H 8150 6110 30  0000 C CNN
F 2 "" H 8150 6000 60  0000 C CNN
F 3 "" H 8150 6000 60  0000 C CNN
	1    8150 6000
	1    0    0    -1  
$EndComp
$Comp
L +3.3V #PWR0132
U 1 1 566BD928
P 9750 6250
F 0 "#PWR0132" H 9750 6210 30  0001 C CNN
F 1 "+3.3V" H 9750 6360 30  0000 C CNN
F 2 "" H 9750 6250 60  0000 C CNN
F 3 "" H 9750 6250 60  0000 C CNN
	1    9750 6250
	1    0    0    -1  
$EndComp
Wire Wire Line
	9750 6250 9550 6250
Wire Wire Line
	9550 6050 9950 6050
Text Label 9950 6050 2    60   ~ 0
TMP37
$Comp
L GND #PWR0133
U 1 1 566BE0F0
P 8550 6500
F 0 "#PWR0133" H 8550 6500 30  0001 C CNN
F 1 "GND" H 8550 6430 30  0001 C CNN
F 2 "" H 8550 6500 60  0000 C CNN
F 3 "" H 8550 6500 60  0000 C CNN
	1    8550 6500
	1    0    0    -1  
$EndComp
$Comp
L GND #PWR0134
U 1 1 566BE134
P 8150 6500
F 0 "#PWR0134" H 8150 6500 30  0001 C CNN
F 1 "GND" H 8150 6430 30  0001 C CNN
F 2 "" H 8150 6500 60  0000 C CNN
F 3 "" H 8150 6500 60  0000 C CNN
	1    8150 6500
	1    0    0    -1  
$EndComp
Wire Wire Line
	8150 6000 8150 6050
Text Label 5850 3200 2    60   ~ 0
TMP37
NoConn ~ 5850 2450
$Comp
L Testpoint TP2
U 1 1 566F8113
P 1100 4950
F 0 "TP2" H 1250 5050 60  0000 C CNN
F 1 "DNP" H 1100 5250 60  0001 C CNN
F 2 "connect:PINTST" H 50  5750 60  0001 C CNN
F 3 "" H 50  5750 60  0000 C CNN
	1    1100 4950
	1    0    0    -1  
$EndComp
$Comp
L Testpoint TP4
U 1 1 566F811A
P 1600 4950
F 0 "TP4" H 1750 5050 60  0000 C CNN
F 1 "DNP" H 1600 5250 60  0001 C CNN
F 2 "connect:PINTST" H 550 5750 60  0001 C CNN
F 3 "" H 550 5750 60  0000 C CNN
	1    1600 4950
	1    0    0    -1  
$EndComp
$Comp
L Testpoint TP5
U 1 1 566F8121
P 2100 4950
F 0 "TP5" H 2250 5050 60  0000 C CNN
F 1 "DNP" H 2100 5250 60  0001 C CNN
F 2 "connect:PINTST" H 1050 5750 60  0001 C CNN
F 3 "" H 1050 5750 60  0000 C CNN
	1    2100 4950
	1    0    0    -1  
$EndComp
$Comp
L GND #PWR0135
U 1 1 566F812F
P 1100 5000
F 0 "#PWR0135" H 1100 5000 30  0001 C CNN
F 1 "GND" H 1100 4930 30  0001 C CNN
F 2 "" H 1100 5000 60  0000 C CNN
F 3 "" H 1100 5000 60  0000 C CNN
	1    1100 5000
	1    0    0    -1  
$EndComp
$Comp
L GND #PWR0136
U 1 1 566F8135
P 1600 5000
F 0 "#PWR0136" H 1600 5000 30  0001 C CNN
F 1 "GND" H 1600 4930 30  0001 C CNN
F 2 "" H 1600 5000 60  0000 C CNN
F 3 "" H 1600 5000 60  0000 C CNN
	1    1600 5000
	1    0    0    -1  
$EndComp
$Comp
L GND #PWR0137
U 1 1 566F813B
P 2100 5000
F 0 "#PWR0137" H 2100 5000 30  0001 C CNN
F 1 "GND" H 2100 4930 30  0001 C CNN
F 2 "" H 2100 5000 60  0000 C CNN
F 3 "" H 2100 5000 60  0000 C CNN
	1    2100 5000
	1    0    0    -1  
$EndComp
Wire Wire Line
	1100 5000 1100 4950
Wire Wire Line
	1600 4950 1600 5000
Wire Wire Line
	2100 4950 2100 5000
Text Label 5550 2550 0    60   ~ 0
DATA0
Text Label 5550 3850 0    60   ~ 0
DCLK
Text Label 5550 3000 0    60   ~ 0
INIT_DONE_2
Text Label 5550 3100 0    60   ~ 0
INIT_DONE_1
Text Label 5550 3950 0    60   ~ 0
nCONFIG
Text Label 5550 4050 0    60   ~ 0
nSTATUS
Text Label 5550 4150 0    60   ~ 0
CONF_DONE
Text Label 2050 3150 2    60   ~ 0
DATA0
Text Label 2050 3350 2    60   ~ 0
INIT_DONE_1
Text Label 2050 3450 2    60   ~ 0
INIT_DONE_2
Text Label 2050 2950 2    60   ~ 0
DCLK
Text Label 2050 3250 2    60   ~ 0
nCONFIG
Text Label 2050 3550 2    60   ~ 0
nSTATUS
Text Label 2050 3650 2    60   ~ 0
CONF_DONE
$Comp
L Testpoint TP1
U 1 1 566FE0DE
P 1100 4500
F 0 "TP1" H 1250 4600 60  0000 C CNN
F 1 "DNP" H 1100 4800 60  0001 C CNN
F 2 "connect:PINTST" H 50  5300 60  0001 C CNN
F 3 "" H 50  5300 60  0000 C CNN
	1    1100 4500
	1    0    0    -1  
$EndComp
$Comp
L Testpoint TP3
U 1 1 566FE0E4
P 1600 4500
F 0 "TP3" H 1750 4600 60  0000 C CNN
F 1 "DNP" H 1600 4800 60  0001 C CNN
F 2 "connect:PINTST" H 550 5300 60  0001 C CNN
F 3 "" H 550 5300 60  0000 C CNN
	1    1600 4500
	1    0    0    -1  
$EndComp
Wire Wire Line
	1100 4500 1100 4550
Wire Wire Line
	1100 4550 1400 4550
Wire Wire Line
	1600 4500 1600 4550
Wire Wire Line
	1600 4550 1900 4550
$Comp
L +3.3V #PWR0138
U 1 1 566FE0FA
P 1900 4550
F 0 "#PWR0138" H 1900 4510 30  0001 C CNN
F 1 "+3.3V" H 1900 4660 30  0000 C CNN
F 2 "" H 1900 4550 60  0000 C CNN
F 3 "" H 1900 4550 60  0000 C CNN
	1    1900 4550
	1    0    0    -1  
$EndComp
$Comp
L +2.5V #PWR0139
U 1 1 566FE103
P 1400 4550
F 0 "#PWR0139" H 1400 4500 20  0001 C CNN
F 1 "+2.5V" H 1400 4650 30  0000 C CNN
F 2 "" H 1400 4550 60  0000 C CNN
F 3 "" H 1400 4550 60  0000 C CNN
	1    1400 4550
	1    0    0    -1  
$EndComp
$Comp
L GND #PWR0140
U 1 1 56702CF6
P 2150 3150
F 0 "#PWR0140" H 2150 3150 30  0001 C CNN
F 1 "GND" H 2150 3080 30  0001 C CNN
F 2 "" H 2150 3150 60  0000 C CNN
F 3 "" H 2150 3150 60  0000 C CNN
	1    2150 3150
	1    0    0    -1  
$EndComp
Wire Wire Line
	1400 3050 2150 3050
Wire Wire Line
	2150 3050 2150 3150
Wire Wire Line
	1400 3650 2050 3650
Wire Wire Line
	2050 3550 1400 3550
Wire Wire Line
	1400 3450 2050 3450
Wire Wire Line
	2050 3350 1400 3350
Wire Wire Line
	1400 3250 2050 3250
Wire Wire Line
	2050 3150 1400 3150
Wire Wire Line
	1400 2950 2050 2950
Wire Wire Line
	1400 3750 2050 3750
Wire Wire Line
	1400 2650 2050 2650
$Comp
L TMP37 U22
U 1 1 566B7FDD
P 8750 6300
F 0 "U22" H 9300 6650 60  0000 C CNN
F 1 "TMP37" H 8900 6650 60  0000 C CNN
F 2 "libcms:SOT23-5" H 9900 6800 60  0001 C CNN
F 3 "" H 9900 6800 60  0000 C CNN
F 4 "TMP37GRTZ-REEL7CT-ND" H 8750 6300 60  0001 C CNN "Field1"
F 5 "Digikey" H 8750 6300 60  0001 C CNN "Field2"
	1    8750 6300
	1    0    0    -1  
$EndComp
$Comp
L 14x1 P1
U 1 1 56B50833
P 1600 3250
F 0 "P1" H 2050 3950 60  0000 C CNN
F 1 "DNP" V 2050 3250 60  0000 C CNN
F 2 "connect:SIL-14" H 1150 3650 60  0001 C CNN
F 3 "" H 1150 3650 60  0000 C CNN
	1    1600 3250
	-1   0    0    1   
$EndComp
$Comp
L C C118
U 1 1 56B5245A
P 7200 3300
F 0 "C118" H 7200 3400 40  0000 L CNN
F 1 "0.1uF" H 7206 3215 40  0000 L CNN
F 2 "libcms:SM0603_Capa" H 7238 3150 30  0001 C CNN
F 3 "~" H 7200 3300 60  0000 C CNN
F 4 "490-9730-1-ND" H 7200 3300 60  0001 C CNN "Field1"
F 5 "Digikey" H 7200 3300 60  0001 C CNN "Field2"
	1    7200 3300
	0    -1   -1   0   
$EndComp
Wire Wire Line
	7400 3300 8000 3300
Wire Wire Line
	1400 2550 2050 2550
Text Label 7450 3300 0    60   ~ 0
MCU_RESET
Text Label 2050 2550 2    60   ~ 0
MCU_RESET
$Comp
L TMM-105-01 P2
U 1 1 56B5B9D7
P 8900 1950
F 0 "P2" H 8900 2250 60  0000 C CNN
F 1 "TMM-105-01" V 8900 1950 40  0000 C CNN
F 2 "integrated_tdc_pcblib:TMM-105-01" H 8900 1950 60  0001 C CNN
F 3 "" H 8900 1950 60  0000 C CNN
F 4 "SAM1171-05-ND" H 8900 1950 60  0001 C CNN "Field1"
F 5 "Digi-Key" H 8900 1950 60  0001 C CNN "Field2"
	1    8900 1950
	-1   0    0    -1  
$EndComp
$Comp
L +5V #PWR0141
U 1 1 56B5F6E1
P 8350 2150
F 0 "#PWR0141" H 8350 2240 20  0001 C CNN
F 1 "+5V" H 8350 2240 30  0000 C CNN
F 2 "" H 8350 2150 60  0000 C CNN
F 3 "" H 8350 2150 60  0000 C CNN
	1    8350 2150
	0    -1   -1   0   
$EndComp
$Comp
L +5V #PWR0142
U 1 1 56B5F80B
P 9450 2150
F 0 "#PWR0142" H 9450 2240 20  0001 C CNN
F 1 "+5V" H 9450 2240 30  0000 C CNN
F 2 "" H 9450 2150 60  0000 C CNN
F 3 "" H 9450 2150 60  0000 C CNN
	1    9450 2150
	0    1    1    0   
$EndComp
Wire Wire Line
	9450 2150 9300 2150
Wire Wire Line
	8500 2150 8350 2150
Wire Wire Line
	8100 2050 8500 2050
Wire Wire Line
	8100 2050 8100 2150
$Comp
L GND #PWR0143
U 1 1 56B5FCCA
P 8100 2150
F 0 "#PWR0143" H 8100 2150 30  0001 C CNN
F 1 "GND" H 8100 2080 30  0001 C CNN
F 2 "" H 8100 2150 60  0000 C CNN
F 3 "" H 8100 2150 60  0000 C CNN
	1    8100 2150
	1    0    0    -1  
$EndComp
Wire Wire Line
	9400 1950 9400 2050
Wire Wire Line
	9850 2050 9850 2150
$Comp
L GND #PWR0144
U 1 1 56B52021
P 9850 2150
F 0 "#PWR0144" H 9850 2150 30  0001 C CNN
F 1 "GND" H 9850 2080 30  0001 C CNN
F 2 "" H 9850 2150 60  0000 C CNN
F 3 "" H 9850 2150 60  0000 C CNN
	1    9850 2150
	1    0    0    -1  
$EndComp
Connection ~ 9400 2050
$Comp
L Testpoint TP6
U 1 1 56B529B7
P 2100 4500
F 0 "TP6" H 2250 4600 60  0000 C CNN
F 1 "DNP" H 2100 4800 60  0001 C CNN
F 2 "connect:PINTST" H 1050 5300 60  0001 C CNN
F 3 "" H 1050 5300 60  0000 C CNN
	1    2100 4500
	1    0    0    -1  
$EndComp
Wire Wire Line
	2100 4500 2100 4550
Wire Wire Line
	2100 4550 2400 4550
$Comp
L +5V #PWR0145
U 1 1 56B52CAE
P 2400 4550
F 0 "#PWR0145" H 2400 4640 20  0001 C CNN
F 1 "+5V" H 2400 4640 30  0000 C CNN
F 2 "" H 2400 4550 60  0000 C CNN
F 3 "" H 2400 4550 60  0000 C CNN
	1    2400 4550
	1    0    0    -1  
$EndComp
$EndSCHEMATC
