(module 4816P-1-101LF (layer F.Cu) (tedit 562E55DC)
  (fp_text reference U13 (at 0 0 90) (layer F.SilkS)
    (effects (font (size 1 1) (thickness 0.15)))
  )
  (fp_text value 4816P-1-101LF (at 0 3.175) (layer F.SilkS) hide
    (effects (font (size 1 1) (thickness 0.15)))
  )
  (fp_circle (center -3.623453 -9.144) (end -3.369453 -8.6995) (layer F.SilkS) (width 0.15))
  (fp_line (start -2.75 2) (end 3.25 2) (layer F.SilkS) (width 0.15))
  (fp_line (start -2.75 -8.5) (end 3.25 -8.5) (layer F.SilkS) (width 0.15))
  (pad 1 smd rect (at -3.4417 -7.62) (size 2.0066 0.635) (layers F.Cu F.Paste F.Mask)
    (clearance 0.1778))
  (pad 2 smd rect (at -3.4417 -6.35) (size 2.0066 0.635) (layers F.Cu F.Paste F.Mask)
    (clearance 0.1778))
  (pad 3 smd rect (at -3.4417 -5.08) (size 2.0066 0.635) (layers F.Cu F.Paste F.Mask))
  (pad 5 smd rect (at -3.4417 -2.54) (size 2.0066 0.635) (layers F.Cu F.Paste F.Mask))
  (pad 6 smd rect (at -3.4417 -1.27) (size 2.0066 0.635) (layers F.Cu F.Paste F.Mask))
  (pad 7 smd rect (at -3.4417 0) (size 2.0066 0.635) (layers F.Cu F.Paste F.Mask))
  (pad 8 smd rect (at -3.4417 1.27) (size 2.0066 0.635) (layers F.Cu F.Paste F.Mask))
  (pad 9 smd rect (at 3.4417 1.27) (size 2.0066 0.635) (layers F.Cu F.Paste F.Mask))
  (pad 10 smd rect (at 3.4417 0) (size 2.0066 0.635) (layers F.Cu F.Paste F.Mask))
  (pad 11 smd rect (at 3.4417 -1.27) (size 2.0066 0.635) (layers F.Cu F.Paste F.Mask))
  (pad 12 smd rect (at 3.4417 -2.54) (size 2.0066 0.635) (layers F.Cu F.Paste F.Mask))
  (pad 13 smd rect (at 3.4417 -3.81) (size 2.0066 0.635) (layers F.Cu F.Paste F.Mask))
  (pad 14 smd rect (at 3.4417 -5.08) (size 2.0066 0.635) (layers F.Cu F.Paste F.Mask))
  (pad 15 smd rect (at 3.4417 -6.35) (size 2.0066 0.635) (layers F.Cu F.Paste F.Mask))
  (pad 16 smd rect (at 3.4417 -7.62) (size 2.0066 0.635) (layers F.Cu F.Paste F.Mask))
  (pad 4 smd rect (at -3.4417 -3.81) (size 2.0066 0.635) (layers F.Cu F.Paste F.Mask))
)
