/*
WARNING: Do NOT edit the input and output ports in this file in a text
editor if you plan to continue editing the block that represents it in
the Block Editor! File corruption is VERY likely to occur.
*/
/*
Copyright (C) 1991-2010 Altera Corporation
Your use of Altera Corporation's design tools, logic functions 
and other software and tools, and its AMPP partner logic 
functions, and any output files from any of the foregoing 
(including device programming or simulation files), and any 
associated documentation or information are expressly subject 
to the terms and conditions of the Altera Program License 
Subscription Agreement, Altera MegaCore Function License 
Agreement, or other applicable license agreement, including, 
without limitation, that your use is for the sole purpose of 
programming logic devices manufactured by Altera and sold by 
Altera or its authorized distributors.  Please refer to the 
applicable agreement for further details.
*/
//#pragma file_not_in_maxplusii_format
(header "graphic" (version "1.3"))
(properties
	(page_setup "header_footer\nDate: %D\n%f\nProject: %j\n\nPage %p of %P\nRevision: %a\nmargin\n0.2\n0.2\n0.2\n0.2\norientation\n2\npaper_size\n3\npaper_source\n15\nfit_page_wide\n1\nfit_page_tall\n1\n")
)
(pin
	(input)
	(rect 208 448 376 464)
	(text "INPUT" (rect 133 0 161 10)(font "Arial" (font_size 6)))
	(text "CK200" (rect 5 0 38 12)(font "Arial" ))
	(pt 168 8)
	(drawing
		(line (pt 92 12)(pt 117 12)(line_width 1))
		(line (pt 92 4)(pt 117 4)(line_width 1))
		(line (pt 121 8)(pt 168 8)(line_width 1))
		(line (pt 92 12)(pt 92 4)(line_width 1))
		(line (pt 117 4)(pt 121 8)(line_width 1))
		(line (pt 117 12)(pt 121 8)(line_width 1))
	)
	(text "VCC" (rect 136 7 156 17)(font "Arial" (font_size 6)))
)
(pin
	(input)
	(rect 208 -16 376 0)
	(text "INPUT" (rect 133 0 161 10)(font "Arial" (font_size 6)))
	(text "TFEV[4..0]" (rect 5 0 58 12)(font "Arial" ))
	(pt 168 8)
	(drawing
		(line (pt 92 12)(pt 117 12)(line_width 1))
		(line (pt 92 4)(pt 117 4)(line_width 1))
		(line (pt 121 8)(pt 168 8)(line_width 1))
		(line (pt 92 12)(pt 92 4)(line_width 1))
		(line (pt 117 4)(pt 121 8)(line_width 1))
		(line (pt 117 12)(pt 121 8)(line_width 1))
	)
	(text "VCC" (rect 136 7 156 17)(font "Arial" (font_size 6)))
)
(pin
	(input)
	(rect 208 -48 376 -32)
	(text "INPUT" (rect 133 0 161 10)(font "Arial" (font_size 6)))
	(text "TC[6..0]" (rect 5 0 45 12)(font "Arial" ))
	(pt 168 8)
	(drawing
		(line (pt 92 12)(pt 117 12)(line_width 1))
		(line (pt 92 4)(pt 117 4)(line_width 1))
		(line (pt 121 8)(pt 168 8)(line_width 1))
		(line (pt 92 12)(pt 92 4)(line_width 1))
		(line (pt 117 4)(pt 121 8)(line_width 1))
		(line (pt 117 12)(pt 121 8)(line_width 1))
	)
	(text "VCC" (rect 136 7 156 17)(font "Arial" (font_size 6)))
)
(pin
	(input)
	(rect 216 352 384 368)
	(text "INPUT" (rect 133 0 161 10)(font "Arial" (font_size 6)))
	(text "TK16Q" (rect 5 0 38 12)(font "Arial" ))
	(pt 168 8)
	(drawing
		(line (pt 92 12)(pt 117 12)(line_width 1))
		(line (pt 92 4)(pt 117 4)(line_width 1))
		(line (pt 121 8)(pt 168 8)(line_width 1))
		(line (pt 92 12)(pt 92 4)(line_width 1))
		(line (pt 117 4)(pt 121 8)(line_width 1))
		(line (pt 117 12)(pt 121 8)(line_width 1))
	)
	(text "VCC" (rect 136 7 156 17)(font "Arial" (font_size 6)))
)
(pin
	(output)
	(rect 1192 -56 1368 -40)
	(text "OUTPUT" (rect 1 0 39 10)(font "Arial" (font_size 6)))
	(text "TCFEVQ[11..0]" (rect 90 0 165 12)(font "Arial" ))
	(pt 0 8)
	(drawing
		(line (pt 0 8)(pt 52 8)(line_width 1))
		(line (pt 52 4)(pt 78 4)(line_width 1))
		(line (pt 52 12)(pt 78 12)(line_width 1))
		(line (pt 52 12)(pt 52 4)(line_width 1))
		(line (pt 78 4)(pt 82 8)(line_width 1))
		(line (pt 82 8)(pt 78 12)(line_width 1))
		(line (pt 78 12)(pt 82 8)(line_width 1))
	)
)
(symbol
	(rect 488 16 552 96)
	(text "DFFE" (rect 1 0 25 10)(font "Arial" (font_size 6)))
	(text "inst16" (rect 3 68 32 80)(font "Arial" ))
	(port
		(pt 32 0)
		(input)
		(text "PRN" (rect 24 13 41 25)(font "Courier New" (bold)))
		(text "PRN" (rect 24 11 41 23)(font "Courier New" (bold)))
		(line (pt 32 4)(pt 32 0)(line_width 1))
	)
	(port
		(pt 32 80)
		(input)
		(text "CLRN" (rect 21 59 44 71)(font "Courier New" (bold)))
		(text "CLRN" (rect 21 58 44 70)(font "Courier New" (bold)))
		(line (pt 32 80)(pt 32 76)(line_width 1))
	)
	(port
		(pt 0 24)
		(input)
		(text "D" (rect 14 20 19 32)(font "Courier New" (bold)))
		(text "D" (rect 14 20 19 32)(font "Courier New" (bold)))
		(line (pt 0 24)(pt 12 24)(line_width 1))
	)
	(port
		(pt 0 40)
		(input)
		(text "CLK" (rect 2 28 19 40)(font "Courier New" (bold))(invisible))
		(text "CLK" (rect 2 28 19 40)(font "Courier New" (bold))(invisible))
		(line (pt 0 40)(pt 12 40)(line_width 1))
	)
	(port
		(pt 0 56)
		(input)
		(text "ENA" (rect 14 50 31 62)(font "Courier New" (bold)))
		(text "ENA" (rect 14 50 31 62)(font "Courier New" (bold)))
		(line (pt 0 56)(pt 12 56)(line_width 1))
	)
	(port
		(pt 64 24)
		(output)
		(text "Q" (rect 44 20 49 32)(font "Courier New" (bold)))
		(text "Q" (rect 44 20 49 32)(font "Courier New" (bold)))
		(line (pt 53 24)(pt 64 24)(line_width 1))
	)
	(drawing
		(line (pt 12 68)(pt 52 68)(line_width 1))
		(line (pt 12 12)(pt 52 12)(line_width 1))
		(line (pt 52 68)(pt 52 12)(line_width 1))
		(line (pt 12 68)(pt 12 12)(line_width 1))
		(line (pt 12 34)(pt 19 41)(line_width 1))
		(line (pt 18 41)(pt 12 47)(line_width 1))
		(circle (rect 28 4 36 12)(line_width 1))
		(circle (rect 28 68 36 76)(line_width 1))
	)
)
(symbol
	(rect 488 112 552 192)
	(text "DFFE" (rect 1 0 25 10)(font "Arial" (font_size 6)))
	(text "inst17" (rect 3 68 32 80)(font "Arial" ))
	(port
		(pt 32 0)
		(input)
		(text "PRN" (rect 24 13 41 25)(font "Courier New" (bold)))
		(text "PRN" (rect 24 11 41 23)(font "Courier New" (bold)))
		(line (pt 32 4)(pt 32 0)(line_width 1))
	)
	(port
		(pt 32 80)
		(input)
		(text "CLRN" (rect 21 59 44 71)(font "Courier New" (bold)))
		(text "CLRN" (rect 21 58 44 70)(font "Courier New" (bold)))
		(line (pt 32 80)(pt 32 76)(line_width 1))
	)
	(port
		(pt 0 24)
		(input)
		(text "D" (rect 14 20 19 32)(font "Courier New" (bold)))
		(text "D" (rect 14 20 19 32)(font "Courier New" (bold)))
		(line (pt 0 24)(pt 12 24)(line_width 1))
	)
	(port
		(pt 0 40)
		(input)
		(text "CLK" (rect 2 28 19 40)(font "Courier New" (bold))(invisible))
		(text "CLK" (rect 2 28 19 40)(font "Courier New" (bold))(invisible))
		(line (pt 0 40)(pt 12 40)(line_width 1))
	)
	(port
		(pt 0 56)
		(input)
		(text "ENA" (rect 14 50 31 62)(font "Courier New" (bold)))
		(text "ENA" (rect 14 50 31 62)(font "Courier New" (bold)))
		(line (pt 0 56)(pt 12 56)(line_width 1))
	)
	(port
		(pt 64 24)
		(output)
		(text "Q" (rect 44 20 49 32)(font "Courier New" (bold)))
		(text "Q" (rect 44 20 49 32)(font "Courier New" (bold)))
		(line (pt 53 24)(pt 64 24)(line_width 1))
	)
	(drawing
		(line (pt 12 68)(pt 52 68)(line_width 1))
		(line (pt 12 12)(pt 52 12)(line_width 1))
		(line (pt 52 68)(pt 52 12)(line_width 1))
		(line (pt 12 68)(pt 12 12)(line_width 1))
		(line (pt 12 34)(pt 19 41)(line_width 1))
		(line (pt 18 41)(pt 12 47)(line_width 1))
		(circle (rect 28 4 36 12)(line_width 1))
		(circle (rect 28 68 36 76)(line_width 1))
	)
)
(symbol
	(rect 288 760 320 792)
	(text "GND" (rect 6 8 16 29)(font "Arial" (font_size 6))(vertical))
	(text "inst30" (rect -1 3 11 32)(font "Arial" )(vertical)(invisible))
	(port
		(pt 32 16)
		(output)
		(text "1" (rect 18 0 23 12)(font "Courier New" (bold))(invisible))
		(text "1" (rect 20 18 32 23)(font "Courier New" (bold))(vertical)(invisible))
		(line (pt 24 16)(pt 32 16)(line_width 1))
	)
	(drawing
		(line (pt 24 8)(pt 16 16)(line_width 1))
		(line (pt 16 16)(pt 24 24)(line_width 1))
		(line (pt 24 8)(pt 24 24)(line_width 1))
	)
	(rotate270)
)
(symbol
	(rect 696 16 760 96)
	(text "DFFE" (rect 1 0 25 10)(font "Arial" (font_size 6)))
	(text "inst18" (rect 3 68 32 80)(font "Arial" ))
	(port
		(pt 32 0)
		(input)
		(text "PRN" (rect 24 13 41 25)(font "Courier New" (bold)))
		(text "PRN" (rect 24 11 41 23)(font "Courier New" (bold)))
		(line (pt 32 4)(pt 32 0)(line_width 1))
	)
	(port
		(pt 32 80)
		(input)
		(text "CLRN" (rect 21 59 44 71)(font "Courier New" (bold)))
		(text "CLRN" (rect 21 58 44 70)(font "Courier New" (bold)))
		(line (pt 32 80)(pt 32 76)(line_width 1))
	)
	(port
		(pt 0 24)
		(input)
		(text "D" (rect 14 20 19 32)(font "Courier New" (bold)))
		(text "D" (rect 14 20 19 32)(font "Courier New" (bold)))
		(line (pt 0 24)(pt 12 24)(line_width 1))
	)
	(port
		(pt 0 40)
		(input)
		(text "CLK" (rect 2 28 19 40)(font "Courier New" (bold))(invisible))
		(text "CLK" (rect 2 28 19 40)(font "Courier New" (bold))(invisible))
		(line (pt 0 40)(pt 12 40)(line_width 1))
	)
	(port
		(pt 0 56)
		(input)
		(text "ENA" (rect 14 50 31 62)(font "Courier New" (bold)))
		(text "ENA" (rect 14 50 31 62)(font "Courier New" (bold)))
		(line (pt 0 56)(pt 12 56)(line_width 1))
	)
	(port
		(pt 64 24)
		(output)
		(text "Q" (rect 44 20 49 32)(font "Courier New" (bold)))
		(text "Q" (rect 44 20 49 32)(font "Courier New" (bold)))
		(line (pt 53 24)(pt 64 24)(line_width 1))
	)
	(drawing
		(line (pt 12 68)(pt 52 68)(line_width 1))
		(line (pt 12 12)(pt 52 12)(line_width 1))
		(line (pt 52 68)(pt 52 12)(line_width 1))
		(line (pt 12 68)(pt 12 12)(line_width 1))
		(line (pt 12 34)(pt 19 41)(line_width 1))
		(line (pt 18 41)(pt 12 47)(line_width 1))
		(circle (rect 28 4 36 12)(line_width 1))
		(circle (rect 28 68 36 76)(line_width 1))
	)
)
(symbol
	(rect 696 112 760 192)
	(text "DFFE" (rect 1 0 25 10)(font "Arial" (font_size 6)))
	(text "inst19" (rect 3 68 32 80)(font "Arial" ))
	(port
		(pt 32 0)
		(input)
		(text "PRN" (rect 24 13 41 25)(font "Courier New" (bold)))
		(text "PRN" (rect 24 11 41 23)(font "Courier New" (bold)))
		(line (pt 32 4)(pt 32 0)(line_width 1))
	)
	(port
		(pt 32 80)
		(input)
		(text "CLRN" (rect 21 59 44 71)(font "Courier New" (bold)))
		(text "CLRN" (rect 21 58 44 70)(font "Courier New" (bold)))
		(line (pt 32 80)(pt 32 76)(line_width 1))
	)
	(port
		(pt 0 24)
		(input)
		(text "D" (rect 14 20 19 32)(font "Courier New" (bold)))
		(text "D" (rect 14 20 19 32)(font "Courier New" (bold)))
		(line (pt 0 24)(pt 12 24)(line_width 1))
	)
	(port
		(pt 0 40)
		(input)
		(text "CLK" (rect 2 28 19 40)(font "Courier New" (bold))(invisible))
		(text "CLK" (rect 2 28 19 40)(font "Courier New" (bold))(invisible))
		(line (pt 0 40)(pt 12 40)(line_width 1))
	)
	(port
		(pt 0 56)
		(input)
		(text "ENA" (rect 14 50 31 62)(font "Courier New" (bold)))
		(text "ENA" (rect 14 50 31 62)(font "Courier New" (bold)))
		(line (pt 0 56)(pt 12 56)(line_width 1))
	)
	(port
		(pt 64 24)
		(output)
		(text "Q" (rect 44 20 49 32)(font "Courier New" (bold)))
		(text "Q" (rect 44 20 49 32)(font "Courier New" (bold)))
		(line (pt 53 24)(pt 64 24)(line_width 1))
	)
	(drawing
		(line (pt 12 68)(pt 52 68)(line_width 1))
		(line (pt 12 12)(pt 52 12)(line_width 1))
		(line (pt 52 68)(pt 52 12)(line_width 1))
		(line (pt 12 68)(pt 12 12)(line_width 1))
		(line (pt 12 34)(pt 19 41)(line_width 1))
		(line (pt 18 41)(pt 12 47)(line_width 1))
		(circle (rect 28 4 36 12)(line_width 1))
		(circle (rect 28 68 36 76)(line_width 1))
	)
)
(symbol
	(rect 904 16 968 96)
	(text "DFFE" (rect 1 0 25 10)(font "Arial" (font_size 6)))
	(text "inst20" (rect 3 68 32 80)(font "Arial" ))
	(port
		(pt 32 0)
		(input)
		(text "PRN" (rect 24 13 41 25)(font "Courier New" (bold)))
		(text "PRN" (rect 24 11 41 23)(font "Courier New" (bold)))
		(line (pt 32 4)(pt 32 0)(line_width 1))
	)
	(port
		(pt 32 80)
		(input)
		(text "CLRN" (rect 21 59 44 71)(font "Courier New" (bold)))
		(text "CLRN" (rect 21 58 44 70)(font "Courier New" (bold)))
		(line (pt 32 80)(pt 32 76)(line_width 1))
	)
	(port
		(pt 0 24)
		(input)
		(text "D" (rect 14 20 19 32)(font "Courier New" (bold)))
		(text "D" (rect 14 20 19 32)(font "Courier New" (bold)))
		(line (pt 0 24)(pt 12 24)(line_width 1))
	)
	(port
		(pt 0 40)
		(input)
		(text "CLK" (rect 2 28 19 40)(font "Courier New" (bold))(invisible))
		(text "CLK" (rect 2 28 19 40)(font "Courier New" (bold))(invisible))
		(line (pt 0 40)(pt 12 40)(line_width 1))
	)
	(port
		(pt 0 56)
		(input)
		(text "ENA" (rect 14 50 31 62)(font "Courier New" (bold)))
		(text "ENA" (rect 14 50 31 62)(font "Courier New" (bold)))
		(line (pt 0 56)(pt 12 56)(line_width 1))
	)
	(port
		(pt 64 24)
		(output)
		(text "Q" (rect 44 20 49 32)(font "Courier New" (bold)))
		(text "Q" (rect 44 20 49 32)(font "Courier New" (bold)))
		(line (pt 53 24)(pt 64 24)(line_width 1))
	)
	(drawing
		(line (pt 12 68)(pt 52 68)(line_width 1))
		(line (pt 12 12)(pt 52 12)(line_width 1))
		(line (pt 52 68)(pt 52 12)(line_width 1))
		(line (pt 12 68)(pt 12 12)(line_width 1))
		(line (pt 12 34)(pt 19 41)(line_width 1))
		(line (pt 18 41)(pt 12 47)(line_width 1))
		(circle (rect 28 4 36 12)(line_width 1))
		(circle (rect 28 68 36 76)(line_width 1))
	)
)
(symbol
	(rect 904 112 968 192)
	(text "DFFE" (rect 1 0 25 10)(font "Arial" (font_size 6)))
	(text "inst21" (rect 3 68 32 80)(font "Arial" ))
	(port
		(pt 32 0)
		(input)
		(text "PRN" (rect 24 13 41 25)(font "Courier New" (bold)))
		(text "PRN" (rect 24 11 41 23)(font "Courier New" (bold)))
		(line (pt 32 4)(pt 32 0)(line_width 1))
	)
	(port
		(pt 32 80)
		(input)
		(text "CLRN" (rect 21 59 44 71)(font "Courier New" (bold)))
		(text "CLRN" (rect 21 58 44 70)(font "Courier New" (bold)))
		(line (pt 32 80)(pt 32 76)(line_width 1))
	)
	(port
		(pt 0 24)
		(input)
		(text "D" (rect 14 20 19 32)(font "Courier New" (bold)))
		(text "D" (rect 14 20 19 32)(font "Courier New" (bold)))
		(line (pt 0 24)(pt 12 24)(line_width 1))
	)
	(port
		(pt 0 40)
		(input)
		(text "CLK" (rect 2 28 19 40)(font "Courier New" (bold))(invisible))
		(text "CLK" (rect 2 28 19 40)(font "Courier New" (bold))(invisible))
		(line (pt 0 40)(pt 12 40)(line_width 1))
	)
	(port
		(pt 0 56)
		(input)
		(text "ENA" (rect 14 50 31 62)(font "Courier New" (bold)))
		(text "ENA" (rect 14 50 31 62)(font "Courier New" (bold)))
		(line (pt 0 56)(pt 12 56)(line_width 1))
	)
	(port
		(pt 64 24)
		(output)
		(text "Q" (rect 44 20 49 32)(font "Courier New" (bold)))
		(text "Q" (rect 44 20 49 32)(font "Courier New" (bold)))
		(line (pt 53 24)(pt 64 24)(line_width 1))
	)
	(drawing
		(line (pt 12 68)(pt 52 68)(line_width 1))
		(line (pt 12 12)(pt 52 12)(line_width 1))
		(line (pt 52 68)(pt 52 12)(line_width 1))
		(line (pt 12 68)(pt 12 12)(line_width 1))
		(line (pt 12 34)(pt 19 41)(line_width 1))
		(line (pt 18 41)(pt 12 47)(line_width 1))
		(circle (rect 28 4 36 12)(line_width 1))
		(circle (rect 28 68 36 76)(line_width 1))
	)
)
(symbol
	(rect 1112 16 1176 96)
	(text "DFFE" (rect 1 0 25 10)(font "Arial" (font_size 6)))
	(text "inst22" (rect 3 68 32 80)(font "Arial" ))
	(port
		(pt 32 0)
		(input)
		(text "PRN" (rect 24 13 41 25)(font "Courier New" (bold)))
		(text "PRN" (rect 24 11 41 23)(font "Courier New" (bold)))
		(line (pt 32 4)(pt 32 0)(line_width 1))
	)
	(port
		(pt 32 80)
		(input)
		(text "CLRN" (rect 21 59 44 71)(font "Courier New" (bold)))
		(text "CLRN" (rect 21 58 44 70)(font "Courier New" (bold)))
		(line (pt 32 80)(pt 32 76)(line_width 1))
	)
	(port
		(pt 0 24)
		(input)
		(text "D" (rect 14 20 19 32)(font "Courier New" (bold)))
		(text "D" (rect 14 20 19 32)(font "Courier New" (bold)))
		(line (pt 0 24)(pt 12 24)(line_width 1))
	)
	(port
		(pt 0 40)
		(input)
		(text "CLK" (rect 2 28 19 40)(font "Courier New" (bold))(invisible))
		(text "CLK" (rect 2 28 19 40)(font "Courier New" (bold))(invisible))
		(line (pt 0 40)(pt 12 40)(line_width 1))
	)
	(port
		(pt 0 56)
		(input)
		(text "ENA" (rect 14 50 31 62)(font "Courier New" (bold)))
		(text "ENA" (rect 14 50 31 62)(font "Courier New" (bold)))
		(line (pt 0 56)(pt 12 56)(line_width 1))
	)
	(port
		(pt 64 24)
		(output)
		(text "Q" (rect 44 20 49 32)(font "Courier New" (bold)))
		(text "Q" (rect 44 20 49 32)(font "Courier New" (bold)))
		(line (pt 53 24)(pt 64 24)(line_width 1))
	)
	(drawing
		(line (pt 12 68)(pt 52 68)(line_width 1))
		(line (pt 12 12)(pt 52 12)(line_width 1))
		(line (pt 52 68)(pt 52 12)(line_width 1))
		(line (pt 12 68)(pt 12 12)(line_width 1))
		(line (pt 12 34)(pt 19 41)(line_width 1))
		(line (pt 18 41)(pt 12 47)(line_width 1))
		(circle (rect 28 4 36 12)(line_width 1))
		(circle (rect 28 68 36 76)(line_width 1))
	)
)
(symbol
	(rect 1112 112 1176 192)
	(text "DFFE" (rect 1 0 25 10)(font "Arial" (font_size 6)))
	(text "inst23" (rect 3 68 32 80)(font "Arial" ))
	(port
		(pt 32 0)
		(input)
		(text "PRN" (rect 24 13 41 25)(font "Courier New" (bold)))
		(text "PRN" (rect 24 11 41 23)(font "Courier New" (bold)))
		(line (pt 32 4)(pt 32 0)(line_width 1))
	)
	(port
		(pt 32 80)
		(input)
		(text "CLRN" (rect 21 59 44 71)(font "Courier New" (bold)))
		(text "CLRN" (rect 21 58 44 70)(font "Courier New" (bold)))
		(line (pt 32 80)(pt 32 76)(line_width 1))
	)
	(port
		(pt 0 24)
		(input)
		(text "D" (rect 14 20 19 32)(font "Courier New" (bold)))
		(text "D" (rect 14 20 19 32)(font "Courier New" (bold)))
		(line (pt 0 24)(pt 12 24)(line_width 1))
	)
	(port
		(pt 0 40)
		(input)
		(text "CLK" (rect 2 28 19 40)(font "Courier New" (bold))(invisible))
		(text "CLK" (rect 2 28 19 40)(font "Courier New" (bold))(invisible))
		(line (pt 0 40)(pt 12 40)(line_width 1))
	)
	(port
		(pt 0 56)
		(input)
		(text "ENA" (rect 14 50 31 62)(font "Courier New" (bold)))
		(text "ENA" (rect 14 50 31 62)(font "Courier New" (bold)))
		(line (pt 0 56)(pt 12 56)(line_width 1))
	)
	(port
		(pt 64 24)
		(output)
		(text "Q" (rect 44 20 49 32)(font "Courier New" (bold)))
		(text "Q" (rect 44 20 49 32)(font "Courier New" (bold)))
		(line (pt 53 24)(pt 64 24)(line_width 1))
	)
	(drawing
		(line (pt 12 68)(pt 52 68)(line_width 1))
		(line (pt 12 12)(pt 52 12)(line_width 1))
		(line (pt 52 68)(pt 52 12)(line_width 1))
		(line (pt 12 68)(pt 12 12)(line_width 1))
		(line (pt 12 34)(pt 19 41)(line_width 1))
		(line (pt 18 41)(pt 12 47)(line_width 1))
		(circle (rect 28 4 36 12)(line_width 1))
		(circle (rect 28 68 36 76)(line_width 1))
	)
)
(symbol
	(rect 1072 272 1136 320)
	(text "OR2" (rect 45 0 63 10)(font "Arial" (font_size 6)))
	(text "inst" (rect 44 37 61 49)(font "Arial" ))
	(port
		(pt 64 32)
		(input)
		(text "IN2" (rect 2 23 19 35)(font "Courier New" (bold))(invisible))
		(text "IN2" (rect 45 23 62 35)(font "Courier New" (bold))(invisible))
		(line (pt 64 32)(pt 49 32)(line_width 1))
	)
	(port
		(pt 64 16)
		(input)
		(text "IN1" (rect 2 7 19 19)(font "Courier New" (bold))(invisible))
		(text "IN1" (rect 45 7 62 19)(font "Courier New" (bold))(invisible))
		(line (pt 64 16)(pt 49 16)(line_width 1))
	)
	(port
		(pt 0 24)
		(output)
		(text "OUT" (rect 48 15 65 27)(font "Courier New" (bold))(invisible))
		(text "OUT" (rect -1 15 16 27)(font "Courier New" (bold))(invisible))
		(line (pt 16 24)(pt 0 24)(line_width 1))
	)
	(drawing
		(line (pt 50 36)(pt 39 36)(line_width 1))
		(line (pt 50 13)(pt 39 13)(line_width 1))
		(arc (pt 57 19)(pt 57 29)(rect 45 8 78 41)(line_width 1))
		(arc (pt 39 13)(pt 15 24)(rect 7 13 70 76)(line_width 1))
		(arc (pt 15 24)(pt 39 35)(rect 7 -27 70 36)(line_width 1))
	)
	(flipy)
)
(symbol
	(rect 1152 248 1200 280)
	(text "NOT" (rect 27 0 47 10)(font "Arial" (font_size 6)))
	(text "inst1" (rect 22 21 45 33)(font "Arial" ))
	(port
		(pt 48 16)
		(input)
		(text "IN" (rect 2 7 13 19)(font "Courier New" (bold))(invisible))
		(text "IN" (rect 35 7 46 19)(font "Courier New" (bold))(invisible))
		(line (pt 48 16)(pt 35 16)(line_width 1))
	)
	(port
		(pt 0 16)
		(output)
		(text "OUT" (rect 32 7 49 19)(font "Courier New" (bold))(invisible))
		(text "OUT" (rect -1 7 16 19)(font "Courier New" (bold))(invisible))
		(line (pt 9 16)(pt 0 16)(line_width 1))
	)
	(drawing
		(line (pt 35 25)(pt 35 7)(line_width 1))
		(line (pt 35 7)(pt 17 16)(line_width 1))
		(line (pt 35 25)(pt 17 16)(line_width 1))
		(circle (rect 9 12 17 20)(line_width 1))
	)
	(flipy)
)
(symbol
	(rect 864 272 928 320)
	(text "OR2" (rect 45 0 63 10)(font "Arial" (font_size 6)))
	(text "inst2" (rect 44 37 67 49)(font "Arial" ))
	(port
		(pt 64 32)
		(input)
		(text "IN2" (rect 2 23 19 35)(font "Courier New" (bold))(invisible))
		(text "IN2" (rect 45 23 62 35)(font "Courier New" (bold))(invisible))
		(line (pt 64 32)(pt 49 32)(line_width 1))
	)
	(port
		(pt 64 16)
		(input)
		(text "IN1" (rect 2 7 19 19)(font "Courier New" (bold))(invisible))
		(text "IN1" (rect 45 7 62 19)(font "Courier New" (bold))(invisible))
		(line (pt 64 16)(pt 49 16)(line_width 1))
	)
	(port
		(pt 0 24)
		(output)
		(text "OUT" (rect 48 15 65 27)(font "Courier New" (bold))(invisible))
		(text "OUT" (rect -1 15 16 27)(font "Courier New" (bold))(invisible))
		(line (pt 16 24)(pt 0 24)(line_width 1))
	)
	(drawing
		(line (pt 50 36)(pt 39 36)(line_width 1))
		(line (pt 50 13)(pt 39 13)(line_width 1))
		(arc (pt 57 19)(pt 57 29)(rect 45 8 78 41)(line_width 1))
		(arc (pt 39 13)(pt 15 24)(rect 7 13 70 76)(line_width 1))
		(arc (pt 15 24)(pt 39 35)(rect 7 -27 70 36)(line_width 1))
	)
	(flipy)
)
(symbol
	(rect 656 272 720 320)
	(text "OR2" (rect 45 0 63 10)(font "Arial" (font_size 6)))
	(text "inst3" (rect 44 37 67 49)(font "Arial" ))
	(port
		(pt 64 32)
		(input)
		(text "IN2" (rect 2 23 19 35)(font "Courier New" (bold))(invisible))
		(text "IN2" (rect 45 23 62 35)(font "Courier New" (bold))(invisible))
		(line (pt 64 32)(pt 49 32)(line_width 1))
	)
	(port
		(pt 64 16)
		(input)
		(text "IN1" (rect 2 7 19 19)(font "Courier New" (bold))(invisible))
		(text "IN1" (rect 45 7 62 19)(font "Courier New" (bold))(invisible))
		(line (pt 64 16)(pt 49 16)(line_width 1))
	)
	(port
		(pt 0 24)
		(output)
		(text "OUT" (rect 48 15 65 27)(font "Courier New" (bold))(invisible))
		(text "OUT" (rect -1 15 16 27)(font "Courier New" (bold))(invisible))
		(line (pt 16 24)(pt 0 24)(line_width 1))
	)
	(drawing
		(line (pt 50 36)(pt 39 36)(line_width 1))
		(line (pt 50 13)(pt 39 13)(line_width 1))
		(arc (pt 57 19)(pt 57 29)(rect 45 8 78 41)(line_width 1))
		(arc (pt 39 13)(pt 15 24)(rect 7 13 70 76)(line_width 1))
		(arc (pt 15 24)(pt 39 35)(rect 7 -27 70 36)(line_width 1))
	)
	(flipy)
)
(symbol
	(rect 448 272 512 320)
	(text "OR2" (rect 45 0 63 10)(font "Arial" (font_size 6)))
	(text "inst4" (rect 44 37 67 49)(font "Arial" ))
	(port
		(pt 64 32)
		(input)
		(text "IN2" (rect 2 23 19 35)(font "Courier New" (bold))(invisible))
		(text "IN2" (rect 45 23 62 35)(font "Courier New" (bold))(invisible))
		(line (pt 64 32)(pt 49 32)(line_width 1))
	)
	(port
		(pt 64 16)
		(input)
		(text "IN1" (rect 2 7 19 19)(font "Courier New" (bold))(invisible))
		(text "IN1" (rect 45 7 62 19)(font "Courier New" (bold))(invisible))
		(line (pt 64 16)(pt 49 16)(line_width 1))
	)
	(port
		(pt 0 24)
		(output)
		(text "OUT" (rect 48 15 65 27)(font "Courier New" (bold))(invisible))
		(text "OUT" (rect -1 15 16 27)(font "Courier New" (bold))(invisible))
		(line (pt 16 24)(pt 0 24)(line_width 1))
	)
	(drawing
		(line (pt 50 36)(pt 39 36)(line_width 1))
		(line (pt 50 13)(pt 39 13)(line_width 1))
		(arc (pt 57 19)(pt 57 29)(rect 45 8 78 41)(line_width 1))
		(arc (pt 39 13)(pt 15 24)(rect 7 13 70 76)(line_width 1))
		(arc (pt 15 24)(pt 39 35)(rect 7 -27 70 36)(line_width 1))
	)
	(flipy)
)
(symbol
	(rect 944 264 1008 312)
	(text "BOR2" (rect 39 0 63 10)(font "Arial" (font_size 6)))
	(text "inst5" (rect 38 37 61 49)(font "Arial" ))
	(port
		(pt 64 16)
		(input)
		(text "IN1" (rect 2 7 19 19)(font "Courier New" (bold))(invisible))
		(text "IN1" (rect 45 7 62 19)(font "Courier New" (bold))(invisible))
		(line (pt 64 16)(pt 57 16)(line_width 1))
	)
	(port
		(pt 64 32)
		(input)
		(text "IN2" (rect 2 23 19 35)(font "Courier New" (bold))(invisible))
		(text "IN2" (rect 45 23 62 35)(font "Courier New" (bold))(invisible))
		(line (pt 64 32)(pt 57 32)(line_width 1))
	)
	(port
		(pt 0 24)
		(output)
		(text "OUT" (rect 48 15 65 27)(font "Courier New" (bold))(invisible))
		(text "OUT" (rect -1 15 16 27)(font "Courier New" (bold))(invisible))
		(line (pt 15 24)(pt 0 24)(line_width 1))
	)
	(drawing
		(line (pt 50 13)(pt 39 13)(line_width 1))
		(line (pt 50 36)(pt 39 36)(line_width 1))
		(arc (pt 15 24)(pt 39 35)(rect 7 -27 70 36)(line_width 1))
		(arc (pt 57 19)(pt 57 29)(rect 45 8 78 41)(line_width 1))
		(arc (pt 39 13)(pt 15 24)(rect 7 13 70 76)(line_width 1))
		(circle (rect 49 12 57 20)(line_width 1))
		(circle (rect 49 28 57 36)(line_width 1))
	)
	(flipy)
)
(symbol
	(rect 736 248 800 328)
	(text "BOR4" (rect 39 0 63 10)(font "Arial" (font_size 6)))
	(text "inst6" (rect 38 69 61 81)(font "Arial" ))
	(port
		(pt 64 16)
		(input)
		(text "IN1" (rect 2 7 19 19)(font "Courier New" (bold))(invisible))
		(text "IN1" (rect 45 7 62 19)(font "Courier New" (bold))(invisible))
		(line (pt 64 16)(pt 59 16)(line_width 1))
	)
	(port
		(pt 64 48)
		(input)
		(text "IN3" (rect 2 39 19 51)(font "Courier New" (bold))(invisible))
		(text "IN3" (rect 45 39 62 51)(font "Courier New" (bold))(invisible))
		(line (pt 64 48)(pt 58 48)(line_width 1))
	)
	(port
		(pt 64 32)
		(input)
		(text "IN2" (rect 2 23 19 35)(font "Courier New" (bold))(invisible))
		(text "IN2" (rect 45 23 62 35)(font "Courier New" (bold))(invisible))
		(line (pt 64 32)(pt 58 32)(line_width 1))
	)
	(port
		(pt 64 64)
		(input)
		(text "IN4" (rect 2 55 19 67)(font "Courier New" (bold))(invisible))
		(text "IN4" (rect 45 55 62 67)(font "Courier New" (bold))(invisible))
		(line (pt 64 64)(pt 59 64)(line_width 1))
	)
	(port
		(pt 0 40)
		(output)
		(text "OUT" (rect 48 31 65 43)(font "Courier New" (bold))(invisible))
		(text "OUT" (rect -1 31 16 43)(font "Courier New" (bold))(invisible))
		(line (pt 16 40)(pt 0 40)(line_width 1))
	)
	(drawing
		(line (pt 50 29)(pt 39 29)(line_width 1))
		(line (pt 50 52)(pt 39 52)(line_width 1))
		(line (pt 51 67)(pt 51 51)(line_width 1))
		(line (pt 51 29)(pt 51 13)(line_width 1))
		(arc (pt 57 35)(pt 57 45)(rect 45 24 78 57)(line_width 1))
		(arc (pt 39 29)(pt 15 40)(rect 7 29 70 92)(line_width 1))
		(arc (pt 15 40)(pt 39 51)(rect 7 -11 70 52)(line_width 1))
		(circle (rect 51 60 59 68)(line_width 1))
		(circle (rect 51 12 59 20)(line_width 1))
		(circle (rect 50 28 58 36)(line_width 1))
		(circle (rect 50 44 58 52)(line_width 1))
	)
	(flipy)
)
(symbol
	(rect 528 248 592 328)
	(text "BOR4" (rect 39 0 63 10)(font "Arial" (font_size 6)))
	(text "inst7" (rect 38 69 61 81)(font "Arial" ))
	(port
		(pt 64 16)
		(input)
		(text "IN1" (rect 2 7 19 19)(font "Courier New" (bold))(invisible))
		(text "IN1" (rect 45 7 62 19)(font "Courier New" (bold))(invisible))
		(line (pt 64 16)(pt 59 16)(line_width 1))
	)
	(port
		(pt 64 48)
		(input)
		(text "IN3" (rect 2 39 19 51)(font "Courier New" (bold))(invisible))
		(text "IN3" (rect 45 39 62 51)(font "Courier New" (bold))(invisible))
		(line (pt 64 48)(pt 58 48)(line_width 1))
	)
	(port
		(pt 64 32)
		(input)
		(text "IN2" (rect 2 23 19 35)(font "Courier New" (bold))(invisible))
		(text "IN2" (rect 45 23 62 35)(font "Courier New" (bold))(invisible))
		(line (pt 64 32)(pt 58 32)(line_width 1))
	)
	(port
		(pt 64 64)
		(input)
		(text "IN4" (rect 2 55 19 67)(font "Courier New" (bold))(invisible))
		(text "IN4" (rect 45 55 62 67)(font "Courier New" (bold))(invisible))
		(line (pt 64 64)(pt 59 64)(line_width 1))
	)
	(port
		(pt 0 40)
		(output)
		(text "OUT" (rect 48 31 65 43)(font "Courier New" (bold))(invisible))
		(text "OUT" (rect -1 31 16 43)(font "Courier New" (bold))(invisible))
		(line (pt 16 40)(pt 0 40)(line_width 1))
	)
	(drawing
		(line (pt 50 29)(pt 39 29)(line_width 1))
		(line (pt 50 52)(pt 39 52)(line_width 1))
		(line (pt 51 67)(pt 51 51)(line_width 1))
		(line (pt 51 29)(pt 51 13)(line_width 1))
		(arc (pt 57 35)(pt 57 45)(rect 45 24 78 57)(line_width 1))
		(arc (pt 39 29)(pt 15 40)(rect 7 29 70 92)(line_width 1))
		(arc (pt 15 40)(pt 39 51)(rect 7 -11 70 52)(line_width 1))
		(circle (rect 51 60 59 68)(line_width 1))
		(circle (rect 51 12 59 20)(line_width 1))
		(circle (rect 50 28 58 36)(line_width 1))
		(circle (rect 50 44 58 52)(line_width 1))
	)
	(flipy)
)
(connector
	(text "zzz[127..0]" (rect 339 760 390 772)(font "Arial" ))
	(pt 320 776)
	(pt 416 776)
	(bus)
)
(connector
	(text "CK200" (rect 872 40 905 52)(font "Arial" ))
	(pt 904 56)
	(pt 864 56)
)
(connector
	(text "CK200" (rect 872 136 905 148)(font "Arial" ))
	(pt 904 152)
	(pt 864 152)
)
(connector
	(pt 856 72)
	(pt 904 72)
)
(connector
	(pt 904 168)
	(pt 856 168)
)
(connector
	(pt 856 296)
	(pt 864 296)
)
(connector
	(pt 856 72)
	(pt 856 168)
)
(connector
	(pt 856 168)
	(pt 856 296)
)
(connector
	(pt 928 304)
	(pt 936 304)
)
(connector
	(text "CK200" (rect 664 40 697 52)(font "Arial" ))
	(pt 696 56)
	(pt 656 56)
)
(connector
	(text "CK200" (rect 664 136 697 148)(font "Arial" ))
	(pt 696 152)
	(pt 656 152)
)
(connector
	(pt 648 72)
	(pt 696 72)
)
(connector
	(pt 696 168)
	(pt 648 168)
)
(connector
	(pt 648 296)
	(pt 656 296)
)
(connector
	(pt 720 304)
	(pt 728 304)
)
(connector
	(pt 648 72)
	(pt 648 168)
)
(connector
	(pt 648 168)
	(pt 648 296)
)
(connector
	(pt 760 40)
	(pt 904 40)
	(bus)
)
(connector
	(text "CK200" (rect 456 40 489 52)(font "Arial" ))
	(pt 488 56)
	(pt 448 56)
)
(connector
	(text "CK200" (rect 456 136 489 148)(font "Arial" ))
	(pt 488 152)
	(pt 448 152)
)
(connector
	(text "TC[6..0],TFEV[4..1]" (rect 360 24 456 36)(font "Arial" ))
	(pt 344 40)
	(pt 488 40)
	(bus)
)
(connector
	(text "TFEV[0]" (rect 352 120 392 132)(font "Arial" ))
	(pt 488 136)
	(pt 344 136)
)
(connector
	(pt 440 72)
	(pt 488 72)
)
(connector
	(pt 488 168)
	(pt 440 168)
)
(connector
	(pt 440 296)
	(pt 448 296)
)
(connector
	(pt 512 304)
	(pt 520 304)
)
(connector
	(pt 440 72)
	(pt 440 168)
)
(connector
	(pt 440 168)
	(pt 440 296)
)
(connector
	(pt 552 40)
	(pt 696 40)
	(bus)
)
(connector
	(text "TCFEVQ[11..1]" (rect 1186 24 1261 36)(font "Arial" ))
	(pt 1264 40)
	(pt 1176 40)
	(bus)
)
(connector
	(pt 1064 296)
	(pt 1072 296)
)
(connector
	(pt 1136 304)
	(pt 1144 304)
)
(connector
	(pt 1064 72)
	(pt 1064 168)
)
(connector
	(pt 1064 168)
	(pt 1064 296)
)
(connector
	(pt 968 40)
	(pt 1112 40)
	(bus)
)
(connector
	(text "CK200" (rect 1080 40 1113 52)(font "Arial" ))
	(pt 1072 56)
	(pt 1112 56)
)
(connector
	(pt 1064 72)
	(pt 1112 72)
)
(connector
	(text "CK200" (rect 1080 136 1113 148)(font "Arial" ))
	(pt 1072 152)
	(pt 1112 152)
)
(connector
	(pt 1064 168)
	(pt 1112 168)
)
(connector
	(pt 512 288)
	(pt 528 288)
)
(connector
	(pt 720 288)
	(pt 736 288)
)
(connector
	(pt 928 288)
	(pt 944 288)
)
(connector
	(pt 1008 280)
	(pt 1016 280)
)
(connector
	(pt 968 136)
	(pt 1016 136)
)
(connector
	(pt 1016 136)
	(pt 1112 136)
)
(connector
	(pt 800 280)
	(pt 808 280)
)
(connector
	(pt 760 136)
	(pt 808 136)
)
(connector
	(pt 808 136)
	(pt 904 136)
)
(connector
	(pt 800 264)
	(pt 808 264)
)
(connector
	(pt 808 280)
	(pt 808 264)
)
(connector
	(pt 592 264)
	(pt 600 264)
)
(connector
	(pt 600 264)
	(pt 600 136)
)
(connector
	(pt 552 136)
	(pt 600 136)
)
(connector
	(pt 600 136)
	(pt 696 136)
)
(connector
	(pt 592 280)
	(pt 608 280)
)
(connector
	(pt 592 296)
	(pt 616 296)
)
(connector
	(pt 616 296)
	(pt 616 216)
)
(connector
	(pt 1016 136)
	(pt 1016 216)
)
(connector
	(pt 1016 216)
	(pt 1016 280)
)
(connector
	(pt 592 312)
	(pt 624 312)
)
(connector
	(pt 624 224)
	(pt 624 312)
)
(connector
	(pt 608 280)
	(pt 608 208)
)
(connector
	(pt 808 208)
	(pt 608 208)
)
(connector
	(pt 808 136)
	(pt 808 208)
)
(connector
	(pt 808 208)
	(pt 808 264)
)
(connector
	(pt 800 296)
	(pt 816 296)
)
(connector
	(pt 816 296)
	(pt 816 216)
)
(connector
	(pt 1016 216)
	(pt 816 216)
)
(connector
	(pt 816 216)
	(pt 616 216)
)
(connector
	(pt 800 312)
	(pt 824 312)
)
(connector
	(pt 824 312)
	(pt 824 224)
)
(connector
	(pt 624 224)
	(pt 824 224)
)
(connector
	(pt 1008 296)
	(pt 1024 296)
)
(connector
	(pt 1024 296)
	(pt 1024 224)
)
(connector
	(pt 824 224)
	(pt 1024 224)
)
(connector
	(pt 520 304)
	(pt 520 360)
)
(connector
	(pt 384 360)
	(pt 520 360)
)
(connector
	(pt 728 304)
	(pt 728 360)
)
(connector
	(pt 1144 304)
	(pt 1144 360)
)
(connector
	(pt 936 304)
	(pt 936 360)
)
(connector
	(pt 520 360)
	(pt 728 360)
)
(connector
	(pt 728 360)
	(pt 936 360)
)
(connector
	(pt 936 360)
	(pt 1144 360)
)
(connector
	(pt 1136 288)
	(pt 1144 288)
)
(connector
	(pt 1144 264)
	(pt 1152 264)
)
(connector
	(pt 1144 288)
	(pt 1144 264)
)
(connector
	(pt 1200 264)
	(pt 1208 264)
)
(connector
	(pt 1024 224)
	(pt 1208 224)
)
(connector
	(pt 1176 136)
	(pt 1208 136)
)
(connector
	(text "TCFEVQ[0]" (rect 1190 120 1246 132)(font "Arial" ))
	(pt 1208 136)
	(pt 1264 136)
)
(connector
	(pt 1208 136)
	(pt 1208 224)
)
(connector
	(pt 1208 224)
	(pt 1208 264)
)
(junction (pt 856 168))
(junction (pt 648 168))
(junction (pt 440 168))
(junction (pt 1064 168))
(junction (pt 1016 136))
(junction (pt 808 136))
(junction (pt 808 264))
(junction (pt 600 136))
(junction (pt 1016 216))
(junction (pt 808 208))
(junction (pt 816 216))
(junction (pt 824 224))
(junction (pt 1024 224))
(junction (pt 520 360))
(junction (pt 728 360))
(junction (pt 936 360))
(junction (pt 1208 224))
(junction (pt 1208 136))
