PCBNEW-LibModule-V1  Fri 21 Nov 2014 12:03:55 PM EST
# encoding utf-8
Units mm
$INDEX
640456-2
$EndINDEX
$MODULE 640456-2
Po 0 0 0 15 546F7079 00000000 ~~
Li 640456-2
Sc 0
AR 
Op 0 0 0
T0 0 -3.81 1 1 0 0.15 N V 21 N "640456-2"
T1 0 3.81 1 1 0 0.15 N V 21 N "VAL**"
DS -2.54 2.86 -2.54 -2.86 0.15 21
DS 2.54 -2.86 2.54 2.86 0.15 21
DS -2.54 2.86 2.54 2.86 0.15 21
$PAD
Sh "1" C 1.016 1.016 0 0 0
Dr 1.016 0 0
At STD N 00E0FFFF
Ne 0 ""
Po -1.27 0
.LocalClearance 0.07
$EndPAD
$PAD
Sh "2" C 1.016 1.016 0 0 0
Dr 1.016 0 0
At STD N 00E0FFFF
Ne 0 ""
Po 1.27 0
.LocalClearance 0.07
$EndPAD
$EndMODULE 640456-2
$EndLIBRARY
