EESchema Schematic File Version 2
LIBS:TDC_Mother-rescue
LIBS:power
LIBS:transistors
LIBS:conn
LIBS:display
LIBS:contrib
LIBS:ep3c5u256_custom
LIBS:ERM8-RA
LIBS:30310-5002hb
LIBS:4816P-1-101LF
LIBS:FIN1108
LIBS:tps78630kttt
LIBS:tps79533
LIBS:+4
LIBS:640456-2
LIBS:micron
LIBS:tps73701drbt
LIBS:ws2812b
LIBS:fixed_conn
LIBS:ao3422
LIBS:my_discrete
LIBS:TMM-105-01
LIBS:my_power
LIBS:atmega168a-mm
LIBS:CAT16-101J4LF
LIBS:tmp36
LIBS:testpoint
LIBS:TDC_Mother-cache
EELAYER 25 0
EELAYER END
$Descr A 11000 8500
encoding utf-8
Sheet 1 14
Title ""
Date "9 oct 2015"
Rev ""
Comp ""
Comment1 ""
Comment2 ""
Comment3 ""
Comment4 ""
$EndDescr
$Sheet
S 4200 3550 1450 300 
U 54603C99
F0 "LVDS_1" 50
F1 "sch/LVDS_FIN1108_BOTTOM.sch" 50
F2 "ASDQ_N[7..0]" I L 4200 3750 60 
F3 "ASDQ_P[7..0]" I L 4200 3650 60 
F4 "LVDS_P[7..0]" I R 5650 3650 60 
F5 "LVDS_N[7..0]" I R 5650 3750 60 
$EndSheet
Text Label 3800 3200 2    60   ~ 0
N1A[7..0]
Text Label 3800 3100 2    60   ~ 0
P1A[7..0]
Text Label 3800 6400 2    60   ~ 0
N2A[7..0]
Text Label 3800 6300 2    60   ~ 0
P2A[7..0]
Text Label 3800 3750 2    60   ~ 0
N1B[7..0]
Text Label 3800 3650 2    60   ~ 0
P1B[7..0]
Text Label 3800 6950 2    60   ~ 0
N2B[7..0]
Text Label 3800 6850 2    60   ~ 0
P2B[7..0]
Text Label 6500 4500 2    60   ~ 0
C5_2+
Text Label 6500 4600 2    60   ~ 0
C5_2-
Text Label 6500 1400 2    60   ~ 0
C5_1-
Text Label 6500 1300 2    60   ~ 0
C5_1+
Text Label 6500 5300 2    60   ~ 0
TCK
Text Label 6500 5400 2    60   ~ 0
TMS
Text Label 6500 5600 2    60   ~ 0
TDO
$Sheet
S 4200 3000 1450 300 
U 546352F5
F0 "LVDS_2" 50
F1 "sch/LVDS_FIN1108_BOTTOM.sch" 50
F2 "ASDQ_N[7..0]" I L 4200 3200 60 
F3 "ASDQ_P[7..0]" I L 4200 3100 60 
F4 "LVDS_P[7..0]" I R 5650 3100 60 
F5 "LVDS_N[7..0]" I R 5650 3200 60 
$EndSheet
$Sheet
S 4200 6200 1450 300 
U 546358D0
F0 "LVDS_3" 50
F1 "sch/LVDS_FIN1108_TOP.sch" 50
F2 "ASDQ_N[7..0]" I L 4200 6400 60 
F3 "ASDQ_P[7..0]" I L 4200 6300 60 
F4 "LVDS_P[7..0]" I R 5650 6300 60 
F5 "LVDS_N[7..0]" I R 5650 6400 60 
$EndSheet
Text Label 6450 2300 2    60   ~ 0
TDI
Text Label 6500 2200 2    60   ~ 0
TMS
Text Label 6500 2100 2    60   ~ 0
TCK
Text Label 6450 2400 2    60   ~ 0
TD_Daisy
Text Notes 3600 4800 0    60   ~ 0
JTAG\n
Text Label 6500 4700 2    60   ~ 0
TDC_Out_2+
Text Label 6500 4800 2    60   ~ 0
TDC_Out_2-
Text Label 6500 1600 2    60   ~ 0
TDC_Out_1-
Text Label 6500 1500 2    60   ~ 0
TDC_Out_1+
Text Label 3050 4850 0    60   ~ 0
TCK
Text Label 3050 5050 0    60   ~ 0
TMS
Text Label 3050 4950 0    60   ~ 0
TDO
$Comp
L GND #PWR01
U 1 1 545F5D3A
P 4350 5300
F 0 "#PWR01" H 4350 5300 30  0001 C CNN
F 1 "GND" H 4350 5230 30  0001 C CNN
F 2 "" H 4350 5300 60  0000 C CNN
F 3 "" H 4350 5300 60  0000 C CNN
	1    4350 5300
	1    0    0    -1  
$EndComp
Text Label 3050 5250 0    60   ~ 0
TDI
Text Label 6500 5500 2    60   ~ 0
TD_Daisy
Text Notes 650  1400 0    150  ~ 30
To Feedthrough Board
Text Notes 7250 1050 0    150  ~ 30
TDC 1
Text Notes 4450 2850 0    100  ~ 20
LVDS chips\n
$Sheet
S 4200 6750 1450 300 
U 54635FFB
F0 "LVDS_4" 50
F1 "sch/LVDS_FIN1108_TOP.sch" 50
F2 "ASDQ_N[7..0]" I L 4200 6950 60 
F3 "ASDQ_P[7..0]" I L 4200 6850 60 
F4 "LVDS_P[7..0]" I R 5650 6850 60 
F5 "LVDS_N[7..0]" I R 5650 6950 60 
$EndSheet
$Comp
L GND #PWR02
U 1 1 54B181CA
P 6550 3050
F 0 "#PWR02" H 6550 3050 30  0001 C CNN
F 1 "GND" H 6550 2980 30  0001 C CNN
F 2 "" H 6550 3050 60  0000 C CNN
F 3 "" H 6550 3050 60  0000 C CNN
	1    6550 3050
	1    0    0    -1  
$EndComp
Text Label 6550 6050 0    60   ~ 0
BOARD_ID1
Text Label 6550 2850 0    60   ~ 0
BOARD_ID1
$Sheet
S 600  6350 900  950 
U 560E697D
F0 "power" 50
F1 "sch/power.sch" 50
F2 "VCCA1" I R 1500 6700 60 
F3 "VCCA2" I R 1500 7150 60 
F4 "VCC_INT1" I R 1500 6500 60 
F5 "VCCD1" I R 1500 6600 60 
F6 "VCC_INT2" I R 1500 6950 60 
F7 "VCCD2" I R 1500 7050 60 
$EndSheet
NoConn ~ -2600 2000
NoConn ~ -5350 5450
Text Notes 3550 4650 0    100  ~ 20
JTAG
Text Label 2200 1850 2    60   ~ 0
P1A[7..0]
Text Label 2200 1950 2    60   ~ 0
N1A[7..0]
Text Label 2200 2150 2    60   ~ 0
P1B[7..0]
Text Label 2200 2250 2    60   ~ 0
N1B[7..0]
Text Label 2200 2450 2    60   ~ 0
P2A[7..0]
Text Label 2200 2550 2    60   ~ 0
N2A[7..0]
Text Label 2200 2750 2    60   ~ 0
P2B[7..0]
Text Label 2200 2850 2    60   ~ 0
N2B[7..0]
Text Label 2300 3450 2    60   ~ 0
TDC_Out_2+
Text Label 2300 3550 2    60   ~ 0
TDC_Out_2-
Text Label 2300 3150 2    60   ~ 0
TDC_Out_1+
Text Label 2300 3250 2    60   ~ 0
TDC_Out_1-
Text Label 2050 4150 2    60   ~ 0
C5_2+
Text Label 2050 4250 2    60   ~ 0
C5_2-
Text Label 2050 3850 2    60   ~ 0
C5_1+
Text Label 2050 3950 2    60   ~ 0
C5_1-
Text Label 8950 3250 0    60   ~ 0
UART_TX
Text Label 8950 3350 0    60   ~ 0
UART_RX
Text Label 2200 5250 2    60   ~ 0
BOARD_ID1
$Comp
L +3.3V #PWR03
U 1 1 54B1FB2D
P 6450 6000
F 0 "#PWR03" H 6450 5960 30  0001 C CNN
F 1 "+3.3V" H 6450 6110 30  0000 C CNN
F 2 "" H 6450 6000 60  0000 C CNN
F 3 "" H 6450 6000 60  0000 C CNN
	1    6450 6000
	1    0    0    -1  
$EndComp
Text Label 2450 4500 2    60   ~ 0
Slow_Control_TX
Text Label 2450 4600 2    60   ~ 0
Slow_Control_RX
Text Label 6250 2500 0    60   ~ 0
Slow_Control_TX
Text Label 6250 2600 0    60   ~ 0
Slow_Control_RX
Text Label 6250 5700 0    60   ~ 0
Slow_Control_TX
Text Label 6250 5800 0    60   ~ 0
Slow_Control_RX
$Sheet
S 7050 4400 1050 2500
U 5461E2FD
F0 "TDC_2" 50
F1 "sch/TDC.sch" 50
F2 "DCLK" I R 8100 4850 60 
F3 "CONF_DONE" I R 8100 4950 60 
F4 "nCONFIG" I R 8100 5050 60 
F5 "TCK" I L 7050 5300 60 
F6 "TDO" I L 7050 5600 60 
F7 "TMS" I L 7050 5400 60 
F8 "TDI" I L 7050 5500 60 
F9 "DATA0" I R 8100 4750 60 
F10 "TDC_In_A_N[7..0]" I L 7050 6550 60 
F11 "TDC_In_A_P[7..0]" I L 7050 6450 60 
F12 "TDC_In_B_N[7..0]" I L 7050 6800 60 
F13 "TDC_In_B_P[7..0]" I L 7050 6700 60 
F14 "nCE" I R 8100 5350 60 
F15 "BOARD_ID0" I L 7050 6150 60 
F16 "BOARD_ID1" I L 7050 6050 60 
F17 "Slow_Control_RX" I L 7050 5800 60 
F18 "Slow_Control_TX" I L 7050 5700 60 
F19 "nSTATUS" I R 8100 5150 60 
F20 "nCEO" I R 8100 5250 60 
F21 "TDC_TX" I R 8100 6050 60 
F22 "TDC_RX" I R 8100 6150 60 
F23 "VCC_INT" I L 7050 5000 60 
F24 "VCCD" I L 7050 5100 60 
F25 "VCCA" I L 7050 5200 60 
F26 "C5_In+" I L 7050 4500 60 
F27 "C5_In-" I L 7050 4600 60 
F28 "TDC_Out-" I L 7050 4800 60 
F29 "TDC_Out+" I L 7050 4700 60 
F30 "INIT_DONE" I R 8100 4650 60 
$EndSheet
Text Label 8950 3150 0    60   ~ 0
MCU_RESET
Text Label 8950 3650 0    60   ~ 0
DATA0
Text Label 8950 3750 0    60   ~ 0
DCLK
Text Label 8950 3850 0    60   ~ 0
nCONFIG
Text Label 8950 3950 0    60   ~ 0
nSTATUS
Text Label 8950 4050 0    60   ~ 0
CONF_DONE
Text Label 8700 4750 2    60   ~ 0
DATA0
Text Label 8700 4850 2    60   ~ 0
DCLK
Text Label 8700 5050 2    60   ~ 0
nCONFIG
Text Label 8700 5150 2    60   ~ 0
nSTATUS
Text Label 8700 4950 2    60   ~ 0
CONF_DONE
Text Label 8700 5350 2    60   ~ 0
nCEO_Daisy
Text Label 8700 1550 2    60   ~ 0
DATA0
Text Label 8700 1650 2    60   ~ 0
DCLK
Text Label 8700 1850 2    60   ~ 0
nCONFIG
Text Label 8700 1950 2    60   ~ 0
nSTATUS
Text Label 8700 1750 2    60   ~ 0
CONF_DONE
Text Label 10200 2050 2    60   ~ 0
nCEO_Daisy
$Comp
L GND #PWR04
U 1 1 56119CE6
P 8550 2300
F 0 "#PWR04" H 8550 2300 30  0001 C CNN
F 1 "GND" H 8550 2230 30  0001 C CNN
F 2 "" H 8550 2300 60  0000 C CNN
F 3 "" H 8550 2300 60  0000 C CNN
	1    8550 2300
	1    0    0    -1  
$EndComp
Text Label 2200 4850 2    60   ~ 0
MCU_RESET
Text Label 2200 4950 2    60   ~ 0
UART_TX
Text Label 2200 5050 2    60   ~ 0
UART_RX
$Comp
L R R2
U 1 1 56121688
P 9050 1750
F 0 "R2" V 9130 1750 40  0000 C CNN
F 1 "DNP" V 9057 1751 40  0000 C CNN
F 2 "libcms:SM0603" V 8980 1750 30  0001 C CNN
F 3 "~" H 9050 1750 30  0000 C CNN
	1    9050 1750
	1    0    0    -1  
$EndComp
$Comp
L R R3
U 1 1 56121697
P 9400 2050
F 0 "R3" V 9480 2050 40  0000 C CNN
F 1 "DNP" V 9407 2051 40  0000 C CNN
F 2 "libcms:SM0603" V 9330 2050 30  0001 C CNN
F 3 "~" H 9400 2050 30  0000 C CNN
	1    9400 2050
	0    -1   -1   0   
$EndComp
$Comp
L +3.3V #PWR05
U 1 1 5612344B
P 9050 1400
F 0 "#PWR05" H 9050 1360 30  0001 C CNN
F 1 "+3.3V" H 9050 1510 30  0000 C CNN
F 2 "" H 9050 1400 60  0000 C CNN
F 3 "" H 9050 1400 60  0000 C CNN
	1    9050 1400
	1    0    0    -1  
$EndComp
$Comp
L GND #PWR06
U 1 1 545F5546
P 4350 4900
F 0 "#PWR06" H 4350 4900 30  0001 C CNN
F 1 "GND" H 4350 4830 30  0001 C CNN
F 2 "" H 4350 4900 60  0000 C CNN
F 3 "" H 4350 4900 60  0000 C CNN
	1    4350 4900
	1    0    0    -1  
$EndComp
Text Notes 4450 6050 0    100  ~ 20
LVDS chips\n
Text Notes 7200 4250 0    150  ~ 30
TDC 2
Text Notes 9650 2900 0    150  ~ 30
MCU
Text Notes 700  6200 0    150  ~ 30
Power
$Comp
L R R1
U 1 1 56137295
P 8900 5650
F 0 "R1" V 8980 5650 40  0000 C CNN
F 1 "0" V 8907 5651 40  0000 C CNN
F 2 "libcms:SM0603" V 8830 5650 30  0001 C CNN
F 3 "~" H 8900 5650 30  0000 C CNN
F 4 "541-0.0GCT-ND" V 8900 5650 60  0001 C CNN "Field1"
F 5 "Digikey" V 8900 5650 60  0001 C CNN "Field2"
	1    8900 5650
	-1   0    0    1   
$EndComp
$Comp
L GND #PWR07
U 1 1 56138237
P 8900 5950
F 0 "#PWR07" H 8900 5950 30  0001 C CNN
F 1 "GND" H 8900 5880 30  0001 C CNN
F 2 "" H 8900 5950 60  0000 C CNN
F 3 "" H 8900 5950 60  0000 C CNN
	1    8900 5950
	1    0    0    -1  
$EndComp
Text Label 8950 4250 0    60   ~ 0
TDC1_TX
Text Label 8950 4350 0    60   ~ 0
TDC1_RX
Text Label 8950 4500 0    60   ~ 0
TDC2_TX
Text Label 8950 4600 0    60   ~ 0
TDC2_RX
Text Label 8600 2850 2    60   ~ 0
TDC1_TX
Text Label 8600 2950 2    60   ~ 0
TDC1_RX
Text Label 8650 6050 2    60   ~ 0
TDC2_TX
Text Label 8650 6150 2    60   ~ 0
TDC2_RX
Text Label 2050 6500 2    60   ~ 0
VCC_INT1
Text Label 2050 6600 2    60   ~ 0
VCCD1
Text Label 2050 6700 2    60   ~ 0
VCCA1
Text Label 2050 6950 2    60   ~ 0
VCC_INT2
Text Label 2050 7050 2    60   ~ 0
VCCD2
Text Label 2050 7150 2    60   ~ 0
VCCA2
Text Label 6500 5200 2    60   ~ 0
VCCA2
Text Label 6500 5100 2    60   ~ 0
VCCD2
Text Label 6500 5000 2    60   ~ 0
VCC_INT2
Text Label 6500 2000 2    60   ~ 0
VCCA1
Text Label 6500 1900 2    60   ~ 0
VCCD1
Text Label 6500 1800 2    60   ~ 0
VCC_INT1
NoConn ~ 4100 5050
NoConn ~ 4100 5150
NoConn ~ 3300 5150
NoConn ~ 8150 5250
$Sheet
S 600  1700 900  3700
U 56098656
F0 "Feedthrough" 50
F1 "sch/feedthrough.sch" 50
F2 "N2A[7..0]" I R 1500 2550 60 
F3 "P2A[7..0]" I R 1500 2450 60 
F4 "N2B[7..0]" I R 1500 2850 60 
F5 "P2B[7..0]" I R 1500 2750 60 
F6 "N1B[7..0]" I R 1500 2250 60 
F7 "P1B[7..0]" I R 1500 2150 60 
F8 "N1A[7..0]" I R 1500 1950 60 
F9 "P1A[7..0]" I R 1500 1850 60 
F10 "UART_TX" I R 1500 4950 60 
F11 "UART_RX" I R 1500 5050 60 
F12 "BOARD_ID1" I R 1500 5250 60 
F13 "Slow_Control_TX" I R 1500 4500 60 
F14 "Slow_Control_RX" I R 1500 4600 60 
F15 "MCU_RESET" I R 1500 4850 60 
F16 "C5_1+" I R 1500 3850 60 
F17 "C5_1-" I R 1500 3950 60 
F18 "TDC_Out_1+" I R 1500 3150 60 
F19 "TDC_Out_1-" I R 1500 3250 60 
F20 "C5_2+" I R 1500 4150 60 
F21 "C5_2-" I R 1500 4250 60 
F22 "TDC_Out_2+" I R 1500 3450 60 
F23 "TDC_Out_2-" I R 1500 3550 60 
$EndSheet
$Sheet
S 7050 1200 1050 2500
U 5611711C
F0 "TDC_1" 50
F1 "sch/TDC.sch" 50
F2 "DCLK" I R 8100 1650 60 
F3 "CONF_DONE" I R 8100 1750 60 
F4 "nCONFIG" I R 8100 1850 60 
F5 "TCK" I L 7050 2100 60 
F6 "TDO" I L 7050 2400 60 
F7 "TMS" I L 7050 2200 60 
F8 "TDI" I L 7050 2300 60 
F9 "DATA0" I R 8100 1550 60 
F10 "TDC_In_A_N[7..0]" I L 7050 3350 60 
F11 "TDC_In_A_P[7..0]" I L 7050 3250 60 
F12 "TDC_In_B_N[7..0]" I L 7050 3600 60 
F13 "TDC_In_B_P[7..0]" I L 7050 3500 60 
F14 "nCE" I R 8100 2150 60 
F15 "BOARD_ID0" I L 7050 2950 60 
F16 "BOARD_ID1" I L 7050 2850 60 
F17 "Slow_Control_RX" I L 7050 2600 60 
F18 "Slow_Control_TX" I L 7050 2500 60 
F19 "nSTATUS" I R 8100 1950 60 
F20 "nCEO" I R 8100 2050 60 
F21 "TDC_TX" I R 8100 2850 60 
F22 "TDC_RX" I R 8100 2950 60 
F23 "VCC_INT" I L 7050 1800 60 
F24 "VCCD" I L 7050 1900 60 
F25 "VCCA" I L 7050 2000 60 
F26 "C5_In+" I L 7050 1300 60 
F27 "C5_In-" I L 7050 1400 60 
F28 "TDC_Out-" I L 7050 1600 60 
F29 "TDC_Out+" I L 7050 1500 60 
F30 "INIT_DONE" I R 8100 1450 60 
$EndSheet
Text Label 8700 1450 2    60   ~ 0
INIT_DONE_1
Text Label 8700 4650 2    60   ~ 0
INIT_DONE_2
Text Label 8950 3450 0    60   ~ 0
INIT_DONE_1
Text Label 8950 3550 0    60   ~ 0
INIT_DONE_2
$Sheet
S 9550 3050 700  1650
U 560F0F07
F0 "MCU" 50
F1 "sch/MCU.sch" 50
F2 "UART_RX" I L 9550 3350 60 
F3 "UART_TX" I L 9550 3250 60 
F4 "MCU_RESET" I L 9550 3150 60 
F5 "DATA0" I L 9550 3650 60 
F6 "DCLK" I L 9550 3750 60 
F7 "nCONFIG" I L 9550 3850 60 
F8 "nSTATUS" I L 9550 3950 60 
F9 "CONF_DONE" I L 9550 4050 60 
F10 "TDC1_TX" I L 9550 4250 60 
F11 "TDC1_RX" I L 9550 4350 60 
F12 "TDC2_TX" I L 9550 4500 60 
F13 "TDC2_RX" I L 9550 4600 60 
F14 "INIT_DONE_2" I L 9550 3550 60 
F15 "INIT_DONE_1" I L 9550 3450 60 
$EndSheet
$Comp
L 30310-5002HB J1
U 1 1 545E3D65
P 3700 5050
F 0 "J1" H 3700 4750 60  0000 C CNN
F 1 "DNP" V 3700 5050 40  0000 C CNN
F 2 "30310-5002HB:30310-5002HB" H 3700 5050 60  0001 C CNN
F 3 "~" H 3700 5050 60  0000 C CNN
F 4 "3M15452-ND" H 3700 5050 60  0001 C CNN "Field1"
F 5 "Digi-Key" H 3700 5050 60  0001 C CNN "Field2"
	1    3700 5050
	1    0    0    -1  
$EndComp
$Comp
L +3.3V #PWR08
U 1 1 566F1733
P 4150 4950
F 0 "#PWR08" H 4150 4910 30  0001 C CNN
F 1 "+3.3V" H 4150 5060 30  0000 C CNN
F 2 "" H 4150 4950 60  0000 C CNN
F 3 "" H 4150 4950 60  0000 C CNN
	1    4150 4950
	0    1    1    0   
$EndComp
Wire Bus Line
	4200 3750 3800 3750
Wire Bus Line
	4200 3650 3800 3650
Wire Bus Line
	4200 3200 3800 3200
Wire Bus Line
	4200 3100 3800 3100
Wire Bus Line
	4200 6400 3800 6400
Wire Bus Line
	4200 6300 3800 6300
Wire Bus Line
	4200 6950 3800 6950
Wire Bus Line
	4200 6850 3800 6850
Wire Bus Line
	5650 6400 5800 6400
Wire Bus Line
	5800 6400 5800 6550
Wire Bus Line
	5800 6550 7050 6550
Wire Bus Line
	5650 6850 5800 6850
Wire Bus Line
	5800 6850 5800 6700
Wire Bus Line
	5800 6700 7050 6700
Wire Bus Line
	5650 6300 5900 6300
Wire Bus Line
	5900 6300 5900 6450
Wire Bus Line
	5900 6450 7050 6450
Wire Bus Line
	5650 6950 5900 6950
Wire Bus Line
	5900 6950 5900 6800
Wire Bus Line
	5900 6800 7050 6800
Wire Bus Line
	5650 3200 5800 3200
Wire Bus Line
	5800 3200 5800 3350
Wire Bus Line
	5800 3350 7050 3350
Wire Bus Line
	5650 3650 5800 3650
Wire Bus Line
	5800 3650 5800 3500
Wire Bus Line
	5800 3500 7050 3500
Wire Bus Line
	5650 3100 5900 3100
Wire Bus Line
	5900 3100 5900 3250
Wire Bus Line
	5900 3250 7050 3250
Wire Bus Line
	5650 3750 5900 3750
Wire Bus Line
	5900 3750 5900 3600
Wire Bus Line
	5900 3600 7050 3600
Wire Wire Line
	7050 1300 6500 1300
Wire Wire Line
	7050 1400 6500 1400
Wire Wire Line
	7050 5300 6500 5300
Wire Wire Line
	7050 5400 6500 5400
Wire Wire Line
	7050 2200 6500 2200
Wire Wire Line
	7050 2100 6500 2100
Wire Wire Line
	7050 4500 6500 4500
Wire Wire Line
	7050 4800 6500 4800
Wire Wire Line
	7050 4600 6500 4600
Wire Wire Line
	7050 4700 6500 4700
Wire Wire Line
	7050 1500 6500 1500
Wire Wire Line
	7050 1600 6500 1600
Wire Wire Line
	6500 2000 7050 2000
Wire Wire Line
	6500 5200 7050 5200
Wire Wire Line
	7050 2950 6550 2950
Wire Wire Line
	6550 2950 6550 3050
Wire Wire Line
	6550 6050 7050 6050
Wire Wire Line
	6550 2850 7050 2850
Wire Wire Line
	6250 2500 7050 2500
Wire Wire Line
	6250 2600 7050 2600
Wire Bus Line
	1500 1850 2200 1850
Wire Bus Line
	1500 1950 2200 1950
Wire Bus Line
	2200 2150 1500 2150
Wire Bus Line
	2200 2250 1500 2250
Wire Bus Line
	2200 2450 1500 2450
Wire Bus Line
	1500 2550 2200 2550
Wire Bus Line
	2200 2750 1500 2750
Wire Bus Line
	2200 2850 1500 2850
Wire Wire Line
	2300 3150 1500 3150
Wire Wire Line
	2300 3250 1500 3250
Wire Wire Line
	2300 3450 1500 3450
Wire Wire Line
	2300 3550 1500 3550
Wire Wire Line
	2050 3850 1500 3850
Wire Wire Line
	2050 3950 1500 3950
Wire Wire Line
	2050 4150 1500 4150
Wire Wire Line
	2050 4250 1500 4250
Wire Wire Line
	2200 5250 1500 5250
Wire Wire Line
	2450 4500 1500 4500
Wire Wire Line
	1500 4600 2450 4600
Wire Wire Line
	6250 5700 7050 5700
Wire Wire Line
	7050 5800 6250 5800
Wire Wire Line
	6450 6150 7050 6150
Wire Wire Line
	6450 6000 6450 6150
Wire Wire Line
	8950 3150 9550 3150
Wire Wire Line
	8950 3250 9550 3250
Wire Wire Line
	8950 3350 9550 3350
Wire Wire Line
	8950 3650 9550 3650
Wire Wire Line
	8950 3750 9550 3750
Wire Wire Line
	8950 3850 9550 3850
Wire Wire Line
	8950 3950 9550 3950
Wire Wire Line
	8950 4050 9550 4050
Wire Wire Line
	8100 4750 8700 4750
Wire Wire Line
	8100 4850 8700 4850
Wire Wire Line
	8100 4950 8700 4950
Wire Wire Line
	8100 5050 8700 5050
Wire Wire Line
	8700 5150 8100 5150
Wire Wire Line
	8100 5350 8900 5350
Wire Wire Line
	8100 1550 8700 1550
Wire Wire Line
	8100 1650 8700 1650
Wire Wire Line
	8100 1750 8700 1750
Wire Wire Line
	8100 1850 8700 1850
Wire Wire Line
	8700 1950 8100 1950
Wire Wire Line
	8100 2050 9150 2050
Wire Wire Line
	2200 4850 1500 4850
Wire Wire Line
	1500 4950 2200 4950
Wire Wire Line
	2200 5050 1500 5050
Wire Wire Line
	9050 2050 9050 2000
Connection ~ 9050 2050
Wire Wire Line
	9650 2050 10200 2050
Wire Wire Line
	9050 1500 9050 1400
Wire Wire Line
	3050 4850 3300 4850
Wire Wire Line
	3050 4950 3300 4950
Wire Wire Line
	3050 5050 3300 5050
Wire Wire Line
	3050 5250 3300 5250
Wire Wire Line
	4100 4850 4350 4850
Wire Wire Line
	4350 4850 4350 4900
Wire Wire Line
	4100 5250 4350 5250
Wire Wire Line
	4350 5250 4350 5300
Wire Wire Line
	8900 5350 8900 5400
Wire Wire Line
	8900 5900 8900 5950
Wire Wire Line
	9550 4250 8950 4250
Wire Wire Line
	9550 4350 8950 4350
Wire Wire Line
	9550 4500 8950 4500
Wire Wire Line
	9550 4600 8950 4600
Wire Wire Line
	8100 2850 8600 2850
Wire Wire Line
	8100 2950 8600 2950
Wire Wire Line
	8100 6050 8650 6050
Wire Wire Line
	8100 6150 8650 6150
Wire Wire Line
	1500 6500 2050 6500
Wire Wire Line
	1500 6600 2050 6600
Wire Wire Line
	1500 6700 2050 6700
Wire Wire Line
	1500 6950 2050 6950
Wire Wire Line
	1500 7050 2050 7050
Wire Wire Line
	7050 1800 6500 1800
Wire Wire Line
	7050 1900 6500 1900
Wire Wire Line
	7050 5100 6500 5100
Wire Wire Line
	6500 5000 7050 5000
Wire Wire Line
	1500 7150 2050 7150
Wire Wire Line
	8100 5250 8150 5250
Wire Wire Line
	6500 5500 7050 5500
Wire Wire Line
	6500 5600 7050 5600
Wire Wire Line
	6450 2300 7050 2300
Wire Wire Line
	6450 2400 7050 2400
Wire Wire Line
	8550 2150 8100 2150
Wire Wire Line
	8550 2300 8550 2150
Wire Wire Line
	8700 4650 8100 4650
Wire Wire Line
	8100 1450 8700 1450
Wire Wire Line
	8950 3450 9550 3450
Wire Wire Line
	8950 3550 9550 3550
Wire Wire Line
	4150 4950 4100 4950
$EndSCHEMATC
