EESchema Schematic File Version 2
LIBS:TDC_Mother-rescue
LIBS:power
LIBS:transistors
LIBS:conn
LIBS:display
LIBS:contrib
LIBS:ep3c5u256_custom
LIBS:ERM8-RA
LIBS:30310-5002hb
LIBS:4816P-1-101LF
LIBS:FIN1108
LIBS:tps78630kttt
LIBS:tps79533
LIBS:+4
LIBS:640456-2
LIBS:micron
LIBS:tps73701drbt
LIBS:ws2812b
LIBS:fixed_conn
LIBS:ao3422
LIBS:my_discrete
LIBS:TMM-105-01
LIBS:my_power
LIBS:atmega168a-mm
LIBS:CAT16-101J4LF
LIBS:tmp36
LIBS:testpoint
LIBS:TDC_Mother-cache
EELAYER 25 0
EELAYER END
$Descr A 11000 8500
encoding utf-8
Sheet 7 14
Title ""
Date "9 oct 2015"
Rev ""
Comp ""
Comment1 ""
Comment2 ""
Comment3 ""
Comment4 ""
$EndDescr
Text HLabel 8950 5500 0    60   Input ~ 0
DCLK
Text HLabel 8950 5600 0    60   Input ~ 0
CONF_DONE
Text HLabel 8950 5700 0    60   Input ~ 0
nCONFIG
Text HLabel 8950 6500 0    60   Input ~ 0
TCK
Text HLabel 8950 6300 0    60   Input ~ 0
TDO
Text HLabel 8950 6200 0    60   Input ~ 0
TMS
Text HLabel 8950 6400 0    60   Input ~ 0
TDI
Text HLabel 8950 4800 0    60   Input ~ 0
DATA0
Text HLabel 9850 7050 2    60   Input ~ 0
C5_In+
Text HLabel 9850 7150 2    60   Input ~ 0
C5_In-
Text HLabel 9850 6950 2    60   Input ~ 0
TDC_Out-
Text HLabel 9850 6850 2    60   Input ~ 0
TDC_Out+
Text HLabel 1400 600  0    60   Input ~ 0
TDC_In_A_N[7..0]
Entry Wire Line
	1650 600  1750 700 
Entry Wire Line
	1650 700  1750 800 
Entry Wire Line
	1650 800  1750 900 
Entry Wire Line
	1650 900  1750 1000
Entry Wire Line
	1650 1000 1750 1100
Entry Wire Line
	1650 1100 1750 1200
Entry Wire Line
	1650 1200 1750 1300
Entry Wire Line
	1650 1300 1750 1400
Entry Wire Line
	1650 2300 1750 2400
Entry Wire Line
	1650 2400 1750 2500
Entry Wire Line
	1650 2500 1750 2600
Entry Wire Line
	1650 2600 1750 2700
Entry Wire Line
	1650 2700 1750 2800
Entry Wire Line
	1650 2800 1750 2900
Entry Wire Line
	1650 2900 1750 3000
Entry Wire Line
	1650 3000 1750 3100
Text HLabel 1550 1450 0    60   Input ~ 0
TDC_In_A_P[7..0]
Entry Wire Line
	1650 1450 1750 1550
Entry Wire Line
	1650 1550 1750 1650
Entry Wire Line
	1650 1650 1750 1750
Entry Wire Line
	1650 1750 1750 1850
Entry Wire Line
	1650 1850 1750 1950
Entry Wire Line
	1650 1950 1750 2050
Entry Wire Line
	1650 2050 1750 2150
Entry Wire Line
	1650 2150 1750 2250
Entry Wire Line
	1650 3150 1750 3250
Entry Wire Line
	1650 3250 1750 3350
Entry Wire Line
	1650 3350 1750 3450
Entry Wire Line
	1650 3450 1750 3550
Entry Wire Line
	1650 3550 1750 3650
Entry Wire Line
	1650 3650 1750 3750
Entry Wire Line
	1650 3750 1750 3850
Entry Wire Line
	1650 3850 1750 3950
Text HLabel 1400 2300 0    60   Input ~ 0
TDC_In_B_N[7..0]
Text HLabel 1550 3150 0    60   Input ~ 0
TDC_In_B_P[7..0]
Text Label 1850 1550 0    60   ~ 0
TDC_In_A_P0
Text Label 1850 1650 0    60   ~ 0
TDC_In_A_P1
Text Label 1850 1750 0    60   ~ 0
TDC_In_A_P2
Text Label 1850 1850 0    60   ~ 0
TDC_In_A_P3
Text Label 1850 1950 0    60   ~ 0
TDC_In_A_P4
Text Label 1850 2050 0    60   ~ 0
TDC_In_A_P5
Text Label 1850 2150 0    60   ~ 0
TDC_In_A_P6
Text Label 1850 2250 0    60   ~ 0
TDC_In_A_P7
Text Label 1850 3250 0    60   ~ 0
TDC_In_B_P0
Text Label 1850 3350 0    60   ~ 0
TDC_In_B_P1
Text Label 1850 3450 0    60   ~ 0
TDC_In_B_P2
Text Label 1850 3550 0    60   ~ 0
TDC_In_B_P3
Text Label 1850 3650 0    60   ~ 0
TDC_In_B_P4
Text Label 1850 3750 0    60   ~ 0
TDC_In_B_P5
Text Label 1850 3850 0    60   ~ 0
TDC_In_B_P6
Text Label 1850 3950 0    60   ~ 0
TDC_In_B_P7
Text Label 1850 800  0    60   ~ 0
TDC_In_A_N1
Text Label 1850 900  0    60   ~ 0
TDC_In_A_N2
Text Label 1850 1000 0    60   ~ 0
TDC_In_A_N3
Text Label 1850 1100 0    60   ~ 0
TDC_In_A_N4
Text Label 1850 1200 0    60   ~ 0
TDC_In_A_N5
Text Label 1850 1300 0    60   ~ 0
TDC_In_A_N6
Text Label 1850 1400 0    60   ~ 0
TDC_In_A_N7
Text Label 1850 2400 0    60   ~ 0
TDC_In_B_N0
Text Label 1850 2500 0    60   ~ 0
TDC_In_B_N1
Text Label 1850 2600 0    60   ~ 0
TDC_In_B_N2
Text Label 1850 2700 0    60   ~ 0
TDC_In_B_N3
Text Label 1850 2800 0    60   ~ 0
TDC_In_B_N4
Text Label 1850 2900 0    60   ~ 0
TDC_In_B_N5
Text Label 1850 3000 0    60   ~ 0
TDC_In_B_N6
Text Label 1850 3100 0    60   ~ 0
TDC_In_B_N7
Text HLabel 8950 4900 0    60   Input ~ 0
nCE
Text HLabel 8100 7050 0    60   Input ~ 0
BOARD_ID0
Text HLabel 8950 5200 0    60   Input ~ 0
Slow_Control_RX
Text HLabel 8950 5100 0    60   Input ~ 0
Slow_Control_TX
Text HLabel 10200 5900 3    60   Input ~ 0
BOARD_ID1
Text Label 6850 2800 2    60   ~ 0
TDC_In_B_N0
Text Label 6850 2900 2    60   ~ 0
TDC_IN_B_P0
Text Label 1850 700  0    60   ~ 0
TDC_In_A_N0
Text Label 6850 2500 2    60   ~ 0
TDC_In_B_N1
Text Label 6850 2600 2    60   ~ 0
TDC_In_B_P1
Text Label 6850 1600 2    60   ~ 0
TDC_In_B_N2
Text Label 3150 1100 2    60   ~ 0
TDC_In_B_N3
Text Label 6850 1700 2    60   ~ 0
TDC_In_B_P2
Text Label 3150 1200 2    60   ~ 0
TDC_In_B_P3
Text Label 3150 2700 2    60   ~ 0
TDC_In_B_P4
Text Label 3150 2600 2    60   ~ 0
TDC_In_B_N4
Text Label 3150 2300 2    60   ~ 0
TDC_In_B_N5
Text Label 3150 2400 2    60   ~ 0
TDC_In_B_P5
Text Label 3150 2000 2    60   ~ 0
TDC_In_B_N6
Text Label 3150 2100 2    60   ~ 0
TDC_In_B_P6
Text Label 3150 1400 2    60   ~ 0
TDC_In_B_N7
Text Label 3150 1500 2    60   ~ 0
TDC_In_B_P7
Text Label 9050 3100 2    60   ~ 0
TDC_In_A_N0
Text Label 9050 3200 2    60   ~ 0
TDC_In_A_P0
Text Label 9050 2800 2    60   ~ 0
TDC_In_A_N1
Text Label 9050 2900 2    60   ~ 0
TDC_In_A_P1
$Comp
L GND #PWR059
U 1 1 56044F7E
P 5450 1700
AR Path="/5461E2FD/56044F7E" Ref="#PWR059"  Part="1" 
AR Path="/5611711C/56044F7E" Ref="#PWR087"  Part="1" 
F 0 "#PWR059" H 5450 1700 30  0001 C CNN
F 1 "GND" H 5450 1630 30  0001 C CNN
F 2 "" H 5450 1700 60  0000 C CNN
F 3 "" H 5450 1700 60  0000 C CNN
	1    5450 1700
	1    0    0    -1  
$EndComp
Text Label 9050 2200 2    60   ~ 0
TDC_In_A_N2
Text Label 9050 2300 2    60   ~ 0
TDC_In_A_P2
Text Label 9050 1900 2    60   ~ 0
TDC_In_A_N3
Text Label 9050 2000 2    60   ~ 0
TDC_In_A_P3
Text Label 9050 1600 2    60   ~ 0
TDC_In_A_N4
Text Label 9050 1700 2    60   ~ 0
TDC_In_A_P4
Text Label 9050 700  2    60   ~ 0
TDC_In_A_N5
Text Label 9050 800  2    60   ~ 0
TDC_In_A_P5
Text Label 6850 1000 2    60   ~ 0
TDC_In_A_N6
Text Label 6850 1100 2    60   ~ 0
TDC_In_A_P6
Text Label 6850 3100 2    60   ~ 0
TDC_In_A_N7
Text Label 6850 3200 2    60   ~ 0
TDC_In_A_P7
$Comp
L GND #PWR060
U 1 1 560496E8
P 700 7600
AR Path="/5461E2FD/560496E8" Ref="#PWR060"  Part="1" 
AR Path="/5611711C/560496E8" Ref="#PWR088"  Part="1" 
F 0 "#PWR060" H 700 7600 30  0001 C CNN
F 1 "GND" H 700 7530 30  0001 C CNN
F 2 "" H 700 7600 60  0000 C CNN
F 3 "" H 700 7600 60  0000 C CNN
	1    700  7600
	1    0    0    -1  
$EndComp
$Comp
L +3.3V #PWR061
U 1 1 5604C8CF
P 3300 5600
AR Path="/5461E2FD/5604C8CF" Ref="#PWR061"  Part="1" 
AR Path="/5611711C/5604C8CF" Ref="#PWR089"  Part="1" 
F 0 "#PWR061" H 3300 5560 30  0001 C CNN
F 1 "+3.3V" H 3300 5710 30  0000 C CNN
F 2 "" H 3300 5600 60  0000 C CNN
F 3 "" H 3300 5600 60  0000 C CNN
	1    3300 5600
	1    0    0    -1  
$EndComp
$Comp
L +2.5V #PWR062
U 1 1 5604C8DE
P 3300 6600
AR Path="/5461E2FD/5604C8DE" Ref="#PWR062"  Part="1" 
AR Path="/5611711C/5604C8DE" Ref="#PWR090"  Part="1" 
F 0 "#PWR062" H 3300 6550 20  0001 C CNN
F 1 "+2.5V" H 3300 6700 30  0000 C CNN
F 2 "" H 3300 6600 60  0000 C CNN
F 3 "" H 3300 6600 60  0000 C CNN
	1    3300 6600
	1    0    0    -1  
$EndComp
$Comp
L +3.3V #PWR063
U 1 1 5604C8FF
P 3300 7400
AR Path="/5461E2FD/5604C8FF" Ref="#PWR063"  Part="1" 
AR Path="/5611711C/5604C8FF" Ref="#PWR091"  Part="1" 
F 0 "#PWR063" H 3300 7360 30  0001 C CNN
F 1 "+3.3V" H 3300 7510 30  0000 C CNN
F 2 "" H 3300 7400 60  0000 C CNN
F 3 "" H 3300 7400 60  0000 C CNN
	1    3300 7400
	1    0    0    -1  
$EndComp
$Comp
L C C57
U 1 1 5604C95C
P 6500 6200
AR Path="/5461E2FD/5604C95C" Ref="C57"  Part="1" 
AR Path="/5611711C/5604C95C" Ref="C102"  Part="1" 
F 0 "C57" H 6500 6300 40  0000 L CNN
F 1 "10uF" H 6506 6115 40  0000 L CNN
F 2 "libcms:SM0603_Capa" H 6538 6050 30  0001 C CNN
F 3 "~" H 6500 6200 60  0000 C CNN
F 4 "445-4112-1-ND" H 6500 6200 60  0001 C CNN "Field1"
F 5 "Digikey" H 6500 6200 60  0001 C CNN "Field2"
	1    6500 6200
	1    0    0    -1  
$EndComp
$Comp
L +3.3V #PWR064
U 1 1 5604D785
P 7250 5900
AR Path="/5461E2FD/5604D785" Ref="#PWR064"  Part="1" 
AR Path="/5611711C/5604D785" Ref="#PWR092"  Part="1" 
F 0 "#PWR064" H 7250 5860 30  0001 C CNN
F 1 "+3.3V" H 7250 6010 30  0000 C CNN
F 2 "" H 7250 5900 60  0000 C CNN
F 3 "" H 7250 5900 60  0000 C CNN
	1    7250 5900
	1    0    0    -1  
$EndComp
$Comp
L +2.5V #PWR065
U 1 1 5604D78B
P 8000 5900
AR Path="/5461E2FD/5604D78B" Ref="#PWR065"  Part="1" 
AR Path="/5611711C/5604D78B" Ref="#PWR093"  Part="1" 
F 0 "#PWR065" H 8000 5850 20  0001 C CNN
F 1 "+2.5V" H 8000 6000 30  0000 C CNN
F 2 "" H 8000 5900 60  0000 C CNN
F 3 "" H 8000 5900 60  0000 C CNN
	1    8000 5900
	1    0    0    -1  
$EndComp
$Comp
L GND #PWR066
U 1 1 5604D791
P 6500 6550
AR Path="/5461E2FD/5604D791" Ref="#PWR066"  Part="1" 
AR Path="/5611711C/5604D791" Ref="#PWR094"  Part="1" 
F 0 "#PWR066" H 6500 6550 30  0001 C CNN
F 1 "GND" H 6500 6480 30  0001 C CNN
F 2 "" H 6500 6550 60  0000 C CNN
F 3 "" H 6500 6550 60  0000 C CNN
	1    6500 6550
	1    0    0    -1  
$EndComp
$Comp
L GND #PWR067
U 1 1 5604D797
P 7250 6550
AR Path="/5461E2FD/5604D797" Ref="#PWR067"  Part="1" 
AR Path="/5611711C/5604D797" Ref="#PWR095"  Part="1" 
F 0 "#PWR067" H 7250 6550 30  0001 C CNN
F 1 "GND" H 7250 6480 30  0001 C CNN
F 2 "" H 7250 6550 60  0000 C CNN
F 3 "" H 7250 6550 60  0000 C CNN
	1    7250 6550
	1    0    0    -1  
$EndComp
$Comp
L GND #PWR068
U 1 1 5604D79D
P 8000 6550
AR Path="/5461E2FD/5604D79D" Ref="#PWR068"  Part="1" 
AR Path="/5611711C/5604D79D" Ref="#PWR096"  Part="1" 
F 0 "#PWR068" H 8000 6550 30  0001 C CNN
F 1 "GND" H 8000 6480 30  0001 C CNN
F 2 "" H 8000 6550 60  0000 C CNN
F 3 "" H 8000 6550 60  0000 C CNN
	1    8000 6550
	1    0    0    -1  
$EndComp
$Comp
L GND #PWR069
U 1 1 5604EACE
P 3650 5350
AR Path="/5461E2FD/5604EACE" Ref="#PWR069"  Part="1" 
AR Path="/5611711C/5604EACE" Ref="#PWR097"  Part="1" 
F 0 "#PWR069" H 3650 5350 30  0001 C CNN
F 1 "GND" H 3650 5280 30  0001 C CNN
F 2 "" H 3650 5350 60  0000 C CNN
F 3 "" H 3650 5350 60  0000 C CNN
	1    3650 5350
	1    0    0    -1  
$EndComp
$Comp
L GND #PWR070
U 1 1 5604EB2A
P 3650 6550
AR Path="/5461E2FD/5604EB2A" Ref="#PWR070"  Part="1" 
AR Path="/5611711C/5604EB2A" Ref="#PWR098"  Part="1" 
F 0 "#PWR070" H 3650 6550 30  0001 C CNN
F 1 "GND" H 3650 6480 30  0001 C CNN
F 2 "" H 3650 6550 60  0000 C CNN
F 3 "" H 3650 6550 60  0000 C CNN
	1    3650 6550
	1    0    0    -1  
$EndComp
$Comp
L GND #PWR071
U 1 1 5604EB80
P 3600 7750
AR Path="/5461E2FD/5604EB80" Ref="#PWR071"  Part="1" 
AR Path="/5611711C/5604EB80" Ref="#PWR099"  Part="1" 
F 0 "#PWR071" H 3600 7750 30  0001 C CNN
F 1 "GND" H 3600 7680 30  0001 C CNN
F 2 "" H 3600 7750 60  0000 C CNN
F 3 "" H 3600 7750 60  0000 C CNN
	1    3600 7750
	1    0    0    -1  
$EndComp
$Comp
L +3.3V #PWR072
U 1 1 5604EF5C
P 3650 4700
AR Path="/5461E2FD/5604EF5C" Ref="#PWR072"  Part="1" 
AR Path="/5611711C/5604EF5C" Ref="#PWR0100"  Part="1" 
F 0 "#PWR072" H 3650 4660 30  0001 C CNN
F 1 "+3.3V" H 3650 4810 30  0000 C CNN
F 2 "" H 3650 4700 60  0000 C CNN
F 3 "" H 3650 4700 60  0000 C CNN
	1    3650 4700
	1    0    0    -1  
$EndComp
$Comp
L +2.5V #PWR073
U 1 1 5604EF62
P 3600 7100
AR Path="/5461E2FD/5604EF62" Ref="#PWR073"  Part="1" 
AR Path="/5611711C/5604EF62" Ref="#PWR0101"  Part="1" 
F 0 "#PWR073" H 3600 7050 20  0001 C CNN
F 1 "+2.5V" H 3600 7200 30  0000 C CNN
F 2 "" H 3600 7100 60  0000 C CNN
F 3 "" H 3600 7100 60  0000 C CNN
	1    3600 7100
	1    0    0    -1  
$EndComp
Wire Wire Line
	8950 5500 9050 5500
Wire Wire Line
	8950 5600 9050 5600
Wire Wire Line
	8950 5700 9050 5700
Wire Wire Line
	8950 4800 9050 4800
Wire Wire Line
	8950 5000 9050 5000
Wire Wire Line
	9850 6950 9700 6950
Wire Wire Line
	9850 6850 9700 6850
Wire Wire Line
	1850 1950 1750 1950
Wire Wire Line
	1850 2050 1750 2050
Wire Wire Line
	1850 2150 1750 2150
Wire Wire Line
	1850 2250 1750 2250
Wire Bus Line
	1550 3150 1650 3150
Wire Bus Line
	1650 3150 1650 3850
Wire Bus Line
	1550 1450 1650 1450
Wire Bus Line
	1650 1450 1650 2150
Wire Bus Line
	1400 600  1650 600 
Wire Bus Line
	1650 600  1650 1300
Wire Bus Line
	1400 2300 1650 2300
Wire Bus Line
	1650 2300 1650 3000
Wire Wire Line
	1850 1550 1750 1550
Wire Wire Line
	1850 1650 1750 1650
Wire Wire Line
	1850 1750 1750 1750
Wire Wire Line
	1850 1850 1750 1850
Wire Wire Line
	1850 3650 1750 3650
Wire Wire Line
	1850 3750 1750 3750
Wire Wire Line
	1850 3850 1750 3850
Wire Wire Line
	1850 3950 1750 3950
Wire Wire Line
	1850 3250 1750 3250
Wire Wire Line
	1850 3350 1750 3350
Wire Wire Line
	1850 3450 1750 3450
Wire Wire Line
	1850 3550 1750 3550
Wire Wire Line
	1750 1100 1850 1100
Wire Wire Line
	1750 1200 1850 1200
Wire Wire Line
	1750 1300 1850 1300
Wire Wire Line
	1750 1400 1850 1400
Wire Wire Line
	1750 800  1850 800 
Wire Wire Line
	1750 900  1850 900 
Wire Wire Line
	1750 1000 1850 1000
Wire Wire Line
	1750 2800 1850 2800
Wire Wire Line
	1750 2900 1850 2900
Wire Wire Line
	1750 3000 1850 3000
Wire Wire Line
	1750 3100 1850 3100
Wire Wire Line
	1750 2400 1850 2400
Wire Wire Line
	1750 2500 1850 2500
Wire Wire Line
	1750 2600 1850 2600
Wire Wire Line
	1750 2700 1850 2700
Wire Wire Line
	8950 4900 9050 4900
Wire Wire Line
	6850 2000 7000 2000
Wire Wire Line
	6850 2300 7000 2300
Wire Wire Line
	6850 1900 7000 1900
Wire Wire Line
	6850 2200 7000 2200
Wire Wire Line
	3300 1400 3150 1400
Wire Wire Line
	3300 1500 3150 1500
Wire Wire Line
	1750 700  1850 700 
Wire Wire Line
	3300 2000 3150 2000
Wire Wire Line
	3300 2100 3150 2100
Wire Wire Line
	3150 2300 3300 2300
Wire Wire Line
	3150 2400 3300 2400
Wire Wire Line
	3150 2700 3300 2700
Wire Wire Line
	3300 2600 3150 2600
Wire Wire Line
	3300 1200 3150 1200
Wire Wire Line
	3150 1100 3300 1100
Wire Wire Line
	7000 3200 6850 3200
Wire Wire Line
	6850 3100 7000 3100
Wire Wire Line
	7000 2900 6850 2900
Wire Wire Line
	6850 2800 7000 2800
Wire Wire Line
	7000 2600 6850 2600
Wire Wire Line
	7000 2500 6850 2500
Wire Wire Line
	7000 1700 6850 1700
Wire Wire Line
	7000 1600 6850 1600
Wire Wire Line
	7000 1100 6850 1100
Wire Wire Line
	7000 1000 6850 1000
Wire Wire Line
	5300 1200 5450 1200
Wire Wire Line
	5450 1200 5450 1700
Wire Wire Line
	9200 3200 9050 3200
Wire Wire Line
	9050 3100 9200 3100
Wire Wire Line
	9200 2900 9050 2900
Wire Wire Line
	9050 2800 9200 2800
Wire Wire Line
	9200 2300 9050 2300
Wire Wire Line
	9050 2200 9200 2200
Wire Wire Line
	9200 2000 9050 2000
Wire Wire Line
	9050 1900 9200 1900
Wire Wire Line
	9200 1700 9050 1700
Wire Wire Line
	9050 1600 9200 1600
Wire Wire Line
	9200 800  9050 800 
Wire Wire Line
	9050 700  9200 700 
Wire Wire Line
	5300 800  5800 800 
Connection ~ 5450 1600
Connection ~ 5600 1600
Wire Wire Line
	5450 1600 5800 1600
Wire Wire Line
	5600 1600 5600 1500
Wire Wire Line
	5800 1600 5800 1500
Wire Wire Line
	900  4700 700  4700
Wire Wire Line
	700  4700 700  7600
Wire Wire Line
	900  4800 700  4800
Connection ~ 700  4800
Wire Wire Line
	900  4900 700  4900
Connection ~ 700  4900
Wire Wire Line
	900  5000 700  5000
Connection ~ 700  5000
Wire Wire Line
	900  5100 700  5100
Connection ~ 700  5100
Wire Wire Line
	900  5200 700  5200
Connection ~ 700  5200
Wire Wire Line
	900  5300 700  5300
Connection ~ 700  5300
Wire Wire Line
	900  5400 700  5400
Connection ~ 700  5400
Wire Wire Line
	900  5500 700  5500
Connection ~ 700  5500
Wire Wire Line
	900  5600 700  5600
Connection ~ 700  5600
Wire Wire Line
	900  5700 700  5700
Connection ~ 700  5700
Wire Wire Line
	900  5800 700  5800
Connection ~ 700  5800
Wire Wire Line
	900  5900 700  5900
Connection ~ 700  5900
Wire Wire Line
	900  6000 700  6000
Connection ~ 700  6000
Wire Wire Line
	700  6100 900  6100
Connection ~ 700  6100
Wire Wire Line
	900  6200 700  6200
Connection ~ 700  6200
Wire Wire Line
	900  6300 700  6300
Connection ~ 700  6300
Wire Wire Line
	900  6400 700  6400
Connection ~ 700  6400
Wire Wire Line
	900  6500 700  6500
Connection ~ 700  6500
Wire Wire Line
	900  6600 700  6600
Connection ~ 700  6600
Wire Wire Line
	900  6700 700  6700
Connection ~ 700  6700
Wire Wire Line
	900  6800 700  6800
Connection ~ 700  6800
Wire Wire Line
	900  6900 700  6900
Connection ~ 700  6900
Wire Wire Line
	900  7000 700  7000
Connection ~ 700  7000
Wire Wire Line
	900  7100 700  7100
Connection ~ 700  7100
Wire Wire Line
	900  7200 700  7200
Connection ~ 700  7200
Wire Wire Line
	900  7300 700  7300
Connection ~ 700  7300
Wire Wire Line
	900  7400 700  7400
Connection ~ 700  7400
Wire Wire Line
	3100 5400 2900 5400
Wire Wire Line
	3100 4550 3100 5400
Wire Wire Line
	2900 5300 3100 5300
Connection ~ 3100 5300
Wire Wire Line
	2900 5200 3100 5200
Connection ~ 3100 5200
Wire Wire Line
	2900 5100 3100 5100
Connection ~ 3100 5100
Wire Wire Line
	2900 5000 3100 5000
Connection ~ 3100 5000
Wire Wire Line
	2900 4900 3100 4900
Connection ~ 3100 4900
Wire Wire Line
	2900 4800 3100 4800
Connection ~ 3100 4800
Connection ~ 3100 4700
Wire Wire Line
	2900 5500 3100 5500
Wire Wire Line
	3100 5500 3100 5600
Wire Wire Line
	2900 5600 3300 5600
Connection ~ 3100 5600
Wire Wire Line
	2900 5700 3100 5700
Wire Wire Line
	3100 5700 3100 6600
Wire Wire Line
	2900 6600 3300 6600
Wire Wire Line
	2900 5800 3100 5800
Connection ~ 3100 5800
Wire Wire Line
	2900 5900 3100 5900
Connection ~ 3100 5900
Wire Wire Line
	2900 6000 3100 6000
Connection ~ 3100 6000
Wire Wire Line
	2900 6100 3100 6100
Connection ~ 3100 6100
Wire Wire Line
	2900 6200 3100 6200
Connection ~ 3100 6200
Wire Wire Line
	2900 6300 3100 6300
Connection ~ 3100 6300
Wire Wire Line
	2900 6400 3100 6400
Connection ~ 3100 6400
Wire Wire Line
	2900 6500 3100 6500
Connection ~ 3100 6500
Connection ~ 3100 6600
Wire Wire Line
	2900 6700 3100 6700
Wire Wire Line
	3100 6700 3100 7400
Wire Wire Line
	2900 7400 3300 7400
Wire Wire Line
	2900 6800 3100 6800
Connection ~ 3100 6800
Wire Wire Line
	2900 6900 3100 6900
Connection ~ 3100 6900
Wire Wire Line
	2900 7000 3100 7000
Connection ~ 3100 7000
Wire Wire Line
	2900 7100 3100 7100
Connection ~ 3100 7100
Wire Wire Line
	2900 7200 3100 7200
Connection ~ 3100 7200
Wire Wire Line
	2900 7300 3100 7300
Connection ~ 3100 7300
Connection ~ 3100 7400
Wire Wire Line
	6500 6400 6500 6550
Wire Wire Line
	6500 5950 6800 5950
Wire Wire Line
	6500 5850 6500 6000
Wire Wire Line
	7250 6400 7250 6550
Wire Wire Line
	7250 5900 7250 6000
Wire Wire Line
	8000 5900 8000 6000
Wire Wire Line
	8000 6400 8000 6550
Wire Wire Line
	3650 4750 6950 4750
Connection ~ 5450 4750
Wire Wire Line
	3650 4700 3650 4800
Connection ~ 5150 4750
Connection ~ 4850 4750
Connection ~ 4550 4750
Connection ~ 4250 4750
Connection ~ 3950 4750
Connection ~ 3650 4750
Wire Wire Line
	5750 5250 5750 5200
Wire Wire Line
	3650 5250 6950 5250
Wire Wire Line
	3650 5200 3650 5350
Wire Wire Line
	5450 5200 5450 5250
Connection ~ 5450 5250
Wire Wire Line
	5150 5200 5150 5250
Connection ~ 5150 5250
Wire Wire Line
	4850 5200 4850 5250
Connection ~ 4850 5250
Wire Wire Line
	4550 5200 4550 5250
Connection ~ 4550 5250
Wire Wire Line
	4250 5200 4250 5250
Connection ~ 4250 5250
Wire Wire Line
	3950 5200 3950 5250
Connection ~ 3950 5250
Connection ~ 3650 5250
Wire Wire Line
	5750 5950 5750 6000
Wire Wire Line
	3650 5950 5750 5950
Wire Wire Line
	5450 6000 5450 5950
Connection ~ 5450 5950
Wire Wire Line
	3650 5850 3650 6000
Wire Wire Line
	5150 6000 5150 5950
Connection ~ 5150 5950
Wire Wire Line
	4850 6000 4850 5950
Connection ~ 4850 5950
Wire Wire Line
	4550 6000 4550 5950
Connection ~ 4550 5950
Wire Wire Line
	4250 6000 4250 5950
Connection ~ 4250 5950
Wire Wire Line
	3950 6000 3950 5950
Connection ~ 3950 5950
Connection ~ 3650 5950
Wire Wire Line
	5750 6450 5750 6400
Wire Wire Line
	3650 6450 5750 6450
Wire Wire Line
	3650 6400 3650 6550
Wire Wire Line
	5450 6400 5450 6450
Connection ~ 5450 6450
Wire Wire Line
	5150 6400 5150 6450
Connection ~ 5150 6450
Wire Wire Line
	4850 6400 4850 6450
Connection ~ 4850 6450
Wire Wire Line
	4550 6400 4550 6450
Connection ~ 4550 6450
Wire Wire Line
	4250 6400 4250 6450
Connection ~ 4250 6450
Wire Wire Line
	3950 6400 3950 6450
Connection ~ 3950 6450
Connection ~ 3650 6450
Wire Wire Line
	6000 7150 6000 7200
Wire Wire Line
	3600 7150 6000 7150
Wire Wire Line
	5700 7200 5700 7150
Connection ~ 5700 7150
Wire Wire Line
	5400 7200 5400 7150
Connection ~ 5400 7150
Wire Wire Line
	5100 7200 5100 7150
Connection ~ 5100 7150
Wire Wire Line
	4800 7200 4800 7150
Connection ~ 4800 7150
Wire Wire Line
	4500 7200 4500 7150
Connection ~ 4500 7150
Wire Wire Line
	4200 7200 4200 7150
Connection ~ 4200 7150
Wire Wire Line
	6000 7650 6000 7600
Wire Wire Line
	3600 7650 6000 7650
Wire Wire Line
	5700 7600 5700 7650
Connection ~ 5700 7650
Wire Wire Line
	5400 7600 5400 7650
Connection ~ 5400 7650
Wire Wire Line
	5100 7600 5100 7650
Connection ~ 5100 7650
Wire Wire Line
	4800 7600 4800 7650
Connection ~ 4800 7650
Wire Wire Line
	4500 7600 4500 7650
Connection ~ 4500 7650
Wire Wire Line
	4200 7600 4200 7650
Connection ~ 4200 7650
Connection ~ 6650 4750
Connection ~ 6350 4750
Connection ~ 6050 4750
Wire Wire Line
	6950 5250 6950 5200
Wire Wire Line
	6650 5200 6650 5250
Connection ~ 6650 5250
Wire Wire Line
	6350 5200 6350 5250
Connection ~ 6350 5250
Wire Wire Line
	6050 5200 6050 5250
Connection ~ 6050 5250
Connection ~ 5750 4750
Connection ~ 5750 5250
Wire Wire Line
	9050 6200 8950 6200
Wire Wire Line
	9050 6300 8950 6300
Wire Wire Line
	9050 6400 8950 6400
Wire Wire Line
	9050 6500 8950 6500
$Sheet
S 8200 6800 1500 450 
U 560C2E25
F0 "unused_tdc" 50
F1 "sch/unused_tdc.sch" 50
F2 "BOARD_ID0" I L 8200 7050 60 
F3 "TDC_Out-" I R 9700 6950 60 
F4 "TDC_Out+" I R 9700 6850 60 
F5 "C5_In+" I R 9700 7050 60 
F6 "C5_In-" I R 9700 7150 60 
$EndSheet
$Comp
L C C30
U 1 1 560EC797
P 3650 5000
AR Path="/5461E2FD/560EC797" Ref="C30"  Part="1" 
AR Path="/5611711C/560EC797" Ref="C75"  Part="1" 
F 0 "C30" H 3650 5100 40  0000 L CNN
F 1 "0.1uF" H 3656 4915 40  0000 L CNN
F 2 "libcms:SM0402" H 3688 4850 30  0001 C CNN
F 3 "~" H 3650 5000 60  0000 C CNN
F 4 "311-1338-1-ND" H 3650 5000 60  0001 C CNN "Field1"
F 5 "Digikey" H 3650 5000 60  0001 C CNN "Field2"
	1    3650 5000
	1    0    0    -1  
$EndComp
Wire Wire Line
	3950 4750 3950 4800
Wire Wire Line
	4250 4750 4250 4800
Wire Wire Line
	4550 4750 4550 4800
Wire Wire Line
	4850 4750 4850 4800
Wire Wire Line
	5150 4800 5150 4750
Wire Wire Line
	5450 4750 5450 4800
Wire Wire Line
	5750 4800 5750 4750
Wire Wire Line
	6050 4750 6050 4800
Wire Wire Line
	6350 4750 6350 4800
Wire Wire Line
	6650 4750 6650 4800
Wire Wire Line
	6950 4750 6950 4800
Wire Wire Line
	6800 5950 6800 6000
Connection ~ 6500 5950
Wire Wire Line
	7250 5950 7550 5950
Wire Wire Line
	7550 5950 7550 6000
Connection ~ 7250 5950
Wire Wire Line
	8000 5950 8300 5950
Wire Wire Line
	8300 5950 8300 6000
Connection ~ 8000 5950
Wire Wire Line
	6800 6400 6800 6450
Wire Wire Line
	6800 6450 6500 6450
Connection ~ 6500 6450
Wire Wire Line
	7550 6400 7550 6450
Wire Wire Line
	7550 6450 7250 6450
Connection ~ 7250 6450
Wire Wire Line
	8300 6400 8300 6450
Wire Wire Line
	8300 6450 8000 6450
Connection ~ 8000 6450
Text HLabel 8950 5800 0    60   Input ~ 0
nSTATUS
Wire Wire Line
	8950 5800 9050 5800
Text HLabel 8950 5000 0    60   Input ~ 0
nCEO
Text HLabel 10050 5350 2    60   Input ~ 0
TDC_TX
Text HLabel 10050 5450 2    60   Input ~ 0
TDC_RX
Text HLabel 4850 4400 0    60   Input ~ 0
VCC_INT
Text HLabel 4850 4200 0    60   Input ~ 0
VCCA
Text HLabel 4850 4300 0    60   Input ~ 0
VCCD
Wire Wire Line
	8700 6000 9050 6000
Wire Wire Line
	8700 6100 9050 6100
Text Label 8700 6000 0    60   ~ 0
VCCA
Text Label 8700 6100 0    60   ~ 0
VCCD
Wire Wire Line
	4850 4200 5200 4200
Wire Wire Line
	4850 4300 5200 4300
Text Label 5200 4200 2    60   ~ 0
VCCA
Text Label 5200 4300 2    60   ~ 0
VCCD
Text Label 5550 800  2    60   ~ 0
VCCD
Text Label 5550 1000 2    60   ~ 0
VCCA
Text Label 5350 4400 2    60   ~ 0
VCC_INT
Wire Wire Line
	4850 4400 5350 4400
Text Notes 5400 4050 2    80   ~ 0
Local power nets
Wire Wire Line
	2900 4700 3100 4700
Text Label 3100 4550 0    60   ~ 0
VCC_INT
Text Label 6500 5850 0    60   ~ 0
VCC_INT
Text Label 3650 5850 0    60   ~ 0
VCC_INT
Wire Wire Line
	5800 800  5800 1100
Wire Wire Line
	5300 1000 5600 1000
Wire Wire Line
	5600 1000 5600 1100
NoConn ~ 3300 1700
NoConn ~ 3300 1800
NoConn ~ 3300 2900
NoConn ~ 3300 3000
NoConn ~ 3300 3100
NoConn ~ 3300 3200
NoConn ~ 3300 3300
NoConn ~ 7000 700 
NoConn ~ 7000 800 
NoConn ~ 6850 1900
NoConn ~ 6850 2000
NoConn ~ 6850 2200
NoConn ~ 6850 2300
NoConn ~ 7000 3400
NoConn ~ 7000 3500
NoConn ~ 7000 3700
NoConn ~ 7000 3800
NoConn ~ 7000 4000
NoConn ~ 7000 4100
NoConn ~ 7000 4200
NoConn ~ 7000 4300
NoConn ~ 9200 4400
NoConn ~ 9200 4300
NoConn ~ 9200 4200
NoConn ~ 9200 4100
NoConn ~ 9200 4000
NoConn ~ 9200 3800
NoConn ~ 9200 3700
NoConn ~ 9200 3500
NoConn ~ 9200 3400
NoConn ~ 9200 2600
NoConn ~ 9200 2500
NoConn ~ 9200 1000
NoConn ~ 9200 1100
NoConn ~ 9200 1300
NoConn ~ 9200 1400
$Comp
L EP3C5U256_CUSTOM U15
U 2 1 56221381
P 4300 2100
AR Path="/5461E2FD/56221381" Ref="U15"  Part="2" 
AR Path="/5611711C/56221381" Ref="U21"  Part="2" 
F 0 "U15" H 4300 2600 60  0000 C CNN
F 1 "EP3C5U256_CUSTOM" V 4300 1900 60  0000 C CNN
F 2 "integrated_tdc_pcblib:UBGA-256" H 4300 2100 60  0001 C CNN
F 3 "" H 4300 2100 60  0000 C CNN
F 4 "Digikey" H 4300 2100 60  0001 C CNN "Field2"
F 5 "544-2439-ND" H 4300 2100 60  0001 C CNN "Field1"
	2    4300 2100
	1    0    0    -1  
$EndComp
$Comp
L EP3C5U256_CUSTOM U15
U 3 1 562214B0
P 8000 2500
AR Path="/5461E2FD/562214B0" Ref="U15"  Part="3" 
AR Path="/5611711C/562214B0" Ref="U21"  Part="3" 
F 0 "U15" H 8000 3000 60  0000 C CNN
F 1 "EP3C5U256_CUSTOM" V 8000 2300 60  0000 C CNN
F 2 "integrated_tdc_pcblib:UBGA-256" H 8000 2500 60  0001 C CNN
F 3 "" H 8000 2500 60  0000 C CNN
	3    8000 2500
	1    0    0    -1  
$EndComp
$Comp
L EP3C5U256_CUSTOM U15
U 4 1 562215C3
P 10200 2600
AR Path="/5461E2FD/562215C3" Ref="U15"  Part="4" 
AR Path="/5611711C/562215C3" Ref="U21"  Part="4" 
F 0 "U15" H 10200 3100 60  0000 C CNN
F 1 "EP3C5U256_CUSTOM" V 10200 2400 60  0000 C CNN
F 2 "integrated_tdc_pcblib:UBGA-256" H 10200 2600 60  0001 C CNN
F 3 "" H 10200 2600 60  0000 C CNN
	4    10200 2600
	1    0    0    -1  
$EndComp
$Comp
L EP3C5U256_CUSTOM U15
U 9 1 562216CE
P 1900 6100
AR Path="/5461E2FD/562216CE" Ref="U15"  Part="9" 
AR Path="/5611711C/562216CE" Ref="U21"  Part="9" 
F 0 "U15" H 1900 6600 60  0000 C CNN
F 1 "EP3C5U256_CUSTOM" V 1900 5900 60  0000 C CNN
F 2 "integrated_tdc_pcblib:UBGA-256" H 1900 6100 60  0001 C CNN
F 3 "" H 1900 6100 60  0000 C CNN
	9    1900 6100
	1    0    0    -1  
$EndComp
Text Notes 4150 3600 0    60   ~ 0
Bank 2
Text Notes 7550 4500 0    60   ~ 0
Bank 3
Text Notes 9750 4600 0    60   ~ 0
Bank 4
Text Notes 1750 7600 0    60   ~ 0
Power
NoConn ~ 7000 1300
NoConn ~ 7000 1400
$Comp
L C C33
U 1 1 562CDF05
P 3950 5000
AR Path="/5461E2FD/562CDF05" Ref="C33"  Part="1" 
AR Path="/5611711C/562CDF05" Ref="C78"  Part="1" 
F 0 "C33" H 3950 5100 40  0000 L CNN
F 1 "0.1uF" H 3956 4915 40  0000 L CNN
F 2 "libcms:SM0402" H 3988 4850 30  0001 C CNN
F 3 "~" H 3950 5000 60  0000 C CNN
F 4 "311-1338-1-ND" H 3950 5000 60  0001 C CNN "Field1"
F 5 "Digikey" H 3950 5000 60  0001 C CNN "Field2"
	1    3950 5000
	1    0    0    -1  
$EndComp
$Comp
L C C36
U 1 1 562CDFC9
P 4250 5000
AR Path="/5461E2FD/562CDFC9" Ref="C36"  Part="1" 
AR Path="/5611711C/562CDFC9" Ref="C81"  Part="1" 
F 0 "C36" H 4250 5100 40  0000 L CNN
F 1 "0.1uF" H 4256 4915 40  0000 L CNN
F 2 "libcms:SM0402" H 4288 4850 30  0001 C CNN
F 3 "~" H 4250 5000 60  0000 C CNN
F 4 "311-1338-1-ND" H 4250 5000 60  0001 C CNN "Field1"
F 5 "Digikey" H 4250 5000 60  0001 C CNN "Field2"
	1    4250 5000
	1    0    0    -1  
$EndComp
$Comp
L C C39
U 1 1 562CE0A4
P 4550 5000
AR Path="/5461E2FD/562CE0A4" Ref="C39"  Part="1" 
AR Path="/5611711C/562CE0A4" Ref="C84"  Part="1" 
F 0 "C39" H 4550 5100 40  0000 L CNN
F 1 "0.1uF" H 4556 4915 40  0000 L CNN
F 2 "libcms:SM0402" H 4588 4850 30  0001 C CNN
F 3 "~" H 4550 5000 60  0000 C CNN
F 4 "311-1338-1-ND" H 4550 5000 60  0001 C CNN "Field1"
F 5 "Digikey" H 4550 5000 60  0001 C CNN "Field2"
	1    4550 5000
	1    0    0    -1  
$EndComp
$Comp
L C C42
U 1 1 562CE2CC
P 4850 5000
AR Path="/5461E2FD/562CE2CC" Ref="C42"  Part="1" 
AR Path="/5611711C/562CE2CC" Ref="C87"  Part="1" 
F 0 "C42" H 4850 5100 40  0000 L CNN
F 1 "0.1uF" H 4856 4915 40  0000 L CNN
F 2 "libcms:SM0402" H 4888 4850 30  0001 C CNN
F 3 "~" H 4850 5000 60  0000 C CNN
F 4 "311-1338-1-ND" H 4850 5000 60  0001 C CNN "Field1"
F 5 "Digikey" H 4850 5000 60  0001 C CNN "Field2"
	1    4850 5000
	1    0    0    -1  
$EndComp
$Comp
L C C45
U 1 1 562CE2D4
P 5150 5000
AR Path="/5461E2FD/562CE2D4" Ref="C45"  Part="1" 
AR Path="/5611711C/562CE2D4" Ref="C90"  Part="1" 
F 0 "C45" H 5150 5100 40  0000 L CNN
F 1 "0.1uF" H 5156 4915 40  0000 L CNN
F 2 "libcms:SM0402" H 5188 4850 30  0001 C CNN
F 3 "~" H 5150 5000 60  0000 C CNN
F 4 "311-1338-1-ND" H 5150 5000 60  0001 C CNN "Field1"
F 5 "Digikey" H 5150 5000 60  0001 C CNN "Field2"
	1    5150 5000
	1    0    0    -1  
$EndComp
$Comp
L C C49
U 1 1 562CE2DC
P 5450 5000
AR Path="/5461E2FD/562CE2DC" Ref="C49"  Part="1" 
AR Path="/5611711C/562CE2DC" Ref="C94"  Part="1" 
F 0 "C49" H 5450 5100 40  0000 L CNN
F 1 "0.1uF" H 5456 4915 40  0000 L CNN
F 2 "libcms:SM0402" H 5488 4850 30  0001 C CNN
F 3 "~" H 5450 5000 60  0000 C CNN
F 4 "311-1338-1-ND" H 5450 5000 60  0001 C CNN "Field1"
F 5 "Digikey" H 5450 5000 60  0001 C CNN "Field2"
	1    5450 5000
	1    0    0    -1  
$EndComp
$Comp
L C C53
U 1 1 562CE2E4
P 5750 5000
AR Path="/5461E2FD/562CE2E4" Ref="C53"  Part="1" 
AR Path="/5611711C/562CE2E4" Ref="C98"  Part="1" 
F 0 "C53" H 5750 5100 40  0000 L CNN
F 1 "0.1uF" H 5756 4915 40  0000 L CNN
F 2 "libcms:SM0402" H 5788 4850 30  0001 C CNN
F 3 "~" H 5750 5000 60  0000 C CNN
F 4 "311-1338-1-ND" H 5750 5000 60  0001 C CNN "Field1"
F 5 "Digikey" H 5750 5000 60  0001 C CNN "Field2"
	1    5750 5000
	1    0    0    -1  
$EndComp
$Comp
L C C56
U 1 1 562CE407
P 6050 5000
AR Path="/5461E2FD/562CE407" Ref="C56"  Part="1" 
AR Path="/5611711C/562CE407" Ref="C101"  Part="1" 
F 0 "C56" H 6050 5100 40  0000 L CNN
F 1 "0.1uF" H 6056 4915 40  0000 L CNN
F 2 "libcms:SM0402" H 6088 4850 30  0001 C CNN
F 3 "~" H 6050 5000 60  0000 C CNN
F 4 "311-1338-1-ND" H 6050 5000 60  0001 C CNN "Field1"
F 5 "Digikey" H 6050 5000 60  0001 C CNN "Field2"
	1    6050 5000
	1    0    0    -1  
$EndComp
$Comp
L C C58
U 1 1 562CE40F
P 6350 5000
AR Path="/5461E2FD/562CE40F" Ref="C58"  Part="1" 
AR Path="/5611711C/562CE40F" Ref="C103"  Part="1" 
F 0 "C58" H 6350 5100 40  0000 L CNN
F 1 "0.1uF" H 6356 4915 40  0000 L CNN
F 2 "libcms:SM0402" H 6388 4850 30  0001 C CNN
F 3 "~" H 6350 5000 60  0000 C CNN
F 4 "311-1338-1-ND" H 6350 5000 60  0001 C CNN "Field1"
F 5 "Digikey" H 6350 5000 60  0001 C CNN "Field2"
	1    6350 5000
	1    0    0    -1  
$EndComp
$Comp
L C C60
U 1 1 562CE417
P 6650 5000
AR Path="/5461E2FD/562CE417" Ref="C60"  Part="1" 
AR Path="/5611711C/562CE417" Ref="C105"  Part="1" 
F 0 "C60" H 6650 5100 40  0000 L CNN
F 1 "0.1uF" H 6656 4915 40  0000 L CNN
F 2 "libcms:SM0402" H 6688 4850 30  0001 C CNN
F 3 "~" H 6650 5000 60  0000 C CNN
F 4 "311-1338-1-ND" H 6650 5000 60  0001 C CNN "Field1"
F 5 "Digikey" H 6650 5000 60  0001 C CNN "Field2"
	1    6650 5000
	1    0    0    -1  
$EndComp
$Comp
L C C61
U 1 1 562CE41F
P 6950 5000
AR Path="/5461E2FD/562CE41F" Ref="C61"  Part="1" 
AR Path="/5611711C/562CE41F" Ref="C106"  Part="1" 
F 0 "C61" H 6950 5100 40  0000 L CNN
F 1 "0.1uF" H 6956 4915 40  0000 L CNN
F 2 "libcms:SM0402" H 6988 4850 30  0001 C CNN
F 3 "~" H 6950 5000 60  0000 C CNN
F 4 "311-1338-1-ND" H 6950 5000 60  0001 C CNN "Field1"
F 5 "Digikey" H 6950 5000 60  0001 C CNN "Field2"
	1    6950 5000
	1    0    0    -1  
$EndComp
$Comp
L C C31
U 1 1 562CE5EE
P 3650 6200
AR Path="/5461E2FD/562CE5EE" Ref="C31"  Part="1" 
AR Path="/5611711C/562CE5EE" Ref="C76"  Part="1" 
F 0 "C31" H 3650 6300 40  0000 L CNN
F 1 "0.1uF" H 3656 6115 40  0000 L CNN
F 2 "libcms:SM0402" H 3688 6050 30  0001 C CNN
F 3 "~" H 3650 6200 60  0000 C CNN
F 4 "311-1338-1-ND" H 3650 6200 60  0001 C CNN "Field1"
F 5 "Digikey" H 3650 6200 60  0001 C CNN "Field2"
	1    3650 6200
	1    0    0    -1  
$EndComp
$Comp
L C C34
U 1 1 562CE5F6
P 3950 6200
AR Path="/5461E2FD/562CE5F6" Ref="C34"  Part="1" 
AR Path="/5611711C/562CE5F6" Ref="C79"  Part="1" 
F 0 "C34" H 3950 6300 40  0000 L CNN
F 1 "0.1uF" H 3956 6115 40  0000 L CNN
F 2 "libcms:SM0402" H 3988 6050 30  0001 C CNN
F 3 "~" H 3950 6200 60  0000 C CNN
F 4 "311-1338-1-ND" H 3950 6200 60  0001 C CNN "Field1"
F 5 "Digikey" H 3950 6200 60  0001 C CNN "Field2"
	1    3950 6200
	1    0    0    -1  
$EndComp
$Comp
L C C37
U 1 1 562CE5FE
P 4250 6200
AR Path="/5461E2FD/562CE5FE" Ref="C37"  Part="1" 
AR Path="/5611711C/562CE5FE" Ref="C82"  Part="1" 
F 0 "C37" H 4250 6300 40  0000 L CNN
F 1 "0.1uF" H 4256 6115 40  0000 L CNN
F 2 "libcms:SM0402" H 4288 6050 30  0001 C CNN
F 3 "~" H 4250 6200 60  0000 C CNN
F 4 "311-1338-1-ND" H 4250 6200 60  0001 C CNN "Field1"
F 5 "Digikey" H 4250 6200 60  0001 C CNN "Field2"
	1    4250 6200
	1    0    0    -1  
$EndComp
$Comp
L C C40
U 1 1 562CE606
P 4550 6200
AR Path="/5461E2FD/562CE606" Ref="C40"  Part="1" 
AR Path="/5611711C/562CE606" Ref="C85"  Part="1" 
F 0 "C40" H 4550 6300 40  0000 L CNN
F 1 "0.1uF" H 4556 6115 40  0000 L CNN
F 2 "libcms:SM0402" H 4588 6050 30  0001 C CNN
F 3 "~" H 4550 6200 60  0000 C CNN
F 4 "311-1338-1-ND" H 4550 6200 60  0001 C CNN "Field1"
F 5 "Digikey" H 4550 6200 60  0001 C CNN "Field2"
	1    4550 6200
	1    0    0    -1  
$EndComp
$Comp
L C C43
U 1 1 562CE60E
P 4850 6200
AR Path="/5461E2FD/562CE60E" Ref="C43"  Part="1" 
AR Path="/5611711C/562CE60E" Ref="C88"  Part="1" 
F 0 "C43" H 4850 6300 40  0000 L CNN
F 1 "0.1uF" H 4856 6115 40  0000 L CNN
F 2 "libcms:SM0402" H 4888 6050 30  0001 C CNN
F 3 "~" H 4850 6200 60  0000 C CNN
F 4 "311-1338-1-ND" H 4850 6200 60  0001 C CNN "Field1"
F 5 "Digikey" H 4850 6200 60  0001 C CNN "Field2"
	1    4850 6200
	1    0    0    -1  
$EndComp
$Comp
L C C46
U 1 1 562CE616
P 5150 6200
AR Path="/5461E2FD/562CE616" Ref="C46"  Part="1" 
AR Path="/5611711C/562CE616" Ref="C91"  Part="1" 
F 0 "C46" H 5150 6300 40  0000 L CNN
F 1 "0.1uF" H 5156 6115 40  0000 L CNN
F 2 "libcms:SM0402" H 5188 6050 30  0001 C CNN
F 3 "~" H 5150 6200 60  0000 C CNN
F 4 "311-1338-1-ND" H 5150 6200 60  0001 C CNN "Field1"
F 5 "Digikey" H 5150 6200 60  0001 C CNN "Field2"
	1    5150 6200
	1    0    0    -1  
$EndComp
$Comp
L C C50
U 1 1 562CE61E
P 5450 6200
AR Path="/5461E2FD/562CE61E" Ref="C50"  Part="1" 
AR Path="/5611711C/562CE61E" Ref="C95"  Part="1" 
F 0 "C50" H 5450 6300 40  0000 L CNN
F 1 "0.1uF" H 5456 6115 40  0000 L CNN
F 2 "libcms:SM0402" H 5488 6050 30  0001 C CNN
F 3 "~" H 5450 6200 60  0000 C CNN
F 4 "311-1338-1-ND" H 5450 6200 60  0001 C CNN "Field1"
F 5 "Digikey" H 5450 6200 60  0001 C CNN "Field2"
	1    5450 6200
	1    0    0    -1  
$EndComp
$Comp
L C C54
U 1 1 562CE626
P 5750 6200
AR Path="/5461E2FD/562CE626" Ref="C54"  Part="1" 
AR Path="/5611711C/562CE626" Ref="C99"  Part="1" 
F 0 "C54" H 5750 6300 40  0000 L CNN
F 1 "0.1uF" H 5756 6115 40  0000 L CNN
F 2 "libcms:SM0402" H 5788 6050 30  0001 C CNN
F 3 "~" H 5750 6200 60  0000 C CNN
F 4 "311-1338-1-ND" H 5750 6200 60  0001 C CNN "Field1"
F 5 "Digikey" H 5750 6200 60  0001 C CNN "Field2"
	1    5750 6200
	1    0    0    -1  
$EndComp
$Comp
L C C32
U 1 1 562CEA89
P 4000 7400
AR Path="/5461E2FD/562CEA89" Ref="C32"  Part="1" 
AR Path="/5611711C/562CEA89" Ref="C77"  Part="1" 
F 0 "C32" H 4000 7500 40  0000 L CNN
F 1 "0.1uF" H 4006 7315 40  0000 L CNN
F 2 "libcms:SM0402" H 4038 7250 30  0001 C CNN
F 3 "~" H 4000 7400 60  0000 C CNN
F 4 "311-1338-1-ND" H 4000 7400 60  0001 C CNN "Field1"
F 5 "Digikey" H 4000 7400 60  0001 C CNN "Field2"
	1    4000 7400
	1    0    0    -1  
$EndComp
$Comp
L C C35
U 1 1 562CEA91
P 4200 7400
AR Path="/5461E2FD/562CEA91" Ref="C35"  Part="1" 
AR Path="/5611711C/562CEA91" Ref="C80"  Part="1" 
F 0 "C35" H 4200 7500 40  0000 L CNN
F 1 "0.1uF" H 4206 7315 40  0000 L CNN
F 2 "libcms:SM0402" H 4238 7250 30  0001 C CNN
F 3 "~" H 4200 7400 60  0000 C CNN
F 4 "311-1338-1-ND" H 4200 7400 60  0001 C CNN "Field1"
F 5 "Digikey" H 4200 7400 60  0001 C CNN "Field2"
	1    4200 7400
	1    0    0    -1  
$EndComp
$Comp
L C C38
U 1 1 562CEA99
P 4500 7400
AR Path="/5461E2FD/562CEA99" Ref="C38"  Part="1" 
AR Path="/5611711C/562CEA99" Ref="C83"  Part="1" 
F 0 "C38" H 4500 7500 40  0000 L CNN
F 1 "0.1uF" H 4506 7315 40  0000 L CNN
F 2 "libcms:SM0402" H 4538 7250 30  0001 C CNN
F 3 "~" H 4500 7400 60  0000 C CNN
F 4 "311-1338-1-ND" H 4500 7400 60  0001 C CNN "Field1"
F 5 "Digikey" H 4500 7400 60  0001 C CNN "Field2"
	1    4500 7400
	1    0    0    -1  
$EndComp
$Comp
L C C41
U 1 1 562CEAA1
P 4800 7400
AR Path="/5461E2FD/562CEAA1" Ref="C41"  Part="1" 
AR Path="/5611711C/562CEAA1" Ref="C86"  Part="1" 
F 0 "C41" H 4800 7500 40  0000 L CNN
F 1 "0.1uF" H 4806 7315 40  0000 L CNN
F 2 "libcms:SM0402" H 4838 7250 30  0001 C CNN
F 3 "~" H 4800 7400 60  0000 C CNN
F 4 "311-1338-1-ND" H 4800 7400 60  0001 C CNN "Field1"
F 5 "Digikey" H 4800 7400 60  0001 C CNN "Field2"
	1    4800 7400
	1    0    0    -1  
$EndComp
$Comp
L C C44
U 1 1 562CEAA9
P 5100 7400
AR Path="/5461E2FD/562CEAA9" Ref="C44"  Part="1" 
AR Path="/5611711C/562CEAA9" Ref="C89"  Part="1" 
F 0 "C44" H 5100 7500 40  0000 L CNN
F 1 "0.1uF" H 5106 7315 40  0000 L CNN
F 2 "libcms:SM0402" H 5138 7250 30  0001 C CNN
F 3 "~" H 5100 7400 60  0000 C CNN
F 4 "311-1338-1-ND" H 5100 7400 60  0001 C CNN "Field1"
F 5 "Digikey" H 5100 7400 60  0001 C CNN "Field2"
	1    5100 7400
	1    0    0    -1  
$EndComp
$Comp
L C C47
U 1 1 562CEAB1
P 5400 7400
AR Path="/5461E2FD/562CEAB1" Ref="C47"  Part="1" 
AR Path="/5611711C/562CEAB1" Ref="C92"  Part="1" 
F 0 "C47" H 5400 7500 40  0000 L CNN
F 1 "0.1uF" H 5406 7315 40  0000 L CNN
F 2 "libcms:SM0402" H 5438 7250 30  0001 C CNN
F 3 "~" H 5400 7400 60  0000 C CNN
F 4 "311-1338-1-ND" H 5400 7400 60  0001 C CNN "Field1"
F 5 "Digikey" H 5400 7400 60  0001 C CNN "Field2"
	1    5400 7400
	1    0    0    -1  
$EndComp
$Comp
L C C51
U 1 1 562CEAB9
P 5700 7400
AR Path="/5461E2FD/562CEAB9" Ref="C51"  Part="1" 
AR Path="/5611711C/562CEAB9" Ref="C96"  Part="1" 
F 0 "C51" H 5700 7500 40  0000 L CNN
F 1 "0.1uF" H 5706 7315 40  0000 L CNN
F 2 "libcms:SM0402" H 5738 7250 30  0001 C CNN
F 3 "~" H 5700 7400 60  0000 C CNN
F 4 "311-1338-1-ND" H 5700 7400 60  0001 C CNN "Field1"
F 5 "Digikey" H 5700 7400 60  0001 C CNN "Field2"
	1    5700 7400
	1    0    0    -1  
$EndComp
$Comp
L C C55
U 1 1 562CEAC1
P 6000 7400
AR Path="/5461E2FD/562CEAC1" Ref="C55"  Part="1" 
AR Path="/5611711C/562CEAC1" Ref="C100"  Part="1" 
F 0 "C55" H 6000 7500 40  0000 L CNN
F 1 "0.1uF" H 6006 7315 40  0000 L CNN
F 2 "libcms:SM0402" H 6038 7250 30  0001 C CNN
F 3 "~" H 6000 7400 60  0000 C CNN
F 4 "311-1338-1-ND" H 6000 7400 60  0001 C CNN "Field1"
F 5 "Digikey" H 6000 7400 60  0001 C CNN "Field2"
	1    6000 7400
	1    0    0    -1  
$EndComp
$Comp
L C C59
U 1 1 562CF663
P 6800 6200
AR Path="/5461E2FD/562CF663" Ref="C59"  Part="1" 
AR Path="/5611711C/562CF663" Ref="C104"  Part="1" 
F 0 "C59" H 6800 6300 40  0000 L CNN
F 1 "10uF" H 6806 6115 40  0000 L CNN
F 2 "libcms:SM0603_Capa" H 6838 6050 30  0001 C CNN
F 3 "~" H 6800 6200 60  0000 C CNN
F 4 "445-4112-1-ND" H 6800 6200 60  0001 C CNN "Field1"
F 5 "Digikey" H 6800 6200 60  0001 C CNN "Field2"
	1    6800 6200
	1    0    0    -1  
$EndComp
$Comp
L C C62
U 1 1 562CF76B
P 7250 6200
AR Path="/5461E2FD/562CF76B" Ref="C62"  Part="1" 
AR Path="/5611711C/562CF76B" Ref="C107"  Part="1" 
F 0 "C62" H 7250 6300 40  0000 L CNN
F 1 "10uF" H 7256 6115 40  0000 L CNN
F 2 "libcms:SM0603_Capa" H 7288 6050 30  0001 C CNN
F 3 "~" H 7250 6200 60  0000 C CNN
F 4 "445-4112-1-ND" H 7250 6200 60  0001 C CNN "Field1"
F 5 "Digikey" H 7250 6200 60  0001 C CNN "Field2"
	1    7250 6200
	1    0    0    -1  
$EndComp
$Comp
L C C63
U 1 1 562CF890
P 7550 6200
AR Path="/5461E2FD/562CF890" Ref="C63"  Part="1" 
AR Path="/5611711C/562CF890" Ref="C108"  Part="1" 
F 0 "C63" H 7550 6300 40  0000 L CNN
F 1 "10uF" H 7556 6115 40  0000 L CNN
F 2 "libcms:SM0603_Capa" H 7588 6050 30  0001 C CNN
F 3 "~" H 7550 6200 60  0000 C CNN
F 4 "445-4112-1-ND" H 7550 6200 60  0001 C CNN "Field1"
F 5 "Digikey" H 7550 6200 60  0001 C CNN "Field2"
	1    7550 6200
	1    0    0    -1  
$EndComp
$Comp
L C C64
U 1 1 562CFAA2
P 8000 6200
AR Path="/5461E2FD/562CFAA2" Ref="C64"  Part="1" 
AR Path="/5611711C/562CFAA2" Ref="C109"  Part="1" 
F 0 "C64" H 8000 6300 40  0000 L CNN
F 1 "10uF" H 8006 6115 40  0000 L CNN
F 2 "libcms:SM0603_Capa" H 8038 6050 30  0001 C CNN
F 3 "~" H 8000 6200 60  0000 C CNN
F 4 "445-4112-1-ND" H 8000 6200 60  0001 C CNN "Field1"
F 5 "Digikey" H 8000 6200 60  0001 C CNN "Field2"
	1    8000 6200
	1    0    0    -1  
$EndComp
$Comp
L C C65
U 1 1 562CFCBC
P 8300 6200
AR Path="/5461E2FD/562CFCBC" Ref="C65"  Part="1" 
AR Path="/5611711C/562CFCBC" Ref="C110"  Part="1" 
F 0 "C65" H 8300 6300 40  0000 L CNN
F 1 "10uF" H 8306 6115 40  0000 L CNN
F 2 "libcms:SM0603_Capa" H 8338 6050 30  0001 C CNN
F 3 "~" H 8300 6200 60  0000 C CNN
F 4 "445-4112-1-ND" H 8300 6200 60  0001 C CNN "Field1"
F 5 "Digikey" H 8300 6200 60  0001 C CNN "Field2"
	1    8300 6200
	1    0    0    -1  
$EndComp
$Comp
L C C48
U 1 1 562D0F30
P 5600 1300
AR Path="/5461E2FD/562D0F30" Ref="C48"  Part="1" 
AR Path="/5611711C/562D0F30" Ref="C93"  Part="1" 
F 0 "C48" H 5600 1400 40  0000 L CNN
F 1 "1uF" H 5606 1215 40  0000 L CNN
F 2 "libcms:SM0402" H 5638 1150 30  0001 C CNN
F 3 "~" H 5600 1300 60  0000 C CNN
F 4 "490-9665-1-ND" H 5600 1300 60  0001 C CNN "Field1"
F 5 "Digikey" H 5600 1300 60  0001 C CNN "Field2"
	1    5600 1300
	1    0    0    -1  
$EndComp
$Comp
L C C52
U 1 1 562D0F39
P 5800 1300
AR Path="/5461E2FD/562D0F39" Ref="C52"  Part="1" 
AR Path="/5611711C/562D0F39" Ref="C97"  Part="1" 
F 0 "C52" H 5800 1400 40  0000 L CNN
F 1 "1uF" H 5806 1215 40  0000 L CNN
F 2 "libcms:SM0402" H 5838 1150 30  0001 C CNN
F 3 "~" H 5800 1300 60  0000 C CNN
F 4 "490-9665-1-ND" H 5800 1300 60  0001 C CNN "Field1"
F 5 "Digikey" H 5800 1300 60  0001 C CNN "Field2"
	1    5800 1300
	1    0    0    -1  
$EndComp
Wire Wire Line
	9700 7050 9850 7050
Wire Wire Line
	9700 7150 9850 7150
NoConn ~ 3300 800 
NoConn ~ 3300 900 
$Comp
L C C113
U 1 1 56439B8D
P 3800 7400
AR Path="/5461E2FD/56439B8D" Ref="C113"  Part="1" 
AR Path="/5611711C/56439B8D" Ref="C114"  Part="1" 
F 0 "C113" H 3800 7500 40  0000 L CNN
F 1 "0.1uF" H 3806 7315 40  0000 L CNN
F 2 "libcms:SM0402" H 3838 7250 30  0001 C CNN
F 3 "~" H 3800 7400 60  0000 C CNN
F 4 "311-1338-1-ND" H 3800 7400 60  0001 C CNN "Field1"
F 5 "Digikey" H 3800 7400 60  0001 C CNN "Field2"
	1    3800 7400
	1    0    0    -1  
$EndComp
$Comp
L C C115
U 1 1 5643D033
P 3600 7400
AR Path="/5461E2FD/5643D033" Ref="C115"  Part="1" 
AR Path="/5611711C/5643D033" Ref="C116"  Part="1" 
F 0 "C115" H 3600 7500 40  0000 L CNN
F 1 "0.1uF" H 3606 7315 40  0000 L CNN
F 2 "libcms:SM0402" H 3638 7250 30  0001 C CNN
F 3 "~" H 3600 7400 60  0000 C CNN
F 4 "311-1338-1-ND" H 3600 7400 60  0001 C CNN "Field1"
F 5 "Digikey" H 3600 7400 60  0001 C CNN "Field2"
	1    3600 7400
	1    0    0    -1  
$EndComp
Wire Wire Line
	3600 7100 3600 7200
Connection ~ 3600 7150
Wire Wire Line
	3800 7200 3800 7150
Connection ~ 3800 7150
Wire Wire Line
	4000 7200 4000 7150
Connection ~ 4000 7150
Wire Wire Line
	3600 7600 3600 7750
Connection ~ 3600 7650
Wire Wire Line
	3800 7600 3800 7650
Connection ~ 3800 7650
Wire Wire Line
	4000 7600 4000 7650
Connection ~ 4000 7650
$Sheet
S 9050 4700 950  1900
U 5604C950
F0 "Device Configuration" 50
F1 "sch/Configuration.sch" 50
F2 "TMS" I L 9050 6200 60 
F3 "TDI" I L 9050 6400 60 
F4 "TDO" I L 9050 6300 60 
F5 "TCK" I L 9050 6500 60 
F6 "DATA0" I L 9050 4800 60 
F7 "nCE" I L 9050 4900 60 
F8 "DCLK" I L 9050 5500 60 
F9 "CONF_DONE" I L 9050 5600 60 
F10 "nCONFIG" I L 9050 5700 60 
F11 "nSTATUS" I L 9050 5800 60 
F12 "nCEO" I L 9050 5000 60 
F13 "TDC_TX" I R 10000 5350 60 
F14 "TDC_RX" I R 10000 5450 60 
F15 "VCCA" I L 9050 6000 60 
F16 "VCCD" I L 9050 6100 60 
F17 "Slow_Control_TX" I L 9050 5100 60 
F18 "Slow_Control_RX" I L 9050 5200 60 
F19 "BOARD_ID1" I R 10000 5900 60 
F20 "INIT_DONE" I L 9050 5400 60 
$EndSheet
Wire Wire Line
	9050 5100 8950 5100
Wire Wire Line
	8950 5200 9050 5200
Wire Wire Line
	8100 7050 8200 7050
Wire Wire Line
	10000 5350 10050 5350
Wire Wire Line
	10000 5450 10050 5450
Wire Wire Line
	10000 5900 10200 5900
Wire Wire Line
	8950 5400 9050 5400
Text HLabel 8950 5400 0    60   Input ~ 0
INIT_DONE
$EndSCHEMATC
