/*
WARNING: Do NOT edit the input and output ports in this file in a text
editor if you plan to continue editing the block that represents it in
the Block Editor! File corruption is VERY likely to occur.
*/
/*
Copyright (C) 1991-2013 Altera Corporation
Your use of Altera Corporation's design tools, logic functions 
and other software and tools, and its AMPP partner logic 
functions, and any output files from any of the foregoing 
(including device programming or simulation files), and any 
associated documentation or information are expressly subject 
to the terms and conditions of the Altera Program License 
Subscription Agreement, Altera MegaCore Function License 
Agreement, or other applicable license agreement, including, 
without limitation, that your use is for the sole purpose of 
programming logic devices manufactured by Altera and sold by 
Altera or its authorized distributors.  Please refer to the 
applicable agreement for further details.
*/
//#pragma file_not_in_maxplusii_format
(header "graphic" (version "1.4"))
(properties
	(page_setup "header_footer\nDate: %D\n%f\nProject: %j\n\nPage %p of %P\nRevision: %a\nmargin\n0.2\n0.2\n0.2\n0.2\norientation\n2\npaper_size\n3\npaper_source\n15\nfit_page_wide\n1\nfit_page_tall\n1\n")
)
(pin
	(input)
	(rect 208 248 376 264)
	(text "INPUT" (rect 133 0 161 9)(font "Arial" (font_size 6)))
	(text "CK200" (rect 5 0 38 10)(font "Arial" ))
	(pt 168 8)
	(drawing
		(line (pt 92 12)(pt 117 12))
		(line (pt 92 4)(pt 117 4))
		(line (pt 121 8)(pt 168 8))
		(line (pt 92 12)(pt 92 4))
		(line (pt 117 4)(pt 121 8))
		(line (pt 117 12)(pt 121 8))
	)
	(text "VCC" (rect 136 7 156 16)(font "Arial" (font_size 6)))
)
(pin
	(input)
	(rect 208 120 376 136)
	(text "INPUT" (rect 133 0 161 9)(font "Arial" (font_size 6)))
	(text "LD" (rect 5 0 19 10)(font "Arial" ))
	(pt 168 8)
	(drawing
		(line (pt 92 12)(pt 117 12))
		(line (pt 92 4)(pt 117 4))
		(line (pt 121 8)(pt 168 8))
		(line (pt 92 12)(pt 92 4))
		(line (pt 117 4)(pt 121 8))
		(line (pt 117 12)(pt 121 8))
	)
	(text "VCC" (rect 136 7 156 16)(font "Arial" (font_size 6)))
)
(pin
	(input)
	(rect 208 168 376 184)
	(text "INPUT" (rect 133 0 161 9)(font "Arial" (font_size 6)))
	(text "Shift1" (rect 5 0 32 10)(font "Arial" ))
	(pt 168 8)
	(drawing
		(line (pt 92 12)(pt 117 12))
		(line (pt 92 4)(pt 117 4))
		(line (pt 121 8)(pt 168 8))
		(line (pt 92 12)(pt 92 4))
		(line (pt 117 4)(pt 121 8))
		(line (pt 117 12)(pt 121 8))
	)
	(text "VCC" (rect 136 7 156 16)(font "Arial" (font_size 6)))
)
(pin
	(input)
	(rect 208 24 376 40)
	(text "INPUT" (rect 133 0 161 9)(font "Arial" (font_size 6)))
	(text "DD[31..0]" (rect 5 0 49 10)(font "Arial" ))
	(pt 168 8)
	(drawing
		(line (pt 92 12)(pt 117 12))
		(line (pt 92 4)(pt 117 4))
		(line (pt 121 8)(pt 168 8))
		(line (pt 92 12)(pt 92 4))
		(line (pt 117 4)(pt 121 8))
		(line (pt 117 12)(pt 121 8))
	)
	(text "VCC" (rect 136 7 156 16)(font "Arial" (font_size 6)))
)
(pin
	(input)
	(rect 208 208 376 224)
	(text "INPUT" (rect 133 0 161 9)(font "Arial" (font_size 6)))
	(text "BB[31..0]" (rect 5 0 48 10)(font "Arial" ))
	(pt 168 8)
	(drawing
		(line (pt 92 12)(pt 117 12))
		(line (pt 92 4)(pt 117 4))
		(line (pt 121 8)(pt 168 8))
		(line (pt 92 12)(pt 92 4))
		(line (pt 117 4)(pt 121 8))
		(line (pt 117 12)(pt 121 8))
	)
	(text "VCC" (rect 136 7 156 16)(font "Arial" (font_size 6)))
)
(pin
	(output)
	(rect 840 32 1016 48)
	(text "OUTPUT" (rect 1 0 39 9)(font "Arial" (font_size 6)))
	(text "QQ[31..0]" (rect 90 0 136 10)(font "Arial" ))
	(pt 0 8)
	(drawing
		(line (pt 0 8)(pt 52 8))
		(line (pt 52 4)(pt 78 4))
		(line (pt 52 12)(pt 78 12))
		(line (pt 52 12)(pt 52 4))
		(line (pt 78 4)(pt 82 8))
		(line (pt 82 8)(pt 78 12))
		(line (pt 78 12)(pt 82 8))
	)
)
(symbol
	(rect 288 760 320 792)
	(text "GND" (rect 6 8 15 29)(font "Arial" (font_size 6))(vertical))
	(text "inst30" (rect -1 3 9 31)(font "Arial" )(vertical)(invisible))
	(port
		(pt 32 16)
		(output)
		(text "1" (rect 18 0 26 11)(font "Courier New" (bold))(invisible))
		(text "1" (rect 20 18 31 26)(font "Courier New" (bold))(vertical)(invisible))
		(line (pt 24 16)(pt 32 16))
	)
	(drawing
		(line (pt 24 8)(pt 16 16))
		(line (pt 16 16)(pt 24 24))
		(line (pt 24 8)(pt 24 24))
	)
	(rotate270)
)
(symbol
	(rect 760 16 824 96)
	(text "DFFE" (rect 1 0 25 9)(font "Arial" (font_size 6)))
	(text "inst3" (rect 3 68 25 78)(font "Arial" ))
	(port
		(pt 32 0)
		(input)
		(text "PRN" (rect 24 13 44 24)(font "Courier New" (bold)))
		(text "PRN" (rect 24 11 44 22)(font "Courier New" (bold)))
		(line (pt 32 4)(pt 32 0))
	)
	(port
		(pt 32 80)
		(input)
		(text "CLRN" (rect 21 59 46 70)(font "Courier New" (bold)))
		(text "CLRN" (rect 21 58 46 69)(font "Courier New" (bold)))
		(line (pt 32 80)(pt 32 76))
	)
	(port
		(pt 0 24)
		(input)
		(text "D" (rect 14 20 22 31)(font "Courier New" (bold)))
		(text "D" (rect 14 20 22 31)(font "Courier New" (bold)))
		(line (pt 0 24)(pt 12 24))
	)
	(port
		(pt 0 40)
		(input)
		(text "CLK" (rect 2 28 23 39)(font "Courier New" (bold))(invisible))
		(text "CLK" (rect 2 28 23 39)(font "Courier New" (bold))(invisible))
		(line (pt 0 40)(pt 12 40))
	)
	(port
		(pt 0 56)
		(input)
		(text "ENA" (rect 14 50 35 61)(font "Courier New" (bold)))
		(text "ENA" (rect 14 50 35 61)(font "Courier New" (bold)))
		(line (pt 0 56)(pt 12 56))
	)
	(port
		(pt 64 24)
		(output)
		(text "Q" (rect 44 20 52 31)(font "Courier New" (bold)))
		(text "Q" (rect 44 20 52 31)(font "Courier New" (bold)))
		(line (pt 53 24)(pt 64 24))
	)
	(drawing
		(line (pt 12 68)(pt 52 68))
		(line (pt 12 12)(pt 52 12))
		(line (pt 52 68)(pt 52 12))
		(line (pt 12 68)(pt 12 12))
		(line (pt 12 34)(pt 19 41))
		(line (pt 18 41)(pt 12 47))
		(circle (rect 28 4 36 12))
		(circle (rect 28 68 36 76))
	)
)
(symbol
	(rect 648 144 712 192)
	(text "OR2" (rect 1 0 22 9)(font "Arial" (font_size 6)))
	(text "inst" (rect 3 37 19 47)(font "Arial" ))
	(port
		(pt 0 32)
		(input)
		(text "IN2" (rect 2 23 22 34)(font "Courier New" (bold))(invisible))
		(text "IN2" (rect 2 23 22 34)(font "Courier New" (bold))(invisible))
		(line (pt 0 32)(pt 15 32))
	)
	(port
		(pt 0 16)
		(input)
		(text "IN1" (rect 2 7 23 18)(font "Courier New" (bold))(invisible))
		(text "IN1" (rect 2 7 23 18)(font "Courier New" (bold))(invisible))
		(line (pt 0 16)(pt 15 16))
	)
	(port
		(pt 64 24)
		(output)
		(text "OUT" (rect 48 15 69 26)(font "Courier New" (bold))(invisible))
		(text "OUT" (rect 48 15 69 26)(font "Courier New" (bold))(invisible))
		(line (pt 48 24)(pt 64 24))
	)
	(drawing
		(line (pt 14 36)(pt 25 36))
		(line (pt 14 13)(pt 25 13))
		(arc (pt 7 29)(pt 7 19)(rect -14 8 19 41))
		(arc (pt 49 24)(pt 25 13)(rect -6 13 57 76))
		(arc (pt 25 35)(pt 49 24)(rect -6 -27 57 36))
	)
)
(symbol
	(rect 536 -8 680 72)
	(text "lpm_mux8" (rect 43 0 113 15)(font "Arial" (font_size 10)))
	(text "inst1" (rect 8 66 30 76)(font "Arial" ))
	(port
		(pt 0 40)
		(input)
		(text "data1x[31..0]" (rect 0 0 75 12)(font "Arial" (font_size 8)))
		(text "data1x[31..0]" (rect 4 27 79 39)(font "Arial" (font_size 8)))
		(line (pt 0 40)(pt 64 40)(line_width 3))
	)
	(port
		(pt 0 56)
		(input)
		(text "data0x[31..0]" (rect 0 0 75 12)(font "Arial" (font_size 8)))
		(text "data0x[31..0]" (rect 4 43 79 55)(font "Arial" (font_size 8)))
		(line (pt 0 56)(pt 64 56)(line_width 3))
	)
	(port
		(pt 72 80)
		(input)
		(text "sel" (rect 0 0 12 17)(font "Arial" (font_size 8))(vertical))
		(text "sel" (rect 66 50 78 67)(font "Arial" (font_size 8))(vertical))
		(line (pt 72 80)(pt 72 68))
	)
	(port
		(pt 144 48)
		(output)
		(text "result[31..0]" (rect 0 0 68 12)(font "Arial" (font_size 8)))
		(text "result[31..0]" (rect 84 35 152 47)(font "Arial" (font_size 8)))
		(line (pt 144 48)(pt 80 48)(line_width 3))
	)
	(drawing
		(line (pt 64 24)(pt 64 72))
		(line (pt 64 24)(pt 80 32))
		(line (pt 64 72)(pt 80 64))
		(line (pt 80 32)(pt 80 64))
		(line (pt 0 0)(pt 146 0))
		(line (pt 146 0)(pt 146 82))
		(line (pt 0 82)(pt 146 82))
		(line (pt 0 0)(pt 0 82))
		(line (pt 0 0)(pt 0 0))
		(line (pt 0 0)(pt 0 0))
		(line (pt 0 0)(pt 0 0))
		(line (pt 0 0)(pt 0 0))
	)
)
(connector
	(text "zzz[127..0]" (rect 339 760 390 770)(font "Arial" ))
	(pt 320 776)
	(pt 416 776)
	(bus)
)
(connector
	(text "CK200" (rect 728 40 761 50)(font "Arial" ))
	(pt 760 56)
	(pt 720 56)
)
(connector
	(pt 736 168)
	(pt 736 72)
)
(connector
	(pt 736 72)
	(pt 760 72)
)
(connector
	(pt 824 40)
	(pt 840 40)
	(bus)
)
(connector
	(pt 712 168)
	(pt 736 168)
)
(connector
	(pt 624 160)
	(pt 648 160)
)
(connector
	(pt 648 176)
	(pt 376 176)
)
(connector
	(pt 624 128)
	(pt 624 160)
)
(connector
	(pt 608 128)
	(pt 608 72)
)
(connector
	(pt 456 216)
	(pt 376 216)
	(bus)
)
(connector
	(pt 456 216)
	(pt 456 48)
	(bus)
)
(connector
	(pt 376 32)
	(pt 536 32)
	(bus)
)
(connector
	(pt 456 48)
	(pt 536 48)
	(bus)
)
(connector
	(pt 680 40)
	(pt 760 40)
	(bus)
)
(connector
	(pt 376 128)
	(pt 608 128)
)
(connector
	(pt 608 128)
	(pt 624 128)
)
(junction (pt 608 128))
