PCBNEW-LibModule-V1  Fri 21 Nov 2014 03:45:36 PM EST
# encoding utf-8
Units mm
$INDEX
30310-5002HB
$EndINDEX
$MODULE 30310-5002HB
Po 0 0 0 15 546FA463 00000000 ~~
Li 30310-5002HB
Sc 0
AR 
Op 0 0 0
T0 0 -3.81 1 1 0 0.15 N V 21 N "30310-5002HB"
T1 0 3.81 1 1 0 0.15 N V 21 N "VAL**"
DS 10.16 5.08 -10.16 5.08 0.15 21
DS -10.16 -5.08 10.16 -5.08 0.15 21
DS -10.16 -5.08 -10.16 5.08 0.15 21
DS 10.16 -5.08 10.16 5.08 0.15 21
DS 6.35 -2.54 6.35 2.54 0.15 21
DS 6.35 2.54 -6.35 2.54 0.15 21
DS -6.35 2.54 -6.35 -2.54 0.15 21
DS -6.35 -2.54 6.35 -2.54 0.15 21
$PAD
Sh "1" C 1.524 1.524 0 0 0
Dr 1.016 0 0
At STD N 00E0FFFF
Ne 0 ""
Po -5.08 1.27
$EndPAD
$PAD
Sh "2" C 1.524 1.524 0 0 0
Dr 1.016 0 0
At STD N 00E0FFFF
Ne 0 ""
Po -5.08 -1.27
$EndPAD
$PAD
Sh "3" C 1.524 1.524 0 0 0
Dr 1.016 0 0
At STD N 00E0FFFF
Ne 0 ""
Po -2.54 1.27
$EndPAD
$PAD
Sh "4" C 1.524 1.524 0 0 0
Dr 1.016 0 0
At STD N 00E0FFFF
Ne 0 ""
Po -2.54 -1.27
$EndPAD
$PAD
Sh "5" C 1.524 1.524 0 0 0
Dr 1.016 0 0
At STD N 00E0FFFF
Ne 0 ""
Po 0 1.27
$EndPAD
$PAD
Sh "6" C 1.524 1.524 0 0 0
Dr 1.016 0 0
At STD N 00E0FFFF
Ne 0 ""
Po 0 -1.27
$EndPAD
$PAD
Sh "7" C 1.524 1.524 0 0 0
Dr 1.016 0 0
At STD N 00E0FFFF
Ne 0 ""
Po 2.54 1.27
$EndPAD
$PAD
Sh "8" C 1.524 1.524 0 0 0
Dr 1.016 0 0
At STD N 00E0FFFF
Ne 0 ""
Po 2.54 -1.27
$EndPAD
$PAD
Sh "9" C 1.524 1.524 0 0 0
Dr 1.016 0 0
At STD N 00E0FFFF
Ne 0 ""
Po 5.08 1.27
$EndPAD
$PAD
Sh "10" C 1.524 1.524 0 0 0
Dr 1.016 0 0
At STD N 00E0FFFF
Ne 0 ""
Po 5.08 -1.27
$EndPAD
$EndMODULE 30310-5002HB
$EndLIBRARY
