(module WS2812B (layer F.Cu) (tedit 562A55AA)
  (attr smd)
  (fp_text reference REF** (at 1.75 -5.5) (layer F.SilkS)
    (effects (font (size 1 1) (thickness 0.15)))
  )
  (fp_text value WS2812B (at 2.6 1.7) (layer F.Fab)
    (effects (font (size 1 1) (thickness 0.15)))
  )
  (fp_circle (center -1.6 -4.9) (end -1.3 -4.7) (layer F.SilkS) (width 0.15))
  (fp_line (start -1 -4.5) (end -1 0.7) (layer F.SilkS) (width 0.15))
  (fp_line (start -1 0.7) (end 5.9 0.7) (layer F.SilkS) (width 0.15))
  (fp_line (start 5.9 0.7) (end 5.9 -4.5) (layer F.SilkS) (width 0.15))
  (fp_line (start 5.9 -4.5) (end -1 -4.5) (layer F.SilkS) (width 0.15))
  (pad 4 smd rect (at 4.9 -3.75) (size 1.5 0.9) (layers F.Cu F.Paste F.Mask))
  (pad 3 smd rect (at 4.9 0) (size 1.5 0.9) (layers F.Cu F.Paste F.Mask))
  (pad 2 smd rect (at 0 0) (size 1.5 0.9) (layers F.Cu F.Paste F.Mask))
  (pad 1 smd rect (at 0 -3.75) (size 1.5 0.9) (layers F.Cu F.Paste F.Mask))
)
