PCBNEW-LibModule-V1  Thu 18 Jun 2015 11:56:40 AM EDT
# encoding utf-8
Units mm
$INDEX
ATMega328
$EndINDEX
$MODULE ATMega328
Po 0 0 0 15 5582EA2A 00000000 ~~
Li ATMega328
Sc 0
AR /54D1452A
Op 0 0 0
At SMD
T0 -4.9344 0.2492 1.016 1.016 0 0.1524 N V 21 N "U3"
T1 0 -3 1 1 0 0.15 N I 21 N "ATMEGA328_28MLF"
T2 -2.464 -2.486 0.508 0.508 0 0.127 N V 21 N "1"
DC -1.143 -1.143 -1.016 -0.889 0.15 21
DS 2 -2 2 2 0.15 21
DS 2 2 -2 2 0.15 21
DS -2 2 -2 -2 0.15 21
DS -2 -2 2 -2 0.15 21
$PAD
Sh "18" R 0.8 0.25 0 0 1800
Dr 0 0 0
At SMD N 00888000
Ne 4 "GND"
Po 2 0
.LocalClearance 0.07
$EndPAD
$PAD
Sh "19" R 0.8 0.25 0 0 1800
Dr 0 0 0
At SMD N 00888000
Ne 7 "N-0000012"
Po 2 -0.45
.LocalClearance 0.07
$EndPAD
$PAD
Sh "20" R 0.8 0.25 0 0 1800
Dr 0 0 0
At SMD N 00888000
Ne 15 "N-0000027"
Po 2 -0.9
.LocalClearance 0.07
$EndPAD
$PAD
Sh "21" O 0.8 0.25 0 0 1800
Dr 0 0 0
At SMD N 00888000
Ne 13 "N-0000024"
Po 2 -1.35
.LocalClearance 0.07
$EndPAD
$PAD
Sh "17" R 0.8 0.25 0 0 1800
Dr 0 0 0
At SMD N 00888000
Ne 4 "GND"
Po 2 0.45
.LocalClearance 0.07
$EndPAD
$PAD
Sh "16" R 0.8 0.25 0 0 1800
Dr 0 0 0
At SMD N 00888000
Ne 1 "+3.3V"
Po 2 0.9
.LocalClearance 0.07
$EndPAD
$PAD
Sh "15" O 0.8 0.25 0 0 1800
Dr 0 0 0
At SMD N 00888000
Ne 10 "N-0000017"
Po 2 1.35
.LocalClearance 0.07
$EndPAD
$PAD
Sh "26" R 0.8 0.25 0 0 2700
Dr 0 0 0
At SMD N 00888000
Ne 2 "/RXD"
Po -0.45 -2
.LocalClearance 0.07
$EndPAD
$PAD
Sh "27" R 0.8 0.25 0 0 2700
Dr 0 0 0
At SMD N 00888000
Ne 3 "/TXD"
Po -0.9 -2
.LocalClearance 0.07
$EndPAD
$PAD
Sh "28" O 0.8 0.25 0 0 2700
Dr 0 0 0
At SMD N 00888000
Ne 23 "N-0000036"
Po -1.35 -2
.LocalClearance 0.07
$EndPAD
$PAD
Sh "25" R 0.8 0.25 0 0 2700
Dr 0 0 0
At SMD N 00888000
Ne 8 "N-0000015"
Po 0 -2
.LocalClearance 0.07
$EndPAD
$PAD
Sh "24" R 0.8 0.25 0 0 2700
Dr 0 0 0
At SMD N 00888000
Ne 21 "N-0000034"
Po 0.45 -2
.LocalClearance 0.07
$EndPAD
$PAD
Sh "23" R 0.8 0.25 0 0 2700
Dr 0 0 0
At SMD N 00888000
Ne 6 "N-0000011"
Po 0.9 -2
.LocalClearance 0.07
$EndPAD
$PAD
Sh "22" O 0.8 0.25 0 0 2700
Dr 0 0 0
At SMD N 00888000
Ne 22 "N-0000035"
Po 1.35 -2
.LocalClearance 0.07
$EndPAD
$PAD
Sh "14" O 0.8 0.25 0 0 2700
Dr 0 0 0
At SMD N 00888000
Ne 9 "N-0000016"
Po 1.35 2
.LocalClearance 0.07
$EndPAD
$PAD
Sh "13" R 0.8 0.25 0 0 2700
Dr 0 0 0
At SMD N 00888000
Ne 11 "N-0000018"
Po 0.9 2
.LocalClearance 0.07
$EndPAD
$PAD
Sh "12" R 0.8 0.25 0 0 2700
Dr 0 0 0
At SMD N 00888000
Ne 12 "N-0000023"
Po 0.45 2
.LocalClearance 0.07
$EndPAD
$PAD
Sh "8" O 0.8 0.25 0 0 2700
Dr 0 0 0
At SMD N 00888000
Ne 16 "N-0000028"
Po -1.35 2
.LocalClearance 0.07
$EndPAD
$PAD
Sh "9" R 0.8 0.25 0 0 2700
Dr 0 0 0
At SMD N 00888000
Ne 5 "N-0000010"
Po -0.9 2
.LocalClearance 0.07
$EndPAD
$PAD
Sh "10" R 0.8 0.25 0 0 2700
Dr 0 0 0
At SMD N 00888000
Ne 18 "N-000003"
Po -0.45 2
.LocalClearance 0.07
$EndPAD
$PAD
Sh "11" R 0.8 0.25 0 0 2700
Dr 0 0 0
At SMD N 00888000
Ne 24 "N-000005"
Po 0 2
.LocalClearance 0.07
$EndPAD
$PAD
Sh "7" O 0.8 0.25 0 0 1800
Dr 0 0 0
At SMD N 00888000
Ne 17 "N-0000029"
Po -2 1.35
.LocalClearance 0.07
$EndPAD
$PAD
Sh "6" R 0.8 0.25 0 0 1800
Dr 0 0 0
At SMD N 00888000
Ne 0 ""
Po -2 0.9
.LocalClearance 0.07
$EndPAD
$PAD
Sh "5" R 0.8 0.25 0 0 1800
Dr 0 0 0
At SMD N 00888000
Ne 20 "N-0000033"
Po -2 0.45
.LocalClearance 0.07
$EndPAD
$PAD
Sh "1" O 0.8 0.25 0 0 1800
Dr 0 0 0
At SMD N 00888000
Ne 19 "N-0000031"
Po -2 -1.35
.LocalClearance 0.07
$EndPAD
$PAD
Sh "2" R 0.8 0.25 0 0 1800
Dr 0 0 0
At SMD N 00888000
Ne 14 "N-0000026"
Po -2 -0.9
.LocalClearance 0.07
$EndPAD
$PAD
Sh "3" R 0.8 0.25 0 0 1800
Dr 0 0 0
At SMD N 00888000
Ne 1 "+3.3V"
Po -2 -0.45
.LocalClearance 0.07
$EndPAD
$PAD
Sh "4" R 0.8 0.25 0 0 1800
Dr 0 0 0
At SMD N 00888000
Ne 4 "GND"
Po -2 0
.LocalClearance 0.07
$EndPAD
$PAD
Sh "29" R 2.25 2.25 0 0 0
Dr 0 0 0
At SMD N 00888000
Ne 0 ""
Po 0 0
$EndPAD
$EndMODULE ATMega328
$EndLIBRARY
