EESchema Schematic File Version 2
LIBS:TDC_Mother-rescue
LIBS:power
LIBS:transistors
LIBS:conn
LIBS:display
LIBS:contrib
LIBS:ep3c5u256_custom
LIBS:ERM8-RA
LIBS:30310-5002hb
LIBS:4816P-1-101LF
LIBS:FIN1108
LIBS:tps78630kttt
LIBS:tps79533
LIBS:+4
LIBS:640456-2
LIBS:micron
LIBS:tps73701drbt
LIBS:ws2812b
LIBS:fixed_conn
LIBS:ao3422
LIBS:my_discrete
LIBS:TMM-105-01
LIBS:my_power
LIBS:atmega168a-mm
LIBS:CAT16-101J4LF
LIBS:tmp36
LIBS:testpoint
LIBS:TDC_Mother-cache
EELAYER 25 0
EELAYER END
$Descr A4 11693 8268
encoding utf-8
Sheet 8 14
Title ""
Date "9 oct 2015"
Rev ""
Comp ""
Comment1 ""
Comment2 ""
Comment3 ""
Comment4 ""
$EndDescr
Text HLabel 7700 2000 2    60   Input ~ 0
BOARD_ID0
NoConn ~ 2800 4300
NoConn ~ 2800 4500
NoConn ~ 2800 4700
NoConn ~ 2800 4900
NoConn ~ 2800 5000
NoConn ~ 2800 5100
NoConn ~ 2800 5200
NoConn ~ 2800 5300
NoConn ~ 2800 5400
NoConn ~ 2800 5500
NoConn ~ 2800 5600
NoConn ~ 7500 5800
NoConn ~ 7500 5600
NoConn ~ 7500 5400
NoConn ~ 7500 5300
NoConn ~ 7500 5100
NoConn ~ 7500 5000
NoConn ~ 7500 4800
NoConn ~ 7500 4700
NoConn ~ 7500 4500
NoConn ~ 7500 4400
NoConn ~ 7500 4200
NoConn ~ 7500 3900
NoConn ~ 7500 3600
NoConn ~ 7500 3500
NoConn ~ 7500 3300
NoConn ~ 7500 3200
NoConn ~ 7500 3000
NoConn ~ 7500 2900
NoConn ~ 7500 2700
NoConn ~ 7500 2400
NoConn ~ 7500 2300
NoConn ~ 7500 2100
NoConn ~ 10300 5800
NoConn ~ 10300 5600
NoConn ~ 10300 5300
NoConn ~ 10300 5200
NoConn ~ 10300 5100
NoConn ~ 10300 5000
NoConn ~ 10300 4800
NoConn ~ 10300 4700
NoConn ~ 10300 4500
NoConn ~ 10300 4300
NoConn ~ 10300 4200
NoConn ~ 10300 4100
NoConn ~ 10300 3900
NoConn ~ 10300 3800
NoConn ~ 10300 3600
NoConn ~ 10300 3500
NoConn ~ 10300 3300
NoConn ~ 10300 3200
NoConn ~ 10300 3000
NoConn ~ 10300 2900
NoConn ~ 10300 2700
NoConn ~ 10300 2600
NoConn ~ 10300 2400
NoConn ~ 10300 2300
NoConn ~ 10300 2100
NoConn ~ 10300 2000
$Comp
L EP3C5U256_CUSTOM U15
U 7 1 56221A96
P 6500 3900
AR Path="/5461E2FD/560C2E25/56221A96" Ref="U15"  Part="7" 
AR Path="/5611711C/560C2E25/56221A96" Ref="U21"  Part="7" 
F 0 "U21" H 6500 4400 60  0000 C CNN
F 1 "EP3C5U256_CUSTOM" V 6500 3700 60  0000 C CNN
F 2 "integrated_tdc_pcblib:UBGA-256" H 6500 3900 60  0001 C CNN
F 3 "" H 6500 3900 60  0000 C CNN
	7    6500 3900
	1    0    0    -1  
$EndComp
$Comp
L EP3C5U256_CUSTOM U15
U 8 1 56221AEF
P 9300 3900
AR Path="/5461E2FD/560C2E25/56221AEF" Ref="U15"  Part="8" 
AR Path="/5611711C/560C2E25/56221AEF" Ref="U21"  Part="8" 
F 0 "U21" H 9300 4400 60  0000 C CNN
F 1 "EP3C5U256_CUSTOM" V 9300 3700 60  0000 C CNN
F 2 "integrated_tdc_pcblib:UBGA-256" H 9300 3900 60  0001 C CNN
F 3 "" H 9300 3900 60  0000 C CNN
	8    9300 3900
	1    0    0    -1  
$EndComp
Text Notes 3600 5800 0    60   ~ 0
Bank 5
Text Notes 6350 6000 0    60   ~ 0
Bank 7
Text Notes 9200 6000 0    60   ~ 0
Bank 8
Wire Wire Line
	7700 2000 7500 2000
Text HLabel 2650 2800 0    60   Input ~ 0
TDC_Out-
Text HLabel 2650 2900 0    60   Input ~ 0
TDC_Out+
Wire Wire Line
	2650 2800 2800 2800
Wire Wire Line
	2650 2900 2800 2900
$Comp
L TMM-105-01 P3
U 1 1 56340D0C
P 3750 1300
AR Path="/5461E2FD/560C2E25/56340D0C" Ref="P3"  Part="1" 
AR Path="/5611711C/560C2E25/56340D0C" Ref="P4"  Part="1" 
F 0 "P4" H 3750 1600 60  0000 C CNN
F 1 "TMM-105-01" V 3750 1300 40  0000 C CNN
F 2 "integrated_tdc_pcblib:TMM-105-01" H 3750 1300 60  0001 C CNN
F 3 "" H 3750 1300 60  0000 C CNN
F 4 "SAM1171-05-ND" H 3750 1300 60  0001 C CNN "Field1"
F 5 "Digi-Key" H 3750 1300 60  0001 C CNN "Field2"
	1    3750 1300
	1    0    0    -1  
$EndComp
$Comp
L EP3C5U256_CUSTOM U15
U 5 1 56221A47
P 3800 3900
AR Path="/5461E2FD/560C2E25/56221A47" Ref="U15"  Part="5" 
AR Path="/5611711C/560C2E25/56221A47" Ref="U21"  Part="5" 
F 0 "U21" H 3800 4400 60  0000 C CNN
F 1 "EP3C5U256_CUSTOM" V 3800 3700 60  0000 C CNN
F 2 "integrated_tdc_pcblib:UBGA-256" H 3800 3900 60  0001 C CNN
F 3 "" H 3800 3900 60  0000 C CNN
	5    3800 3900
	1    0    0    -1  
$EndComp
NoConn ~ 2800 3100
NoConn ~ 2800 3200
Text Label 2300 2600 0    60   ~ 0
LVDS0_P
Text Label 2300 2500 0    60   ~ 0
LVDS0_N
Text Label 2300 4100 0    60   ~ 0
LVDS1_P
Text Label 2300 4000 0    60   ~ 0
LVDS1_N
Text Label 2300 3800 0    60   ~ 0
LVDS2_P
Text Label 2300 3700 0    60   ~ 0
LVDS2_N
Text Label 2300 3500 0    60   ~ 0
LVDS3_P
Text Label 2300 3400 0    60   ~ 0
LVDS3_N
Wire Wire Line
	2300 3500 2800 3500
Wire Wire Line
	2300 3400 2800 3400
Wire Wire Line
	2300 3800 2800 3800
Wire Wire Line
	2800 3700 2300 3700
Wire Wire Line
	2800 4100 2300 4100
Wire Wire Line
	2300 4000 2800 4000
Wire Wire Line
	2300 2600 2800 2600
Wire Wire Line
	2800 2500 2300 2500
Text Label 2900 1200 0    60   ~ 0
LVDS1_P
Text Label 4650 1200 2    60   ~ 0
LVDS1_N
Text Label 2900 1300 0    60   ~ 0
LVDS2_P
Text Label 4650 1300 2    60   ~ 0
LVDS2_N
Text Label 2900 1400 0    60   ~ 0
LVDS3_P
Text Label 4650 1400 2    60   ~ 0
LVDS3_N
Text Label 2900 1100 0    60   ~ 0
LVDS0_P
Text Label 4650 1100 2    60   ~ 0
LVDS0_N
Wire Wire Line
	3350 1100 2900 1100
Wire Wire Line
	2900 1200 3350 1200
Wire Wire Line
	2900 1300 3350 1300
Wire Wire Line
	2900 1400 3350 1400
Wire Wire Line
	4150 1100 4650 1100
Wire Wire Line
	4150 1200 4650 1200
Wire Wire Line
	4150 1300 4650 1300
Wire Wire Line
	4150 1400 4650 1400
$Comp
L GND #PWR074
U 1 1 56341537
P 4300 1600
AR Path="/5461E2FD/560C2E25/56341537" Ref="#PWR074"  Part="1" 
AR Path="/5611711C/560C2E25/56341537" Ref="#PWR0102"  Part="1" 
F 0 "#PWR0102" H 4300 1600 30  0001 C CNN
F 1 "GND" H 4300 1530 30  0001 C CNN
F 2 "" H 4300 1600 60  0000 C CNN
F 3 "" H 4300 1600 60  0000 C CNN
	1    4300 1600
	1    0    0    -1  
$EndComp
$Comp
L GND #PWR075
U 1 1 56341553
P 3250 1600
AR Path="/5461E2FD/560C2E25/56341553" Ref="#PWR075"  Part="1" 
AR Path="/5611711C/560C2E25/56341553" Ref="#PWR0103"  Part="1" 
F 0 "#PWR0103" H 3250 1600 30  0001 C CNN
F 1 "GND" H 3250 1530 30  0001 C CNN
F 2 "" H 3250 1600 60  0000 C CNN
F 3 "" H 3250 1600 60  0000 C CNN
	1    3250 1600
	1    0    0    -1  
$EndComp
Wire Wire Line
	3250 1600 3250 1500
Wire Wire Line
	3250 1500 3350 1500
Wire Wire Line
	4150 1500 4300 1500
Wire Wire Line
	4300 1500 4300 1600
Text HLabel 2650 2200 0    60   Input ~ 0
C5_In+
Text HLabel 2650 2300 0    60   Input ~ 0
C5_In-
Wire Wire Line
	2650 2200 2800 2200
Wire Wire Line
	2650 2300 2800 2300
NoConn ~ 7500 3800
NoConn ~ 7500 4100
NoConn ~ 7500 2600
$EndSCHEMATC
