EESchema Schematic File Version 2
LIBS:TDC_Mother-rescue
LIBS:power
LIBS:transistors
LIBS:conn
LIBS:display
LIBS:contrib
LIBS:ep3c5u256_custom
LIBS:ERM8-RA
LIBS:30310-5002hb
LIBS:4816P-1-101LF
LIBS:FIN1108
LIBS:tps78630kttt
LIBS:tps79533
LIBS:+4
LIBS:640456-2
LIBS:micron
LIBS:tps73701drbt
LIBS:ws2812b
LIBS:fixed_conn
LIBS:ao3422
LIBS:my_discrete
LIBS:TMM-105-01
LIBS:my_power
LIBS:atmega168a-mm
LIBS:CAT16-101J4LF
LIBS:tmp36
LIBS:testpoint
LIBS:TDC_Mother-cache
EELAYER 25 0
EELAYER END
$Descr A 11000 8500
encoding utf-8
Sheet 10 14
Title ""
Date "9 oct 2015"
Rev ""
Comp ""
Comment1 ""
Comment2 ""
Comment3 ""
Comment4 ""
$EndDescr
$Comp
L Connecter_to_FlexiBoard J3
U 1 1 56099040
P 4850 3000
F 0 "J3" H 5500 -700 60  0000 C CNN
F 1 "ERM8-050-RA" H 5450 4300 50  0000 C CNN
F 2 "ERM8-RA:ERM8-RA" H 4850 3000 60  0001 C CNN
F 3 "~" H 4850 3000 60  0000 C CNN
F 4 "ERM8-050-RA" H 4850 3000 60  0001 C CNN "Field1"
F 5 "Samtec" H 4850 3000 60  0001 C CNN "Field2"
	1    4850 3000
	1    0    0    -1  
$EndComp
Entry Wire Line
	7200 2400 7100 2500
Entry Wire Line
	7200 2600 7100 2700
Entry Wire Line
	7200 2800 7100 2900
Entry Wire Line
	7200 3000 7100 3100
Entry Wire Line
	7200 3200 7100 3300
Entry Wire Line
	7200 3400 7100 3500
Entry Wire Line
	7200 3600 7100 3700
Entry Wire Line
	7200 3800 7100 3900
Entry Wire Line
	7250 2500 7150 2600
Entry Wire Line
	7250 2700 7150 2800
Entry Wire Line
	7250 2900 7150 3000
Entry Wire Line
	7250 3100 7150 3200
Entry Wire Line
	7250 3300 7150 3400
Entry Wire Line
	7250 3500 7150 3600
Entry Wire Line
	7250 3700 7150 3800
Entry Wire Line
	7250 3900 7150 4000
$Comp
L GND #PWR079
U 1 1 56099056
P 3150 6650
F 0 "#PWR079" H 3150 6650 30  0001 C CNN
F 1 "GND" H 3150 6580 30  0001 C CNN
F 2 "" H 3150 6650 60  0000 C CNN
F 3 "" H 3150 6650 60  0000 C CNN
	1    3150 6650
	1    0    0    -1  
$EndComp
Text Label 7000 2350 2    60   ~ 0
A2Shield
Text Label 7000 4150 2    60   ~ 0
A2Shield
Text Label 7000 6150 2    60   ~ 0
B2Shield
Text Label 7000 4350 2    60   ~ 0
B2Shield
Text Label 3950 6150 0    60   ~ 0
B1Shield
Text Label 3950 4350 0    60   ~ 0
B1Shield
Text Label 3950 2350 0    60   ~ 0
A1Shield
Text Label 3950 4150 0    60   ~ 0
A1Shield
Text Label 6600 4000 0    60   ~ 0
N2A7
Text Label 6600 3600 0    60   ~ 0
N2A5
Text Label 6600 3800 0    60   ~ 0
N2A6
Text Label 6600 3400 0    60   ~ 0
N2A4
Text Label 6600 3200 0    60   ~ 0
N2A3
Text Label 6600 3000 0    60   ~ 0
N2A2
Text Label 6600 2800 0    60   ~ 0
N2A1
Text Label 6600 2600 0    60   ~ 0
N2A0
Text Label 6850 3900 0    60   ~ 0
P2A7
Text Label 6850 3700 0    60   ~ 0
P2A6
Text Label 6850 3500 0    60   ~ 0
P2A5
Text Label 6850 3300 0    60   ~ 0
P2A4
Text Label 6850 3100 0    60   ~ 0
P2A3
Text Label 6850 2900 0    60   ~ 0
P2A2
Text Label 6850 2700 0    60   ~ 0
P2A1
Text Label 6850 2500 0    60   ~ 0
P2A0
Entry Wire Line
	3750 2400 3850 2500
Entry Wire Line
	3750 2600 3850 2700
Entry Wire Line
	3750 2800 3850 2900
Entry Wire Line
	3750 3000 3850 3100
Entry Wire Line
	3750 3200 3850 3300
Entry Wire Line
	3750 3400 3850 3500
Entry Wire Line
	3750 3600 3850 3700
Entry Wire Line
	3750 3800 3850 3900
Entry Wire Line
	3700 2500 3800 2600
Entry Wire Line
	3700 2700 3800 2800
Entry Wire Line
	3700 2900 3800 3000
Entry Wire Line
	3700 3100 3800 3200
Entry Wire Line
	3700 3300 3800 3400
Entry Wire Line
	3700 3500 3800 3600
Entry Wire Line
	3700 3700 3800 3800
Entry Wire Line
	3700 3900 3800 4000
Text Label 4350 4000 2    60   ~ 0
N1A7
Text Label 4350 3600 2    60   ~ 0
N1A5
Text Label 4350 3800 2    60   ~ 0
N1A6
Text Label 4350 3400 2    60   ~ 0
N1A4
Text Label 4350 3200 2    60   ~ 0
N1A3
Text Label 4350 3000 2    60   ~ 0
N1A2
Text Label 4350 2800 2    60   ~ 0
N1A1
Text Label 4350 2600 2    60   ~ 0
N1A0
Text Label 4100 3900 2    60   ~ 0
P1A7
Text Label 4100 3700 2    60   ~ 0
P1A6
Text Label 4100 3500 2    60   ~ 0
P1A5
Text Label 4100 3300 2    60   ~ 0
P1A4
Text Label 4100 3100 2    60   ~ 0
P1A3
Text Label 4100 2900 2    60   ~ 0
P1A2
Text Label 4100 2700 2    60   ~ 0
P1A1
Text Label 4100 2500 2    60   ~ 0
P1A0
Entry Wire Line
	7200 4400 7100 4500
Entry Wire Line
	7200 4600 7100 4700
Entry Wire Line
	7200 4800 7100 4900
Entry Wire Line
	7200 5000 7100 5100
Entry Wire Line
	7200 5200 7100 5300
Entry Wire Line
	7200 5400 7100 5500
Entry Wire Line
	7200 5600 7100 5700
Entry Wire Line
	7200 5800 7100 5900
Entry Wire Line
	7250 4500 7150 4600
Entry Wire Line
	7250 4700 7150 4800
Entry Wire Line
	7250 4900 7150 5000
Entry Wire Line
	7250 5100 7150 5200
Entry Wire Line
	7250 5300 7150 5400
Entry Wire Line
	7250 5500 7150 5600
Entry Wire Line
	7250 5700 7150 5800
Entry Wire Line
	7250 5900 7150 6000
Text Label 6600 6000 0    60   ~ 0
N2B7
Text Label 6600 5600 0    60   ~ 0
N2B5
Text Label 6600 5800 0    60   ~ 0
N2B6
Text Label 6600 5400 0    60   ~ 0
N2B4
Text Label 6600 5200 0    60   ~ 0
N2B3
Text Label 6600 5000 0    60   ~ 0
N2B2
Text Label 6600 4800 0    60   ~ 0
N2B1
Text Label 6600 4600 0    60   ~ 0
N2B0
Text Label 6850 5900 0    60   ~ 0
P2B7
Text Label 6850 5700 0    60   ~ 0
P2B6
Text Label 6850 5500 0    60   ~ 0
P2B5
Text Label 6850 5300 0    60   ~ 0
P2B4
Text Label 6850 5100 0    60   ~ 0
P2B3
Text Label 6850 4900 0    60   ~ 0
P2B2
Text Label 6850 4700 0    60   ~ 0
P2B1
Text Label 6850 4500 0    60   ~ 0
P2B0
Entry Wire Line
	3750 4400 3850 4500
Entry Wire Line
	3750 4600 3850 4700
Entry Wire Line
	3750 4800 3850 4900
Entry Wire Line
	3750 5000 3850 5100
Entry Wire Line
	3750 5200 3850 5300
Entry Wire Line
	3750 5400 3850 5500
Entry Wire Line
	3750 5600 3850 5700
Entry Wire Line
	3750 5800 3850 5900
Entry Wire Line
	3700 4500 3800 4600
Entry Wire Line
	3700 4700 3800 4800
Entry Wire Line
	3700 4900 3800 5000
Entry Wire Line
	3700 5100 3800 5200
Entry Wire Line
	3700 5300 3800 5400
Entry Wire Line
	3700 5500 3800 5600
Entry Wire Line
	3700 5700 3800 5800
Entry Wire Line
	3700 5900 3800 6000
Text Label 4350 6000 2    60   ~ 0
N1B7
Text Label 4350 5600 2    60   ~ 0
N1B5
Text Label 4350 5800 2    60   ~ 0
N1B6
Text Label 4350 5400 2    60   ~ 0
N1B4
Text Label 4350 5200 2    60   ~ 0
N1B3
Text Label 4350 5000 2    60   ~ 0
N1B2
Text Label 4350 4800 2    60   ~ 0
N1B1
Text Label 4350 4600 2    60   ~ 0
N1B0
Text Label 4100 5900 2    60   ~ 0
P1B7
Text Label 4100 5700 2    60   ~ 0
P1B6
Text Label 4100 5500 2    60   ~ 0
P1B5
Text Label 4100 5300 2    60   ~ 0
P1B4
Text Label 4100 5100 2    60   ~ 0
P1B3
Text Label 4100 4900 2    60   ~ 0
P1B2
Text Label 4100 4700 2    60   ~ 0
P1B1
Text Label 4100 4500 2    60   ~ 0
P1B0
Text Notes 5050 1600 0    60   ~ 0
Orientation on file
$Comp
L +5V #PWR080
U 1 1 560990F5
P 3150 6250
F 0 "#PWR080" H 3150 6340 20  0001 C CNN
F 1 "+5V" H 3150 6340 30  0000 C CNN
F 2 "" H 3150 6250 60  0000 C CNN
F 3 "" H 3150 6250 60  0000 C CNN
	1    3150 6250
	1    0    0    -1  
$EndComp
Text Notes 4350 1400 0    150  ~ 30
To Feedthrough Board
Text Label 8850 3050 0    60   ~ 0
A2Shield
Text Label 9900 3050 0    60   ~ 0
B2Shield
Text Label 9400 3050 0    60   ~ 0
B1Shield
Text Label 8250 3050 0    60   ~ 0
A1Shield
$Comp
L R R7
U 1 1 56099102
P 9900 3400
F 0 "R7" V 9980 3400 50  0000 C CNN
F 1 "1k" V 9900 3400 50  0000 C CNN
F 2 "libcms:SM0603" H 9900 3400 60  0001 C CNN
F 3 "" H 9900 3400 60  0000 C CNN
F 4 "RHM1.00KCFCT-ND" V 9900 3400 60  0001 C CNN "Field1"
F 5 "Digi-Key" V 9900 3400 60  0001 C CNN "Field2"
	1    9900 3400
	1    0    0    -1  
$EndComp
$Comp
L GND #PWR081
U 1 1 56099108
P 9900 3750
F 0 "#PWR081" H 9900 3750 30  0001 C CNN
F 1 "GND" H 9900 3680 30  0001 C CNN
F 2 "" H 9900 3750 60  0000 C CNN
F 3 "" H 9900 3750 60  0000 C CNN
	1    9900 3750
	1    0    0    -1  
$EndComp
$Comp
L R R5
U 1 1 56099110
P 8850 3400
F 0 "R5" V 8930 3400 50  0000 C CNN
F 1 "1k" V 8850 3400 50  0000 C CNN
F 2 "libcms:SM0603" H 8850 3400 60  0001 C CNN
F 3 "" H 8850 3400 60  0000 C CNN
F 4 "RHM1.00KCFCT-ND" V 8850 3400 60  0001 C CNN "Field1"
F 5 "Digi-Key" V 8850 3400 60  0001 C CNN "Field2"
	1    8850 3400
	1    0    0    -1  
$EndComp
$Comp
L GND #PWR082
U 1 1 56099116
P 8850 3750
F 0 "#PWR082" H 8850 3750 30  0001 C CNN
F 1 "GND" H 8850 3680 30  0001 C CNN
F 2 "" H 8850 3750 60  0000 C CNN
F 3 "" H 8850 3750 60  0000 C CNN
	1    8850 3750
	1    0    0    -1  
$EndComp
$Comp
L R R4
U 1 1 5609911E
P 8250 3400
F 0 "R4" V 8150 3400 50  0000 C CNN
F 1 "1k" V 8250 3400 50  0000 C CNN
F 2 "libcms:SM0603" H 8250 3400 60  0001 C CNN
F 3 "" H 8250 3400 60  0000 C CNN
F 4 "RHM1.00KCFCT-ND" V 8250 3400 60  0001 C CNN "Field1"
F 5 "Digi-Key" V 8250 3400 60  0001 C CNN "Field2"
	1    8250 3400
	1    0    0    -1  
$EndComp
$Comp
L GND #PWR083
U 1 1 56099124
P 8250 3750
F 0 "#PWR083" H 8250 3750 30  0001 C CNN
F 1 "GND" H 8250 3680 30  0001 C CNN
F 2 "" H 8250 3750 60  0000 C CNN
F 3 "" H 8250 3750 60  0000 C CNN
	1    8250 3750
	1    0    0    -1  
$EndComp
$Comp
L R R6
U 1 1 5609912C
P 9400 3400
F 0 "R6" V 9300 3400 50  0000 C CNN
F 1 "1k" V 9400 3400 50  0000 C CNN
F 2 "libcms:SM0603" H 9400 3400 60  0001 C CNN
F 3 "" H 9400 3400 60  0000 C CNN
F 4 "RHM1.00KCFCT-ND" V 9400 3400 60  0001 C CNN "Field1"
F 5 "Digi-Key" V 9400 3400 60  0001 C CNN "Field2"
	1    9400 3400
	1    0    0    -1  
$EndComp
$Comp
L GND #PWR084
U 1 1 56099132
P 9400 3750
F 0 "#PWR084" H 9400 3750 30  0001 C CNN
F 1 "GND" H 9400 3680 30  0001 C CNN
F 2 "" H 9400 3750 60  0000 C CNN
F 3 "" H 9400 3750 60  0000 C CNN
	1    9400 3750
	1    0    0    -1  
$EndComp
Text HLabel 7550 2300 2    60   Input ~ 0
N2A[7..0]
Text HLabel 7700 2400 2    60   Input ~ 0
P2A[7..0]
Text HLabel 7550 4300 2    60   Input ~ 0
N2B[7..0]
Text HLabel 7700 4400 2    60   Input ~ 0
P2B[7..0]
Text HLabel 3400 4300 0    60   Input ~ 0
N1B[7..0]
Text HLabel 3250 4400 0    60   Input ~ 0
P1B[7..0]
Text HLabel 6950 6300 2    60   Input ~ 0
UART_TX
Text HLabel 6950 6400 2    60   Input ~ 0
UART_RX
Text HLabel 6950 6600 2    60   Input ~ 0
BOARD_ID1
Text HLabel 2700 1600 0    60   Input ~ 0
C5_1+
Text HLabel 2700 2100 0    60   Input ~ 0
C5_1-
Text HLabel 4000 2000 0    60   Input ~ 0
TDC_Out_1+
Text HLabel 4000 2100 0    60   Input ~ 0
TDC_Out_1-
Text HLabel 4000 2200 0    60   Input ~ 0
Slow_Control_TX
Text HLabel 8400 1600 2    60   Input ~ 0
C5_2+
Text HLabel 8400 2100 2    60   Input ~ 0
C5_2-
Text HLabel 6950 2000 2    60   Input ~ 0
TDC_Out_2+
Text HLabel 6950 2100 2    60   Input ~ 0
TDC_Out_2-
Text HLabel 6950 2200 2    60   Input ~ 0
Slow_Control_RX
Text HLabel 3400 2300 0    60   Input ~ 0
N1A[7..0]
Text HLabel 3250 2400 0    60   Input ~ 0
P1A[7..0]
Text HLabel 6950 6500 2    60   Input ~ 0
MCU_RESET
$Comp
L PWR_FLAG #FLG085
U 1 1 562162CD
P 3450 6300
F 0 "#FLG085" H 3450 6395 30  0001 C CNN
F 1 "PWR_FLAG" H 3450 6480 30  0000 C CNN
F 2 "" H 3450 6300 60  0000 C CNN
F 3 "" H 3450 6300 60  0000 C CNN
	1    3450 6300
	1    0    0    -1  
$EndComp
$Comp
L PWR_FLAG #FLG086
U 1 1 562162EF
P 3450 6600
F 0 "#FLG086" H 3450 6695 30  0001 C CNN
F 1 "PWR_FLAG" H 3450 6780 30  0000 C CNN
F 2 "" H 3450 6600 60  0000 C CNN
F 3 "" H 3450 6600 60  0000 C CNN
	1    3450 6600
	1    0    0    -1  
$EndComp
$Comp
L R R24
U 1 1 56637F7E
P 8050 1850
F 0 "R24" V 7950 1850 50  0000 C CNN
F 1 "100" V 8050 1850 50  0000 C CNN
F 2 "libcms:SM0603" H 8050 1850 60  0001 C CNN
F 3 "" H 8050 1850 60  0000 C CNN
F 4 "RHM100CFCT-ND" V 8050 1850 60  0001 C CNN "Field1"
F 5 "Digi-Key" V 8050 1850 60  0001 C CNN "Field2"
	1    8050 1850
	1    0    0    -1  
$EndComp
$Comp
L R R23
U 1 1 566389FC
P 2950 1850
F 0 "R23" V 2850 1850 50  0000 C CNN
F 1 "100" V 2950 1850 50  0000 C CNN
F 2 "libcms:SM0603" H 2950 1850 60  0001 C CNN
F 3 "" H 2950 1850 60  0000 C CNN
F 4 "RHM100CFCT-ND" V 2950 1850 60  0001 C CNN "Field1"
F 5 "Digi-Key" V 2950 1850 60  0001 C CNN "Field2"
	1    2950 1850
	1    0    0    -1  
$EndComp
Wire Bus Line
	7200 2300 7200 3800
Wire Bus Line
	7200 2300 7550 2300
Wire Bus Line
	7250 2400 7250 3900
Wire Bus Line
	7250 2400 7700 2400
Wire Wire Line
	6500 2500 7100 2500
Wire Wire Line
	6500 2700 7100 2700
Wire Wire Line
	6500 2900 7100 2900
Wire Wire Line
	6500 3300 7100 3300
Wire Wire Line
	6500 3500 7100 3500
Wire Wire Line
	6500 3700 7100 3700
Wire Wire Line
	6500 3900 7100 3900
Wire Wire Line
	6500 2600 7150 2600
Wire Wire Line
	6500 2800 7150 2800
Wire Wire Line
	6500 3000 7150 3000
Wire Wire Line
	6500 3200 7150 3200
Wire Wire Line
	6500 3400 7150 3400
Wire Wire Line
	6500 3600 7150 3600
Wire Wire Line
	6500 3800 7150 3800
Wire Wire Line
	6500 4000 7150 4000
Wire Wire Line
	4200 6400 4450 6400
Wire Wire Line
	4200 6700 4450 6700
Connection ~ 4200 6600
Wire Wire Line
	6500 2300 6550 2300
Wire Wire Line
	6550 2300 6550 2400
Wire Wire Line
	6550 2400 6500 2400
Wire Wire Line
	6550 2350 7000 2350
Connection ~ 6550 2350
Wire Wire Line
	6500 4100 6550 4100
Wire Wire Line
	6550 4100 6550 4200
Wire Wire Line
	6550 4200 6500 4200
Wire Wire Line
	6550 4150 7000 4150
Connection ~ 6550 4150
Wire Wire Line
	4450 4100 4400 4100
Wire Wire Line
	4400 4100 4400 4200
Wire Wire Line
	4400 4200 4450 4200
Wire Wire Line
	3950 4150 4400 4150
Connection ~ 4400 4150
Wire Wire Line
	4450 2300 4400 2300
Wire Wire Line
	4400 2300 4400 2400
Wire Wire Line
	4400 2400 4450 2400
Wire Wire Line
	3950 2350 4400 2350
Connection ~ 4400 2350
Wire Wire Line
	4400 4400 4450 4400
Wire Wire Line
	4400 4300 4400 4400
Wire Wire Line
	4400 4300 4450 4300
Wire Wire Line
	3950 4350 4400 4350
Connection ~ 4400 4350
Wire Wire Line
	6550 6200 6500 6200
Wire Wire Line
	6550 6100 6550 6200
Wire Wire Line
	6550 6100 6500 6100
Wire Wire Line
	6550 6150 7000 6150
Connection ~ 6550 6150
Wire Wire Line
	6550 4400 6500 4400
Wire Wire Line
	6550 4300 6550 4400
Wire Wire Line
	6550 4300 6500 4300
Wire Wire Line
	6550 4350 7000 4350
Connection ~ 6550 4350
Wire Wire Line
	4450 6100 4400 6100
Wire Wire Line
	4400 6100 4400 6200
Wire Wire Line
	4400 6200 4450 6200
Wire Wire Line
	3950 6150 4400 6150
Connection ~ 4400 6150
Wire Wire Line
	6500 1800 7800 1800
Wire Wire Line
	6500 1900 7800 1900
Wire Wire Line
	6500 2000 6950 2000
Wire Wire Line
	6500 2100 6950 2100
Wire Wire Line
	6500 6300 6950 6300
Wire Wire Line
	6500 6400 6950 6400
Wire Wire Line
	3150 1800 4450 1800
Wire Wire Line
	3150 1900 4450 1900
Wire Wire Line
	4000 2000 4450 2000
Wire Wire Line
	4000 2100 4450 2100
Wire Wire Line
	7100 3100 6500 3100
Wire Bus Line
	3750 2300 3750 3800
Wire Bus Line
	3750 2300 3400 2300
Wire Bus Line
	3700 2400 3700 3900
Wire Bus Line
	3700 2400 3250 2400
Wire Wire Line
	4450 2500 3850 2500
Wire Wire Line
	4450 2700 3850 2700
Wire Wire Line
	4450 2900 3850 2900
Wire Wire Line
	4450 3300 3850 3300
Wire Wire Line
	4450 3500 3850 3500
Wire Wire Line
	4450 3700 3850 3700
Wire Wire Line
	4450 3900 3850 3900
Wire Wire Line
	4450 2600 3800 2600
Wire Wire Line
	4450 2800 3800 2800
Wire Wire Line
	4450 3000 3800 3000
Wire Wire Line
	4450 3200 3800 3200
Wire Wire Line
	4450 3400 3800 3400
Wire Wire Line
	4450 3600 3800 3600
Wire Wire Line
	4450 3800 3800 3800
Wire Wire Line
	4450 4000 3800 4000
Wire Wire Line
	3850 3100 4450 3100
Wire Bus Line
	7200 4300 7200 5800
Wire Bus Line
	7200 4300 7550 4300
Wire Bus Line
	7250 4400 7250 5900
Wire Bus Line
	7250 4400 7700 4400
Wire Wire Line
	6500 4500 7100 4500
Wire Wire Line
	6500 4700 7100 4700
Wire Wire Line
	6500 4900 7100 4900
Wire Wire Line
	6500 5300 7100 5300
Wire Wire Line
	6500 5500 7100 5500
Wire Wire Line
	6500 5700 7100 5700
Wire Wire Line
	6500 5900 7100 5900
Wire Wire Line
	6500 4600 7150 4600
Wire Wire Line
	6500 4800 7150 4800
Wire Wire Line
	6500 5000 7150 5000
Wire Wire Line
	6500 5200 7150 5200
Wire Wire Line
	6500 5400 7150 5400
Wire Wire Line
	6500 5600 7150 5600
Wire Wire Line
	6500 5800 7150 5800
Wire Wire Line
	6500 6000 7150 6000
Wire Wire Line
	7100 5100 6500 5100
Wire Bus Line
	3750 4300 3750 5800
Wire Bus Line
	3750 4300 3400 4300
Wire Bus Line
	3700 4400 3700 5900
Wire Bus Line
	3700 4400 3250 4400
Wire Wire Line
	4450 4500 3850 4500
Wire Wire Line
	4450 4700 3850 4700
Wire Wire Line
	4450 4900 3850 4900
Wire Wire Line
	4450 5300 3850 5300
Wire Wire Line
	4450 5500 3850 5500
Wire Wire Line
	4450 5700 3850 5700
Wire Wire Line
	4450 5900 3850 5900
Wire Wire Line
	4450 4600 3800 4600
Wire Wire Line
	4450 4800 3800 4800
Wire Wire Line
	4450 5000 3800 5000
Wire Wire Line
	4450 5200 3800 5200
Wire Wire Line
	4450 5400 3800 5400
Wire Wire Line
	4450 5600 3800 5600
Wire Wire Line
	4450 5800 3800 5800
Wire Wire Line
	4450 6000 3800 6000
Wire Wire Line
	3850 5100 4450 5100
Connection ~ 4200 6700
Wire Wire Line
	6500 6700 6500 6800
Wire Wire Line
	6500 6800 4200 6800
Connection ~ 4200 6300
Wire Wire Line
	9900 3050 9900 3150
Wire Wire Line
	9900 3650 9900 3750
Wire Wire Line
	8850 3050 8850 3150
Wire Wire Line
	8850 3650 8850 3750
Wire Wire Line
	8250 3050 8250 3150
Wire Wire Line
	8250 3650 8250 3750
Wire Wire Line
	9400 3050 9400 3150
Wire Wire Line
	9400 3650 9400 3750
Wire Wire Line
	4200 6800 4200 6600
Wire Wire Line
	4200 6500 4450 6500
Connection ~ 4200 6400
Wire Wire Line
	4200 6300 4200 6500
Wire Wire Line
	6500 2200 6950 2200
Wire Wire Line
	3150 6600 4450 6600
Wire Wire Line
	4450 2200 4000 2200
Wire Wire Line
	6500 6600 6950 6600
Wire Wire Line
	3150 6300 4450 6300
Connection ~ 3450 6300
Connection ~ 3450 6600
Wire Wire Line
	7800 1800 7800 1600
Wire Wire Line
	7800 1600 8400 1600
Wire Wire Line
	7800 1900 7800 2100
Wire Wire Line
	7800 2100 8400 2100
Connection ~ 8050 1600
Connection ~ 8050 2100
Wire Wire Line
	2700 2100 3150 2100
Wire Wire Line
	3150 2100 3150 1900
Wire Wire Line
	3150 1600 3150 1800
Connection ~ 2950 2100
Wire Wire Line
	2700 1600 3150 1600
Connection ~ 2950 1600
Wire Wire Line
	6500 6500 6950 6500
Wire Wire Line
	3150 6300 3150 6250
Wire Wire Line
	3150 6600 3150 6650
$EndSCHEMATC
