EESchema Schematic File Version 2
LIBS:power
LIBS:device
LIBS:transistors
LIBS:conn
LIBS:linear
LIBS:regul
LIBS:74xx
LIBS:cmos4000
LIBS:adc-dac
LIBS:memory
LIBS:xilinx
LIBS:special
LIBS:microcontrollers
LIBS:dsp
LIBS:microchip
LIBS:analog_switches
LIBS:motorola
LIBS:texas
LIBS:intel
LIBS:audio
LIBS:interface
LIBS:digital-audio
LIBS:philips
LIBS:display
LIBS:cypress
LIBS:siliconi
LIBS:opto
LIBS:atmel
LIBS:contrib
LIBS:valves
LIBS:HVConn
LIBS:HVGroundingBoard-cache
EELAYER 27 0
EELAYER END
$Descr A4 11693 8268
encoding utf-8
Sheet 1 1
Title ""
Date "8 apr 2015"
Rev ""
Comp ""
Comment1 ""
Comment2 ""
Comment3 ""
Comment4 ""
$EndDescr
$Comp
L GNDPIN1 P5
U 1 1 550C5D92
P 5300 2850
F 0 "P5" H 5100 2650 60  0000 C CNN
F 1 "GNDPIN1" H 5500 2650 60  0000 C CNN
F 2 "" H 5300 2850 60  0000 C CNN
F 3 "" H 5300 2850 60  0000 C CNN
	1    5300 2850
	1    0    0    -1  
$EndComp
$Comp
L GNDPIN2 P6
U 1 1 550C5DA1
P 5300 3550
F 0 "P6" H 5100 3350 60  0000 C CNN
F 1 "GNDPIN2" H 5500 3350 60  0000 C CNN
F 2 "" H 5300 3550 60  0000 C CNN
F 3 "" H 5300 3550 60  0000 C CNN
	1    5300 3550
	1    0    0    -1  
$EndComp
$Comp
L SHV P1
U 1 1 550C5DB0
P 4300 2700
F 0 "P1" H 4150 2550 60  0000 C CNN
F 1 "SHV" H 4550 2600 60  0000 C CNN
F 2 "" H 4300 2700 60  0000 C CNN
F 3 "" H 4300 2700 60  0000 C CNN
	1    4300 2700
	-1   0    0    1   
$EndComp
$Comp
L SHV2 P2
U 1 1 550C5DBF
P 4300 3050
F 0 "P2" H 4150 2900 60  0000 C CNN
F 1 "SHV2" H 4550 2950 60  0000 C CNN
F 2 "" H 4300 3050 60  0000 C CNN
F 3 "" H 4300 3050 60  0000 C CNN
	1    4300 3050
	-1   0    0    1   
$EndComp
$Comp
L SHV3 P3
U 1 1 550C5DCE
P 4300 3400
F 0 "P3" H 4150 3250 60  0000 C CNN
F 1 "SHV3" H 4550 3300 60  0000 C CNN
F 2 "" H 4300 3400 60  0000 C CNN
F 3 "" H 4300 3400 60  0000 C CNN
	1    4300 3400
	-1   0    0    1   
$EndComp
$Comp
L SHV4 P4
U 1 1 550C5DDD
P 4300 3750
F 0 "P4" H 4150 3600 60  0000 C CNN
F 1 "SHV4" H 4550 3650 60  0000 C CNN
F 2 "" H 4300 3750 60  0000 C CNN
F 3 "" H 4300 3750 60  0000 C CNN
	1    4300 3750
	-1   0    0    1   
$EndComp
Wire Wire Line
	4550 3400 5000 3400
Wire Wire Line
	4550 3750 5000 3750
Wire Wire Line
	4550 2700 5000 2700
Wire Wire Line
	4550 3050 5000 3050
$Comp
L SCREW P7
U 1 1 550C5F35
P 6800 2650
F 0 "P7" H 6550 2550 60  0000 C CNN
F 1 "SCREW" H 6850 2550 60  0000 C CNN
F 2 "" H 6800 2650 60  0000 C CNN
F 3 "" H 6800 2650 60  0000 C CNN
	1    6800 2650
	1    0    0    -1  
$EndComp
$Comp
L SCREW P8
U 1 1 550C5F72
P 6800 2850
F 0 "P8" H 6550 2750 60  0000 C CNN
F 1 "SCREW" H 6850 2750 60  0000 C CNN
F 2 "" H 6800 2850 60  0000 C CNN
F 3 "" H 6800 2850 60  0000 C CNN
	1    6800 2850
	1    0    0    -1  
$EndComp
$Comp
L SCREW P9
U 1 1 550C5F78
P 6800 3050
F 0 "P9" H 6550 2950 60  0000 C CNN
F 1 "SCREW" H 6850 2950 60  0000 C CNN
F 2 "" H 6800 3050 60  0000 C CNN
F 3 "" H 6800 3050 60  0000 C CNN
	1    6800 3050
	1    0    0    -1  
$EndComp
$Comp
L SCREW P10
U 1 1 550C5F7E
P 6800 3250
F 0 "P10" H 6550 3150 60  0000 C CNN
F 1 "SCREW" H 6850 3150 60  0000 C CNN
F 2 "" H 6800 3250 60  0000 C CNN
F 3 "" H 6800 3250 60  0000 C CNN
	1    6800 3250
	1    0    0    -1  
$EndComp
Wire Wire Line
	6500 2650 6500 3250
Connection ~ 6500 2850
Connection ~ 6500 3050
$Comp
L GNDPIN1 P11
U 1 1 55256FF2
P 5300 4150
F 0 "P11" H 5050 4000 60  0000 C CNN
F 1 "JUMPER" H 5450 4000 60  0000 C CNN
F 2 "" H 5300 4150 60  0000 C CNN
F 3 "" H 5300 4150 60  0000 C CNN
	1    5300 4150
	1    0    0    -1  
$EndComp
$Comp
L GNDPIN2 P13
U 1 1 552570B2
P 5300 5300
F 0 "P13" H 5050 5150 60  0000 C CNN
F 1 "JUMPER" H 5450 5100 60  0000 C CNN
F 2 "" H 5300 5300 60  0000 C CNN
F 3 "" H 5300 5300 60  0000 C CNN
	1    5300 5300
	1    0    0    -1  
$EndComp
$Comp
L GNDPIN3 P12
U 1 1 5525723A
P 5300 4700
F 0 "P12" H 5050 4500 60  0000 C CNN
F 1 "JUMPER" H 5500 4550 60  0000 C CNN
F 2 "~" H 5300 4700 60  0000 C CNN
F 3 "~" H 5300 4700 60  0000 C CNN
	1    5300 4700
	1    0    0    -1  
$EndComp
Wire Wire Line
	5000 3050 5000 2900
Wire Wire Line
	5000 3750 5000 3600
Wire Wire Line
	4900 2700 4900 4000
Wire Wire Line
	4900 4000 5000 4000
Connection ~ 4900 2700
Wire Wire Line
	4850 3050 4850 4550
Wire Wire Line
	4850 4200 5000 4200
Connection ~ 4850 3050
Wire Wire Line
	4850 4550 5000 4550
Connection ~ 4850 4200
Wire Wire Line
	4800 3400 4800 5150
Wire Wire Line
	4800 4750 5000 4750
Connection ~ 4800 3400
Wire Wire Line
	4800 5150 5000 5150
Connection ~ 4800 4750
Wire Wire Line
	4750 3750 4750 5350
Wire Wire Line
	4750 5350 5000 5350
Connection ~ 4750 3750
$EndSCHEMATC
