M48
;DRILL file {Pcbnew (2013-10-07 BZR 4378)-stable} date Wed 22 Apr 2015 11:44:55 AM EDT
;FORMAT={-:-/ absolute / inch / decimal}
FMAT,2
INCH,TZ
T1C0.147
T2C0.510
%
G90
G05
M72
T1
X7.0677Y-4.8083
X7.0677Y-5.639
X10.2079Y-4.8083
X10.2079Y-5.639
T2
X7.4567Y-5.2252
X8.2441Y-5.2252
X9.0315Y-5.2252
X9.8189Y-5.2252
T0
M30
