M48
;DRILL file {Pcbnew (25-Oct-2014 BZR 4029)-stable} date Mon 20 Apr 2015 09:22:10 PM EDT
;FORMAT={-:-/ absolute / inch / decimal}
FMAT,2
INCH,TZ
T1C0.147
T2C0.510
%
G90
G05
M72
T1
X7.0677Y-4.8083
X7.0677Y-5.639
X10.2079Y-4.8083
X10.2079Y-5.639
T2
X7.4567Y-5.2252
X8.2441Y-5.2252
X9.0315Y-5.2252
X9.8189Y-5.2252
T0
M30
