PCBNEW-LibModule-V1  Fri 05 Dec 2014 03:37:29 PM EST
# encoding utf-8
Units mm
$INDEX
HVBoard:C_1825
$EndINDEX
$MODULE HVBoard:C_1825
Po 0 0 0 15 5482177F 00000000 ~~
Li HVBoard:C_1825
Cd Capacitor SMD 1825, hand soldering
Kw capacitor 1825
Sc 0
AR /5463ADE8
Op 0 0 0
At SMD
T0 0 -4.7 1 1 0 0.15 N V 21 N "C2"
T1 0 4.7 1 1 0 0.15 N V 21 N "5.6nF"
DS -4.3 -3.55 4.3 -3.55 0.05 21
DS -4.3 3.55 4.3 3.55 0.05 21
DS -4.3 -3.55 -4.3 3.55 0.05 21
DS 4.3 -3.55 4.3 3.55 0.05 21
$PAD
Sh "1" R 2.2 6.45 0 0 0
Dr 0 0 0
At SMD N 00888000
Ne 1 "N-0000031"
Po -2.9 0
$EndPAD
$PAD
Sh "2" R 2.2 6.45 0 0 0
Dr 0 0 0
At SMD N 00888000
Ne 2 "N-0000032"
Po 2.9 0
$EndPAD
$SHAPE3D
Na "Capacitors_SMD/C_1825P.wrl"
Sc 1 1 1
Of 0 0 0
Ro 0 0 0
$EndSHAPE3D
$EndMODULE HVBoard:C_1825
$EndLIBRARY
