PCBNEW-LibModule-V1  Fri 05 Dec 2014 03:35:54 PM EST
# encoding utf-8
Units mm
$INDEX
HVBoard:R_1206
$EndINDEX
$MODULE HVBoard:R_1206
Po 0 0 0 15 54821727 00000000 ~~
Li HVBoard:R_1206
Cd Resistor SMD 1206, hand soldering
Kw resistor 1206
Sc 0
AR /545D34C9
Op 0 0 0
At SMD
T0 0 -2.3 1 1 0 0.15 N V 21 N "R5"
T1 0 2.3 1 1 0 0.15 N V 21 N "100k"
DS 3.1 -1.2 -3.1 -1.2 0.05 21
DS -3.1 1.2 3.1 1.2 0.05 21
DS -3.1 -1.2 -3.1 1.2 0.05 21
DS 3.1 -1.2 3.1 1.2 0.05 21
$PAD
Sh "1" R 1.6 1.9 0 0 0
Dr 0 0 0
At SMD N 00888000
Ne 2 "N-0000034"
Po -2 0
$EndPAD
$PAD
Sh "2" R 1.6 1.9 0 0 0
Dr 0 0 0
At SMD N 00888000
Ne 1 "N-0000028"
Po 2 0
$EndPAD
$SHAPE3D
Na "Resistors_SMD/R_1206.wrl"
Sc 1 1 1
Of 0 0 0
Ro 0 0 0
$EndSHAPE3D
$EndMODULE HVBoard:R_1206
$EndLIBRARY
