(module HV_Connector_pinin (layer F.Cu) (tedit 54666620)
  (fp_text reference "VAL **" (at 14.8 2.2) (layer F.SilkS)
    (effects (font (size 1.5 1.5) (thickness 0.15)))
  )
  (fp_text value Board_In_Connect (at 17.78 -5.08) (layer F.SilkS)
    (effects (font (size 1.5 1.5) (thickness 0.15)))
  )
  (fp_line (start -1.5 57.4) (end -1.5 -1.2) (layer Dwgs.User) (width 0.15))
  (fp_line (start 1.5 57.4) (end -1.5 57.4) (layer Dwgs.User) (width 0.15))
  (fp_line (start 1.5 -1.3) (end -1.5 -1.3) (layer Dwgs.User) (width 0.15))
  (fp_line (start 1.5 -1.3) (end 1.5 57.4) (layer F.SilkS) (width 0.15))
  (fp_line (start 1.5 57.4) (end 4 57.4) (layer F.SilkS) (width 0.15))
  (fp_line (start 4 57.4) (end 4 -1.3) (layer F.SilkS) (width 0.15))
  (fp_line (start 1.5 -1.3) (end 4 -1.3) (layer F.SilkS) (width 0.15))
  (pad 1 thru_hole circle (at 0 0 90) (size 1.8 1.8) (drill 1.02) (layers *.Cu *.Mask F.SilkS))
  (pad 6 thru_hole circle (at 0 12.7 90) (size 1.8 1.8) (drill 1.02) (layers *.Cu *.Mask F.SilkS))
  (pad 5 thru_hole circle (at 0 10.16 90) (size 1.8 1.8) (drill 1.02) (layers *.Cu *.Mask F.SilkS))
  (pad 18 thru_hole circle (at 0 43.18 90) (size 1.8 1.8) (drill 1.02) (layers *.Cu *.Mask F.SilkS))
  (pad 14 thru_hole circle (at 0 33.02 90) (size 1.8 1.8) (drill 1.02) (layers *.Cu *.Mask F.SilkS))
  (pad 10 thru_hole circle (at 0 22.86 90) (size 1.8 1.8) (drill 1.02) (layers *.Cu *.Mask F.SilkS))
  (pad 19 thru_hole circle (at 0 45.72 90) (size 1.8 1.8) (drill 1.02) (layers *.Cu *.Mask F.SilkS))
  (pad 23 thru_hole circle (at 0 55.88 90) (size 1.8 1.8) (drill 1.02) (layers *.Cu *.Mask F.SilkS))
)
