PCBNEW-LibModule-V1  Fri 06 Nov 2015 10:50:27 AM EST
# encoding utf-8
Units mm
$INDEX
GND_Connector
HV_Connector
HV_Connector_flip
HV_Connector_new
$EndINDEX
$MODULE GND_Connector
Po 0 0 0 15 563BD0F0 00000000 ~~
Li GND_Connector
Sc 0
AR /547CD540
Op 0 0 0
T0 4.32 0 1.5 1.5 0 0.15 N V 21 N "J?"
T1 0.09 -4.99 1.5 1.5 0 0.15 N V 21 N "CONN_GND"
$PAD
Sh "" C 1.8 1.8 0 0 900
Dr 1.02 0 0
At STD N 00E0FFFF
Ne 0 ""
Po 1.27 1.27
$EndPAD
$PAD
Sh "2" C 1.8 1.8 0 0 900
Dr 1.02 0 0
At STD N 00E0FFFF
Ne 0 ""
Po -1.27 1.27
$EndPAD
$PAD
Sh "1" C 1.8 1.8 0 0 900
Dr 1.02 0 0
At STD N 00E0FFFF
Ne 0 ""
Po -1.27 -1.27
$EndPAD
$PAD
Sh "" C 1.8 1.8 0 0 900
Dr 1.02 0 0
At STD N 00E0FFFF
Ne 0 ""
Po 1.27 -1.27
$EndPAD
$EndMODULE GND_Connector
$MODULE HV_Connector
Po 0 0 0 15 563BD130 00000000 ~~
Li HV_Connector
Sc 0
AR /547CD540
Op 0 0 0
T0 18.6 -3.2 1.5 1.5 0 0.15 N V 21 N "J?"
T1 11.1 -6.6 1.5 1.5 0 0.15 N V 21 N "CONN_SHV"
DS 4.4 3 15.9 3 0.15 21
DS 15.9 3 15.9 -3 0.15 21
DS 15.9 -3 4.4 -3 0.15 21
DS 4.4 0.3 1.7 0.3 0.15 21
DS 4.4 -0.3 1.7 -0.3 0.15 21
DS 4.4 -3 4.4 3 0.15 21
DS 0.5 0.8 0.5 -0.8 0.15 21
DS 4.4 -0.8 4.4 0.8 0.15 21
DS 4.4 0.8 0.5 0.8 0.15 21
DS 0.5 -0.8 4.4 -0.8 0.15 21
DS 4.4 0.3 4.4 -0.3 0.15 21
DS -1.7 1.3 1.7 1.3 0.15 21
DS 1.7 1.3 1.7 -1.3 0.15 21
DS 1.7 -1.3 -1.7 -1.3 0.15 21
DS -1.7 -1.3 -1.7 1.3 0.15 21
$PAD
Sh "" C 2.54 2.54 0 0 0
Dr 2.54 0 0
At HOLE N 00E0FFFF
Ne 0 ""
Po 10.4 -3.5
$EndPAD
$PAD
Sh "1" C 1.8 1.8 0 0 900
Dr 1.02 0 0
At STD N 00E0FFFF
Ne 0 ""
Po 0 0
$EndPAD
$PAD
Sh "" C 2.54 2.54 0 0 0
Dr 2.54 0 0
At HOLE N 00E0FFFF
Ne 0 ""
Po 10.4 3.5
$EndPAD
$EndMODULE HV_Connector
$MODULE HV_Connector_flip
Po 0 0 0 15 551EE75E 00000000 ~~
Li HV_Connector_flip
Sc 0
AR /547CD554
Op 0 0 0
T0 18.6 -3.2 1.5 1.5 0 0.15 N V 21 N "I2"
T1 11.1 -6.6 1.5 1.5 0 0.15 N V 21 N "High_Voltage_Input"
DS 4.4 3 15.9 3 0.15 21
DS 15.9 3 15.9 -3 0.15 21
DS 15.9 -3 4.4 -3 0.15 21
DS 4.4 0.3 1.7 0.3 0.15 21
DS 4.4 -0.3 1.7 -0.3 0.15 21
DS 4.4 -3 4.4 3 0.15 21
DS 0.5 0.8 0.5 -0.8 0.15 21
DS 4.4 -0.8 4.4 0.8 0.15 21
DS 4.4 0.8 0.5 0.8 0.15 21
DS 0.5 -0.8 4.4 -0.8 0.15 21
DS 4.4 0.3 4.4 -0.3 0.15 21
DS -1.7 1.3 1.7 1.3 0.15 21
DS 1.7 1.3 1.7 -1.3 0.15 21
DS 1.7 -1.3 -1.7 -1.3 0.15 21
DS -1.7 -1.3 -1.7 1.3 0.15 21
$PAD
Sh "2" C 1.8 1.8 0 0 900
Dr 1.02 0 0
At STD N 00E0FFFF
Ne 0 ""
Po 8.7472 -8.7302
$EndPAD
$PAD
Sh "" C 2.54 2.54 0 0 0
Dr 2.54 0 0
At HOLE N 00E0FFFF
Ne 0 ""
Po 10.4 -3.5
$EndPAD
$PAD
Sh "" C 1.8 1.8 0 0 900
Dr 1.02 0 0
At HOLE N 00E0FFFF
Ne 0 ""
Po 11.2872 -8.7302
$EndPAD
$PAD
Sh "1" C 1.8 1.8 0 0 900
Dr 1.02 0 0
At STD N 00E0FFFF
Ne 1 "N-0000036"
Po 0 0
$EndPAD
$PAD
Sh "" C 2.54 2.54 0 0 0
Dr 2.54 0 0
At HOLE N 00E0FFFF
Ne 0 ""
Po 10.4 3.5
$EndPAD
$EndMODULE HV_Connector_flip
$MODULE HV_Connector_new
Po 0 0 0 15 563BD130 00000000 ~~
Li HV_Connector_new
Sc 0
AR /547CD540
Op 0 0 0
T0 18.6 -3.2 1.5 1.5 0 0.15 N V 21 N "J?"
T1 11.1 -6.6 1.5 1.5 0 0.15 N V 21 N "CONN_SHV"
DS 4.4 3 15.9 3 0.15 21
DS 15.9 3 15.9 -3 0.15 21
DS 15.9 -3 4.4 -3 0.15 21
DS 4.4 0.3 1.7 0.3 0.15 21
DS 4.4 -0.3 1.7 -0.3 0.15 21
DS 4.4 -3 4.4 3 0.15 21
DS 0.5 0.8 0.5 -0.8 0.15 21
DS 4.4 -0.8 4.4 0.8 0.15 21
DS 4.4 0.8 0.5 0.8 0.15 21
DS 0.5 -0.8 4.4 -0.8 0.15 21
DS 4.4 0.3 4.4 -0.3 0.15 21
DS -1.7 1.3 1.7 1.3 0.15 21
DS 1.7 1.3 1.7 -1.3 0.15 21
DS 1.7 -1.3 -1.7 -1.3 0.15 21
DS -1.7 -1.3 -1.7 1.3 0.15 21
$PAD
Sh "" C 2.54 2.54 0 0 0
Dr 2.54 0 0
At HOLE N 00E0FFFF
Ne 0 ""
Po 10.4 -3.5
$EndPAD
$PAD
Sh "1" C 1.8 1.8 0 0 900
Dr 1.02 0 0
At STD N 00E0FFFF
Ne 0 ""
Po 0 0
$EndPAD
$PAD
Sh "" C 2.54 2.54 0 0 0
Dr 2.54 0 0
At HOLE N 00E0FFFF
Ne 0 ""
Po 10.4 3.5
$EndPAD
$EndMODULE HV_Connector_new
$EndLIBRARY
