EESchema Schematic File Version 2
LIBS:HVBoard
LIBS:power
LIBS:pspice
LIBS:jumper
LIBS:HVBoard-cache
EELAYER 24 0
EELAYER END
$Descr A4 11693 8268
encoding utf-8
Sheet 1 1
Title ""
Date "21 jan 2015"
Rev ""
Comp ""
Comment1 ""
Comment2 ""
Comment3 ""
Comment4 ""
$EndDescr
$Comp
L R R6
U 1 1 545D33F2
P 5800 3250
F 0 "R6" V 5700 3250 40  0000 C CNN
F 1 "1k" V 5807 3251 40  0000 C CNN
F 2 "HVBoard:R_1206" V 5730 3250 30  0001 C CNN
F 3 "" H 5800 3250 30  0000 C CNN
F 4 "HVCB1206JDD1K00TR-ND" V 5800 3250 60  0001 C CNN "Field1"
F 5 "Digi-Key" V 5800 3250 60  0001 C CNN "Field2"
	1    5800 3250
	0    1    1    0   
$EndComp
$Comp
L R R5
U 1 1 545D34C9
P 5800 2850
F 0 "R5" V 5880 2850 40  0000 C CNN
F 1 "100k" V 5807 2851 40  0000 C CNN
F 2 "HVBoard:R_1206" V 5730 2850 30  0001 C CNN
F 3 "" H 5800 2850 30  0000 C CNN
F 4 "HVCB1206FKC100KCT-ND" V 5800 2850 60  0001 C CNN "Field1"
F 5 "Digi-Key" V 5800 2850 60  0001 C CNN "Field2"
	1    5800 2850
	0    1    1    0   
$EndComp
$Comp
L CAP C1
U 1 1 54612925
P 5350 3000
F 0 "C1" V 5150 3000 50  0000 C CNN
F 1 "5.6nF" V 5550 3000 50  0000 C CNN
F 2 "HVBoard:C_1825" H 5350 3000 60  0001 C CNN
F 3 "" H 5350 3000 60  0000 C CNN
F 4 "478-3018-1-ND" V 5350 3000 60  0001 C CNN "Field1"
F 5 "Digi-Key" V 5350 3000 60  0001 C CNN "Field2"
	1    5350 3000
	1    0    0    -1  
$EndComp
Text Notes 5050 2600 0    60   ~ 0
HV Capacitors\n
$Comp
L R R1
U 1 1 54614AFA
P 4900 2750
F 0 "R1" V 4980 2750 40  0000 C CNN
F 1 "100k" V 4907 2751 40  0000 C CNN
F 2 "HVBoard:R_1206" V 4830 2750 30  0001 C CNN
F 3 "" H 4900 2750 30  0000 C CNN
F 4 "HVCB1206FKC100KCT-ND" V 4900 2750 60  0001 C CNN "Field1"
F 5 "Digi-Key" V 4900 2750 60  0001 C CNN "Field2"
	1    4900 2750
	0    1    1    0   
$EndComp
$Comp
L R R7
U 1 1 5463ADD6
P 5800 3350
F 0 "R7" V 5700 3350 40  0000 C CNN
F 1 "1k" V 5807 3351 40  0000 C CNN
F 2 "HVBoard:R_1206" V 5730 3350 30  0001 C CNN
F 3 "" H 5800 3350 30  0000 C CNN
F 4 "HVCB1206JDD1K00TR-ND" V 5800 3350 60  0001 C CNN "Field1"
F 5 "Digi-Key" V 5800 3350 60  0001 C CNN "Field2"
	1    5800 3350
	0    1    -1   0   
$EndComp
$Comp
L R R8
U 1 1 5463ADDC
P 5800 3750
F 0 "R8" V 5880 3750 40  0000 C CNN
F 1 "100k" V 5807 3751 40  0000 C CNN
F 2 "HVBoard:R_1206" V 5730 3750 30  0001 C CNN
F 3 "" H 5800 3750 30  0000 C CNN
F 4 "HVCB1206FKC100KCT-ND" V 5800 3750 60  0001 C CNN "Field1"
F 5 "Digi-Key" V 5800 3750 60  0001 C CNN "Field2"
	1    5800 3750
	0    1    -1   0   
$EndComp
$Comp
L CAP C2
U 1 1 5463ADE8
P 5350 3600
F 0 "C2" V 5150 3600 50  0000 C CNN
F 1 "5.6nF" V 5550 3600 50  0000 C CNN
F 2 "HVBoard:C_1825" H 5350 3600 60  0001 C CNN
F 3 "" H 5350 3600 60  0000 C CNN
F 4 "478-3018-1-ND" V 5350 3600 60  0001 C CNN "Field1"
F 5 "Digi-Key" V 5350 3600 60  0001 C CNN "Field2"
	1    5350 3600
	1    0    0    1   
$EndComp
$Comp
L R R2
U 1 1 5463ADF2
P 4900 3750
F 0 "R2" V 4980 3750 40  0000 C CNN
F 1 "100k" V 4907 3751 40  0000 C CNN
F 2 "HVBoard:R_1206" V 4830 3750 30  0001 C CNN
F 3 "" H 4900 3750 30  0000 C CNN
F 4 "HVCB1206FKC100KCT-ND" V 4900 3750 60  0001 C CNN "Field1"
F 5 "Digi-Key" V 4900 3750 60  0001 C CNN "Field2"
	1    4900 3750
	0    1    -1   0   
$EndComp
$Comp
L JUMPER JP1
U 1 1 5463CA2F
P 4250 2750
F 0 "JP1" H 4250 2900 60  0000 C CNN
F 1 "JUMPER" H 4250 2600 40  0000 C CNN
F 2 "HVBoard:Jumper" H 4250 2750 60  0001 C CNN
F 3 "" H 4250 2750 60  0000 C CNN
F 4 "SAM1087-05-ND" H 4250 2750 60  0001 C CNN "Field1"
F 5 "Digi-Key" H 4250 2750 60  0001 C CNN "Field2"
F 6 "Remove middle 3 pins" H 4250 2750 60  0001 C CNN "notes"
	1    4250 2750
	1    0    0    -1  
$EndComp
$Comp
L JUMPER JP2
U 1 1 5463D040
P 4250 3750
F 0 "JP2" H 4250 3900 60  0000 C CNN
F 1 "JUMPER" H 4250 3600 40  0000 C CNN
F 2 "HVBoard:Jumper" H 4250 3750 60  0001 C CNN
F 3 "" H 4250 3750 60  0000 C CNN
F 4 "SAM1087-05-ND" H 4250 3750 60  0001 C CNN "Field1"
F 5 "Digi-Key" H 4250 3750 60  0001 C CNN "Field2"
	1    4250 3750
	1    0    0    -1  
$EndComp
Text Notes 7600 2650 0    60   ~ 0
In\n
Text Notes 3600 2600 0    60   ~ 0
Out\n
Connection ~ 5350 3250
Connection ~ 5350 2750
Wire Wire Line
	4550 2750 4650 2750
Connection ~ 5350 3350
Connection ~ 5350 3850
Wire Wire Line
	3950 3350 5550 3350
Wire Wire Line
	5250 3850 5450 3850
Wire Wire Line
	4650 3750 4550 3750
Wire Wire Line
	5150 2750 5450 2750
Wire Wire Line
	5450 2850 5550 2850
Wire Wire Line
	5450 2750 5450 2850
Wire Wire Line
	5150 3750 5250 3750
Wire Wire Line
	5250 3750 5250 3850
Wire Wire Line
	5550 3750 5450 3750
Wire Wire Line
	5450 3750 5450 3850
$Comp
L R R10
U 1 1 54641935
P 5800 4550
F 0 "R10" V 5700 4550 40  0000 C CNN
F 1 "1k" V 5807 4551 40  0000 C CNN
F 2 "HVBoard:R_1206" V 5730 4550 30  0001 C CNN
F 3 "" H 5800 4550 30  0000 C CNN
F 4 "HVCB1206JDD1K00TR-ND" V 5800 4550 60  0001 C CNN "Field1"
F 5 "Digi-Key" V 5800 4550 60  0001 C CNN "Field2"
	1    5800 4550
	0    1    1    0   
$EndComp
$Comp
L R R9
U 1 1 5464193B
P 5800 4150
F 0 "R9" V 5880 4150 40  0000 C CNN
F 1 "100k" V 5807 4151 40  0000 C CNN
F 2 "HVBoard:R_1206" V 5730 4150 30  0001 C CNN
F 3 "" H 5800 4150 30  0000 C CNN
F 4 "HVCB1206FKC100KCT-ND" V 5800 4150 60  0001 C CNN "Field1"
F 5 "Digi-Key" V 5800 4150 60  0001 C CNN "Field2"
	1    5800 4150
	0    1    1    0   
$EndComp
$Comp
L CAP C3
U 1 1 54641941
P 5350 4300
F 0 "C3" V 5150 4300 50  0000 C CNN
F 1 "5.6nF" V 5550 4300 50  0000 C CNN
F 2 "HVBoard:C_1825" H 5350 4300 60  0001 C CNN
F 3 "" H 5350 4300 60  0000 C CNN
F 4 "478-3018-1-ND" V 5350 4300 60  0001 C CNN "Field1"
F 5 "Digi-Key" V 5350 4300 60  0001 C CNN "Field2"
	1    5350 4300
	1    0    0    -1  
$EndComp
$Comp
L R R3
U 1 1 54641947
P 4900 4150
F 0 "R3" V 4980 4150 40  0000 C CNN
F 1 "100k" V 4907 4151 40  0000 C CNN
F 2 "HVBoard:R_1206" V 4830 4150 30  0001 C CNN
F 3 "" H 4900 4150 30  0000 C CNN
F 4 "HVCB1206FKC100KCT-ND" V 4900 4150 60  0001 C CNN "Field1"
F 5 "Digi-Key" V 4900 4150 60  0001 C CNN "Field2"
	1    4900 4150
	0    1    1    0   
$EndComp
$Comp
L R R11
U 1 1 5464194D
P 5800 4650
F 0 "R11" V 5700 4650 40  0000 C CNN
F 1 "1k" V 5807 4651 40  0000 C CNN
F 2 "HVBoard:R_1206" V 5730 4650 30  0001 C CNN
F 3 "" H 5800 4650 30  0000 C CNN
F 4 "HVCB1206JDD1K00TR-ND" V 5800 4650 60  0001 C CNN "Field1"
F 5 "Digi-Key" V 5800 4650 60  0001 C CNN "Field2"
	1    5800 4650
	0    1    -1   0   
$EndComp
$Comp
L R R12
U 1 1 54641953
P 5800 5050
F 0 "R12" V 5880 5050 40  0000 C CNN
F 1 "100k" V 5807 5051 40  0000 C CNN
F 2 "HVBoard:R_1206" V 5730 5050 30  0001 C CNN
F 3 "" H 5800 5050 30  0000 C CNN
F 4 "HVCB1206FKC100KCT-ND" V 5800 5050 60  0001 C CNN "Field1"
F 5 "Digi-Key" V 5800 5050 60  0001 C CNN "Field2"
	1    5800 5050
	0    1    -1   0   
$EndComp
$Comp
L CAP C4
U 1 1 54641959
P 5350 4900
F 0 "C4" V 5150 4900 50  0000 C CNN
F 1 "5.6nF" V 5550 4900 50  0000 C CNN
F 2 "HVBoard:C_1825" H 5350 4900 60  0001 C CNN
F 3 "" H 5350 4900 60  0000 C CNN
F 4 "478-3018-1-ND" V 5350 4900 60  0001 C CNN "Field1"
F 5 "Digi-Key" V 5350 4900 60  0001 C CNN "Field2"
	1    5350 4900
	1    0    0    1   
$EndComp
$Comp
L R R4
U 1 1 5464195F
P 4900 5150
F 0 "R4" V 4980 5150 40  0000 C CNN
F 1 "100k" V 4907 5151 40  0000 C CNN
F 2 "HVBoard:R_1206" V 4830 5150 30  0001 C CNN
F 3 "" H 4900 5150 30  0000 C CNN
F 4 "HVCB1206FKC100KCT-ND" V 4900 5150 60  0001 C CNN "Field1"
F 5 "Digi-Key" V 4900 5150 60  0001 C CNN "Field2"
	1    4900 5150
	0    1    -1   0   
$EndComp
$Comp
L JUMPER JP3
U 1 1 54641965
P 4250 4150
F 0 "JP3" H 4250 4300 60  0000 C CNN
F 1 "JUMPER" H 4250 4000 40  0000 C CNN
F 2 "HVBoard:Jumper" H 4250 4150 60  0001 C CNN
F 3 "" H 4250 4150 60  0000 C CNN
F 4 "SAM1087-05-ND" H 4250 4150 60  0001 C CNN "Field1"
F 5 "Digi-Key" H 4250 4150 60  0001 C CNN "Field2"
	1    4250 4150
	1    0    0    -1  
$EndComp
$Comp
L JUMPER JP4
U 1 1 5464196B
P 4250 5150
F 0 "JP4" H 4250 5300 60  0000 C CNN
F 1 "JUMPER" H 4250 5000 40  0000 C CNN
F 2 "HVBoard:Jumper" H 4250 5150 60  0001 C CNN
F 3 "" H 4250 5150 60  0000 C CNN
F 4 "SAM1087-05-ND" H 4250 5150 60  0001 C CNN "Field1"
F 5 "Digi-Key" H 4250 5150 60  0001 C CNN "Field2"
	1    4250 5150
	1    0    0    -1  
$EndComp
Connection ~ 5350 4550
Connection ~ 5350 4050
Wire Wire Line
	4550 4150 4650 4150
Connection ~ 5350 4650
Connection ~ 5350 5150
Wire Wire Line
	3950 4550 5550 4550
Wire Wire Line
	5150 5150 5450 5150
Wire Wire Line
	4650 5150 4550 5150
Wire Wire Line
	5250 4050 5250 4150
Wire Wire Line
	5250 4150 5150 4150
Wire Wire Line
	5450 4150 5550 4150
Wire Wire Line
	5450 4050 5450 4150
Wire Wire Line
	5250 4050 5450 4050
Wire Wire Line
	5550 5050 5450 5050
Wire Wire Line
	5450 5050 5450 5150
$Comp
L HV_jumper U1
U 1 1 54665985
P 6450 2600
F 0 "U1" H 6600 2500 60  0000 C CNN
F 1 "HV_jumper" H 6450 2750 60  0000 C CNN
F 2 "HVBoard:TH-point" H 6450 2600 60  0001 C CNN
F 3 "" H 6450 2600 60  0000 C CNN
F 4 "DNP" H 6450 2600 60  0001 C CNN "Part #"
	1    6450 2600
	1    0    0    -1  
$EndComp
$Comp
L HV_jumper U2
U 1 1 546659CE
P 6450 3500
F 0 "U2" H 6600 3400 60  0000 C CNN
F 1 "HV_jumper" H 6450 3600 60  0000 C CNN
F 2 "HVBoard:TH-point" H 6450 3500 60  0001 C CNN
F 3 "" H 6450 3500 60  0000 C CNN
F 4 "DNP" H 6450 3500 60  0001 C CNN "Part #"
	1    6450 3500
	1    0    0    -1  
$EndComp
$Comp
L HV_jumper U3
U 1 1 546659EF
P 6450 3900
F 0 "U3" H 6600 3800 60  0000 C CNN
F 1 "HV_jumper" H 6450 4000 60  0000 C CNN
F 2 "HVBoard:TH-point" H 6450 3900 60  0001 C CNN
F 3 "" H 6450 3900 60  0000 C CNN
F 4 "DNP" H 6450 3900 60  0001 C CNN "Part #"
	1    6450 3900
	1    0    0    -1  
$EndComp
$Comp
L HV_jumper U4
U 1 1 54665A08
P 6450 4800
F 0 "U4" H 6600 4700 60  0000 C CNN
F 1 "HV_jumper" H 6450 4900 60  0000 C CNN
F 2 "HVBoard:TH-point" H 6450 4800 60  0001 C CNN
F 3 "" H 6450 4800 60  0000 C CNN
F 4 "DNP" H 6450 4800 60  0001 C CNN "Part #"
	1    6450 4800
	1    0    0    -1  
$EndComp
$Comp
L HV_jumper U5
U 1 1 54666527
P 6950 3500
F 0 "U5" H 7100 3400 60  0000 C CNN
F 1 "HV_jumper" H 6950 3600 60  0000 C CNN
F 2 "HVBoard:TH-point" H 6950 3500 60  0001 C CNN
F 3 "" H 6950 3500 60  0000 C CNN
F 4 "DNP" H 6950 3500 60  0001 C CNN "Part #"
	1    6950 3500
	1    0    0    -1  
$EndComp
$Comp
L HV_jumper U6
U 1 1 54666542
P 6950 3900
F 0 "U6" H 7100 3800 60  0000 C CNN
F 1 "HV_jumper" H 6950 4000 60  0000 C CNN
F 2 "HVBoard:TH-point" H 6950 3900 60  0001 C CNN
F 3 "" H 6950 3900 60  0000 C CNN
F 4 "DNP" H 6950 3900 60  0001 C CNN "Part #"
	1    6950 3900
	1    0    0    -1  
$EndComp
Connection ~ 6450 5050
Connection ~ 6450 4150
Connection ~ 6950 4150
Connection ~ 6950 3750
Connection ~ 6450 3750
Connection ~ 6450 2850
$Comp
L Board_Connect J1
U 1 1 545D6013
P 3650 2900
F 0 "J1" H 4050 2700 60  0001 C CNN
F 1 "CONN_BOARD_OUT" H 3650 3150 60  0001 C CNN
F 2 "HVBoard:HV_Connector_pinout" H 3650 2900 60  0001 C CNN
F 3 "" H 3650 2900 60  0000 C CNN
F 4 "S5500-ND" H 3650 2900 60  0001 C CNN "Field1"
F 5 "Digi-Key" H 3650 2900 60  0001 C CNN "Field2"
F 6 "remove 17 pins" H 3650 2900 60  0001 C CNN "note"
	1    3650 2900
	1    0    0    -1  
$EndComp
Wire Wire Line
	3950 4750 4150 4750
Wire Wire Line
	4150 4750 4150 4650
Wire Wire Line
	4150 4650 5550 4650
Wire Wire Line
	3950 3150 4150 3150
Wire Wire Line
	4150 3150 4150 3250
Wire Wire Line
	4150 3250 5550 3250
NoConn ~ 3950 5050
NoConn ~ 3950 4950
NoConn ~ 3950 4850
NoConn ~ 3950 4650
NoConn ~ 3950 4450
NoConn ~ 3950 4350
NoConn ~ 3950 4250
NoConn ~ 3950 4050
NoConn ~ 3950 3950
NoConn ~ 3950 3850
NoConn ~ 3950 3650
NoConn ~ 3950 3550
NoConn ~ 3950 3450
NoConn ~ 3950 3250
NoConn ~ 3950 3050
NoConn ~ 3950 2950
NoConn ~ 3950 2850
$Comp
L High_Voltage_Input J2
U 1 1 547CD540
P 7600 2750
F 0 "J2" H 7850 2550 60  0001 C CNN
F 1 "CONN_SHV" H 7600 2850 60  0001 C CNN
F 2 "HVBoard:HV_Connector_new" H 7600 2750 60  0001 C CNN
F 3 "" H 7600 2750 60  0000 C CNN
F 4 "S1311EC-01-ND" H 7600 2750 60  0001 C CNN "Field1"
F 5 "Digi-Key" H 7600 2750 60  0001 C CNN "Field2"
	1    7600 2750
	1    0    0    -1  
$EndComp
$Comp
L High_Voltage_Input J3
U 1 1 547CD554
P 7600 3850
F 0 "J3" H 7850 3650 60  0001 C CNN
F 1 "CONN_SHV" H 7600 3950 60  0001 C CNN
F 2 "HVBoard:HV_Connector_new" H 7600 3850 60  0001 C CNN
F 3 "" H 7600 3850 60  0000 C CNN
F 4 "S1311EC-01-ND" H 7600 3850 60  0001 C CNN "Field1"
F 5 "Digi-Key" H 7600 3850 60  0001 C CNN "Field2"
	1    7600 3850
	1    0    0    1   
$EndComp
$Comp
L High_Voltage_Input J4
U 1 1 547CD568
P 7600 4050
F 0 "J4" H 7850 3850 60  0001 C CNN
F 1 "CONN_SHV" H 7600 4150 60  0001 C CNN
F 2 "HVBoard:HV_Connector_new" H 7600 4050 60  0001 C CNN
F 3 "" H 7600 4050 60  0000 C CNN
F 4 "S1311EC-01-ND" H 7600 4050 60  0001 C CNN "Field1"
F 5 "Digi-Key" H 7600 4050 60  0001 C CNN "Field2"
	1    7600 4050
	1    0    0    -1  
$EndComp
$Comp
L High_Voltage_Input J5
U 1 1 547CD57C
P 7600 5150
F 0 "J5" H 7850 4950 60  0001 C CNN
F 1 "CONN_SHV" H 7600 5250 60  0001 C CNN
F 2 "HVBoard:HV_Connector_new" H 7600 5150 60  0001 C CNN
F 3 "" H 7600 5150 60  0000 C CNN
F 4 "S1311EC-01-ND" H 7600 5150 60  0001 C CNN "Field1"
F 5 "Digi-Key" H 7600 5150 60  0001 C CNN "Field2"
	1    7600 5150
	1    0    0    1   
$EndComp
Wire Wire Line
	6050 2850 7300 2850
Wire Wire Line
	6050 3350 7300 3350
Wire Wire Line
	6050 3250 7300 3250
Wire Wire Line
	6050 3750 7300 3750
Wire Wire Line
	6050 4150 7300 4150
Wire Wire Line
	6050 4550 7300 4550
Wire Wire Line
	6050 4650 7300 4650
Wire Wire Line
	6050 5050 7300 5050
$Comp
L GND_INPUT J6
U 1 1 563BC82C
P 7600 3150
F 0 "J6" H 7850 2950 60  0001 C CNN
F 1 "GND_INPUT" H 7600 3250 60  0000 C CNN
F 2 "" H 7600 3150 60  0000 C CNN
F 3 "" H 7600 3150 60  0000 C CNN
F 4 "S5555-ND" H 7600 3150 60  0001 C CNN "Part #"
F 5 "Digi-key" H 7600 3150 60  0001 C CNN "Distributor"
	1    7600 3150
	1    0    0    -1  
$EndComp
$Comp
L GND_INPUT J7
U 1 1 563BC840
P 7600 4450
F 0 "J7" H 7850 4250 60  0001 C CNN
F 1 "GND_INPUT" H 7600 4550 60  0000 C CNN
F 2 "" H 7600 4450 60  0000 C CNN
F 3 "" H 7600 4450 60  0000 C CNN
F 4 "S5555-ND" H 7600 4450 60  0001 C CNN "Part #"
F 5 "Digi-key" H 7600 4450 60  0001 C CNN "Distributor"
	1    7600 4450
	1    0    0    -1  
$EndComp
$EndSCHEMATC
