PCBNEW-LibModule-V1  Fri 05 Dec 2014 03:33:12 PM EST
# encoding utf-8
Units mm
$INDEX
HVBoard:HV_Connector_pinout
$EndINDEX
$MODULE HVBoard:HV_Connector_pinout
Po 0 0 0 15 54821684 00000000 ~~
Li HVBoard:HV_Connector_pinout
Sc 0
AR /545D6013
Op 0 0 0
T0 0.3 -3.6 1.5 1.5 0 0.15 N V 21 N "D1"
T1 1.3 -6.6 1.5 1.5 0 0.15 N I 21 N "Board_Connect"
DS -1.6 -1.5 -1.6 62.5 0.15 21
DS -10.1 62.5 -10.1 -1.5 0.15 21
DS -1.6 62.5 -10.1 62.5 0.15 21
DS 1.6 -1.5 1.6 62.5 0.15 21
DS 1.6 62.5 -1.6 62.5 0.15 21
DS 1.6 -1.5 -1.6 -1.5 0.15 21
DS -10.1 -1.5 -1.6 -1.5 0.15 21
$PAD
Sh "21" C 1.8 1.8 0 0 900
Dr 1.02 0 0
At STD N 00E0FFFF
Ne 6 "N-0000040"
Po 0 50.8
$EndPAD
$PAD
Sh "7" C 1.8 1.8 0 0 900
Dr 1.02 0 0
At STD N 00E0FFFF
Ne 4 "N-0000032"
Po 0 15.24
$EndPAD
$PAD
Sh "1" C 1.8 1.8 0 0 900
Dr 1.02 0 0
At STD N 00E0FFFF
Ne 1 "N-0000012"
Po 0 0
$EndPAD
$PAD
Sh "5" C 1.8 1.8 0 0 900
Dr 1.02 0 0
At STD N 00E0FFFF
Ne 3 "N-0000029"
Po 0 10.16
$EndPAD
$PAD
Sh "19" C 1.8 1.8 0 0 900
Dr 1.02 0 0
At STD N 00E0FFFF
Ne 5 "N-0000038"
Po 0 45.72
$EndPAD
$PAD
Sh "15" C 1.8 1.8 0 0 900
Dr 1.02 0 0
At STD N 00E0FFFF
Ne 7 "N-000005"
Po 0 35.56
$EndPAD
$PAD
Sh "11" C 1.8 1.8 0 0 900
Dr 1.02 0 0
At STD N 00E0FFFF
Ne 2 "N-0000020"
Po 0 25.4
$EndPAD
$PAD
Sh "25" C 1.8 1.8 0 0 900
Dr 1.02 0 0
At STD N 00E0FFFF
Ne 8 "N-000006"
Po 0 60.96
$EndPAD
$EndMODULE HVBoard:HV_Connector_pinout
$EndLIBRARY
