"5.6nF",4,"C1 C2 C3 C4","HVBoard:C_1825",,"478-3018-1-ND","Digi-Key",
"GND_INPUT",2,"J6 J7",,,"DNP","Digi-key",
"CONN_SHV",4,"J2 J3 J4 J5","HVBoard:HV_Connector_new",,"DNP","Digi-Key",
"CONN_BOARD_OUT",1,"J1","HVBoard:HV_Connector_pinout",,"DNP","Digi-Key","remove 17 pins"
"JUMPER",1,"JP1","HVBoard:Jumper",,"DNP","Digi-Key","Remove middle 3 pins"
"JUMPER",3,"JP2 JP3 JP4","HVBoard:Jumper",,"DNP","Digi-Key",
"1k",4,"R6 R7 R10 R11","HVBoard:R_1206",,"HVCB1206JDD1K00TR-ND","Digi-Key",
"100k",8,"R1 R2 R3 R4 R5 R8 R9 R12","HVBoard:R_1206",,"HVCB1206FKC100KCT-ND","Digi-Key",
"HV_jumper",6,"U1 U2 U3 U4 U5 U6","HVBoard:TH-point",,"DNP",,
