PCBNEW-LibModule-V1  Fri 05 Dec 2014 03:34:23 PM EST
# encoding utf-8
Units mm
$INDEX
HVBoard:Jumper
$EndINDEX
$MODULE HVBoard:Jumper
Po 0 0 0 15 548216CD 00000000 ~~
Li HVBoard:Jumper
Sc 0
AR /5463D040
Op 0 0 0
T0 0 -2.4 1.5 1.5 0 0.15 N V 21 N "JP2"
T1 0 2.8 1.5 1.5 0 0.15 N V 21 N "JUMPER"
DS -6.4 1.4 6.4 1.4 0.05 21
DS 6.4 1.4 6.4 -1.4 0.05 21
DS -6.4 1.4 -6.4 -1.4 0.05 21
DS -6.4 -1.4 6.4 -1.4 0.05 21
$PAD
Sh "2" C 1.8 1.8 0 0 900
Dr 1.02 0 0
At STD N 00E0FFFF
Ne 2 "N-0000027"
Po 5.08 0
$EndPAD
$PAD
Sh "1" C 1.8 1.8 0 0 900
Dr 1.02 0 0
At STD N 00E0FFFF
Ne 1 "N-0000020"
Po -5.08 0
$EndPAD
$EndMODULE HVBoard:Jumper
$EndLIBRARY
