(module C_1825 (layer F.Cu) (tedit 5463CED5)
  (descr "Capacitor SMD 1825, hand soldering")
  (tags "capacitor 1825")
  (attr smd)
  (fp_text reference C_1825 (at 0 -4.7) (layer F.SilkS)
    (effects (font (size 1 1) (thickness 0.15)))
  )
  (fp_text value VAL** (at 0 4.7) (layer F.SilkS)
    (effects (font (size 1 1) (thickness 0.15)))
  )
  (fp_line (start -4.3 -3.55) (end 4.3 -3.55) (layer F.CrtYd) (width 0.05))
  (fp_line (start -4.3 3.55) (end 4.3 3.55) (layer F.CrtYd) (width 0.05))
  (fp_line (start -4.3 -3.55) (end -4.3 3.55) (layer F.CrtYd) (width 0.05))
  (fp_line (start 4.3 -3.55) (end 4.3 3.55) (layer F.CrtYd) (width 0.05))
  (fp_line (start 1.8 -3.4) (end -1.8 -3.4) (layer F.SilkS) (width 0.15))
  (fp_line (start -1.8 3.4) (end 1.8 3.4) (layer F.SilkS) (width 0.15))
  (pad 1 smd rect (at -2.9 0) (size 2.2 6.45) (layers F.Cu F.Paste F.Mask))
  (pad 2 smd rect (at 2.9 0) (size 2.2 6.45) (layers F.Cu F.Paste F.Mask))
  (model Capacitors_SMD/C_1825P.wrl
    (at (xyz 0 0 0))
    (scale (xyz 1 1 1))
    (rotate (xyz 0 0 0))
  )
)
