PCBNEW-LibModule-V1  Fri 03 Apr 2015 03:17:53 PM EDT
# encoding utf-8
Units mm
$INDEX
HVBoard:HV_Connector_flip
HVBoard:HV_Connector_new
$EndINDEX
$MODULE HVBoard:HV_Connector_flip
Po 0 0 0 15 551EE75E 00000000 ~~
Li HVBoard:HV_Connector_flip
Sc 0
AR /547CD554
Op 0 0 0
T0 18.6 -3.2 1.5 1.5 0 0.15 N V 21 N "I2"
T1 11.1 -6.6 1.5 1.5 0 0.15 N V 21 N "High_Voltage_Input"
DS 4.4 3 15.9 3 0.15 21
DS 15.9 3 15.9 -3 0.15 21
DS 15.9 -3 4.4 -3 0.15 21
DS 4.4 0.3 1.7 0.3 0.15 21
DS 4.4 -0.3 1.7 -0.3 0.15 21
DS 4.4 -3 4.4 3 0.15 21
DS 0.5 0.8 0.5 -0.8 0.15 21
DS 4.4 -0.8 4.4 0.8 0.15 21
DS 4.4 0.8 0.5 0.8 0.15 21
DS 0.5 -0.8 4.4 -0.8 0.15 21
DS 4.4 0.3 4.4 -0.3 0.15 21
DS -1.7 1.3 1.7 1.3 0.15 21
DS 1.7 1.3 1.7 -1.3 0.15 21
DS 1.7 -1.3 -1.7 -1.3 0.15 21
DS -1.7 -1.3 -1.7 1.3 0.15 21
$PAD
Sh "2" C 1.8 1.8 0 0 900
Dr 1.02 0 0
At STD N 00E0FFFF
Ne 0 ""
Po 8.7472 -8.7302
$EndPAD
$PAD
Sh "" C 2.54 2.54 0 0 0
Dr 2.54 0 0
At HOLE N 00E0FFFF
Ne 0 ""
Po 10.4 -3.5
$EndPAD
$PAD
Sh "" C 1.8 1.8 0 0 900
Dr 1.02 0 0
At HOLE N 00E0FFFF
Ne 0 ""
Po 11.2872 -8.7302
$EndPAD
$PAD
Sh "1" C 1.8 1.8 0 0 900
Dr 1.02 0 0
At STD N 00E0FFFF
Ne 1 "N-0000036"
Po 0 0
$EndPAD
$PAD
Sh "" C 2.54 2.54 0 0 0
Dr 2.54 0 0
At HOLE N 00E0FFFF
Ne 0 ""
Po 10.4 3.5
$EndPAD
$EndMODULE HVBoard:HV_Connector_flip
$MODULE HVBoard:HV_Connector_new
Po 0 0 0 15 551EE744 00000000 ~~
Li HVBoard:HV_Connector_new
Sc 0
AR /547CD554
Op 0 0 0
T0 18.6 -3.2 1.5 1.5 0 0.15 N V 21 N "I2"
T1 11.1 -6.6 1.5 1.5 0 0.15 N V 21 N "High_Voltage_Input"
DS 4.4 3 15.9 3 0.15 21
DS 15.9 3 15.9 -3 0.15 21
DS 15.9 -3 4.4 -3 0.15 21
DS 4.4 0.3 1.7 0.3 0.15 21
DS 4.4 -0.3 1.7 -0.3 0.15 21
DS 4.4 -3 4.4 3 0.15 21
DS 0.5 0.8 0.5 -0.8 0.15 21
DS 4.4 -0.8 4.4 0.8 0.15 21
DS 4.4 0.8 0.5 0.8 0.15 21
DS 0.5 -0.8 4.4 -0.8 0.15 21
DS 4.4 0.3 4.4 -0.3 0.15 21
DS -1.7 1.3 1.7 1.3 0.15 21
DS 1.7 1.3 1.7 -1.3 0.15 21
DS 1.7 -1.3 -1.7 -1.3 0.15 21
DS -1.7 -1.3 -1.7 1.3 0.15 21
$PAD
Sh "2" C 1.8 1.8 0 0 900
Dr 1.02 0 0
At STD N 00E0FFFF
Ne 1 "N-0000023"
Po 8.7472 8.7302
$EndPAD
$PAD
Sh "" C 2.54 2.54 0 0 0
Dr 2.54 0 0
At HOLE N 00E0FFFF
Ne 0 ""
Po 10.4 -3.5
$EndPAD
$PAD
Sh "" C 1.8 1.8 0 0 900
Dr 1.02 0 0
At HOLE N 00E0FFFF
Ne 0 ""
Po 11.2872 8.7302
$EndPAD
$PAD
Sh "1" C 1.8 1.8 0 0 900
Dr 1.02 0 0
At STD N 00E0FFFF
Ne 2 "N-0000036"
Po 0 0
$EndPAD
$PAD
Sh "" C 2.54 2.54 0 0 0
Dr 2.54 0 0
At HOLE N 00E0FFFF
Ne 0 ""
Po 10.4 3.5
$EndPAD
$EndMODULE HVBoard:HV_Connector_new
$EndLIBRARY
