M48
;DRILL file {Pcbnew (2013-jul-07)-stable} date Wed 10 Dec 2014 02:47:42 PM EST
;FORMAT={-:-/ absolute / inch / decimal}
FMAT,2
INCH,TZ
T1C0.100
%
G90
G05
M72
T1
X6.6693Y-2.3031
X6.6693Y-2.5787
X6.6693Y-3.0906
X6.6693Y-3.3661
X6.6693Y-3.878
X6.6693Y-4.1535
X6.6693Y-4.6654
X6.6693Y-4.9409
T0
M30
