(module TH-point (layer F.Cu) (tedit 54664481)
  (fp_text reference TH-point (at 0 -2.54) (layer F.SilkS)
    (effects (font (size 1 1) (thickness 0.15)))
  )
  (fp_text value VAL** (at 0 3.81) (layer F.SilkS)
    (effects (font (size 1 1) (thickness 0.15)))
  )
  (pad 1 thru_hole circle (at 0 0) (size 1.5 1.5) (drill 0.6) (layers *.Cu *.Mask F.SilkS))
)
