  0
SECTION
  2
HEADER
  9
$ANGBASE
  50
0.0
  9
$ANGDIR
  70
  1
  9
$MEASUREMENT
  70
0
  0
ENDSEC
  0
SECTION
  2
TABLES
  0
TABLE
  2
LTYPE
  70
1
  0
LTYPE
  2
CONTINUOUS
  70
0
  3
Solid line
  72
65
  73
0
  40
0.0
  0
ENDTAB
  0
TABLE
  2
STYLE
  70
4
  0
STYLE
  2
KICAD
  70
0
  40
0
  41
1
  42
1
  50
0
  71
0
  3
isocp.shx
  0
STYLE
  2
KICADB
  70
0
  40
0
  41
1
  42
1
  50
0
  71
0
  3
isocp.shx
  0
STYLE
  2
KICADI
  70
0
  40
0
  41
1
  42
1
  50
15
  71
0
  3
isocp.shx
  0
STYLE
  2
KICADBI
  70
0
  40
0
  41
1
  42
1
  50
15
  71
0
  3
isocp.shx
  0
ENDTAB
  0
TABLE
  2
LAYER
  70
30
  0
LAYER
  2
BLACK
  70
0
  62
7
  6
CONTINUOUS
  0
LAYER
  2
GRAY1
  70
0
  62
251
  6
CONTINUOUS
  0
LAYER
  2
GRAY2
  70
0
  62
8
  6
CONTINUOUS
  0
LAYER
  2
GRAY3
  70
0
  62
9
  6
CONTINUOUS
  0
LAYER
  2
WHITE
  70
0
  62
7
  6
CONTINUOUS
  0
LAYER
  2
LYELLOW
  70
0
  62
51
  6
CONTINUOUS
  0
LAYER
  2
BLUE1
  70
0
  62
178
  6
CONTINUOUS
  0
LAYER
  2
GREEN1
  70
0
  62
98
  6
CONTINUOUS
  0
LAYER
  2
CYAN1
  70
0
  62
138
  6
CONTINUOUS
  0
LAYER
  2
RED1
  70
0
  62
18
  6
CONTINUOUS
  0
LAYER
  2
MAGENTA1
  70
0
  62
228
  6
CONTINUOUS
  0
LAYER
  2
BROWN1
  70
0
  62
58
  6
CONTINUOUS
  0
LAYER
  2
BLUE2
  70
0
  62
5
  6
CONTINUOUS
  0
LAYER
  2
GREEN2
  70
0
  62
3
  6
CONTINUOUS
  0
LAYER
  2
CYAN2
  70
0
  62
4
  6
CONTINUOUS
  0
LAYER
  2
RED2
  70
0
  62
1
  6
CONTINUOUS
  0
LAYER
  2
MAGENTA2
  70
0
  62
6
  6
CONTINUOUS
  0
LAYER
  2
BROWN2
  70
0
  62
54
  6
CONTINUOUS
  0
LAYER
  2
BLUE3
  70
0
  62
171
  6
CONTINUOUS
  0
LAYER
  2
GREEN3
  70
0
  62
91
  6
CONTINUOUS
  0
LAYER
  2
CYAN3
  70
0
  62
131
  6
CONTINUOUS
  0
LAYER
  2
RED3
  70
0
  62
11
  6
CONTINUOUS
  0
LAYER
  2
MAGENTA3
  70
0
  62
221
  6
CONTINUOUS
  0
LAYER
  2
YELLOW3
  70
0
  62
2
  6
CONTINUOUS
  0
LAYER
  2
BLUE4
  70
0
  62
5
  6
CONTINUOUS
  0
LAYER
  2
GREEN4
  70
0
  62
3
  6
CONTINUOUS
  0
LAYER
  2
CYAN4
  70
0
  62
4
  6
CONTINUOUS
  0
LAYER
  2
RED4
  70
0
  62
1
  6
CONTINUOUS
  0
LAYER
  2
MAGENTA4
  70
0
  62
6
  6
CONTINUOUS
  0
LAYER
  2
YELLOW4
  70
0
  62
2
  6
CONTINUOUS
  0
ENDTAB
  0
ENDSEC
  0
SECTION
  2
ENTITIES
0
LINE
8
Black
10
171.577
20
-233.045
11
448.691
21
-233.045
0
LINE
8
Black
10
439.826
20
-215.646
11
174.244
21
-215.646
  0
TEXT
  7
KICADB
  8
Black
  10
272.72
  11
272.72
  20
-252.48
  21
-252.48
  40
1.5
  41
1
  50
-0
  51
0
  71
0
  72
1
  73
2
  1
14.8660 in
0
LINE
8
Black
10
83.9216
20
-251.13
11
461.518
21
-251.13
0
LINE
8
Black
10
83.9216
20
-220.218
11
83.9216
21
-253.83
0
LINE
8
Black
10
461.518
20
-220.218
11
461.518
21
-253.83
0
LINE
8
Black
10
461.518
20
-251.13
11
460.391
21
-251.716
0
LINE
8
Black
10
461.518
20
-251.13
11
460.391
21
-250.543
0
LINE
8
Black
10
83.9216
20
-251.13
11
85.0481
21
-251.716
0
LINE
8
Black
10
83.9216
20
-251.13
11
85.0481
21
-250.543
  0
TEXT
  7
KICADB
  8
Black
  10
279.273
  11
279.273
  20
-149.018
  21
-149.018
  40
1.5
  41
1
  50
0
  51
0
  71
0
  72
1
  73
2
  1
15.3820 in
0
LINE
8
Black
10
83.9216
20
-150.368
11
474.624
21
-150.368
0
LINE
8
Black
10
83.9216
20
-204.851
11
83.9216
21
-147.668
0
LINE
8
Black
10
474.624
20
-204.851
11
474.624
21
-147.668
0
LINE
8
Black
10
474.624
20
-150.368
11
473.498
21
-150.954
0
LINE
8
Black
10
474.624
20
-150.368
11
473.498
21
-149.782
0
LINE
8
Black
10
83.9216
20
-150.368
11
85.0481
21
-150.954
0
LINE
8
Black
10
83.9216
20
-150.368
11
85.0481
21
-149.782
  0
TEXT
  7
KICADB
  8
Black
  10
81.9404
  11
81.9404
  20
-327.787
  21
-327.787
  40
5.08
  41
1
  50
0
  51
0
  71
0
  72
0
  73
2
  1
Boston University
  0
TEXT
  7
KICADB
  8
Black
  10
81.9404
  11
81.9404
  20
-335.199
  21
-335.199
  40
5.08
  41
1
  50
0
  51
0
  71
0
  72
0
  73
2
  1
P/N g2_flexi_A_revB
  0
TEXT
  7
KICADB
  8
Black
  10
82.6008
  11
82.6008
  20
-279.324
  21
-279.324
  40
1.5
  41
1
  50
270
  51
0
  71
0
  72
1
  73
2
  1
 
0
LINE
8
Black
10
82.6008
20
-270.078
11
82.6008
21
-288.569
0
LINE
8
Black
10
82.6008
20
-288.569
11
82.0144
21
-287.443
0
LINE
8
Black
10
82.6008
20
-288.569
11
83.1872
21
-287.443
0
LINE
8
Black
10
82.6008
20
-270.078
11
82.0144
21
-271.205
0
LINE
8
Black
10
82.6008
20
-270.078
11
83.1872
21
-271.205
  0
TEXT
  7
KICADB
  8
Black
  10
98.4504
  11
98.4504
  20
-180.746
  21
-180.746
  40
1.5
  41
1
  50
0
  51
0
  71
0
  72
1
  73
2
  1
0.40 in
0
LINE
8
Black
10
83.9216
20
-180.594
11
94.0816
21
-180.594
0
LINE
8
Black
10
83.9216
20
-204.851
11
83.9216
21
-177.894
0
LINE
8
Black
10
94.0816
20
-204.851
11
94.0816
21
-177.894
0
LINE
8
Black
10
94.0816
20
-180.594
11
92.9551
21
-181.18
0
LINE
8
Black
10
94.0816
20
-180.594
11
92.9551
21
-180.008
0
LINE
8
Black
10
83.9216
20
-180.594
11
85.0481
21
-181.18
0
LINE
8
Black
10
83.9216
20
-180.594
11
85.0481
21
-180.008
  0
TEXT
  7
KICADB
  8
Black
  10
86.5886
  11
86.5886
  20
-172.034
  21
-172.034
  40
1.5
  41
1
  50
0
  51
0
  71
0
  72
1
  73
2
  1
0.21 in
0
LINE
8
Black
10
83.9216
20
-176.327
11
89.2556
21
-176.327
0
LINE
8
Black
10
83.9216
20
-204.851
11
83.9216
21
-173.627
0
LINE
8
Black
10
89.2556
20
-204.851
11
89.2556
21
-173.627
0
LINE
8
Black
10
89.2556
20
-176.327
11
88.1291
21
-176.913
0
LINE
8
Black
10
89.2556
20
-176.327
11
88.1291
21
-175.74
0
LINE
8
Black
10
83.9216
20
-176.327
11
85.0481
21
-176.913
0
LINE
8
Black
10
83.9216
20
-176.327
11
85.0481
21
-175.74
  0
TEXT
  7
KICADB
  8
Black
  10
520.17
  11
520.17
  20
-213.042
  21
-213.042
  40
1.5
  41
1
  50
270
  51
0
  71
0
  72
1
  73
2
  1
1.9150 in
0
LINE
8
Black
10
518.82
20
-188.722
11
518.82
21
-237.363
0
LINE
8
Black
10
501.904
20
-188.722
11
521.52
21
-188.722
0
LINE
8
Black
10
501.904
20
-237.363
11
521.52
21
-237.363
0
LINE
8
Black
10
518.82
20
-237.363
11
518.234
21
-236.236
0
LINE
8
Black
10
518.82
20
-237.363
11
519.407
21
-236.236
0
LINE
8
Black
10
518.82
20
-188.722
11
518.234
21
-189.849
0
LINE
8
Black
10
518.82
20
-188.722
11
519.407
21
-189.849
0
LINE
8
Black
10
504.698
20
-155.727
11
506.273
21
-154.153
0
LINE
8
Black
10
88.519
20
-162.306
11
88.5444
21
-162.306
0
LINE
8
Black
10
88.519
20
-161.366
11
88.519
21
-162.306
0
LINE
8
Black
10
89.535
20
-161.366
11
88.519
21
-161.366
0
LINE
8
Black
10
88.519
20
-161.366
11
89.535
21
-161.366
0
LINE
8
Black
10
105.816
20
-178.664
11
88.519
21
-161.366
0
LINE
8
Black
10
502.209
20
-158.217
11
502.488
21
-158.217
0
LINE
8
Black
10
502.209
20
-157.861
11
502.209
21
-158.217
0
LINE
8
Black
10
502.209
20
-158.217
11
502.209
21
-157.861
0
LINE
8
Black
10
502.209
20
-158.217
11
504.698
21
-155.727
0
LINE
8
Black
10
502.387
20
-159.791
11
502.742
21
-159.791
0
LINE
8
Black
10
502.387
20
-160.147
11
502.387
21
-159.791
0
LINE
8
Black
10
502.387
20
-159.791
11
502.387
21
-160.147
0
LINE
8
Black
10
506.095
20
-163.5
11
502.387
21
-159.791
  0
TEXT
  7
KICADB
  8
Black
  10
506.552
  11
506.552
  20
-153.924
  21
-153.924
  40
1.5
  41
1
  50
0
  51
0
  71
0
  72
0
  73
2
  1
Stiffener for connector
  0
TEXT
  7
KICADB
  8
Black
  10
506.552
  11
506.552
  20
-156.324
  21
-156.324
  40
1.5
  41
1
  50
0
  51
0
  71
0
  72
0
  73
2
  1
F.Cu
  0
TEXT
  7
KICADB
  8
Black
  10
506.552
  11
506.552
  20
-158.724
  21
-158.724
  40
1.5
  41
1
  50
0
  51
0
  71
0
  72
0
  73
2
  1
Inner2.Cu
  0
TEXT
  7
KICADB
  8
Black
  10
506.552
  11
506.552
  20
-161.124
  21
-161.124
  40
1.5
  41
1
  50
0
  51
0
  71
0
  72
0
  73
2
  1
Inner1.Cu
  0
TEXT
  7
KICADB
  8
Black
  10
506.552
  11
506.552
  20
-163.524
  21
-163.524
  40
1.5
  41
1
  50
0
  51
0
  71
0
  72
0
  73
2
  1
B.Cu
0
LINE
8
Black
10
88.392
20
-292.659
11
88.4174
21
-292.659
0
LINE
8
Black
10
88.392
20
-291.77
11
88.392
21
-292.659
0
LINE
8
Black
10
87.376
20
-291.77
11
88.392
21
-291.77
0
LINE
8
Black
10
88.392
20
-291.77
11
87.376
21
-291.77
0
LINE
8
Black
10
77.978
20
-302.184
11
88.392
21
-291.77
  0
TEXT
  7
KICADB
  8
Black
  10
66.0654
  11
66.0654
  20
-301.549
  21
-301.549
  40
1.5
  41
1
  50
0
  51
0
  71
0
  72
1
  73
2
  1
Exposed inner layer 
  0
TEXT
  7
KICADB
  8
Black
  10
66.0654
  11
66.0654
  20
-303.949
  21
-303.949
  40
1.5
  41
1
  50
0
  51
0
  71
0
  72
1
  73
2
  1
with ZIF connector pads
  0
TEXT
  7
KICADB
  8
Black
  10
486.664
  11
486.664
  20
-185.035
  21
-185.035
  40
1.5
  41
1
  50
0
  51
0
  71
0
  72
1
  73
2
  1
1.2000 in
0
LINE
8
Black
10
501.904
20
-186.385
11
471.424
21
-186.385
0
LINE
8
Black
10
501.904
20
-188.722
11
501.904
21
-183.685
0
LINE
8
Black
10
471.424
20
-188.722
11
471.424
21
-183.685
0
LINE
8
Black
10
471.424
20
-186.385
11
472.551
21
-185.799
0
LINE
8
Black
10
471.424
20
-186.385
11
472.551
21
-186.972
0
LINE
8
Black
10
501.904
20
-186.385
11
500.777
21
-185.799
0
LINE
8
Black
10
501.904
20
-186.385
11
500.777
21
-186.972
  0
TEXT
  7
KICADB
  8
Black
  10
511.255
  11
511.255
  20
-193.294
  21
-193.294
  40
1.5
  41
1
  50
270
  51
0
  71
0
  72
1
  73
2
  1
0.3600 in
0
LINE
8
Black
10
509.905
20
-188.722
11
509.905
21
-197.866
0
LINE
8
Black
10
501.904
20
-188.722
11
512.605
21
-188.722
0
LINE
8
Black
10
501.904
20
-197.866
11
512.605
21
-197.866
0
LINE
8
Black
10
509.905
20
-197.866
11
509.319
21
-196.739
0
LINE
8
Black
10
509.905
20
-197.866
11
510.491
21
-196.739
0
LINE
8
Black
10
509.905
20
-188.722
11
509.319
21
-189.849
0
LINE
8
Black
10
509.905
20
-188.722
11
510.491
21
-189.849
  0
TEXT
  7
KICADB
  8
Black
  10
115.341
  11
115.341
  20
-242.9
  21
-242.9
  40
1.5
  41
1
  50
0
  51
0
  71
0
  72
1
  73
2
  1
Region with flexing
  0
TEXT
  7
KICADB
  8
Black
  10
299.034
  11
299.034
  20
-237.037
  21
-237.037
  40
1.5
  41
1
  50
0
  51
0
  71
0
  72
1
  73
2
  1
1.3000 in
0
LINE
8
Black
10
315.544
20
-235.687
11
282.524
21
-235.687
0
LINE
8
Black
10
315.544
20
-233.045
11
315.544
21
-238.387
0
LINE
8
Black
10
282.524
20
-233.045
11
282.524
21
-238.387
0
LINE
8
Black
10
282.524
20
-235.687
11
283.651
21
-235.1
0
LINE
8
Black
10
282.524
20
-235.687
11
283.651
21
-236.273
0
LINE
8
Black
10
315.544
20
-235.687
11
314.418
21
-235.1
0
LINE
8
Black
10
315.544
20
-235.687
11
314.418
21
-236.273
  0
TEXT
  7
KICADB
  8
Black
  10
199.72
  11
199.72
  20
-249.051
  21
-249.051
  40
1.5
  41
1
  50
0
  51
0
  71
0
  72
1
  73
2
  1
9.1200 in
0
LINE
8
Black
10
315.544
20
-247.701
11
83.8962
21
-247.701
0
LINE
8
Black
10
315.544
20
-233.045
11
315.544
21
-250.401
0
LINE
8
Black
10
83.8962
20
-233.045
11
83.8962
21
-250.401
0
LINE
8
Black
10
83.8962
20
-247.701
11
85.0227
21
-247.114
0
LINE
8
Black
10
83.8962
20
-247.701
11
85.0227
21
-248.287
0
LINE
8
Black
10
315.544
20
-247.701
11
314.418
21
-247.114
0
LINE
8
Black
10
315.544
20
-247.701
11
314.418
21
-248.287
  0
TEXT
  7
KICADB
  8
Black
  10
114.706
  11
114.706
  20
-240.974
  21
-240.974
  40
1.5
  41
1
  50
0
  51
0
  71
0
  72
1
  73
2
  1
1.5760 in
0
LINE
8
Black
10
94.6912
20
-239.624
11
134.722
21
-239.624
0
LINE
8
Black
10
94.6912
20
-237.363
11
94.6912
21
-242.324
0
LINE
8
Black
10
134.722
20
-237.363
11
134.722
21
-242.324
0
LINE
8
Black
10
134.722
20
-239.624
11
133.595
21
-240.21
0
LINE
8
Black
10
134.722
20
-239.624
11
133.595
21
-239.037
0
LINE
8
Black
10
94.6912
20
-239.624
11
95.8177
21
-240.21
0
LINE
8
Black
10
94.6912
20
-239.624
11
95.8177
21
-239.037
  0
TEXT
  7
KICADB
  8
Black
  10
109.322
  11
109.322
  20
-196.084
  21
-196.084
  40
1.5
  41
1
  50
0
  51
0
  71
0
  72
1
  73
2
  1
2.0000 in
0
LINE
8
Black
10
83.9216
20
-197.434
11
134.722
21
-197.434
0
LINE
8
Black
10
83.9216
20
-204.851
11
83.9216
21
-194.734
0
LINE
8
Black
10
134.722
20
-204.851
11
134.722
21
-194.734
0
LINE
8
Black
10
134.722
20
-197.434
11
133.595
21
-198.021
0
LINE
8
Black
10
134.722
20
-197.434
11
133.595
21
-196.848
0
LINE
8
Black
10
83.9216
20
-197.434
11
85.0481
21
-198.021
0
LINE
8
Black
10
83.9216
20
-197.434
11
85.0481
21
-196.848
0
LINE
8
Black
10
461.518
20
-210.464
11
461.518
21
-210.82
0
LINE
8
Black
10
463.956
20
-208.026
11
461.518
21
-210.464
0
LINE
8
Black
10
461.518
20
-220.218
11
461.518
21
-210.82
0
LINE
8
Black
10
448.691
20
-233.045
11
461.518
21
-220.218
0
LINE
8
Black
10
83.8962
20
-237.363
11
85.0392
21
-237.363
0
LINE
8
Black
10
85.0392
20
-237.363
11
85.2678
21
-237.592
0
LINE
8
Black
10
85.2678
20
-237.592
11
85.2678
21
-237.846
0
LINE
8
Black
10
85.2678
20
-237.846
11
85.5726
21
-238.15
0
LINE
8
Black
10
85.5726
20
-238.15
11
86.7156
21
-238.15
0
LINE
8
Black
10
86.7156
20
-238.15
11
86.7156
21
-237.363
0
LINE
8
Black
10
83.8962
20
-237.363
11
83.8962
21
-204.851
0
LINE
8
Black
10
83.8962
20
-204.851
11
84.836
21
-204.851
0
LINE
8
Black
10
84.8106
20
-204.851
11
84.8868
21
-204.851
0
LINE
8
Black
10
84.8868
20
-204.851
11
84.963
21
-204.851
0
LINE
8
Black
10
84.963
20
-204.851
11
85.2678
21
-204.546
0
LINE
8
Black
10
85.2678
20
-204.546
11
85.2678
21
-204.318
0
LINE
8
Black
10
85.2678
20
-204.318
11
85.5472
21
-204.038
0
LINE
8
Black
10
85.5472
20
-204.038
11
86.6902
21
-204.038
0
LINE
8
Black
10
86.6902
20
-204.038
11
86.6902
21
-204.826
0
LINE
8
Black
10
474.116
20
-197.866
11
463.956
21
-208.026
0
LINE
8
Black
10
167.259
20
-237.363
11
171.577
21
-233.045
0
LINE
8
Black
10
83.947
20
-237.363
11
167.259
21
-237.363
0
LINE
8
Black
10
83.947
20
-204.851
11
83.947
21
-237.363
0
LINE
8
Black
10
163.449
20
-204.851
11
83.947
21
-204.851
0
LINE
8
Black
10
174.244
20
-215.646
11
163.449
21
-204.851
0
LINE
8
Black
10
443.636
20
-211.836
11
439.826
21
-215.646
0
LINE
8
Black
10
443.636
20
-188.722
11
443.636
21
-211.836
0
LINE
8
Black
10
474.116
20
-188.722
11
474.116
21
-197.866
0
LINE
8
Black
10
474.116
20
-188.722
11
443.636
21
-188.722
  0
TEXT
  7
KICADB
  8
Black
  10
298.221
  11
298.221
  20
-240.64
  21
-240.64
  40
1.5
  41
1
  50
0
  51
0
  71
0
  72
1
  73
2
  1
Region with flexing
  0
TEXT
  7
KICADB
  8
Black
  10
131.293
  11
131.293
  20
-296.875
  21
-296.875
  40
1.5
  41
1
  50
0
  51
0
  71
0
  72
1
  73
2
  1
Bottom coverlay (1 mil kapton, 1 mil adhesive)
0
LINE
8
Black
10
103.124
20
-298.221
11
103.124
21
-295.681
0
LINE
8
Black
10
163.779
20
-298.221
11
103.124
21
-298.221
0
LINE
8
Black
10
163.779
20
-295.681
11
163.779
21
-298.221
0
LINE
8
Black
10
103.124
20
-295.681
11
163.779
21
-295.681
0
LINE
8
Black
10
103.124
20
-292.532
11
163.779
21
-292.532
0
LINE
8
Black
10
163.779
20
-292.532
11
163.779
21
-295.072
0
LINE
8
Black
10
163.779
20
-295.072
11
103.124
21
-295.072
0
LINE
8
Black
10
103.124
20
-295.072
11
103.124
21
-292.532
  0
TEXT
  7
KICADB
  8
Black
  10
129.845
  11
129.845
  20
-293.929
  21
-293.929
  40
1.5
  41
1
  50
0
  51
0
  71
0
  72
1
  73
2
  1
Bottom Cu (0.5 oz) Flex base (3 mil kapton)
  0
TEXT
  7
KICADB
  8
Black
  10
113.309
  11
113.309
  20
-290.678
  21
-290.678
  40
1.5
  41
1
  50
0
  51
0
  71
0
  72
1
  73
2
  1
Adhesive (1 mil)
0
LINE
8
Black
10
103.124
20
-289.484
11
163.805
21
-289.484
0
LINE
8
Black
10
163.805
20
-289.484
11
163.805
21
-292.024
0
LINE
8
Black
10
163.805
20
-292.024
11
103.124
21
-292.024
0
LINE
8
Black
10
103.149
20
-292.024
11
103.149
21
-289.484
  0
TEXT
  7
KICADB
  8
Black
  10
113.335
  11
113.335
  20
-277.647
  21
-277.647
  40
1.5
  41
1
  50
0
  51
0
  71
0
  72
1
  73
2
  1
Adhesive (1 mil)
0
LINE
8
Black
10
84.2264
20
-278.994
11
84.2264
21
-276.454
0
LINE
8
Black
10
163.805
20
-278.994
11
84.2264
21
-278.994
0
LINE
8
Black
10
163.805
20
-276.454
11
163.805
21
-278.994
0
LINE
8
Black
10
84.2264
20
-276.454
11
163.805
21
-276.454
0
LINE
8
Black
10
84.2264
20
-270.078
11
163.779
21
-270.078
0
LINE
8
Black
10
163.779
20
-270.078
11
163.779
21
-272.618
0
LINE
8
Black
10
163.779
20
-272.618
11
84.2264
21
-272.618
0
LINE
8
Black
10
84.2264
20
-272.618
11
84.2264
21
-270.078
  0
TEXT
  7
KICADB
  8
Black
  10
129.007
  11
129.007
  20
-271.297
  21
-271.297
  40
1.5
  41
1
  50
0
  51
0
  71
0
  72
1
  73
2
  1
Top coverlay (1 mil kapton, 1 mil adhesive)
0
LINE
8
Black
10
163.779
20
-288.569
11
84.2264
21
-288.569
0
LINE
8
Black
10
84.2264
20
-279.578
11
163.779
21
-279.578
0
LINE
8
Black
10
163.779
20
-279.578
11
163.779
21
-288.569
0
LINE
8
Black
10
84.2264
20
-288.569
11
84.2264
21
-279.578
  0
TEXT
  7
KICADB
  8
Black
  10
103.607
  11
103.607
  20
-281.584
  21
-281.584
  40
1.5
  41
1
  50
0
  51
0
  71
0
  72
0
  73
2
  1
Inner 2 copper (0.5 oz)
  0
TEXT
  7
KICADB
  8
Black
  10
103.607
  11
103.607
  20
-283.984
  21
-283.984
  40
1.5
  41
1
  50
0
  51
0
  71
0
  72
0
  73
2
  1
Flex base (5 mil)
  0
TEXT
  7
KICADB
  8
Black
  10
103.607
  11
103.607
  20
-286.384
  21
-286.384
  40
1.5
  41
1
  50
0
  51
0
  71
0
  72
0
  73
2
  1
Inner 1 copper (0.5 oz)
  0
TEXT
  7
KICADB
  8
Black
  10
128.6
  11
128.6
  20
-274.523
  21
-274.523
  40
1.5
  41
1
  50
0
  51
0
  71
0
  72
1
  73
2
  1
Front Cu (0.5 oz) Flex base (3 mil kapton)
0
LINE
8
Black
10
84.2264
20
-275.869
11
84.2264
21
-273.329
0
LINE
8
Black
10
163.779
20
-275.869
11
84.2264
21
-275.869
0
LINE
8
Black
10
163.779
20
-273.329
11
163.779
21
-275.869
0
LINE
8
Black
10
84.2264
20
-273.329
11
163.779
21
-273.329
0
LINE
8
Black
10
501.904
20
-159.436
11
93.9292
21
-159.436
0
LINE
8
Black
10
501.904
20
-159.182
11
83.9216
21
-159.182
0
LINE
8
Black
10
501.904
20
-158.064
11
501.904
21
-158.445
0
LINE
8
Black
10
471.424
20
-158.064
11
501.904
21
-158.064
0
LINE
8
Black
10
471.424
20
-158.445
11
471.424
21
-158.064
0
LINE
8
Black
10
501.904
20
-158.445
11
471.424
21
-158.445
0
LINE
8
Black
10
501.904
20
-158.674
11
83.9216
21
-158.674
0
LINE
8
Black
10
501.904
20
-158.928
11
83.9216
21
-158.928
  0
TEXT
  7
KICADB
  8
Black
  10
103.988
  11
103.988
  20
-180.873
  21
-180.873
  40
1.5
  41
1
  50
0
  51
0
  71
0
  72
0
  73
2
  1
Peel away region
  0
TEXT
  7
KICADB
  8
Black
  10
59.2328
  11
59.2328
  20
-277.216
  21
-277.216
  40
1.5
  41
1
  50
0
  51
0
  71
0
  72
1
  73
2
  1
ZIF connector region (0.12-0.13mils)
  0
TEXT
  7
KICADB
  8
Black
  10
59.2328
  11
59.2328
  20
-279.616
  21
-279.616
  40
1.5
  41
1
  50
0
  51
0
  71
0
  72
1
  73
2
  1
ZIF pads on bottom side (inner 1 Cu)
  0
TEXT
  7
KICADB
  8
Black
  10
487.045
  11
487.045
  20
-179.603
  21
-179.603
  40
1.5
  41
1
  50
0
  51
0
  71
0
  72
1
  73
2
  1
Stiff region on front layer
  0
TEXT
  7
KICADB
  8
Black
  10
487.045
  11
487.045
  20
-182.003
  21
-182.003
  40
1.5
  41
1
  50
0
  51
0
  71
0
  72
1
  73
2
  1
SMT connector on bottom layer
  0
ENDSEC
  0
EOF
