%FSLAX34Y34*%
G04 Gerber Fmt 3.4, Leading zero omitted, Abs format*
G04 (created by PCBNEW (2013-10-07 BZR 4378)-stable) date Mon 03 Nov 2014 10:34:20 AM EST*
%MOIN*%
G01*
G70*
G90*
G04 APERTURE LIST*
%ADD10C,0.005906*%
%ADD11C,0.011811*%
%ADD12C,0.007874*%
%ADD13C,0.003937*%
G04 APERTURE END LIST*
G54D10*
G54D11*
X52649Y-38198D02*
X52930Y-38198D01*
X52593Y-38367D02*
X52790Y-37776D01*
X52986Y-38367D01*
X53183Y-37973D02*
X53183Y-38564D01*
X53183Y-38001D02*
X53239Y-37973D01*
X53352Y-37973D01*
X53408Y-38001D01*
X53436Y-38029D01*
X53464Y-38085D01*
X53464Y-38254D01*
X53436Y-38310D01*
X53408Y-38339D01*
X53352Y-38367D01*
X53239Y-38367D01*
X53183Y-38339D01*
X53718Y-37973D02*
X53718Y-38564D01*
X53718Y-38001D02*
X53774Y-37973D01*
X53886Y-37973D01*
X53942Y-38001D01*
X53971Y-38029D01*
X53999Y-38085D01*
X53999Y-38254D01*
X53971Y-38310D01*
X53942Y-38339D01*
X53886Y-38367D01*
X53774Y-38367D01*
X53718Y-38339D01*
X54252Y-38367D02*
X54252Y-37973D01*
X54252Y-38085D02*
X54280Y-38029D01*
X54308Y-38001D01*
X54364Y-37973D01*
X54421Y-37973D01*
X54702Y-38367D02*
X54646Y-38339D01*
X54617Y-38310D01*
X54589Y-38254D01*
X54589Y-38085D01*
X54617Y-38029D01*
X54646Y-38001D01*
X54702Y-37973D01*
X54786Y-37973D01*
X54842Y-38001D01*
X54871Y-38029D01*
X54899Y-38085D01*
X54899Y-38254D01*
X54871Y-38310D01*
X54842Y-38339D01*
X54786Y-38367D01*
X54702Y-38367D01*
X55095Y-38367D02*
X55405Y-37973D01*
X55095Y-37973D02*
X55405Y-38367D01*
X55630Y-38367D02*
X55630Y-37973D01*
X55630Y-37776D02*
X55602Y-37804D01*
X55630Y-37832D01*
X55658Y-37804D01*
X55630Y-37776D01*
X55630Y-37832D01*
X55911Y-38367D02*
X55911Y-37973D01*
X55911Y-38029D02*
X55939Y-38001D01*
X55995Y-37973D01*
X56080Y-37973D01*
X56136Y-38001D01*
X56164Y-38057D01*
X56164Y-38367D01*
X56164Y-38057D02*
X56192Y-38001D01*
X56248Y-37973D01*
X56333Y-37973D01*
X56389Y-38001D01*
X56417Y-38057D01*
X56417Y-38367D01*
X56951Y-38367D02*
X56951Y-38057D01*
X56923Y-38001D01*
X56867Y-37973D01*
X56755Y-37973D01*
X56698Y-38001D01*
X56951Y-38339D02*
X56895Y-38367D01*
X56755Y-38367D01*
X56698Y-38339D01*
X56670Y-38282D01*
X56670Y-38226D01*
X56698Y-38170D01*
X56755Y-38142D01*
X56895Y-38142D01*
X56951Y-38114D01*
X57148Y-37973D02*
X57373Y-37973D01*
X57233Y-37776D02*
X57233Y-38282D01*
X57261Y-38339D01*
X57317Y-38367D01*
X57373Y-38367D01*
X57795Y-38339D02*
X57739Y-38367D01*
X57626Y-38367D01*
X57570Y-38339D01*
X57542Y-38282D01*
X57542Y-38057D01*
X57570Y-38001D01*
X57626Y-37973D01*
X57739Y-37973D01*
X57795Y-38001D01*
X57823Y-38057D01*
X57823Y-38114D01*
X57542Y-38170D01*
X58442Y-37973D02*
X58667Y-37973D01*
X58526Y-38367D02*
X58526Y-37860D01*
X58554Y-37804D01*
X58611Y-37776D01*
X58667Y-37776D01*
X58948Y-38367D02*
X58892Y-38339D01*
X58864Y-38282D01*
X58864Y-37776D01*
X59398Y-38339D02*
X59342Y-38367D01*
X59229Y-38367D01*
X59173Y-38339D01*
X59145Y-38282D01*
X59145Y-38057D01*
X59173Y-38001D01*
X59229Y-37973D01*
X59342Y-37973D01*
X59398Y-38001D01*
X59426Y-38057D01*
X59426Y-38114D01*
X59145Y-38170D01*
X59623Y-38367D02*
X59932Y-37973D01*
X59623Y-37973D02*
X59932Y-38367D01*
X60607Y-38367D02*
X60607Y-37973D01*
X60607Y-38085D02*
X60635Y-38029D01*
X60664Y-38001D01*
X60720Y-37973D01*
X60776Y-37973D01*
X61198Y-38339D02*
X61142Y-38367D01*
X61029Y-38367D01*
X60973Y-38339D01*
X60945Y-38282D01*
X60945Y-38057D01*
X60973Y-38001D01*
X61029Y-37973D01*
X61142Y-37973D01*
X61198Y-38001D01*
X61226Y-38057D01*
X61226Y-38114D01*
X60945Y-38170D01*
X61732Y-37973D02*
X61732Y-38451D01*
X61704Y-38507D01*
X61676Y-38535D01*
X61620Y-38564D01*
X61535Y-38564D01*
X61479Y-38535D01*
X61732Y-38339D02*
X61676Y-38367D01*
X61563Y-38367D01*
X61507Y-38339D01*
X61479Y-38310D01*
X61451Y-38254D01*
X61451Y-38085D01*
X61479Y-38029D01*
X61507Y-38001D01*
X61563Y-37973D01*
X61676Y-37973D01*
X61732Y-38001D01*
X62013Y-38367D02*
X62013Y-37973D01*
X62013Y-37776D02*
X61985Y-37804D01*
X62013Y-37832D01*
X62041Y-37804D01*
X62013Y-37776D01*
X62013Y-37832D01*
X62379Y-38367D02*
X62323Y-38339D01*
X62295Y-38310D01*
X62266Y-38254D01*
X62266Y-38085D01*
X62295Y-38029D01*
X62323Y-38001D01*
X62379Y-37973D01*
X62463Y-37973D01*
X62520Y-38001D01*
X62548Y-38029D01*
X62576Y-38085D01*
X62576Y-38254D01*
X62548Y-38310D01*
X62520Y-38339D01*
X62463Y-38367D01*
X62379Y-38367D01*
X62829Y-37973D02*
X62829Y-38367D01*
X62829Y-38029D02*
X62857Y-38001D01*
X62913Y-37973D01*
X62998Y-37973D01*
X63054Y-38001D01*
X63082Y-38057D01*
X63082Y-38367D01*
X49021Y-38721D02*
X49162Y-39312D01*
X49274Y-38890D01*
X49387Y-39312D01*
X49527Y-38721D01*
X49752Y-39312D02*
X49752Y-38918D01*
X49752Y-38721D02*
X49724Y-38749D01*
X49752Y-38777D01*
X49781Y-38749D01*
X49752Y-38721D01*
X49752Y-38777D01*
X50118Y-39312D02*
X50062Y-39283D01*
X50034Y-39227D01*
X50034Y-38721D01*
X50427Y-39312D02*
X50371Y-39283D01*
X50343Y-39227D01*
X50343Y-38721D01*
X51102Y-39312D02*
X51102Y-38918D01*
X51102Y-39030D02*
X51130Y-38974D01*
X51158Y-38946D01*
X51215Y-38918D01*
X51271Y-38918D01*
X51693Y-39283D02*
X51637Y-39312D01*
X51524Y-39312D01*
X51468Y-39283D01*
X51440Y-39227D01*
X51440Y-39002D01*
X51468Y-38946D01*
X51524Y-38918D01*
X51637Y-38918D01*
X51693Y-38946D01*
X51721Y-39002D01*
X51721Y-39058D01*
X51440Y-39115D01*
X51974Y-39312D02*
X51974Y-38918D01*
X51974Y-38974D02*
X52002Y-38946D01*
X52058Y-38918D01*
X52143Y-38918D01*
X52199Y-38946D01*
X52227Y-39002D01*
X52227Y-39312D01*
X52227Y-39002D02*
X52255Y-38946D01*
X52311Y-38918D01*
X52396Y-38918D01*
X52452Y-38946D01*
X52480Y-39002D01*
X52480Y-39312D01*
X52846Y-39312D02*
X52790Y-39283D01*
X52761Y-39255D01*
X52733Y-39199D01*
X52733Y-39030D01*
X52761Y-38974D01*
X52790Y-38946D01*
X52846Y-38918D01*
X52930Y-38918D01*
X52986Y-38946D01*
X53014Y-38974D01*
X53043Y-39030D01*
X53043Y-39199D01*
X53014Y-39255D01*
X52986Y-39283D01*
X52930Y-39312D01*
X52846Y-39312D01*
X53239Y-38918D02*
X53380Y-39312D01*
X53521Y-38918D01*
X53971Y-39283D02*
X53914Y-39312D01*
X53802Y-39312D01*
X53746Y-39283D01*
X53718Y-39227D01*
X53718Y-39002D01*
X53746Y-38946D01*
X53802Y-38918D01*
X53914Y-38918D01*
X53971Y-38946D01*
X53999Y-39002D01*
X53999Y-39058D01*
X53718Y-39115D01*
X54674Y-39283D02*
X54730Y-39312D01*
X54842Y-39312D01*
X54899Y-39283D01*
X54927Y-39227D01*
X54927Y-39199D01*
X54899Y-39143D01*
X54842Y-39115D01*
X54758Y-39115D01*
X54702Y-39087D01*
X54674Y-39030D01*
X54674Y-39002D01*
X54702Y-38946D01*
X54758Y-38918D01*
X54842Y-38918D01*
X54899Y-38946D01*
X55264Y-39312D02*
X55208Y-39283D01*
X55180Y-39255D01*
X55152Y-39199D01*
X55152Y-39030D01*
X55180Y-38974D01*
X55208Y-38946D01*
X55264Y-38918D01*
X55349Y-38918D01*
X55405Y-38946D01*
X55433Y-38974D01*
X55461Y-39030D01*
X55461Y-39199D01*
X55433Y-39255D01*
X55405Y-39283D01*
X55349Y-39312D01*
X55264Y-39312D01*
X55714Y-39312D02*
X55714Y-38918D01*
X55714Y-38974D02*
X55742Y-38946D01*
X55799Y-38918D01*
X55883Y-38918D01*
X55939Y-38946D01*
X55967Y-39002D01*
X55967Y-39312D01*
X55967Y-39002D02*
X55995Y-38946D01*
X56052Y-38918D01*
X56136Y-38918D01*
X56192Y-38946D01*
X56220Y-39002D01*
X56220Y-39312D01*
X56727Y-39283D02*
X56670Y-39312D01*
X56558Y-39312D01*
X56502Y-39283D01*
X56473Y-39227D01*
X56473Y-39002D01*
X56502Y-38946D01*
X56558Y-38918D01*
X56670Y-38918D01*
X56727Y-38946D01*
X56755Y-39002D01*
X56755Y-39058D01*
X56473Y-39115D01*
X57401Y-38918D02*
X57542Y-39312D01*
X57683Y-38918D01*
X57908Y-39312D02*
X57908Y-38918D01*
X57908Y-38721D02*
X57879Y-38749D01*
X57908Y-38777D01*
X57936Y-38749D01*
X57908Y-38721D01*
X57908Y-38777D01*
X58442Y-39312D02*
X58442Y-39002D01*
X58414Y-38946D01*
X58358Y-38918D01*
X58245Y-38918D01*
X58189Y-38946D01*
X58442Y-39283D02*
X58386Y-39312D01*
X58245Y-39312D01*
X58189Y-39283D01*
X58161Y-39227D01*
X58161Y-39171D01*
X58189Y-39115D01*
X58245Y-39087D01*
X58386Y-39087D01*
X58442Y-39058D01*
X58695Y-39283D02*
X58751Y-39312D01*
X58864Y-39312D01*
X58920Y-39283D01*
X58948Y-39227D01*
X58948Y-39199D01*
X58920Y-39143D01*
X58864Y-39115D01*
X58779Y-39115D01*
X58723Y-39087D01*
X58695Y-39030D01*
X58695Y-39002D01*
X58723Y-38946D01*
X58779Y-38918D01*
X58864Y-38918D01*
X58920Y-38946D01*
X59567Y-38918D02*
X59792Y-38918D01*
X59651Y-39312D02*
X59651Y-38805D01*
X59679Y-38749D01*
X59736Y-38721D01*
X59792Y-38721D01*
X59989Y-39312D02*
X59989Y-38918D01*
X59989Y-39030D02*
X60017Y-38974D01*
X60045Y-38946D01*
X60101Y-38918D01*
X60157Y-38918D01*
X60439Y-39312D02*
X60382Y-39283D01*
X60354Y-39255D01*
X60326Y-39199D01*
X60326Y-39030D01*
X60354Y-38974D01*
X60382Y-38946D01*
X60439Y-38918D01*
X60523Y-38918D01*
X60579Y-38946D01*
X60607Y-38974D01*
X60635Y-39030D01*
X60635Y-39199D01*
X60607Y-39255D01*
X60579Y-39283D01*
X60523Y-39312D01*
X60439Y-39312D01*
X60888Y-39312D02*
X60888Y-38918D01*
X60888Y-38974D02*
X60917Y-38946D01*
X60973Y-38918D01*
X61057Y-38918D01*
X61113Y-38946D01*
X61142Y-39002D01*
X61142Y-39312D01*
X61142Y-39002D02*
X61170Y-38946D01*
X61226Y-38918D01*
X61310Y-38918D01*
X61367Y-38946D01*
X61395Y-39002D01*
X61395Y-39312D01*
X62041Y-38918D02*
X62266Y-38918D01*
X62126Y-38721D02*
X62126Y-39227D01*
X62154Y-39283D01*
X62210Y-39312D01*
X62266Y-39312D01*
X62463Y-39312D02*
X62463Y-38721D01*
X62716Y-39312D02*
X62716Y-39002D01*
X62688Y-38946D01*
X62632Y-38918D01*
X62548Y-38918D01*
X62491Y-38946D01*
X62463Y-38974D01*
X62998Y-39312D02*
X62998Y-38918D01*
X62998Y-38721D02*
X62969Y-38749D01*
X62998Y-38777D01*
X63026Y-38749D01*
X62998Y-38721D01*
X62998Y-38777D01*
X63251Y-39283D02*
X63307Y-39312D01*
X63419Y-39312D01*
X63476Y-39283D01*
X63504Y-39227D01*
X63504Y-39199D01*
X63476Y-39143D01*
X63419Y-39115D01*
X63335Y-39115D01*
X63279Y-39087D01*
X63251Y-39030D01*
X63251Y-39002D01*
X63279Y-38946D01*
X63335Y-38918D01*
X63419Y-38918D01*
X63476Y-38946D01*
X64207Y-39312D02*
X64207Y-38918D01*
X64207Y-39030D02*
X64235Y-38974D01*
X64263Y-38946D01*
X64319Y-38918D01*
X64376Y-38918D01*
X64797Y-39283D02*
X64741Y-39312D01*
X64629Y-39312D01*
X64572Y-39283D01*
X64544Y-39227D01*
X64544Y-39002D01*
X64572Y-38946D01*
X64629Y-38918D01*
X64741Y-38918D01*
X64797Y-38946D01*
X64826Y-39002D01*
X64826Y-39058D01*
X64544Y-39115D01*
X65332Y-38918D02*
X65332Y-39396D01*
X65304Y-39452D01*
X65275Y-39480D01*
X65219Y-39508D01*
X65135Y-39508D01*
X65079Y-39480D01*
X65332Y-39283D02*
X65275Y-39312D01*
X65163Y-39312D01*
X65107Y-39283D01*
X65079Y-39255D01*
X65050Y-39199D01*
X65050Y-39030D01*
X65079Y-38974D01*
X65107Y-38946D01*
X65163Y-38918D01*
X65275Y-38918D01*
X65332Y-38946D01*
X65613Y-39312D02*
X65613Y-38918D01*
X65613Y-38721D02*
X65585Y-38749D01*
X65613Y-38777D01*
X65641Y-38749D01*
X65613Y-38721D01*
X65613Y-38777D01*
X65978Y-39312D02*
X65922Y-39283D01*
X65894Y-39255D01*
X65866Y-39199D01*
X65866Y-39030D01*
X65894Y-38974D01*
X65922Y-38946D01*
X65978Y-38918D01*
X66063Y-38918D01*
X66119Y-38946D01*
X66147Y-38974D01*
X66175Y-39030D01*
X66175Y-39199D01*
X66147Y-39255D01*
X66119Y-39283D01*
X66063Y-39312D01*
X65978Y-39312D01*
X66428Y-38918D02*
X66428Y-39312D01*
X66428Y-38974D02*
X66457Y-38946D01*
X66513Y-38918D01*
X66597Y-38918D01*
X66653Y-38946D01*
X66682Y-39002D01*
X66682Y-39312D01*
X55583Y-36298D02*
X55639Y-36298D01*
X55696Y-36326D01*
X55724Y-36354D01*
X55752Y-36410D01*
X55780Y-36523D01*
X55780Y-36663D01*
X55752Y-36776D01*
X55724Y-36832D01*
X55696Y-36860D01*
X55639Y-36888D01*
X55583Y-36888D01*
X55527Y-36860D01*
X55499Y-36832D01*
X55471Y-36776D01*
X55443Y-36663D01*
X55443Y-36523D01*
X55471Y-36410D01*
X55499Y-36354D01*
X55527Y-36326D01*
X55583Y-36298D01*
X56033Y-36832D02*
X56061Y-36860D01*
X56033Y-36888D01*
X56005Y-36860D01*
X56033Y-36832D01*
X56033Y-36888D01*
X56596Y-36298D02*
X56314Y-36298D01*
X56286Y-36579D01*
X56314Y-36551D01*
X56371Y-36523D01*
X56511Y-36523D01*
X56567Y-36551D01*
X56596Y-36579D01*
X56624Y-36635D01*
X56624Y-36776D01*
X56596Y-36832D01*
X56567Y-36860D01*
X56511Y-36888D01*
X56371Y-36888D01*
X56314Y-36860D01*
X56286Y-36832D01*
X56989Y-36298D02*
X57045Y-36298D01*
X57102Y-36326D01*
X57130Y-36354D01*
X57158Y-36410D01*
X57186Y-36523D01*
X57186Y-36663D01*
X57158Y-36776D01*
X57130Y-36832D01*
X57102Y-36860D01*
X57045Y-36888D01*
X56989Y-36888D01*
X56933Y-36860D01*
X56905Y-36832D01*
X56877Y-36776D01*
X56849Y-36663D01*
X56849Y-36523D01*
X56877Y-36410D01*
X56905Y-36354D01*
X56933Y-36326D01*
X56989Y-36298D01*
X57552Y-36298D02*
X57608Y-36298D01*
X57664Y-36326D01*
X57692Y-36354D01*
X57720Y-36410D01*
X57749Y-36523D01*
X57749Y-36663D01*
X57720Y-36776D01*
X57692Y-36832D01*
X57664Y-36860D01*
X57608Y-36888D01*
X57552Y-36888D01*
X57495Y-36860D01*
X57467Y-36832D01*
X57439Y-36776D01*
X57411Y-36663D01*
X57411Y-36523D01*
X57439Y-36410D01*
X57467Y-36354D01*
X57495Y-36326D01*
X57552Y-36298D01*
X58114Y-36298D02*
X58170Y-36298D01*
X58227Y-36326D01*
X58255Y-36354D01*
X58283Y-36410D01*
X58311Y-36523D01*
X58311Y-36663D01*
X58283Y-36776D01*
X58255Y-36832D01*
X58227Y-36860D01*
X58170Y-36888D01*
X58114Y-36888D01*
X58058Y-36860D01*
X58030Y-36832D01*
X58002Y-36776D01*
X57974Y-36663D01*
X57974Y-36523D01*
X58002Y-36410D01*
X58030Y-36354D01*
X58058Y-36326D01*
X58114Y-36298D01*
X59014Y-36888D02*
X59014Y-36494D01*
X59014Y-36298D02*
X58986Y-36326D01*
X59014Y-36354D01*
X59042Y-36326D01*
X59014Y-36298D01*
X59014Y-36354D01*
X59295Y-36494D02*
X59295Y-36888D01*
X59295Y-36551D02*
X59323Y-36523D01*
X59380Y-36494D01*
X59464Y-36494D01*
X59520Y-36523D01*
X59548Y-36579D01*
X59548Y-36888D01*
X55010Y-36090D02*
X60010Y-36090D01*
X55010Y-35180D02*
X55010Y-37152D01*
X60010Y-35180D02*
X60010Y-37152D01*
X60010Y-36090D02*
X59566Y-36320D01*
X60010Y-36090D02*
X59566Y-35859D01*
X55010Y-36090D02*
X55453Y-36320D01*
X55010Y-36090D02*
X55453Y-35859D01*
G54D12*
X60000Y-25630D02*
X60000Y-35160D01*
X55000Y-25630D02*
X55000Y-35160D01*
G54D13*
X82170Y-23220D02*
X82170Y-28280D01*
X86000Y-19190D02*
X86000Y-19390D01*
X72590Y-26510D02*
X74000Y-25100D01*
X71750Y-26510D02*
X72590Y-26510D01*
X44530Y-21040D02*
X44480Y-21040D01*
X50000Y-26510D02*
X44530Y-21040D01*
X38150Y-33850D02*
X46180Y-33850D01*
X38140Y-21040D02*
X44480Y-21040D01*
X86000Y-19190D02*
X86000Y-16030D01*
X82170Y-23220D02*
X86000Y-19390D01*
X76080Y-34370D02*
X82170Y-28280D01*
X46700Y-34370D02*
X76080Y-34370D01*
X46610Y-34280D02*
X46700Y-34370D01*
X46180Y-33850D02*
X46610Y-34280D01*
X38140Y-20730D02*
X38140Y-21040D01*
X37690Y-20730D02*
X38140Y-20730D01*
X37580Y-20840D02*
X37690Y-20730D01*
X37580Y-20930D02*
X37580Y-20840D01*
X37460Y-21050D02*
X37580Y-20930D01*
X37430Y-21050D02*
X37460Y-21050D01*
X37400Y-21050D02*
X37430Y-21050D01*
X37040Y-21050D02*
X37410Y-21050D01*
X37040Y-33850D02*
X37040Y-21050D01*
X38150Y-34160D02*
X38150Y-33850D01*
X37700Y-34160D02*
X38150Y-34160D01*
X37580Y-34040D02*
X37700Y-34160D01*
X37580Y-33940D02*
X37580Y-34040D01*
X37490Y-33850D02*
X37580Y-33940D01*
X37040Y-33850D02*
X37490Y-33850D01*
X74000Y-24300D02*
X74000Y-25100D01*
X74000Y-22820D02*
X74000Y-24301D01*
X50000Y-26507D02*
X71750Y-26507D01*
X74000Y-16031D02*
X86000Y-16031D01*
X74000Y-22820D02*
X74000Y-16031D01*
M02*
