  0
SECTION
  2
HEADER
  9
$ANGBASE
  50
0.0
  9
$ANGDIR
  70
  1
  9
$MEASUREMENT
  70
0
  0
ENDSEC
  0
SECTION
  2
TABLES
  0
TABLE
  2
LTYPE
  70
1
  0
LTYPE
  2
CONTINUOUS
  70
0
  3
Solid line
  72
65
  73
0
  40
0.0
  0
ENDTAB
  0
TABLE
  2
STYLE
  70
4
  0
STYLE
  2
KICAD
  70
0
  40
0
  41
1
  42
1
  50
0
  71
0
  3
isocp.shx
  0
STYLE
  2
KICADB
  70
0
  40
0
  41
1
  42
1
  50
0
  71
0
  3
isocp.shx
  0
STYLE
  2
KICADI
  70
0
  40
0
  41
1
  42
1
  50
15
  71
0
  3
isocp.shx
  0
STYLE
  2
KICADBI
  70
0
  40
0
  41
1
  42
1
  50
15
  71
0
  3
isocp.shx
  0
ENDTAB
  0
TABLE
  2
LAYER
  70
30
  0
LAYER
  2
BLACK
  70
0
  62
7
  6
CONTINUOUS
  0
LAYER
  2
GRAY1
  70
0
  62
251
  6
CONTINUOUS
  0
LAYER
  2
GRAY2
  70
0
  62
8
  6
CONTINUOUS
  0
LAYER
  2
GRAY3
  70
0
  62
9
  6
CONTINUOUS
  0
LAYER
  2
WHITE
  70
0
  62
7
  6
CONTINUOUS
  0
LAYER
  2
LYELLOW
  70
0
  62
51
  6
CONTINUOUS
  0
LAYER
  2
BLUE1
  70
0
  62
178
  6
CONTINUOUS
  0
LAYER
  2
GREEN1
  70
0
  62
98
  6
CONTINUOUS
  0
LAYER
  2
CYAN1
  70
0
  62
138
  6
CONTINUOUS
  0
LAYER
  2
RED1
  70
0
  62
18
  6
CONTINUOUS
  0
LAYER
  2
MAGENTA1
  70
0
  62
228
  6
CONTINUOUS
  0
LAYER
  2
BROWN1
  70
0
  62
58
  6
CONTINUOUS
  0
LAYER
  2
BLUE2
  70
0
  62
5
  6
CONTINUOUS
  0
LAYER
  2
GREEN2
  70
0
  62
3
  6
CONTINUOUS
  0
LAYER
  2
CYAN2
  70
0
  62
4
  6
CONTINUOUS
  0
LAYER
  2
RED2
  70
0
  62
1
  6
CONTINUOUS
  0
LAYER
  2
MAGENTA2
  70
0
  62
6
  6
CONTINUOUS
  0
LAYER
  2
BROWN2
  70
0
  62
54
  6
CONTINUOUS
  0
LAYER
  2
BLUE3
  70
0
  62
171
  6
CONTINUOUS
  0
LAYER
  2
GREEN3
  70
0
  62
91
  6
CONTINUOUS
  0
LAYER
  2
CYAN3
  70
0
  62
131
  6
CONTINUOUS
  0
LAYER
  2
RED3
  70
0
  62
11
  6
CONTINUOUS
  0
LAYER
  2
MAGENTA3
  70
0
  62
221
  6
CONTINUOUS
  0
LAYER
  2
YELLOW3
  70
0
  62
2
  6
CONTINUOUS
  0
LAYER
  2
BLUE4
  70
0
  62
5
  6
CONTINUOUS
  0
LAYER
  2
GREEN4
  70
0
  62
3
  6
CONTINUOUS
  0
LAYER
  2
CYAN4
  70
0
  62
4
  6
CONTINUOUS
  0
LAYER
  2
RED4
  70
0
  62
1
  6
CONTINUOUS
  0
LAYER
  2
MAGENTA4
  70
0
  62
6
  6
CONTINUOUS
  0
LAYER
  2
YELLOW4
  70
0
  62
2
  6
CONTINUOUS
  0
ENDTAB
  0
ENDSEC
  0
SECTION
  2
ENTITIES
0
LINE
8
Black
10
171.577
20
-233.095
11
330.334
21
-233.095
0
LINE
8
Black
10
171.577
20
-232.995
11
330.334
21
-232.995
0
ARC
8
Black
10
330.334
20
-233.045
40
0.05
50
270
51
450
0
ARC
8
Black
10
171.577
20
-233.045
40
0.05
50
90
51
270
0
LINE
8
Black
10
343.211
20
-210.82
11
343.211
21
-210.464
0
LINE
8
Black
10
343.111
20
-210.82
11
343.111
21
-210.464
0
ARC
8
Black
10
343.161
20
-210.464
40
0.05
50
360
51
540
0
ARC
8
Black
10
343.161
20
-210.82
40
0.05
50
180
51
360
0
LINE
8
Black
10
345.564
20
-207.991
11
343.126
21
-210.429
0
LINE
8
Black
10
345.635
20
-208.061
11
343.197
21
-210.5
0
ARC
8
Black
10
343.161
20
-210.464
40
0.05
50
495
51
675
0
ARC
8
Black
10
345.6
20
-208.026
40
0.05
50
315
51
495
0
LINE
8
Black
10
343.211
20
-220.218
11
343.211
21
-210.82
0
LINE
8
Black
10
343.111
20
-220.218
11
343.111
21
-210.82
0
ARC
8
Black
10
343.161
20
-210.82
40
0.05
50
360
51
540
0
ARC
8
Black
10
343.161
20
-220.218
40
0.05
50
180
51
360
0
LINE
8
Black
10
330.37
20
-233.08
11
343.197
21
-220.253
0
LINE
8
Black
10
330.299
20
-233.01
11
343.126
21
-220.183
0
ARC
8
Black
10
343.161
20
-220.218
40
0.05
50
315
51
495
0
ARC
8
Black
10
330.334
20
-233.045
40
0.05
50
135
51
315
0
LINE
8
Black
10
83.8962
20
-237.413
11
85.0392
21
-237.413
0
LINE
8
Black
10
83.8962
20
-237.313
11
85.0392
21
-237.313
0
ARC
8
Black
10
85.0392
20
-237.363
40
0.05
50
270
51
450
0
ARC
8
Black
10
83.8962
20
-237.363
40
0.05
50
90
51
270
0
LINE
8
Black
10
85.0038
20
-237.398
11
85.2324
21
-237.627
0
LINE
8
Black
10
85.0746
20
-237.328
11
85.3032
21
-237.556
0
ARC
8
Black
10
85.2678
20
-237.592
40
0.05
50
225
51
405
0
ARC
8
Black
10
85.0392
20
-237.363
40
0.05
50
45
51
225
0
LINE
8
Black
10
85.3178
20
-237.846
11
85.3178
21
-237.592
0
LINE
8
Black
10
85.2178
20
-237.846
11
85.2178
21
-237.592
0
ARC
8
Black
10
85.2678
20
-237.592
40
0.05
50
360
51
540
0
ARC
8
Black
10
85.2678
20
-237.846
40
0.05
50
180
51
360
0
LINE
8
Black
10
85.2324
20
-237.881
11
85.5372
21
-238.186
0
LINE
8
Black
10
85.3032
20
-237.81
11
85.608
21
-238.115
0
ARC
8
Black
10
85.5726
20
-238.15
40
0.05
50
225
51
405
0
ARC
8
Black
10
85.2678
20
-237.846
40
0.05
50
45
51
225
0
LINE
8
Black
10
85.5726
20
-238.2
11
86.7156
21
-238.2
0
LINE
8
Black
10
85.5726
20
-238.1
11
86.7156
21
-238.1
0
ARC
8
Black
10
86.7156
20
-238.15
40
0.05
50
270
51
450
0
ARC
8
Black
10
85.5726
20
-238.15
40
0.05
50
90
51
270
0
LINE
8
Black
10
86.7656
20
-238.15
11
86.7656
21
-237.363
0
LINE
8
Black
10
86.6656
20
-238.15
11
86.6656
21
-237.363
0
ARC
8
Black
10
86.7156
20
-237.363
40
0.05
50
360
51
540
0
ARC
8
Black
10
86.7156
20
-238.15
40
0.05
50
180
51
360
0
LINE
8
Black
10
83.9462
20
-237.363
11
83.9462
21
-204.851
0
LINE
8
Black
10
83.8462
20
-237.363
11
83.8462
21
-204.851
0
ARC
8
Black
10
83.8962
20
-204.851
40
0.05
50
360
51
540
0
ARC
8
Black
10
83.8962
20
-237.363
40
0.05
50
180
51
360
0
LINE
8
Black
10
83.8962
20
-204.901
11
84.836
21
-204.901
0
LINE
8
Black
10
83.8962
20
-204.801
11
84.836
21
-204.801
0
ARC
8
Black
10
84.836
20
-204.851
40
0.05
50
270
51
450
0
ARC
8
Black
10
83.8962
20
-204.851
40
0.05
50
90
51
270
0
LINE
8
Black
10
84.8106
20
-204.901
11
84.8868
21
-204.901
0
LINE
8
Black
10
84.8106
20
-204.801
11
84.8868
21
-204.801
0
ARC
8
Black
10
84.8868
20
-204.851
40
0.05
50
270
51
450
0
ARC
8
Black
10
84.8106
20
-204.851
40
0.05
50
90
51
270
0
LINE
8
Black
10
84.8868
20
-204.901
11
84.963
21
-204.901
0
LINE
8
Black
10
84.8868
20
-204.801
11
84.963
21
-204.801
0
ARC
8
Black
10
84.963
20
-204.851
40
0.05
50
270
51
450
0
ARC
8
Black
10
84.8868
20
-204.851
40
0.05
50
90
51
270
0
LINE
8
Black
10
84.9984
20
-204.886
11
85.3032
21
-204.582
0
LINE
8
Black
10
84.9276
20
-204.816
11
85.2324
21
-204.511
0
ARC
8
Black
10
85.2678
20
-204.546
40
0.05
50
315
51
495
0
ARC
8
Black
10
84.963
20
-204.851
40
0.05
50
135
51
315
0
LINE
8
Black
10
85.3178
20
-204.546
11
85.3178
21
-204.318
0
LINE
8
Black
10
85.2178
20
-204.546
11
85.2178
21
-204.318
0
ARC
8
Black
10
85.2678
20
-204.318
40
0.05
50
360
51
540
0
ARC
8
Black
10
85.2678
20
-204.546
40
0.05
50
180
51
360
0
LINE
8
Black
10
85.3032
20
-204.353
11
85.5826
21
-204.074
0
LINE
8
Black
10
85.2324
20
-204.282
11
85.5118
21
-204.003
0
ARC
8
Black
10
85.5472
20
-204.038
40
0.05
50
315
51
495
0
ARC
8
Black
10
85.2678
20
-204.318
40
0.05
50
135
51
315
0
LINE
8
Black
10
85.5472
20
-204.088
11
86.6902
21
-204.088
0
LINE
8
Black
10
85.5472
20
-203.988
11
86.6902
21
-203.988
0
ARC
8
Black
10
86.6902
20
-204.038
40
0.05
50
270
51
450
0
ARC
8
Black
10
85.5472
20
-204.038
40
0.05
50
90
51
270
0
LINE
8
Black
10
86.7402
20
-204.826
11
86.7402
21
-204.038
0
LINE
8
Black
10
86.6402
20
-204.826
11
86.6402
21
-204.038
0
ARC
8
Black
10
86.6902
20
-204.038
40
0.05
50
360
51
540
0
ARC
8
Black
10
86.6902
20
-204.826
40
0.05
50
180
51
360
0
LINE
8
Black
10
355.724
20
-197.831
11
345.564
21
-207.991
0
LINE
8
Black
10
355.795
20
-197.901
11
345.635
21
-208.061
0
ARC
8
Black
10
345.6
20
-208.026
40
0.05
50
495
51
675
0
ARC
8
Black
10
355.76
20
-197.866
40
0.05
50
315
51
495
0
LINE
8
Black
10
167.294
20
-237.398
11
171.612
21
-233.08
0
LINE
8
Black
10
167.224
20
-237.328
11
171.542
21
-233.01
0
ARC
8
Black
10
171.577
20
-233.045
40
0.05
50
315
51
495
0
ARC
8
Black
10
167.259
20
-237.363
40
0.05
50
135
51
315
0
LINE
8
Black
10
83.947
20
-237.413
11
167.259
21
-237.413
0
LINE
8
Black
10
83.947
20
-237.313
11
167.259
21
-237.313
0
ARC
8
Black
10
167.259
20
-237.363
40
0.05
50
270
51
450
0
ARC
8
Black
10
83.947
20
-237.363
40
0.05
50
90
51
270
0
LINE
8
Black
10
83.997
20
-237.363
11
83.997
21
-204.851
0
LINE
8
Black
10
83.897
20
-237.363
11
83.897
21
-204.851
0
ARC
8
Black
10
83.947
20
-204.851
40
0.05
50
360
51
540
0
ARC
8
Black
10
83.947
20
-237.363
40
0.05
50
180
51
360
0
LINE
8
Black
10
83.947
20
-204.901
11
163.449
21
-204.901
0
LINE
8
Black
10
83.947
20
-204.801
11
163.449
21
-204.801
0
ARC
8
Black
10
163.449
20
-204.851
40
0.05
50
270
51
450
0
ARC
8
Black
10
83.947
20
-204.851
40
0.05
50
90
51
270
0
LINE
8
Black
10
174.279
20
-215.611
11
163.484
21
-204.816
0
LINE
8
Black
10
174.209
20
-215.681
11
163.414
21
-204.886
0
ARC
8
Black
10
163.449
20
-204.851
40
0.05
50
405
51
585
0
ARC
8
Black
10
174.244
20
-215.646
40
0.05
50
225
51
405
0
LINE
8
Black
10
174.244
20
-215.696
11
321.47
21
-215.696
0
LINE
8
Black
10
174.244
20
-215.596
11
321.47
21
-215.596
0
ARC
8
Black
10
321.47
20
-215.646
40
0.05
50
270
51
450
0
ARC
8
Black
10
174.244
20
-215.646
40
0.05
50
90
51
270
0
LINE
8
Black
10
325.244
20
-211.801
11
321.434
21
-215.611
0
LINE
8
Black
10
325.315
20
-211.871
11
321.505
21
-215.681
0
ARC
8
Black
10
321.47
20
-215.646
40
0.05
50
495
51
675
0
ARC
8
Black
10
325.28
20
-211.836
40
0.05
50
315
51
495
0
LINE
8
Black
10
325.33
20
-211.836
11
325.33
21
-188.722
0
LINE
8
Black
10
325.23
20
-211.836
11
325.23
21
-188.722
0
ARC
8
Black
10
325.28
20
-188.722
40
0.05
50
360
51
540
0
ARC
8
Black
10
325.28
20
-211.836
40
0.05
50
180
51
360
0
LINE
8
Black
10
355.81
20
-197.866
11
355.81
21
-188.722
0
LINE
8
Black
10
355.71
20
-197.866
11
355.71
21
-188.722
0
ARC
8
Black
10
355.76
20
-188.722
40
0.05
50
360
51
540
0
ARC
8
Black
10
355.76
20
-197.866
40
0.05
50
180
51
360
0
LINE
8
Black
10
325.28
20
-188.772
11
355.76
21
-188.772
0
LINE
8
Black
10
325.28
20
-188.672
11
355.76
21
-188.672
0
ARC
8
Black
10
355.76
20
-188.722
40
0.05
50
270
51
450
0
ARC
8
Black
10
325.28
20
-188.722
40
0.05
50
90
51
270
0
LINE
8
Black
10
346.92
20
-195.806
11
346.92
21
-194.306
0
LINE
8
Black
10
346.92
20
-194.306
11
346.62
21
-194.306
0
LINE
8
Black
10
346.62
20
-194.306
11
346.62
21
-195.806
0
LINE
8
Black
10
346.62
20
-195.806
11
346.92
21
-195.806
0
LINE
8
Black
10
347.42
20
-195.806
11
347.42
21
-194.306
0
LINE
8
Black
10
347.42
20
-194.306
11
347.12
21
-194.306
0
LINE
8
Black
10
347.12
20
-194.306
11
347.12
21
-195.806
0
LINE
8
Black
10
347.12
20
-195.806
11
347.42
21
-195.806
0
LINE
8
Black
10
348.42
20
-195.806
11
348.42
21
-194.306
0
LINE
8
Black
10
348.42
20
-194.306
11
348.12
21
-194.306
0
LINE
8
Black
10
348.12
20
-194.306
11
348.12
21
-195.806
0
LINE
8
Black
10
348.12
20
-195.806
11
348.42
21
-195.806
0
LINE
8
Black
10
347.92
20
-195.806
11
347.92
21
-194.306
0
LINE
8
Black
10
347.92
20
-194.306
11
347.62
21
-194.306
0
LINE
8
Black
10
347.62
20
-194.306
11
347.62
21
-195.806
0
LINE
8
Black
10
347.62
20
-195.806
11
347.92
21
-195.806
0
LINE
8
Black
10
349.92
20
-195.806
11
349.92
21
-194.306
0
LINE
8
Black
10
349.92
20
-194.306
11
349.62
21
-194.306
0
LINE
8
Black
10
349.62
20
-194.306
11
349.62
21
-195.806
0
LINE
8
Black
10
349.62
20
-195.806
11
349.92
21
-195.806
0
LINE
8
Black
10
350.42
20
-195.806
11
350.42
21
-194.306
0
LINE
8
Black
10
350.42
20
-194.306
11
350.12
21
-194.306
0
LINE
8
Black
10
350.12
20
-194.306
11
350.12
21
-195.806
0
LINE
8
Black
10
350.12
20
-195.806
11
350.42
21
-195.806
0
LINE
8
Black
10
349.42
20
-195.806
11
349.42
21
-194.306
0
LINE
8
Black
10
349.42
20
-194.306
11
349.12
21
-194.306
0
LINE
8
Black
10
349.12
20
-194.306
11
349.12
21
-195.806
0
LINE
8
Black
10
349.12
20
-195.806
11
349.42
21
-195.806
0
LINE
8
Black
10
348.92
20
-195.806
11
348.92
21
-194.306
0
LINE
8
Black
10
348.92
20
-194.306
11
348.62
21
-194.306
0
LINE
8
Black
10
348.62
20
-194.306
11
348.62
21
-195.806
0
LINE
8
Black
10
348.62
20
-195.806
11
348.92
21
-195.806
0
LINE
8
Black
10
338.92
20
-195.806
11
338.92
21
-194.306
0
LINE
8
Black
10
338.92
20
-194.306
11
338.62
21
-194.306
0
LINE
8
Black
10
338.62
20
-194.306
11
338.62
21
-195.806
0
LINE
8
Black
10
338.62
20
-195.806
11
338.92
21
-195.806
0
LINE
8
Black
10
339.42
20
-195.806
11
339.42
21
-194.306
0
LINE
8
Black
10
339.42
20
-194.306
11
339.12
21
-194.306
0
LINE
8
Black
10
339.12
20
-194.306
11
339.12
21
-195.806
0
LINE
8
Black
10
339.12
20
-195.806
11
339.42
21
-195.806
0
LINE
8
Black
10
340.42
20
-195.806
11
340.42
21
-194.306
0
LINE
8
Black
10
340.42
20
-194.306
11
340.12
21
-194.306
0
LINE
8
Black
10
340.12
20
-194.306
11
340.12
21
-195.806
0
LINE
8
Black
10
340.12
20
-195.806
11
340.42
21
-195.806
0
LINE
8
Black
10
339.92
20
-195.806
11
339.92
21
-194.306
0
LINE
8
Black
10
339.92
20
-194.306
11
339.62
21
-194.306
0
LINE
8
Black
10
339.62
20
-194.306
11
339.62
21
-195.806
0
LINE
8
Black
10
339.62
20
-195.806
11
339.92
21
-195.806
0
LINE
8
Black
10
341.92
20
-195.806
11
341.92
21
-194.306
0
LINE
8
Black
10
341.92
20
-194.306
11
341.62
21
-194.306
0
LINE
8
Black
10
341.62
20
-194.306
11
341.62
21
-195.806
0
LINE
8
Black
10
341.62
20
-195.806
11
341.92
21
-195.806
0
LINE
8
Black
10
342.42
20
-195.806
11
342.42
21
-194.306
0
LINE
8
Black
10
342.42
20
-194.306
11
342.12
21
-194.306
0
LINE
8
Black
10
342.12
20
-194.306
11
342.12
21
-195.806
0
LINE
8
Black
10
342.12
20
-195.806
11
342.42
21
-195.806
0
LINE
8
Black
10
341.42
20
-195.806
11
341.42
21
-194.306
0
LINE
8
Black
10
341.42
20
-194.306
11
341.12
21
-194.306
0
LINE
8
Black
10
341.12
20
-194.306
11
341.12
21
-195.806
0
LINE
8
Black
10
341.12
20
-195.806
11
341.42
21
-195.806
0
LINE
8
Black
10
340.92
20
-195.806
11
340.92
21
-194.306
0
LINE
8
Black
10
340.92
20
-194.306
11
340.62
21
-194.306
0
LINE
8
Black
10
340.62
20
-194.306
11
340.62
21
-195.806
0
LINE
8
Black
10
340.62
20
-195.806
11
340.92
21
-195.806
0
LINE
8
Black
10
344.92
20
-195.806
11
344.92
21
-194.306
0
LINE
8
Black
10
344.92
20
-194.306
11
344.62
21
-194.306
0
LINE
8
Black
10
344.62
20
-194.306
11
344.62
21
-195.806
0
LINE
8
Black
10
344.62
20
-195.806
11
344.92
21
-195.806
0
LINE
8
Black
10
345.42
20
-195.806
11
345.42
21
-194.306
0
LINE
8
Black
10
345.42
20
-194.306
11
345.12
21
-194.306
0
LINE
8
Black
10
345.12
20
-194.306
11
345.12
21
-195.806
0
LINE
8
Black
10
345.12
20
-195.806
11
345.42
21
-195.806
0
LINE
8
Black
10
346.42
20
-195.806
11
346.42
21
-194.306
0
LINE
8
Black
10
346.42
20
-194.306
11
346.12
21
-194.306
0
LINE
8
Black
10
346.12
20
-194.306
11
346.12
21
-195.806
0
LINE
8
Black
10
346.12
20
-195.806
11
346.42
21
-195.806
0
LINE
8
Black
10
345.92
20
-195.806
11
345.92
21
-194.306
0
LINE
8
Black
10
345.92
20
-194.306
11
345.62
21
-194.306
0
LINE
8
Black
10
345.62
20
-194.306
11
345.62
21
-195.806
0
LINE
8
Black
10
345.62
20
-195.806
11
345.92
21
-195.806
0
LINE
8
Black
10
343.92
20
-195.806
11
343.92
21
-194.306
0
LINE
8
Black
10
343.92
20
-194.306
11
343.62
21
-194.306
0
LINE
8
Black
10
343.62
20
-194.306
11
343.62
21
-195.806
0
LINE
8
Black
10
343.62
20
-195.806
11
343.92
21
-195.806
0
LINE
8
Black
10
344.42
20
-195.806
11
344.42
21
-194.306
0
LINE
8
Black
10
344.42
20
-194.306
11
344.12
21
-194.306
0
LINE
8
Black
10
344.12
20
-194.306
11
344.12
21
-195.806
0
LINE
8
Black
10
344.12
20
-195.806
11
344.42
21
-195.806
0
LINE
8
Black
10
343.42
20
-195.806
11
343.42
21
-194.306
0
LINE
8
Black
10
343.42
20
-194.306
11
343.12
21
-194.306
0
LINE
8
Black
10
343.12
20
-194.306
11
343.12
21
-195.806
0
LINE
8
Black
10
343.12
20
-195.806
11
343.42
21
-195.806
0
LINE
8
Black
10
342.92
20
-195.806
11
342.92
21
-194.306
0
LINE
8
Black
10
342.92
20
-194.306
11
342.62
21
-194.306
0
LINE
8
Black
10
342.62
20
-194.306
11
342.62
21
-195.806
0
LINE
8
Black
10
342.62
20
-195.806
11
342.92
21
-195.806
0
LINE
8
Black
10
334.92
20
-195.806
11
334.92
21
-194.306
0
LINE
8
Black
10
334.92
20
-194.306
11
334.62
21
-194.306
0
LINE
8
Black
10
334.62
20
-194.306
11
334.62
21
-195.806
0
LINE
8
Black
10
334.62
20
-195.806
11
334.92
21
-195.806
0
LINE
8
Black
10
335.42
20
-195.806
11
335.42
21
-194.306
0
LINE
8
Black
10
335.42
20
-194.306
11
335.12
21
-194.306
0
LINE
8
Black
10
335.12
20
-194.306
11
335.12
21
-195.806
0
LINE
8
Black
10
335.12
20
-195.806
11
335.42
21
-195.806
0
LINE
8
Black
10
336.42
20
-195.806
11
336.42
21
-194.306
0
LINE
8
Black
10
336.42
20
-194.306
11
336.12
21
-194.306
0
LINE
8
Black
10
336.12
20
-194.306
11
336.12
21
-195.806
0
LINE
8
Black
10
336.12
20
-195.806
11
336.42
21
-195.806
0
LINE
8
Black
10
335.92
20
-195.806
11
335.92
21
-194.306
0
LINE
8
Black
10
335.92
20
-194.306
11
335.62
21
-194.306
0
LINE
8
Black
10
335.62
20
-194.306
11
335.62
21
-195.806
0
LINE
8
Black
10
335.62
20
-195.806
11
335.92
21
-195.806
0
LINE
8
Black
10
337.92
20
-195.806
11
337.92
21
-194.306
0
LINE
8
Black
10
337.92
20
-194.306
11
337.62
21
-194.306
0
LINE
8
Black
10
337.62
20
-194.306
11
337.62
21
-195.806
0
LINE
8
Black
10
337.62
20
-195.806
11
337.92
21
-195.806
0
LINE
8
Black
10
338.42
20
-195.806
11
338.42
21
-194.306
0
LINE
8
Black
10
338.42
20
-194.306
11
338.12
21
-194.306
0
LINE
8
Black
10
338.12
20
-194.306
11
338.12
21
-195.806
0
LINE
8
Black
10
338.12
20
-195.806
11
338.42
21
-195.806
0
LINE
8
Black
10
337.42
20
-195.806
11
337.42
21
-194.306
0
LINE
8
Black
10
337.42
20
-194.306
11
337.12
21
-194.306
0
LINE
8
Black
10
337.12
20
-194.306
11
337.12
21
-195.806
0
LINE
8
Black
10
337.12
20
-195.806
11
337.42
21
-195.806
0
LINE
8
Black
10
336.92
20
-195.806
11
336.92
21
-194.306
0
LINE
8
Black
10
336.92
20
-194.306
11
336.62
21
-194.306
0
LINE
8
Black
10
336.62
20
-194.306
11
336.62
21
-195.806
0
LINE
8
Black
10
336.62
20
-195.806
11
336.92
21
-195.806
0
LINE
8
Black
10
332.92
20
-195.806
11
332.92
21
-194.306
0
LINE
8
Black
10
332.92
20
-194.306
11
332.62
21
-194.306
0
LINE
8
Black
10
332.62
20
-194.306
11
332.62
21
-195.806
0
LINE
8
Black
10
332.62
20
-195.806
11
332.92
21
-195.806
0
LINE
8
Black
10
333.42
20
-195.806
11
333.42
21
-194.306
0
LINE
8
Black
10
333.42
20
-194.306
11
333.12
21
-194.306
0
LINE
8
Black
10
333.12
20
-194.306
11
333.12
21
-195.806
0
LINE
8
Black
10
333.12
20
-195.806
11
333.42
21
-195.806
0
LINE
8
Black
10
334.42
20
-195.806
11
334.42
21
-194.306
0
LINE
8
Black
10
334.42
20
-194.306
11
334.12
21
-194.306
0
LINE
8
Black
10
334.12
20
-194.306
11
334.12
21
-195.806
0
LINE
8
Black
10
334.12
20
-195.806
11
334.42
21
-195.806
0
LINE
8
Black
10
333.92
20
-195.806
11
333.92
21
-194.306
0
LINE
8
Black
10
333.92
20
-194.306
11
333.62
21
-194.306
0
LINE
8
Black
10
333.62
20
-194.306
11
333.62
21
-195.806
0
LINE
8
Black
10
333.62
20
-195.806
11
333.92
21
-195.806
0
LINE
8
Black
10
331.92
20
-195.806
11
331.92
21
-194.306
0
LINE
8
Black
10
331.92
20
-194.306
11
331.62
21
-194.306
0
LINE
8
Black
10
331.62
20
-194.306
11
331.62
21
-195.806
0
LINE
8
Black
10
331.62
20
-195.806
11
331.92
21
-195.806
0
LINE
8
Black
10
332.42
20
-195.806
11
332.42
21
-194.306
0
LINE
8
Black
10
332.42
20
-194.306
11
332.12
21
-194.306
0
LINE
8
Black
10
332.12
20
-194.306
11
332.12
21
-195.806
0
LINE
8
Black
10
332.12
20
-195.806
11
332.42
21
-195.806
0
LINE
8
Black
10
331.42
20
-195.806
11
331.42
21
-194.306
0
LINE
8
Black
10
331.42
20
-194.306
11
331.12
21
-194.306
0
LINE
8
Black
10
331.12
20
-194.306
11
331.12
21
-195.806
0
LINE
8
Black
10
331.12
20
-195.806
11
331.42
21
-195.806
0
LINE
8
Black
10
346.92
20
-192.106
11
346.92
21
-190.606
0
LINE
8
Black
10
346.92
20
-190.606
11
346.62
21
-190.606
0
LINE
8
Black
10
346.62
20
-190.606
11
346.62
21
-192.106
0
LINE
8
Black
10
346.62
20
-192.106
11
346.92
21
-192.106
0
LINE
8
Black
10
347.42
20
-192.106
11
347.42
21
-190.606
0
LINE
8
Black
10
347.42
20
-190.606
11
347.12
21
-190.606
0
LINE
8
Black
10
347.12
20
-190.606
11
347.12
21
-192.106
0
LINE
8
Black
10
347.12
20
-192.106
11
347.42
21
-192.106
0
LINE
8
Black
10
348.42
20
-192.106
11
348.42
21
-190.606
0
LINE
8
Black
10
348.42
20
-190.606
11
348.12
21
-190.606
0
LINE
8
Black
10
348.12
20
-190.606
11
348.12
21
-192.106
0
LINE
8
Black
10
348.12
20
-192.106
11
348.42
21
-192.106
0
LINE
8
Black
10
347.92
20
-192.106
11
347.92
21
-190.606
0
LINE
8
Black
10
347.92
20
-190.606
11
347.62
21
-190.606
0
LINE
8
Black
10
347.62
20
-190.606
11
347.62
21
-192.106
0
LINE
8
Black
10
347.62
20
-192.106
11
347.92
21
-192.106
0
LINE
8
Black
10
349.92
20
-192.106
11
349.92
21
-190.606
0
LINE
8
Black
10
349.92
20
-190.606
11
349.62
21
-190.606
0
LINE
8
Black
10
349.62
20
-190.606
11
349.62
21
-192.106
0
LINE
8
Black
10
349.62
20
-192.106
11
349.92
21
-192.106
0
LINE
8
Black
10
350.42
20
-192.106
11
350.42
21
-190.606
0
LINE
8
Black
10
350.42
20
-190.606
11
350.12
21
-190.606
0
LINE
8
Black
10
350.12
20
-190.606
11
350.12
21
-192.106
0
LINE
8
Black
10
350.12
20
-192.106
11
350.42
21
-192.106
0
LINE
8
Black
10
349.42
20
-192.106
11
349.42
21
-190.606
0
LINE
8
Black
10
349.42
20
-190.606
11
349.12
21
-190.606
0
LINE
8
Black
10
349.12
20
-190.606
11
349.12
21
-192.106
0
LINE
8
Black
10
349.12
20
-192.106
11
349.42
21
-192.106
0
LINE
8
Black
10
348.92
20
-192.106
11
348.92
21
-190.606
0
LINE
8
Black
10
348.92
20
-190.606
11
348.62
21
-190.606
0
LINE
8
Black
10
348.62
20
-190.606
11
348.62
21
-192.106
0
LINE
8
Black
10
348.62
20
-192.106
11
348.92
21
-192.106
0
LINE
8
Black
10
338.92
20
-192.106
11
338.92
21
-190.606
0
LINE
8
Black
10
338.92
20
-190.606
11
338.62
21
-190.606
0
LINE
8
Black
10
338.62
20
-190.606
11
338.62
21
-192.106
0
LINE
8
Black
10
338.62
20
-192.106
11
338.92
21
-192.106
0
LINE
8
Black
10
339.42
20
-192.106
11
339.42
21
-190.606
0
LINE
8
Black
10
339.42
20
-190.606
11
339.12
21
-190.606
0
LINE
8
Black
10
339.12
20
-190.606
11
339.12
21
-192.106
0
LINE
8
Black
10
339.12
20
-192.106
11
339.42
21
-192.106
0
LINE
8
Black
10
340.42
20
-192.106
11
340.42
21
-190.606
0
LINE
8
Black
10
340.42
20
-190.606
11
340.12
21
-190.606
0
LINE
8
Black
10
340.12
20
-190.606
11
340.12
21
-192.106
0
LINE
8
Black
10
340.12
20
-192.106
11
340.42
21
-192.106
0
LINE
8
Black
10
339.92
20
-192.106
11
339.92
21
-190.606
0
LINE
8
Black
10
339.92
20
-190.606
11
339.62
21
-190.606
0
LINE
8
Black
10
339.62
20
-190.606
11
339.62
21
-192.106
0
LINE
8
Black
10
339.62
20
-192.106
11
339.92
21
-192.106
0
LINE
8
Black
10
341.92
20
-192.106
11
341.92
21
-190.606
0
LINE
8
Black
10
341.92
20
-190.606
11
341.62
21
-190.606
0
LINE
8
Black
10
341.62
20
-190.606
11
341.62
21
-192.106
0
LINE
8
Black
10
341.62
20
-192.106
11
341.92
21
-192.106
0
LINE
8
Black
10
342.42
20
-192.106
11
342.42
21
-190.606
0
LINE
8
Black
10
342.42
20
-190.606
11
342.12
21
-190.606
0
LINE
8
Black
10
342.12
20
-190.606
11
342.12
21
-192.106
0
LINE
8
Black
10
342.12
20
-192.106
11
342.42
21
-192.106
0
LINE
8
Black
10
341.42
20
-192.106
11
341.42
21
-190.606
0
LINE
8
Black
10
341.42
20
-190.606
11
341.12
21
-190.606
0
LINE
8
Black
10
341.12
20
-190.606
11
341.12
21
-192.106
0
LINE
8
Black
10
341.12
20
-192.106
11
341.42
21
-192.106
0
LINE
8
Black
10
340.92
20
-192.106
11
340.92
21
-190.606
0
LINE
8
Black
10
340.92
20
-190.606
11
340.62
21
-190.606
0
LINE
8
Black
10
340.62
20
-190.606
11
340.62
21
-192.106
0
LINE
8
Black
10
340.62
20
-192.106
11
340.92
21
-192.106
0
LINE
8
Black
10
344.92
20
-192.106
11
344.92
21
-190.606
0
LINE
8
Black
10
344.92
20
-190.606
11
344.62
21
-190.606
0
LINE
8
Black
10
344.62
20
-190.606
11
344.62
21
-192.106
0
LINE
8
Black
10
344.62
20
-192.106
11
344.92
21
-192.106
0
LINE
8
Black
10
345.42
20
-192.106
11
345.42
21
-190.606
0
LINE
8
Black
10
345.42
20
-190.606
11
345.12
21
-190.606
0
LINE
8
Black
10
345.12
20
-190.606
11
345.12
21
-192.106
0
LINE
8
Black
10
345.12
20
-192.106
11
345.42
21
-192.106
0
LINE
8
Black
10
346.42
20
-192.106
11
346.42
21
-190.606
0
LINE
8
Black
10
346.42
20
-190.606
11
346.12
21
-190.606
0
LINE
8
Black
10
346.12
20
-190.606
11
346.12
21
-192.106
0
LINE
8
Black
10
346.12
20
-192.106
11
346.42
21
-192.106
0
LINE
8
Black
10
345.92
20
-192.106
11
345.92
21
-190.606
0
LINE
8
Black
10
345.92
20
-190.606
11
345.62
21
-190.606
0
LINE
8
Black
10
345.62
20
-190.606
11
345.62
21
-192.106
0
LINE
8
Black
10
345.62
20
-192.106
11
345.92
21
-192.106
0
LINE
8
Black
10
343.92
20
-192.106
11
343.92
21
-190.606
0
LINE
8
Black
10
343.92
20
-190.606
11
343.62
21
-190.606
0
LINE
8
Black
10
343.62
20
-190.606
11
343.62
21
-192.106
0
LINE
8
Black
10
343.62
20
-192.106
11
343.92
21
-192.106
0
LINE
8
Black
10
344.42
20
-192.106
11
344.42
21
-190.606
0
LINE
8
Black
10
344.42
20
-190.606
11
344.12
21
-190.606
0
LINE
8
Black
10
344.12
20
-190.606
11
344.12
21
-192.106
0
LINE
8
Black
10
344.12
20
-192.106
11
344.42
21
-192.106
0
LINE
8
Black
10
343.42
20
-192.106
11
343.42
21
-190.606
0
LINE
8
Black
10
343.42
20
-190.606
11
343.12
21
-190.606
0
LINE
8
Black
10
343.12
20
-190.606
11
343.12
21
-192.106
0
LINE
8
Black
10
343.12
20
-192.106
11
343.42
21
-192.106
0
LINE
8
Black
10
342.92
20
-192.106
11
342.92
21
-190.606
0
LINE
8
Black
10
342.92
20
-190.606
11
342.62
21
-190.606
0
LINE
8
Black
10
342.62
20
-190.606
11
342.62
21
-192.106
0
LINE
8
Black
10
342.62
20
-192.106
11
342.92
21
-192.106
0
LINE
8
Black
10
334.92
20
-192.106
11
334.92
21
-190.606
0
LINE
8
Black
10
334.92
20
-190.606
11
334.62
21
-190.606
0
LINE
8
Black
10
334.62
20
-190.606
11
334.62
21
-192.106
0
LINE
8
Black
10
334.62
20
-192.106
11
334.92
21
-192.106
0
LINE
8
Black
10
335.42
20
-192.106
11
335.42
21
-190.606
0
LINE
8
Black
10
335.42
20
-190.606
11
335.12
21
-190.606
0
LINE
8
Black
10
335.12
20
-190.606
11
335.12
21
-192.106
0
LINE
8
Black
10
335.12
20
-192.106
11
335.42
21
-192.106
0
LINE
8
Black
10
336.42
20
-192.106
11
336.42
21
-190.606
0
LINE
8
Black
10
336.42
20
-190.606
11
336.12
21
-190.606
0
LINE
8
Black
10
336.12
20
-190.606
11
336.12
21
-192.106
0
LINE
8
Black
10
336.12
20
-192.106
11
336.42
21
-192.106
0
LINE
8
Black
10
335.92
20
-192.106
11
335.92
21
-190.606
0
LINE
8
Black
10
335.92
20
-190.606
11
335.62
21
-190.606
0
LINE
8
Black
10
335.62
20
-190.606
11
335.62
21
-192.106
0
LINE
8
Black
10
335.62
20
-192.106
11
335.92
21
-192.106
0
LINE
8
Black
10
337.92
20
-192.106
11
337.92
21
-190.606
0
LINE
8
Black
10
337.92
20
-190.606
11
337.62
21
-190.606
0
LINE
8
Black
10
337.62
20
-190.606
11
337.62
21
-192.106
0
LINE
8
Black
10
337.62
20
-192.106
11
337.92
21
-192.106
0
LINE
8
Black
10
338.42
20
-192.106
11
338.42
21
-190.606
0
LINE
8
Black
10
338.42
20
-190.606
11
338.12
21
-190.606
0
LINE
8
Black
10
338.12
20
-190.606
11
338.12
21
-192.106
0
LINE
8
Black
10
338.12
20
-192.106
11
338.42
21
-192.106
0
LINE
8
Black
10
337.42
20
-192.106
11
337.42
21
-190.606
0
LINE
8
Black
10
337.42
20
-190.606
11
337.12
21
-190.606
0
LINE
8
Black
10
337.12
20
-190.606
11
337.12
21
-192.106
0
LINE
8
Black
10
337.12
20
-192.106
11
337.42
21
-192.106
0
LINE
8
Black
10
336.92
20
-192.106
11
336.92
21
-190.606
0
LINE
8
Black
10
336.92
20
-190.606
11
336.62
21
-190.606
0
LINE
8
Black
10
336.62
20
-190.606
11
336.62
21
-192.106
0
LINE
8
Black
10
336.62
20
-192.106
11
336.92
21
-192.106
0
LINE
8
Black
10
332.92
20
-192.106
11
332.92
21
-190.606
0
LINE
8
Black
10
332.92
20
-190.606
11
332.62
21
-190.606
0
LINE
8
Black
10
332.62
20
-190.606
11
332.62
21
-192.106
0
LINE
8
Black
10
332.62
20
-192.106
11
332.92
21
-192.106
0
LINE
8
Black
10
333.42
20
-192.106
11
333.42
21
-190.606
0
LINE
8
Black
10
333.42
20
-190.606
11
333.12
21
-190.606
0
LINE
8
Black
10
333.12
20
-190.606
11
333.12
21
-192.106
0
LINE
8
Black
10
333.12
20
-192.106
11
333.42
21
-192.106
0
LINE
8
Black
10
334.42
20
-192.106
11
334.42
21
-190.606
0
LINE
8
Black
10
334.42
20
-190.606
11
334.12
21
-190.606
0
LINE
8
Black
10
334.12
20
-190.606
11
334.12
21
-192.106
0
LINE
8
Black
10
334.12
20
-192.106
11
334.42
21
-192.106
0
LINE
8
Black
10
333.92
20
-192.106
11
333.92
21
-190.606
0
LINE
8
Black
10
333.92
20
-190.606
11
333.62
21
-190.606
0
LINE
8
Black
10
333.62
20
-190.606
11
333.62
21
-192.106
0
LINE
8
Black
10
333.62
20
-192.106
11
333.92
21
-192.106
0
LINE
8
Black
10
331.92
20
-192.106
11
331.92
21
-190.606
0
LINE
8
Black
10
331.92
20
-190.606
11
331.62
21
-190.606
0
LINE
8
Black
10
331.62
20
-190.606
11
331.62
21
-192.106
0
LINE
8
Black
10
331.62
20
-192.106
11
331.92
21
-192.106
0
LINE
8
Black
10
332.42
20
-192.106
11
332.42
21
-190.606
0
LINE
8
Black
10
332.42
20
-190.606
11
332.12
21
-190.606
0
LINE
8
Black
10
332.12
20
-190.606
11
332.12
21
-192.106
0
LINE
8
Black
10
332.12
20
-192.106
11
332.42
21
-192.106
0
LINE
8
Black
10
331.42
20
-192.106
11
331.42
21
-190.606
0
LINE
8
Black
10
331.42
20
-190.606
11
331.12
21
-190.606
0
LINE
8
Black
10
331.12
20
-190.606
11
331.12
21
-192.106
0
LINE
8
Black
10
331.12
20
-192.106
11
331.42
21
-192.106
0
LINE
8
Black
10
330.92
20
-192.106
11
330.92
21
-190.606
0
LINE
8
Black
10
330.92
20
-190.606
11
330.62
21
-190.606
0
LINE
8
Black
10
330.62
20
-190.606
11
330.62
21
-192.106
0
LINE
8
Black
10
330.62
20
-192.106
11
330.92
21
-192.106
0
CIRCLE
8
Black
10
351.52
20
-194.056
40
0.725
0
LINE
8
Black
10
330.92
20
-195.806
11
330.92
21
-194.306
0
LINE
8
Black
10
330.92
20
-194.306
11
330.62
21
-194.306
0
LINE
8
Black
10
330.62
20
-194.306
11
330.62
21
-195.806
0
LINE
8
Black
10
330.62
20
-195.806
11
330.92
21
-195.806
0
CIRCLE
8
Black
10
329.52
20
-194.056
40
0.725
  0
ENDSEC
  0
EOF
