%FSLAX34Y34*%
G04 Gerber Fmt 3.4, Leading zero omitted, Abs format*
G04 (created by PCBNEW (2013-10-07 BZR 4378)-stable) date Fri 19 Dec 2014 03:59:51 PM EST*
%MOIN*%
G01*
G70*
G90*
G04 APERTURE LIST*
%ADD10C,0.005906*%
%ADD11C,0.003937*%
%ADD12R,0.011811X0.059055*%
%ADD13C,0.016000*%
%ADD14C,0.050000*%
%ADD15C,0.020000*%
%ADD16C,0.018000*%
%ADD17C,0.010000*%
%ADD18C,0.003000*%
%ADD19C,0.030000*%
%ADD20C,0.075000*%
%ADD21C,0.050000*%
%ADD22C,0.005000*%
G04 APERTURE END LIST*
G54D10*
G54D11*
X148180Y-91750D02*
X67550Y-91750D01*
X153230Y-82860D02*
X153230Y-83000D01*
X154190Y-81900D02*
X153230Y-82860D01*
X153230Y-86700D02*
X153230Y-83000D01*
X148180Y-91750D02*
X153230Y-86700D01*
X33030Y-93450D02*
X33480Y-93450D01*
X33480Y-93450D02*
X33570Y-93540D01*
X33570Y-93540D02*
X33570Y-93640D01*
X33570Y-93640D02*
X33690Y-93760D01*
X33690Y-93760D02*
X34140Y-93760D01*
X34140Y-93760D02*
X34140Y-93450D01*
X33030Y-93450D02*
X33030Y-80650D01*
X33030Y-80650D02*
X33400Y-80650D01*
X33390Y-80650D02*
X33420Y-80650D01*
X33420Y-80650D02*
X33450Y-80650D01*
X33450Y-80650D02*
X33570Y-80530D01*
X33570Y-80530D02*
X33570Y-80440D01*
X33570Y-80440D02*
X33680Y-80330D01*
X33680Y-80330D02*
X34130Y-80330D01*
X34130Y-80330D02*
X34130Y-80640D01*
X158190Y-77900D02*
X154190Y-81900D01*
X65850Y-93450D02*
X67550Y-91750D01*
X33050Y-93450D02*
X65850Y-93450D01*
X33050Y-80650D02*
X33050Y-93450D01*
X64350Y-80650D02*
X33050Y-80650D01*
X68600Y-84900D02*
X64350Y-80650D01*
X144690Y-84900D02*
X68600Y-84900D01*
X146190Y-83400D02*
X144690Y-84900D01*
X146190Y-74300D02*
X146190Y-83400D01*
X158190Y-74300D02*
X158190Y-77900D01*
X158190Y-74300D02*
X146190Y-74300D01*
G54D12*
X154650Y-76793D03*
X154847Y-76793D03*
X155241Y-76793D03*
X155044Y-76793D03*
X155832Y-76793D03*
X156028Y-76793D03*
X155635Y-76793D03*
X155438Y-76793D03*
X151501Y-76793D03*
X151698Y-76793D03*
X152091Y-76793D03*
X151895Y-76793D03*
X152682Y-76793D03*
X152879Y-76793D03*
X152485Y-76793D03*
X152288Y-76793D03*
X153863Y-76793D03*
X154060Y-76793D03*
X154454Y-76793D03*
X154257Y-76793D03*
X153469Y-76793D03*
X153666Y-76793D03*
X153272Y-76793D03*
X153076Y-76793D03*
X149926Y-76793D03*
X150123Y-76793D03*
X150517Y-76793D03*
X150320Y-76793D03*
X151107Y-76793D03*
X151304Y-76793D03*
X150910Y-76793D03*
X150713Y-76793D03*
X149139Y-76793D03*
X149335Y-76793D03*
X149729Y-76793D03*
X149532Y-76793D03*
X148745Y-76793D03*
X148942Y-76793D03*
X148548Y-76793D03*
X154650Y-75337D03*
X154847Y-75337D03*
X155241Y-75337D03*
X155044Y-75337D03*
X155832Y-75337D03*
X156028Y-75337D03*
X155635Y-75337D03*
X155438Y-75337D03*
X151501Y-75337D03*
X151698Y-75337D03*
X152091Y-75337D03*
X151895Y-75337D03*
X152682Y-75337D03*
X152879Y-75337D03*
X152485Y-75337D03*
X152288Y-75337D03*
X153863Y-75337D03*
X154060Y-75337D03*
X154454Y-75337D03*
X154257Y-75337D03*
X153469Y-75337D03*
X153666Y-75337D03*
X153272Y-75337D03*
X153076Y-75337D03*
X149926Y-75337D03*
X150123Y-75337D03*
X150517Y-75337D03*
X150320Y-75337D03*
X151107Y-75337D03*
X151304Y-75337D03*
X150910Y-75337D03*
X150713Y-75337D03*
X149139Y-75337D03*
X149335Y-75337D03*
X149729Y-75337D03*
X149532Y-75337D03*
X148745Y-75337D03*
X148942Y-75337D03*
X148548Y-75337D03*
X148351Y-75337D03*
X148351Y-76793D03*
G54D13*
X38065Y-82655D03*
X37730Y-82655D03*
G54D14*
X151190Y-76000D03*
G54D13*
X37400Y-82200D03*
X37400Y-81950D03*
G54D14*
X150120Y-74740D03*
X148940Y-74740D03*
G54D13*
X153470Y-74620D03*
X153670Y-74900D03*
X37400Y-93250D03*
X148930Y-77500D03*
X148750Y-77340D03*
X37400Y-83420D03*
X153665Y-77500D03*
X37400Y-88530D03*
X153470Y-77340D03*
X154060Y-77500D03*
X37400Y-88940D03*
X153870Y-77340D03*
X154455Y-77500D03*
X37400Y-89340D03*
X154250Y-77340D03*
X154845Y-77500D03*
X37400Y-89730D03*
X154650Y-77340D03*
X155240Y-77500D03*
X155050Y-77340D03*
X37400Y-90130D03*
X155630Y-77500D03*
X155430Y-77340D03*
X37400Y-90520D03*
X149335Y-77500D03*
X149130Y-77340D03*
X37400Y-83810D03*
X149730Y-77500D03*
X149530Y-77340D03*
X37400Y-84210D03*
X150120Y-77500D03*
X149930Y-77340D03*
X37400Y-84600D03*
X150515Y-77500D03*
X150310Y-77340D03*
X37400Y-85000D03*
X150911Y-77499D03*
X150710Y-77340D03*
X37400Y-85390D03*
X151305Y-77500D03*
X151110Y-77340D03*
X37400Y-85790D03*
X151700Y-77500D03*
X151490Y-77340D03*
X37400Y-86180D03*
X152880Y-77500D03*
X152670Y-77340D03*
X37400Y-87760D03*
X153275Y-77500D03*
X37400Y-88150D03*
X153070Y-77340D03*
G54D15*
X155380Y-75830D03*
G54D13*
X154070Y-74880D03*
X37400Y-92860D03*
X153870Y-74680D03*
X154650Y-75800D03*
X155045Y-75800D03*
X154450Y-75960D03*
X37400Y-91500D03*
X154850Y-75960D03*
X37400Y-91890D03*
X38545Y-83050D03*
X37730Y-83210D03*
X66080Y-84830D03*
X56300Y-83050D03*
X60300Y-83050D03*
X62300Y-83050D03*
X58300Y-83050D03*
X54300Y-83050D03*
X38110Y-83105D03*
X64300Y-83050D03*
G54D14*
X157680Y-74810D03*
G54D13*
X106955Y-90635D03*
X110955Y-90635D03*
X108955Y-90635D03*
X104955Y-90635D03*
X72955Y-90635D03*
X76955Y-90635D03*
X80955Y-90635D03*
X84955Y-90635D03*
X88955Y-90635D03*
X92955Y-90635D03*
X96955Y-90635D03*
X100955Y-90635D03*
X102955Y-90635D03*
X98955Y-90635D03*
X94955Y-90635D03*
X90955Y-90635D03*
X86955Y-90635D03*
X82955Y-90635D03*
X78955Y-90635D03*
X74955Y-90635D03*
X124955Y-90635D03*
X70955Y-90635D03*
X68955Y-90635D03*
X66955Y-90635D03*
X38265Y-86565D03*
X37905Y-86750D03*
X38090Y-87535D03*
X37765Y-87345D03*
X37715Y-90890D03*
X37810Y-91450D03*
G54D16*
X37400Y-92265D03*
G54D13*
X127640Y-90625D03*
X64885Y-90705D03*
X55880Y-91705D03*
X59880Y-91705D03*
X61880Y-91705D03*
X57880Y-91705D03*
X53880Y-91700D03*
X63860Y-91715D03*
X131640Y-90625D03*
X135640Y-90625D03*
X139640Y-90625D03*
X143640Y-90625D03*
X145640Y-90625D03*
X141640Y-90625D03*
X137640Y-90625D03*
X133640Y-90625D03*
X129640Y-90625D03*
X149090Y-89180D03*
X147640Y-90625D03*
X154360Y-79785D03*
X153365Y-80780D03*
X151960Y-82210D03*
X151930Y-84210D03*
X155775Y-78370D03*
X151920Y-86350D03*
X150505Y-87765D03*
X54060Y-92580D03*
X56060Y-92990D03*
X58060Y-92580D03*
X60060Y-92990D03*
X62060Y-92580D03*
X65210Y-91900D03*
X65680Y-92320D03*
X37800Y-92990D03*
X37790Y-92580D03*
X64930Y-88225D03*
X67780Y-88225D03*
X69780Y-88225D03*
X147950Y-86655D03*
X124370Y-88225D03*
X128370Y-88225D03*
X132370Y-88225D03*
X136370Y-88225D03*
X140370Y-88225D03*
X144370Y-88225D03*
X142370Y-88225D03*
X138370Y-88225D03*
X134370Y-88225D03*
X130370Y-88225D03*
X126370Y-88225D03*
X73780Y-88225D03*
X77780Y-88225D03*
X81780Y-88225D03*
X85780Y-88225D03*
X89780Y-88225D03*
X93780Y-88225D03*
X97780Y-88225D03*
X101780Y-88225D03*
X99780Y-88225D03*
X95780Y-88225D03*
X91780Y-88225D03*
X87780Y-88225D03*
X83780Y-88225D03*
X79780Y-88225D03*
X75780Y-88225D03*
X71780Y-88225D03*
X103780Y-88225D03*
X107780Y-88225D03*
X109780Y-88225D03*
X105780Y-88225D03*
X149510Y-85090D03*
X146370Y-88225D03*
X149520Y-82660D03*
X149515Y-80160D03*
X151660Y-78000D03*
G54D14*
X151890Y-76100D03*
X150710Y-74740D03*
X149530Y-74740D03*
G54D13*
X37400Y-82860D03*
X37400Y-82450D03*
X67850Y-86595D03*
X66800Y-90165D03*
X68800Y-90165D03*
X70800Y-90165D03*
X53480Y-91060D03*
X57480Y-91060D03*
X61480Y-91060D03*
X59480Y-91060D03*
X55480Y-91060D03*
X63485Y-91055D03*
X64400Y-90165D03*
X37400Y-91060D03*
X63480Y-87230D03*
X55480Y-87230D03*
X59480Y-87230D03*
X61480Y-87230D03*
X57480Y-87230D03*
X53480Y-87230D03*
X37480Y-87230D03*
X55610Y-86890D03*
X59610Y-86890D03*
X61610Y-86890D03*
X57610Y-86890D03*
X53610Y-86890D03*
X37610Y-86890D03*
X63480Y-86885D03*
X67940Y-88530D03*
X69940Y-88530D03*
X64800Y-88530D03*
X148815Y-88750D03*
X150035Y-87530D03*
X148170Y-86885D03*
X124530Y-88530D03*
X128530Y-88530D03*
X132530Y-88530D03*
X136530Y-88530D03*
X140530Y-88530D03*
X144530Y-88530D03*
X142530Y-88530D03*
X138530Y-88530D03*
X134530Y-88530D03*
X130530Y-88530D03*
X126530Y-88530D03*
X73940Y-88530D03*
X77940Y-88530D03*
X81940Y-88530D03*
X85940Y-88530D03*
X89940Y-88530D03*
X93940Y-88530D03*
X97940Y-88530D03*
X101940Y-88530D03*
X99940Y-88530D03*
X95940Y-88530D03*
X91940Y-88530D03*
X87940Y-88530D03*
X83940Y-88530D03*
X79940Y-88530D03*
X75940Y-88530D03*
X71940Y-88530D03*
X103940Y-88530D03*
X107940Y-88530D03*
X109940Y-88530D03*
X105940Y-88530D03*
X146530Y-88530D03*
X149820Y-82740D03*
X149820Y-85225D03*
X151460Y-84100D03*
X151445Y-86115D03*
X149840Y-80280D03*
X152120Y-78000D03*
X129390Y-90165D03*
X133390Y-90165D03*
X137390Y-90165D03*
X141390Y-90165D03*
X145390Y-90165D03*
X143390Y-90165D03*
X139390Y-90165D03*
X135390Y-90165D03*
X131390Y-90165D03*
X127390Y-90165D03*
X124800Y-90165D03*
X74800Y-90165D03*
X78800Y-90165D03*
X82800Y-90165D03*
X86800Y-90165D03*
X90800Y-90165D03*
X94800Y-90165D03*
X98800Y-90165D03*
X102800Y-90165D03*
X100800Y-90165D03*
X96800Y-90165D03*
X92800Y-90165D03*
X88800Y-90165D03*
X84800Y-90165D03*
X80800Y-90165D03*
X76800Y-90165D03*
X72800Y-90165D03*
X104800Y-90165D03*
X108800Y-90165D03*
X110800Y-90165D03*
X106800Y-90165D03*
X147395Y-90170D03*
X104900Y-86595D03*
X108900Y-86595D03*
X110900Y-86595D03*
X106900Y-86595D03*
X102900Y-86595D03*
X70900Y-86595D03*
X74900Y-86595D03*
X78900Y-86595D03*
X82900Y-86595D03*
X86900Y-86595D03*
X90900Y-86595D03*
X94900Y-86595D03*
X98900Y-86595D03*
X100900Y-86595D03*
X96900Y-86595D03*
X92900Y-86595D03*
X88900Y-86595D03*
X84900Y-86595D03*
X80900Y-86595D03*
X76900Y-86595D03*
X72900Y-86595D03*
X125490Y-86595D03*
X129490Y-86595D03*
X133490Y-86595D03*
X137490Y-86595D03*
X141490Y-86595D03*
X143490Y-86595D03*
X139490Y-86595D03*
X135490Y-86595D03*
X131490Y-86595D03*
X127490Y-86595D03*
X151460Y-81990D03*
X152840Y-80585D03*
X153985Y-79435D03*
X145465Y-86565D03*
X37400Y-81700D03*
X37400Y-81450D03*
G54D14*
X146690Y-74800D03*
G54D13*
X155405Y-78015D03*
G54D14*
X153090Y-76100D03*
G54D13*
X146645Y-85375D03*
X147880Y-82000D03*
X147890Y-78000D03*
X147880Y-80000D03*
X147880Y-84000D03*
G54D14*
X152490Y-76100D03*
G54D17*
X151107Y-75337D02*
X151107Y-75917D01*
X151107Y-75917D02*
X151190Y-76000D01*
X151107Y-75917D02*
X151190Y-76000D01*
X151304Y-75337D02*
X151304Y-75885D01*
X151304Y-75885D02*
X151190Y-76000D01*
X149926Y-75337D02*
X149926Y-74933D01*
X149926Y-74933D02*
X150120Y-74740D01*
X150320Y-75337D02*
X150320Y-74939D01*
X150123Y-74743D02*
X150120Y-74740D01*
X150123Y-74743D02*
X150123Y-75337D01*
X150320Y-74939D02*
X150120Y-74740D01*
X148745Y-75337D02*
X148745Y-74934D01*
X148745Y-74934D02*
X148940Y-74740D01*
X149139Y-75337D02*
X149139Y-74938D01*
X148942Y-74741D02*
X148940Y-74740D01*
X148942Y-74741D02*
X148942Y-75337D01*
X149139Y-74938D02*
X148940Y-74740D01*
X153470Y-75337D02*
X153470Y-74620D01*
X153470Y-74620D02*
X153470Y-74620D01*
X153666Y-74903D02*
X153670Y-74900D01*
X153666Y-74903D02*
X153666Y-75337D01*
G54D18*
X148942Y-77488D02*
X148930Y-77500D01*
X148942Y-76793D02*
X148942Y-77488D01*
X148745Y-76793D02*
X148745Y-77335D01*
X148745Y-77335D02*
X148750Y-77340D01*
X153666Y-77498D02*
X153665Y-77500D01*
X153666Y-77498D02*
X153666Y-76793D01*
X153470Y-77339D02*
X153470Y-76793D01*
X153470Y-77339D02*
X153470Y-77340D01*
X154060Y-77499D02*
X154060Y-77500D01*
X154060Y-77499D02*
X154060Y-76793D01*
X153863Y-77333D02*
X153863Y-76793D01*
X153863Y-77333D02*
X153870Y-77340D01*
X154454Y-77498D02*
X154455Y-77500D01*
X154454Y-77498D02*
X154454Y-76793D01*
X154257Y-77333D02*
X154257Y-76793D01*
X154257Y-77333D02*
X154250Y-77340D01*
X154848Y-77497D02*
X154845Y-77500D01*
X154848Y-77497D02*
X154848Y-76793D01*
X154651Y-77339D02*
X154651Y-76793D01*
X154651Y-77339D02*
X154650Y-77340D01*
X155241Y-77498D02*
X155240Y-77500D01*
X155241Y-77498D02*
X155241Y-76793D01*
X155044Y-77334D02*
X155044Y-76793D01*
X155044Y-77334D02*
X155050Y-77340D01*
X155635Y-77495D02*
X155630Y-77500D01*
X155635Y-76793D02*
X155635Y-77495D01*
X155438Y-77331D02*
X155438Y-76793D01*
X155438Y-77331D02*
X155430Y-77340D01*
X149336Y-77499D02*
X149335Y-77500D01*
X149336Y-77499D02*
X149336Y-76793D01*
X149139Y-76793D02*
X149139Y-77331D01*
X149139Y-77331D02*
X149130Y-77340D01*
X149729Y-77499D02*
X149730Y-77500D01*
X149729Y-77499D02*
X149729Y-76793D01*
X149533Y-76793D02*
X149533Y-77337D01*
X149533Y-77337D02*
X149530Y-77340D01*
X150123Y-76793D02*
X150123Y-77496D01*
X150123Y-77496D02*
X150120Y-77500D01*
X149926Y-76793D02*
X149926Y-77336D01*
X149926Y-77336D02*
X149930Y-77340D01*
X150517Y-77498D02*
X150515Y-77500D01*
X150517Y-77498D02*
X150517Y-76793D01*
X150320Y-76793D02*
X150320Y-77330D01*
X150320Y-77330D02*
X150310Y-77340D01*
X150911Y-76793D02*
X150911Y-77499D01*
X150911Y-77499D02*
X150910Y-77500D01*
X150714Y-76793D02*
X150714Y-77336D01*
X150714Y-77336D02*
X150710Y-77340D01*
X151304Y-77499D02*
X151305Y-77500D01*
X151304Y-77499D02*
X151304Y-76793D01*
X151107Y-76793D02*
X151107Y-77337D01*
X151107Y-77337D02*
X151110Y-77340D01*
X151698Y-77497D02*
X151700Y-77500D01*
X151698Y-77497D02*
X151698Y-76793D01*
X151501Y-76793D02*
X151501Y-77328D01*
X151501Y-77328D02*
X151490Y-77340D01*
X152879Y-77498D02*
X152880Y-77500D01*
X152879Y-77498D02*
X152879Y-76793D01*
X152682Y-76793D02*
X152682Y-77327D01*
X152682Y-77327D02*
X152670Y-77340D01*
X153273Y-77497D02*
X153275Y-77500D01*
X153273Y-77497D02*
X153273Y-76793D01*
X153076Y-77334D02*
X153070Y-77340D01*
X153076Y-76793D02*
X153076Y-77334D01*
G54D17*
X155241Y-75691D02*
X155380Y-75830D01*
X155241Y-75337D02*
X155241Y-75691D01*
X154060Y-74889D02*
X154070Y-74880D01*
X154060Y-75337D02*
X154060Y-74889D01*
X153863Y-74686D02*
X153863Y-75337D01*
X153863Y-74686D02*
X153870Y-74680D01*
G54D18*
X154651Y-75799D02*
X154650Y-75800D01*
X154651Y-75337D02*
X154651Y-75799D01*
X155044Y-75799D02*
X155045Y-75800D01*
X155044Y-75799D02*
X155044Y-75337D01*
X154454Y-75956D02*
X154450Y-75960D01*
X154454Y-75337D02*
X154454Y-75956D01*
X154848Y-75337D02*
X154848Y-75957D01*
X154848Y-75957D02*
X154850Y-75960D01*
G54D17*
X68900Y-86600D02*
X67850Y-86600D01*
X65715Y-84465D02*
X64300Y-83050D01*
X66080Y-84830D02*
X65715Y-84465D01*
X67850Y-86600D02*
X66080Y-84830D01*
X68900Y-86600D02*
X113490Y-86600D01*
X38110Y-83105D02*
X40300Y-83050D01*
X42300Y-83050D02*
X44300Y-83050D01*
X46300Y-83050D02*
X48300Y-83050D01*
X50300Y-83050D02*
X52300Y-83050D01*
X54300Y-83050D02*
X56300Y-83050D01*
X58300Y-83050D02*
X60300Y-83050D01*
X62300Y-83050D02*
X64300Y-83050D01*
X60300Y-83050D02*
X62300Y-83050D01*
X56300Y-83050D02*
X58300Y-83050D01*
X52300Y-83050D02*
X54300Y-83050D01*
X48300Y-83050D02*
X50300Y-83050D01*
X44300Y-83050D02*
X46300Y-83050D01*
X40300Y-83050D02*
X42300Y-83050D01*
X156028Y-75337D02*
X156028Y-74896D01*
X156028Y-74896D02*
X156115Y-74810D01*
X155832Y-75337D02*
X155832Y-74810D01*
X155635Y-75337D02*
X155635Y-74810D01*
X155438Y-75337D02*
X155438Y-74826D01*
X156140Y-76030D02*
X157360Y-74810D01*
X157360Y-74810D02*
X157680Y-74810D01*
X156140Y-76030D02*
X156029Y-76030D01*
X155455Y-74810D02*
X155635Y-74810D01*
X155635Y-74810D02*
X155832Y-74810D01*
X155832Y-74810D02*
X156115Y-74810D01*
X156115Y-74810D02*
X157680Y-74810D01*
X155438Y-74826D02*
X155455Y-74810D01*
X66955Y-90635D02*
X68955Y-90635D01*
X113545Y-90635D02*
X115640Y-90625D01*
X104955Y-90635D02*
X106955Y-90635D01*
X108955Y-90635D02*
X110955Y-90635D01*
X112955Y-90635D02*
X114955Y-90635D01*
X116955Y-90635D02*
X118955Y-90635D01*
X120955Y-90635D02*
X122955Y-90635D01*
X118955Y-90635D02*
X120955Y-90635D01*
X114955Y-90635D02*
X116955Y-90635D01*
X110955Y-90635D02*
X112955Y-90635D01*
X106955Y-90635D02*
X108955Y-90635D01*
X74955Y-90635D02*
X76955Y-90635D01*
X78955Y-90635D02*
X80955Y-90635D01*
X82955Y-90635D02*
X84955Y-90635D01*
X86955Y-90635D02*
X88955Y-90635D01*
X90955Y-90635D02*
X92955Y-90635D01*
X94955Y-90635D02*
X96955Y-90635D01*
X98955Y-90635D02*
X100955Y-90635D01*
X104955Y-90635D02*
X102955Y-90635D01*
X100955Y-90635D02*
X102955Y-90635D01*
X96955Y-90635D02*
X98955Y-90635D01*
X92955Y-90635D02*
X94955Y-90635D01*
X88955Y-90635D02*
X90955Y-90635D01*
X84955Y-90635D02*
X86955Y-90635D01*
X80955Y-90635D02*
X82955Y-90635D01*
X76955Y-90635D02*
X78955Y-90635D01*
X74955Y-90635D02*
X72955Y-90635D01*
X122955Y-90635D02*
X124955Y-90635D01*
X87545Y-90635D02*
X89545Y-90635D01*
X91545Y-90635D02*
X93545Y-90635D01*
X95545Y-90635D02*
X97545Y-90635D01*
X99545Y-90635D02*
X101545Y-90635D01*
X103545Y-90635D02*
X105545Y-90635D01*
X107545Y-90635D02*
X109545Y-90635D01*
X111545Y-90635D02*
X113545Y-90635D01*
X109545Y-90635D02*
X111545Y-90635D01*
X105545Y-90635D02*
X107545Y-90635D01*
X101545Y-90635D02*
X103545Y-90635D01*
X97545Y-90635D02*
X99545Y-90635D01*
X93545Y-90635D02*
X95545Y-90635D01*
X89545Y-90635D02*
X91545Y-90635D01*
X124955Y-90635D02*
X87545Y-90635D01*
X70955Y-90635D02*
X72955Y-90635D01*
X68955Y-90635D02*
X70955Y-90635D01*
X148548Y-75337D02*
X148548Y-75948D01*
X148544Y-75953D02*
X148548Y-75953D01*
X148548Y-75948D02*
X148544Y-75953D01*
X156365Y-77780D02*
X156440Y-77780D01*
X156440Y-77780D02*
X156770Y-77450D01*
X66955Y-90635D02*
X64940Y-90650D01*
X64940Y-90650D02*
X64885Y-90705D01*
X53880Y-91700D02*
X55880Y-91705D01*
X57880Y-91705D02*
X59880Y-91705D01*
X61880Y-91705D02*
X63860Y-91715D01*
X59880Y-91705D02*
X61880Y-91705D01*
X55880Y-91705D02*
X57880Y-91705D01*
X65465Y-90635D02*
X64935Y-90650D01*
X64935Y-90650D02*
X63860Y-91715D01*
X66955Y-90635D02*
X65465Y-90635D01*
X117640Y-90575D02*
X119640Y-90575D01*
X121640Y-90575D02*
X123640Y-90575D01*
X125640Y-90575D02*
X127640Y-90575D01*
X129640Y-90575D02*
X131640Y-90575D01*
X133640Y-90575D02*
X135640Y-90575D01*
X137640Y-90575D02*
X139640Y-90575D01*
X141640Y-90575D02*
X143640Y-90575D01*
X147645Y-90630D02*
X145640Y-90575D01*
X143640Y-90575D02*
X145640Y-90575D01*
X139640Y-90575D02*
X141640Y-90575D01*
X135640Y-90575D02*
X137640Y-90575D01*
X131640Y-90575D02*
X133640Y-90575D01*
X127640Y-90575D02*
X129640Y-90575D01*
X123640Y-90575D02*
X125640Y-90575D01*
X119640Y-90575D02*
X121640Y-90575D01*
X115640Y-90575D02*
X117640Y-90575D01*
X147645Y-90630D02*
X145840Y-90575D01*
X149090Y-89180D02*
X149085Y-89180D01*
X150505Y-87765D02*
X149090Y-89180D01*
X149085Y-89180D02*
X147640Y-90625D01*
X151960Y-82210D02*
X151960Y-82185D01*
X151920Y-82250D02*
X151960Y-82210D01*
X151930Y-84210D02*
X151920Y-82250D01*
X151920Y-86350D02*
X151930Y-84210D01*
X151960Y-82185D02*
X153365Y-80780D01*
X153365Y-80780D02*
X154360Y-79785D01*
X154360Y-79785D02*
X155775Y-78370D01*
X150505Y-87765D02*
X151920Y-86350D01*
X156029Y-77170D02*
X156029Y-77428D01*
X156365Y-77780D02*
X155775Y-78370D01*
X156365Y-77765D02*
X156365Y-77780D01*
X156029Y-77428D02*
X156365Y-77765D01*
X56490Y-92780D02*
X54260Y-92780D01*
X54260Y-92780D02*
X54060Y-92580D01*
X58090Y-92780D02*
X56490Y-92780D01*
X56490Y-92780D02*
X56270Y-92780D01*
X56270Y-92780D02*
X56060Y-92990D01*
X60450Y-92780D02*
X58260Y-92780D01*
X58260Y-92780D02*
X58060Y-92580D01*
X62390Y-92780D02*
X60450Y-92780D01*
X60450Y-92780D02*
X60270Y-92780D01*
X60270Y-92780D02*
X60060Y-92990D01*
X62520Y-92780D02*
X62390Y-92780D01*
X62390Y-92780D02*
X62260Y-92780D01*
X62260Y-92780D02*
X62060Y-92580D01*
X66250Y-91540D02*
X65570Y-91540D01*
X65570Y-91540D02*
X65210Y-91900D01*
X66250Y-91330D02*
X66250Y-91540D01*
X66250Y-91540D02*
X66250Y-91750D01*
X66250Y-91750D02*
X65680Y-92320D01*
X38440Y-92780D02*
X38010Y-92780D01*
X38010Y-92780D02*
X37800Y-92990D01*
X37990Y-92780D02*
X37790Y-92580D01*
X64800Y-92780D02*
X62520Y-92780D01*
X62520Y-92780D02*
X58090Y-92780D01*
X58090Y-92780D02*
X38440Y-92780D01*
X38440Y-92780D02*
X37990Y-92780D01*
X66200Y-91380D02*
X66250Y-91330D01*
X156770Y-77450D02*
X157260Y-77450D01*
X157260Y-77450D02*
X157440Y-77630D01*
X157440Y-77630D02*
X157440Y-77880D01*
X157440Y-77880D02*
X152690Y-82630D01*
X152690Y-82630D02*
X152690Y-86620D01*
X152690Y-86620D02*
X147930Y-91380D01*
X147930Y-91380D02*
X66200Y-91380D01*
X66250Y-91330D02*
X64800Y-92780D01*
X69780Y-88210D02*
X114370Y-88210D01*
X65155Y-88210D02*
X64930Y-88210D01*
X64927Y-88207D02*
X64930Y-88210D01*
X146370Y-88210D02*
X144570Y-88210D01*
X114370Y-88210D02*
X116370Y-88210D01*
X118370Y-88210D02*
X120370Y-88210D01*
X122370Y-88210D02*
X124370Y-88210D01*
X126370Y-88210D02*
X128370Y-88210D01*
X130370Y-88210D02*
X132370Y-88210D01*
X134370Y-88210D02*
X136370Y-88210D01*
X138370Y-88210D02*
X140370Y-88210D01*
X142370Y-88210D02*
X144370Y-88210D01*
X146370Y-88210D02*
X144370Y-88210D01*
X140370Y-88210D02*
X142370Y-88210D01*
X136370Y-88210D02*
X138370Y-88210D01*
X132370Y-88210D02*
X134370Y-88210D01*
X128370Y-88210D02*
X130370Y-88210D01*
X124370Y-88210D02*
X126370Y-88210D01*
X120370Y-88210D02*
X122370Y-88210D01*
X116370Y-88210D02*
X118370Y-88210D01*
X123780Y-88210D02*
X86370Y-88210D01*
X88370Y-88210D02*
X90370Y-88210D01*
X92370Y-88210D02*
X94370Y-88210D01*
X96370Y-88210D02*
X98370Y-88210D01*
X100370Y-88210D02*
X102370Y-88210D01*
X104370Y-88210D02*
X106370Y-88210D01*
X108370Y-88210D02*
X110370Y-88210D01*
X114370Y-88210D02*
X112370Y-88210D01*
X110370Y-88210D02*
X112370Y-88210D01*
X106370Y-88210D02*
X108370Y-88210D01*
X102370Y-88210D02*
X104370Y-88210D01*
X98370Y-88210D02*
X100370Y-88210D01*
X94370Y-88210D02*
X96370Y-88210D01*
X90370Y-88210D02*
X92370Y-88210D01*
X86370Y-88210D02*
X88370Y-88210D01*
X121780Y-88210D02*
X123780Y-88210D01*
X71780Y-88210D02*
X73780Y-88210D01*
X75780Y-88210D02*
X77780Y-88210D01*
X79780Y-88210D02*
X81780Y-88210D01*
X83780Y-88210D02*
X85780Y-88210D01*
X87780Y-88210D02*
X89780Y-88210D01*
X91780Y-88210D02*
X93780Y-88210D01*
X95780Y-88210D02*
X97780Y-88210D01*
X99780Y-88210D02*
X101780Y-88210D01*
X103780Y-88210D02*
X101780Y-88210D01*
X97780Y-88210D02*
X99780Y-88210D01*
X93780Y-88210D02*
X95780Y-88210D01*
X89780Y-88210D02*
X91780Y-88210D01*
X85780Y-88210D02*
X87780Y-88210D01*
X81780Y-88210D02*
X83780Y-88210D01*
X77780Y-88210D02*
X79780Y-88210D01*
X73780Y-88210D02*
X75780Y-88210D01*
X105780Y-88210D02*
X107780Y-88210D01*
X109780Y-88210D02*
X111780Y-88210D01*
X113780Y-88210D02*
X115780Y-88210D01*
X117780Y-88210D02*
X119780Y-88210D01*
X119780Y-88210D02*
X121780Y-88210D01*
X115780Y-88210D02*
X117780Y-88210D01*
X111780Y-88210D02*
X113780Y-88210D01*
X107780Y-88210D02*
X109780Y-88225D01*
X103780Y-88210D02*
X105780Y-88210D01*
X149500Y-83800D02*
X149510Y-85090D01*
X149505Y-85095D02*
X149510Y-85090D01*
X149510Y-85090D02*
X149505Y-85095D01*
X151895Y-76793D02*
X151895Y-77765D01*
X146370Y-88210D02*
X67780Y-88210D01*
X67780Y-88210D02*
X65155Y-88210D01*
X149505Y-85095D02*
X147950Y-86655D01*
X147950Y-86655D02*
X146370Y-88210D01*
X149515Y-80160D02*
X149520Y-82660D01*
X149520Y-82660D02*
X149500Y-83800D01*
X151895Y-77765D02*
X151660Y-78000D01*
X151660Y-78000D02*
X149515Y-80160D01*
X156029Y-75337D02*
X156029Y-76030D01*
X156029Y-76030D02*
X156029Y-76793D01*
X156029Y-76793D02*
X156029Y-77170D01*
X156029Y-77170D02*
X156029Y-77401D01*
X148548Y-76793D02*
X148548Y-75953D01*
X148548Y-75953D02*
X148548Y-75337D01*
X151698Y-75337D02*
X151698Y-75907D01*
X151698Y-75907D02*
X151890Y-76100D01*
X151501Y-75337D02*
X151501Y-75711D01*
X151501Y-75711D02*
X151890Y-76100D01*
X152092Y-75337D02*
X152092Y-75898D01*
X152092Y-75898D02*
X151890Y-76100D01*
X152092Y-76793D02*
X152092Y-76301D01*
X152092Y-76301D02*
X151890Y-76100D01*
X151895Y-75337D02*
X151895Y-76095D01*
X151895Y-76104D02*
X151890Y-76100D01*
X151895Y-76104D02*
X151895Y-76793D01*
X151895Y-76095D02*
X151890Y-76100D01*
X150911Y-75337D02*
X150911Y-74940D01*
X150911Y-74940D02*
X150710Y-74740D01*
X150517Y-75337D02*
X150517Y-74933D01*
X150714Y-74743D02*
X150710Y-74740D01*
X150714Y-74743D02*
X150714Y-75337D01*
X150517Y-74933D02*
X150710Y-74740D01*
X149729Y-75337D02*
X149729Y-74939D01*
X149729Y-74939D02*
X149530Y-74740D01*
X149336Y-75337D02*
X149336Y-74934D01*
X149533Y-74742D02*
X149530Y-74740D01*
X149533Y-74742D02*
X149533Y-75337D01*
X149336Y-74934D02*
X149530Y-74740D01*
X37400Y-82450D02*
X37400Y-82860D01*
X70800Y-90115D02*
X115390Y-90115D01*
X39480Y-91060D02*
X41480Y-91060D01*
X43480Y-91060D02*
X45480Y-91060D01*
X47480Y-91060D02*
X49480Y-91060D01*
X51480Y-91060D02*
X53480Y-91060D01*
X55480Y-91060D02*
X57480Y-91060D01*
X59480Y-91060D02*
X61480Y-91060D01*
X61480Y-91060D02*
X63480Y-91060D01*
X57480Y-91060D02*
X59480Y-91060D01*
X53480Y-91060D02*
X55480Y-91060D01*
X49480Y-91060D02*
X51480Y-91060D01*
X45480Y-91060D02*
X47480Y-91060D01*
X41480Y-91060D02*
X43480Y-91060D01*
X37480Y-91060D02*
X39480Y-91060D01*
X64750Y-90115D02*
X64490Y-90115D01*
X64400Y-90115D02*
X63485Y-91055D01*
X63485Y-91055D02*
X63480Y-91060D01*
X37400Y-91060D02*
X63480Y-91060D01*
X37480Y-87230D02*
X39480Y-87230D01*
X41480Y-87230D02*
X43480Y-87230D01*
X45480Y-87230D02*
X47480Y-87230D01*
X49480Y-87230D02*
X51480Y-87230D01*
X53480Y-87230D02*
X55480Y-87230D01*
X57480Y-87230D02*
X59480Y-87230D01*
X61480Y-87230D02*
X63480Y-87230D01*
X59480Y-87230D02*
X61480Y-87230D01*
X55480Y-87230D02*
X57480Y-87230D01*
X51480Y-87230D02*
X53480Y-87230D01*
X47480Y-87230D02*
X49480Y-87230D01*
X43480Y-87230D02*
X45480Y-87230D01*
X39480Y-87230D02*
X41480Y-87230D01*
X63480Y-86885D02*
X37390Y-86890D01*
X37610Y-86890D02*
X39610Y-86890D01*
X41610Y-86890D02*
X43610Y-86890D01*
X45610Y-86890D02*
X47610Y-86890D01*
X49610Y-86890D02*
X51610Y-86890D01*
X53610Y-86890D02*
X55610Y-86890D01*
X57610Y-86890D02*
X59610Y-86890D01*
X61610Y-86890D02*
X63480Y-86885D01*
X59610Y-86890D02*
X61610Y-86890D01*
X55610Y-86890D02*
X57610Y-86890D01*
X51610Y-86890D02*
X53610Y-86890D01*
X47610Y-86890D02*
X49610Y-86890D01*
X43610Y-86890D02*
X45610Y-86890D01*
X39610Y-86890D02*
X41610Y-86890D01*
X37680Y-91060D02*
X37400Y-91060D01*
X37480Y-91060D02*
X37680Y-91060D01*
X69940Y-88550D02*
X114530Y-88550D01*
X114530Y-88550D02*
X116530Y-88550D01*
X118530Y-88550D02*
X120530Y-88550D01*
X122530Y-88550D02*
X124530Y-88550D01*
X126530Y-88550D02*
X128530Y-88550D01*
X130530Y-88550D02*
X132530Y-88550D01*
X134530Y-88550D02*
X136530Y-88550D01*
X138530Y-88550D02*
X140530Y-88550D01*
X142530Y-88550D02*
X144530Y-88550D01*
X146530Y-88550D02*
X144530Y-88550D01*
X140530Y-88550D02*
X142530Y-88550D01*
X136530Y-88550D02*
X138530Y-88550D01*
X132530Y-88550D02*
X134530Y-88550D01*
X128530Y-88550D02*
X130530Y-88550D01*
X124530Y-88550D02*
X126530Y-88550D01*
X120530Y-88550D02*
X122530Y-88550D01*
X116530Y-88550D02*
X118530Y-88550D01*
X123940Y-88550D02*
X86530Y-88550D01*
X88530Y-88550D02*
X90530Y-88550D01*
X92530Y-88550D02*
X94530Y-88550D01*
X96530Y-88550D02*
X98530Y-88550D01*
X100530Y-88550D02*
X102530Y-88550D01*
X104530Y-88550D02*
X106530Y-88550D01*
X108530Y-88550D02*
X110530Y-88550D01*
X114530Y-88550D02*
X112530Y-88550D01*
X110530Y-88550D02*
X112530Y-88550D01*
X106530Y-88550D02*
X108530Y-88550D01*
X102530Y-88550D02*
X104530Y-88550D01*
X98530Y-88550D02*
X100530Y-88550D01*
X94530Y-88550D02*
X96530Y-88550D01*
X90530Y-88550D02*
X92530Y-88550D01*
X86530Y-88550D02*
X88530Y-88550D01*
X121940Y-88550D02*
X123940Y-88550D01*
X71940Y-88550D02*
X73940Y-88550D01*
X75940Y-88550D02*
X77940Y-88550D01*
X79940Y-88550D02*
X81940Y-88550D01*
X83940Y-88550D02*
X85940Y-88550D01*
X87940Y-88550D02*
X89940Y-88550D01*
X91940Y-88550D02*
X93940Y-88550D01*
X95940Y-88550D02*
X97940Y-88550D01*
X99940Y-88550D02*
X101940Y-88550D01*
X103940Y-88550D02*
X101940Y-88550D01*
X97940Y-88550D02*
X99940Y-88550D01*
X93940Y-88550D02*
X95940Y-88550D01*
X89940Y-88550D02*
X91940Y-88550D01*
X85940Y-88550D02*
X87940Y-88550D01*
X81940Y-88550D02*
X83940Y-88550D01*
X77940Y-88550D02*
X79940Y-88550D01*
X73940Y-88550D02*
X75940Y-88550D01*
X105940Y-88550D02*
X107940Y-88550D01*
X109940Y-88550D02*
X111940Y-88550D01*
X113940Y-88550D02*
X115940Y-88550D01*
X117940Y-88550D02*
X119940Y-88550D01*
X119940Y-88550D02*
X121940Y-88550D01*
X115940Y-88550D02*
X117940Y-88550D01*
X111940Y-88550D02*
X113940Y-88550D01*
X107940Y-88550D02*
X109940Y-88550D01*
X103940Y-88550D02*
X105940Y-88550D01*
X147395Y-90170D02*
X145590Y-90115D01*
X115390Y-90115D02*
X117390Y-90115D01*
X119390Y-90115D02*
X121390Y-90115D01*
X123390Y-90115D02*
X125390Y-90115D01*
X127390Y-90115D02*
X129390Y-90115D01*
X131390Y-90115D02*
X133390Y-90115D01*
X135390Y-90115D02*
X137390Y-90115D01*
X139390Y-90115D02*
X141390Y-90115D01*
X143390Y-90115D02*
X145390Y-90115D01*
X147395Y-90170D02*
X145390Y-90115D01*
X141390Y-90115D02*
X143390Y-90115D01*
X137390Y-90115D02*
X139390Y-90115D01*
X133390Y-90115D02*
X135390Y-90115D01*
X129390Y-90115D02*
X131390Y-90115D01*
X125390Y-90115D02*
X127390Y-90115D01*
X121390Y-90115D02*
X123390Y-90115D01*
X117390Y-90115D02*
X119390Y-90115D01*
X124800Y-90115D02*
X87390Y-90115D01*
X89390Y-90115D02*
X91390Y-90115D01*
X93390Y-90115D02*
X95390Y-90115D01*
X97390Y-90115D02*
X99390Y-90115D01*
X101390Y-90115D02*
X103390Y-90115D01*
X105390Y-90115D02*
X107390Y-90115D01*
X109390Y-90115D02*
X111390Y-90115D01*
X115390Y-90115D02*
X113390Y-90115D01*
X111390Y-90115D02*
X113390Y-90115D01*
X107390Y-90115D02*
X109390Y-90115D01*
X103390Y-90115D02*
X105390Y-90115D01*
X99390Y-90115D02*
X101390Y-90115D01*
X95390Y-90115D02*
X97390Y-90115D01*
X91390Y-90115D02*
X93390Y-90115D01*
X87390Y-90115D02*
X89390Y-90115D01*
X122800Y-90115D02*
X124800Y-90115D01*
X72800Y-90115D02*
X74800Y-90115D01*
X76800Y-90115D02*
X78800Y-90115D01*
X80800Y-90115D02*
X82800Y-90115D01*
X84800Y-90115D02*
X86800Y-90115D01*
X88800Y-90115D02*
X90800Y-90115D01*
X92800Y-90115D02*
X94800Y-90115D01*
X96800Y-90115D02*
X98800Y-90115D01*
X100800Y-90115D02*
X102800Y-90115D01*
X104800Y-90115D02*
X102800Y-90115D01*
X98800Y-90115D02*
X100800Y-90115D01*
X94800Y-90115D02*
X96800Y-90115D01*
X90800Y-90115D02*
X92800Y-90115D01*
X86800Y-90115D02*
X88800Y-90115D01*
X82800Y-90115D02*
X84800Y-90115D01*
X78800Y-90115D02*
X80800Y-90115D01*
X74800Y-90115D02*
X76800Y-90115D01*
X106800Y-90115D02*
X108800Y-90115D01*
X110800Y-90115D02*
X112800Y-90115D01*
X114800Y-90115D02*
X116800Y-90115D01*
X118800Y-90115D02*
X120800Y-90115D01*
X120800Y-90115D02*
X122800Y-90115D01*
X116800Y-90115D02*
X118800Y-90115D01*
X112800Y-90115D02*
X114800Y-90115D01*
X108800Y-90115D02*
X110800Y-90115D01*
X104800Y-90115D02*
X106800Y-90115D01*
X151430Y-83960D02*
X151460Y-84100D01*
X151460Y-84100D02*
X151445Y-86115D01*
X69020Y-90115D02*
X147395Y-90170D01*
X147395Y-90170D02*
X148815Y-88750D01*
X148815Y-88750D02*
X150035Y-87530D01*
X150035Y-87530D02*
X151445Y-86115D01*
X69020Y-90115D02*
X68800Y-90115D01*
X68800Y-90115D02*
X67020Y-90115D01*
X67020Y-90115D02*
X66800Y-90115D01*
X66800Y-90115D02*
X64750Y-90115D01*
X64750Y-90115D02*
X64400Y-90115D01*
X102900Y-86600D02*
X104900Y-86600D01*
X106900Y-86600D02*
X108900Y-86600D01*
X110900Y-86600D02*
X112900Y-86600D01*
X114900Y-86600D02*
X116900Y-86600D01*
X118900Y-86600D02*
X120900Y-86600D01*
X116900Y-86600D02*
X118900Y-86600D01*
X112900Y-86600D02*
X114900Y-86600D01*
X108900Y-86600D02*
X110900Y-86600D01*
X104900Y-86600D02*
X106900Y-86600D01*
X72900Y-86600D02*
X74900Y-86600D01*
X76900Y-86600D02*
X78900Y-86600D01*
X80900Y-86600D02*
X82900Y-86600D01*
X84900Y-86600D02*
X86900Y-86600D01*
X88900Y-86600D02*
X90900Y-86600D01*
X92900Y-86600D02*
X94900Y-86600D01*
X96900Y-86600D02*
X98900Y-86600D01*
X102900Y-86600D02*
X100900Y-86600D01*
X98900Y-86600D02*
X100900Y-86600D01*
X94900Y-86600D02*
X96900Y-86600D01*
X90900Y-86600D02*
X92900Y-86600D01*
X86900Y-86600D02*
X88900Y-86600D01*
X82900Y-86600D02*
X84900Y-86600D01*
X78900Y-86600D02*
X80900Y-86600D01*
X74900Y-86600D02*
X76900Y-86600D01*
X70900Y-86600D02*
X72900Y-86600D01*
X120900Y-86600D02*
X122900Y-86600D01*
X124900Y-86600D02*
X87490Y-86600D01*
X89490Y-86600D02*
X91490Y-86600D01*
X93490Y-86600D02*
X95490Y-86600D01*
X97490Y-86600D02*
X99490Y-86600D01*
X101490Y-86600D02*
X103490Y-86600D01*
X105490Y-86600D02*
X107490Y-86600D01*
X109490Y-86600D02*
X111490Y-86600D01*
X113490Y-86600D02*
X111490Y-86600D01*
X107490Y-86600D02*
X109490Y-86600D01*
X103490Y-86600D02*
X105490Y-86600D01*
X99490Y-86600D02*
X101490Y-86600D01*
X95490Y-86600D02*
X97490Y-86600D01*
X91490Y-86600D02*
X93490Y-86600D01*
X87490Y-86600D02*
X89490Y-86600D01*
X122900Y-86600D02*
X124900Y-86600D01*
X115490Y-86600D02*
X117490Y-86600D01*
X119490Y-86600D02*
X121490Y-86600D01*
X123490Y-86600D02*
X125490Y-86600D01*
X127490Y-86600D02*
X129490Y-86600D01*
X131490Y-86600D02*
X133490Y-86600D01*
X135490Y-86600D02*
X137490Y-86600D01*
X139490Y-86600D02*
X141490Y-86600D01*
X145465Y-86570D02*
X143490Y-86600D01*
X141490Y-86600D02*
X143490Y-86600D01*
X137490Y-86600D02*
X139490Y-86600D01*
X133490Y-86600D02*
X135490Y-86600D01*
X129490Y-86600D02*
X131490Y-86600D01*
X125490Y-86600D02*
X127490Y-86600D01*
X121490Y-86600D02*
X123490Y-86600D01*
X117490Y-86600D02*
X119490Y-86600D01*
X113490Y-86600D02*
X115490Y-86600D01*
X65220Y-88550D02*
X64800Y-88550D01*
X63480Y-87230D02*
X37390Y-87230D01*
X64800Y-88550D02*
X63480Y-87230D01*
X152485Y-76793D02*
X152485Y-77634D01*
X64810Y-88550D02*
X64930Y-88550D01*
X146530Y-88550D02*
X67940Y-88550D01*
X67940Y-88550D02*
X65220Y-88550D01*
X65220Y-88550D02*
X64810Y-88550D01*
X149820Y-85225D02*
X148170Y-86885D01*
X148170Y-86885D02*
X146530Y-88550D01*
X149840Y-80280D02*
X149820Y-82740D01*
X149820Y-82740D02*
X149820Y-85225D01*
X152485Y-77634D02*
X152120Y-78000D01*
X152120Y-78000D02*
X149840Y-80280D01*
X152840Y-80585D02*
X151460Y-81990D01*
X151460Y-81990D02*
X151430Y-83960D01*
G54D19*
X146790Y-76350D02*
X146790Y-76900D01*
X68050Y-86200D02*
X64500Y-82650D01*
X145190Y-86200D02*
X68050Y-86200D01*
X147490Y-83900D02*
X145190Y-86200D01*
X147490Y-77600D02*
X147490Y-83900D01*
X146790Y-76900D02*
X147490Y-77600D01*
G54D20*
X68350Y-85500D02*
X64450Y-81600D01*
X69000Y-85500D02*
X68350Y-85500D01*
X146790Y-83600D02*
X144890Y-85500D01*
X144890Y-85500D02*
X69000Y-85500D01*
G54D21*
X146690Y-74800D02*
X146690Y-75800D01*
X146690Y-75800D02*
X146790Y-75900D01*
G54D20*
X146790Y-75900D02*
X146790Y-76350D01*
X146790Y-76350D02*
X146790Y-83600D01*
X64450Y-81600D02*
X63550Y-81600D01*
G54D17*
X155832Y-77558D02*
X155832Y-76793D01*
X155832Y-77558D02*
X155650Y-77740D01*
X155650Y-77740D02*
X155405Y-78015D01*
X152840Y-80585D02*
X153985Y-79435D01*
X153985Y-79435D02*
X155405Y-78015D01*
X147227Y-75337D02*
X148351Y-75337D01*
X147227Y-75337D02*
X146690Y-74800D01*
X154257Y-75337D02*
X154257Y-75833D01*
X153990Y-76100D02*
X153090Y-76100D01*
X154257Y-75833D02*
X153990Y-76100D01*
X155635Y-75337D02*
X155635Y-75924D01*
X155635Y-75924D02*
X155832Y-76121D01*
X155832Y-76793D02*
X155832Y-76121D01*
X155832Y-76121D02*
X155832Y-75337D01*
X146490Y-85600D02*
X145465Y-86570D01*
X147890Y-84200D02*
X146645Y-85375D01*
X146645Y-85375D02*
X146490Y-85600D01*
X147880Y-84000D02*
X147880Y-82000D01*
X147880Y-80000D02*
X147890Y-78000D01*
X148351Y-77538D02*
X147890Y-78000D01*
X148351Y-76793D02*
X148351Y-77538D01*
X147880Y-82000D02*
X147880Y-80000D01*
X147880Y-84000D02*
X147890Y-84200D01*
X145465Y-86570D02*
X143690Y-86600D01*
X148351Y-76793D02*
X148351Y-75337D01*
X153273Y-75337D02*
X153273Y-75917D01*
X153076Y-76085D02*
X153090Y-76100D01*
X153076Y-76085D02*
X153076Y-75337D01*
X153273Y-75917D02*
X153090Y-76100D01*
X153076Y-75337D02*
X153076Y-75814D01*
X152790Y-76100D02*
X152490Y-76100D01*
X153076Y-75814D02*
X152790Y-76100D01*
X152879Y-75337D02*
X152879Y-75711D01*
X152879Y-75711D02*
X152490Y-76100D01*
X152682Y-75337D02*
X152682Y-75907D01*
X152682Y-75907D02*
X152490Y-76100D01*
X152288Y-75337D02*
X152288Y-75898D01*
X152288Y-75898D02*
X152490Y-76100D01*
X152288Y-76793D02*
X152288Y-76301D01*
X152288Y-76301D02*
X152490Y-76100D01*
X152490Y-76100D02*
X152490Y-75341D01*
X152485Y-76104D02*
X152490Y-76100D01*
X152485Y-76793D02*
X152485Y-76104D01*
X152490Y-75341D02*
X152485Y-75337D01*
G54D10*
G36*
X149805Y-74525D02*
X149802Y-74527D01*
X149745Y-74665D01*
X149745Y-74814D01*
X149766Y-74864D01*
X149765Y-74866D01*
X149765Y-74867D01*
X149759Y-74872D01*
X149759Y-74875D01*
X149743Y-74875D01*
X149719Y-74850D01*
X149649Y-74821D01*
X149643Y-74816D01*
X149636Y-74816D01*
X149625Y-74816D01*
X149618Y-74816D01*
X149613Y-74821D01*
X149543Y-74850D01*
X149532Y-74861D01*
X149522Y-74850D01*
X149452Y-74821D01*
X149447Y-74816D01*
X149439Y-74816D01*
X149429Y-74816D01*
X149421Y-74816D01*
X149416Y-74821D01*
X149346Y-74850D01*
X149322Y-74875D01*
X149306Y-74875D01*
X149306Y-74872D01*
X149295Y-74862D01*
X149315Y-74814D01*
X149315Y-74665D01*
X149258Y-74527D01*
X149255Y-74525D01*
X149805Y-74525D01*
X149805Y-74525D01*
G37*
G54D22*
X149805Y-74525D02*
X149802Y-74527D01*
X149745Y-74665D01*
X149745Y-74814D01*
X149766Y-74864D01*
X149765Y-74866D01*
X149765Y-74867D01*
X149759Y-74872D01*
X149759Y-74875D01*
X149743Y-74875D01*
X149719Y-74850D01*
X149649Y-74821D01*
X149643Y-74816D01*
X149636Y-74816D01*
X149625Y-74816D01*
X149618Y-74816D01*
X149613Y-74821D01*
X149543Y-74850D01*
X149532Y-74861D01*
X149522Y-74850D01*
X149452Y-74821D01*
X149447Y-74816D01*
X149439Y-74816D01*
X149429Y-74816D01*
X149421Y-74816D01*
X149416Y-74821D01*
X149346Y-74850D01*
X149322Y-74875D01*
X149306Y-74875D01*
X149306Y-74872D01*
X149295Y-74862D01*
X149315Y-74814D01*
X149315Y-74665D01*
X149258Y-74527D01*
X149255Y-74525D01*
X149805Y-74525D01*
G54D10*
G36*
X153295Y-74875D02*
X153286Y-74875D01*
X153262Y-74850D01*
X153192Y-74821D01*
X153187Y-74816D01*
X153179Y-74816D01*
X153169Y-74816D01*
X153161Y-74816D01*
X153156Y-74821D01*
X153086Y-74850D01*
X153076Y-74861D01*
X153065Y-74850D01*
X152995Y-74821D01*
X152990Y-74816D01*
X152983Y-74816D01*
X152972Y-74816D01*
X152965Y-74816D01*
X152959Y-74821D01*
X152889Y-74850D01*
X152879Y-74861D01*
X152868Y-74850D01*
X152798Y-74821D01*
X152793Y-74816D01*
X152786Y-74816D01*
X152775Y-74816D01*
X152768Y-74816D01*
X152763Y-74821D01*
X152692Y-74850D01*
X152682Y-74861D01*
X152672Y-74850D01*
X152601Y-74821D01*
X152596Y-74816D01*
X152589Y-74816D01*
X152578Y-74816D01*
X152571Y-74816D01*
X152566Y-74821D01*
X152495Y-74850D01*
X152485Y-74861D01*
X152475Y-74850D01*
X152404Y-74821D01*
X152399Y-74816D01*
X152392Y-74816D01*
X152381Y-74816D01*
X152374Y-74816D01*
X152369Y-74821D01*
X152299Y-74850D01*
X152288Y-74861D01*
X152278Y-74850D01*
X152208Y-74821D01*
X152202Y-74816D01*
X152195Y-74816D01*
X152184Y-74816D01*
X152177Y-74816D01*
X152172Y-74821D01*
X152102Y-74850D01*
X152091Y-74861D01*
X152081Y-74850D01*
X152011Y-74821D01*
X152006Y-74816D01*
X151998Y-74816D01*
X151988Y-74816D01*
X151980Y-74816D01*
X151975Y-74821D01*
X151905Y-74850D01*
X151895Y-74861D01*
X151884Y-74850D01*
X151814Y-74821D01*
X151809Y-74816D01*
X151802Y-74816D01*
X151791Y-74816D01*
X151783Y-74816D01*
X151778Y-74821D01*
X151708Y-74850D01*
X151698Y-74861D01*
X151687Y-74850D01*
X151617Y-74821D01*
X151612Y-74816D01*
X151605Y-74816D01*
X151594Y-74816D01*
X151587Y-74816D01*
X151581Y-74821D01*
X151511Y-74850D01*
X151487Y-74875D01*
X151471Y-74875D01*
X151471Y-74872D01*
X151415Y-74816D01*
X151397Y-74816D01*
X151314Y-74850D01*
X151290Y-74875D01*
X151121Y-74875D01*
X151097Y-74850D01*
X151014Y-74816D01*
X150996Y-74816D01*
X150940Y-74872D01*
X150940Y-74875D01*
X150924Y-74875D01*
X150900Y-74850D01*
X150830Y-74821D01*
X150825Y-74816D01*
X150817Y-74816D01*
X150806Y-74816D01*
X150799Y-74816D01*
X150794Y-74821D01*
X150724Y-74850D01*
X150713Y-74861D01*
X150703Y-74850D01*
X150633Y-74821D01*
X150628Y-74816D01*
X150620Y-74816D01*
X150610Y-74816D01*
X150602Y-74816D01*
X150597Y-74821D01*
X150527Y-74850D01*
X150503Y-74875D01*
X150487Y-74875D01*
X150487Y-74872D01*
X150476Y-74861D01*
X150495Y-74814D01*
X150495Y-74665D01*
X150438Y-74527D01*
X150435Y-74525D01*
X153288Y-74525D01*
X153265Y-74579D01*
X153265Y-74660D01*
X153295Y-74732D01*
X153295Y-74875D01*
X153295Y-74875D01*
G37*
G54D22*
X153295Y-74875D02*
X153286Y-74875D01*
X153262Y-74850D01*
X153192Y-74821D01*
X153187Y-74816D01*
X153179Y-74816D01*
X153169Y-74816D01*
X153161Y-74816D01*
X153156Y-74821D01*
X153086Y-74850D01*
X153076Y-74861D01*
X153065Y-74850D01*
X152995Y-74821D01*
X152990Y-74816D01*
X152983Y-74816D01*
X152972Y-74816D01*
X152965Y-74816D01*
X152959Y-74821D01*
X152889Y-74850D01*
X152879Y-74861D01*
X152868Y-74850D01*
X152798Y-74821D01*
X152793Y-74816D01*
X152786Y-74816D01*
X152775Y-74816D01*
X152768Y-74816D01*
X152763Y-74821D01*
X152692Y-74850D01*
X152682Y-74861D01*
X152672Y-74850D01*
X152601Y-74821D01*
X152596Y-74816D01*
X152589Y-74816D01*
X152578Y-74816D01*
X152571Y-74816D01*
X152566Y-74821D01*
X152495Y-74850D01*
X152485Y-74861D01*
X152475Y-74850D01*
X152404Y-74821D01*
X152399Y-74816D01*
X152392Y-74816D01*
X152381Y-74816D01*
X152374Y-74816D01*
X152369Y-74821D01*
X152299Y-74850D01*
X152288Y-74861D01*
X152278Y-74850D01*
X152208Y-74821D01*
X152202Y-74816D01*
X152195Y-74816D01*
X152184Y-74816D01*
X152177Y-74816D01*
X152172Y-74821D01*
X152102Y-74850D01*
X152091Y-74861D01*
X152081Y-74850D01*
X152011Y-74821D01*
X152006Y-74816D01*
X151998Y-74816D01*
X151988Y-74816D01*
X151980Y-74816D01*
X151975Y-74821D01*
X151905Y-74850D01*
X151895Y-74861D01*
X151884Y-74850D01*
X151814Y-74821D01*
X151809Y-74816D01*
X151802Y-74816D01*
X151791Y-74816D01*
X151783Y-74816D01*
X151778Y-74821D01*
X151708Y-74850D01*
X151698Y-74861D01*
X151687Y-74850D01*
X151617Y-74821D01*
X151612Y-74816D01*
X151605Y-74816D01*
X151594Y-74816D01*
X151587Y-74816D01*
X151581Y-74821D01*
X151511Y-74850D01*
X151487Y-74875D01*
X151471Y-74875D01*
X151471Y-74872D01*
X151415Y-74816D01*
X151397Y-74816D01*
X151314Y-74850D01*
X151290Y-74875D01*
X151121Y-74875D01*
X151097Y-74850D01*
X151014Y-74816D01*
X150996Y-74816D01*
X150940Y-74872D01*
X150940Y-74875D01*
X150924Y-74875D01*
X150900Y-74850D01*
X150830Y-74821D01*
X150825Y-74816D01*
X150817Y-74816D01*
X150806Y-74816D01*
X150799Y-74816D01*
X150794Y-74821D01*
X150724Y-74850D01*
X150713Y-74861D01*
X150703Y-74850D01*
X150633Y-74821D01*
X150628Y-74816D01*
X150620Y-74816D01*
X150610Y-74816D01*
X150602Y-74816D01*
X150597Y-74821D01*
X150527Y-74850D01*
X150503Y-74875D01*
X150487Y-74875D01*
X150487Y-74872D01*
X150476Y-74861D01*
X150495Y-74814D01*
X150495Y-74665D01*
X150438Y-74527D01*
X150435Y-74525D01*
X153288Y-74525D01*
X153265Y-74579D01*
X153265Y-74660D01*
X153295Y-74732D01*
X153295Y-74875D01*
G54D10*
G36*
X157965Y-77920D02*
X156215Y-79670D01*
X154088Y-81797D01*
X154088Y-81797D01*
X153128Y-82757D01*
X153096Y-82804D01*
X153095Y-82809D01*
X153085Y-82819D01*
X153085Y-86640D01*
X148120Y-91605D01*
X67509Y-91605D01*
X67499Y-91615D01*
X67499Y-91615D01*
X67494Y-91616D01*
X67447Y-91647D01*
X65790Y-93305D01*
X37599Y-93305D01*
X37604Y-93290D01*
X37605Y-93209D01*
X37573Y-93134D01*
X37516Y-93076D01*
X37464Y-93054D01*
X37515Y-93033D01*
X37573Y-92976D01*
X37604Y-92900D01*
X37605Y-92819D01*
X37573Y-92744D01*
X37516Y-92686D01*
X37440Y-92655D01*
X37359Y-92654D01*
X37284Y-92686D01*
X37226Y-92743D01*
X37195Y-92819D01*
X37194Y-92900D01*
X37226Y-92975D01*
X37283Y-93033D01*
X37335Y-93055D01*
X37284Y-93076D01*
X37226Y-93133D01*
X37195Y-93209D01*
X37194Y-93290D01*
X37200Y-93305D01*
X37085Y-93305D01*
X37085Y-91325D01*
X37286Y-91325D01*
X37284Y-91326D01*
X37226Y-91383D01*
X37195Y-91459D01*
X37194Y-91540D01*
X37226Y-91615D01*
X37283Y-91673D01*
X37335Y-91695D01*
X37284Y-91716D01*
X37226Y-91773D01*
X37195Y-91849D01*
X37194Y-91930D01*
X37226Y-92005D01*
X37283Y-92063D01*
X37359Y-92094D01*
X37440Y-92095D01*
X37515Y-92063D01*
X37573Y-92006D01*
X37604Y-91930D01*
X37605Y-91849D01*
X37573Y-91774D01*
X37516Y-91716D01*
X37464Y-91694D01*
X37515Y-91673D01*
X37573Y-91616D01*
X37604Y-91540D01*
X37605Y-91459D01*
X37573Y-91384D01*
X37516Y-91326D01*
X37513Y-91325D01*
X63710Y-91325D01*
X64630Y-90405D01*
X147480Y-90405D01*
X151695Y-86190D01*
X151675Y-82070D01*
X156070Y-77675D01*
X155840Y-77675D01*
X151525Y-81989D01*
X151525Y-86129D01*
X147420Y-90235D01*
X64549Y-90235D01*
X63629Y-91155D01*
X37605Y-91155D01*
X37605Y-90479D01*
X37573Y-90404D01*
X37516Y-90346D01*
X37464Y-90324D01*
X37515Y-90303D01*
X37573Y-90246D01*
X37604Y-90170D01*
X37605Y-90089D01*
X37573Y-90014D01*
X37516Y-89956D01*
X37452Y-89929D01*
X37515Y-89903D01*
X37573Y-89846D01*
X37604Y-89770D01*
X37605Y-89689D01*
X37573Y-89614D01*
X37516Y-89556D01*
X37464Y-89534D01*
X37515Y-89513D01*
X37573Y-89456D01*
X37604Y-89380D01*
X37605Y-89299D01*
X37573Y-89224D01*
X37516Y-89166D01*
X37452Y-89139D01*
X37515Y-89113D01*
X37573Y-89056D01*
X37604Y-88980D01*
X37605Y-88899D01*
X37573Y-88824D01*
X37516Y-88766D01*
X37440Y-88735D01*
X37440Y-88735D01*
X37515Y-88703D01*
X37573Y-88646D01*
X37604Y-88570D01*
X37605Y-88489D01*
X37573Y-88414D01*
X37516Y-88356D01*
X37476Y-88339D01*
X37515Y-88323D01*
X37573Y-88266D01*
X37604Y-88190D01*
X37605Y-88109D01*
X37573Y-88034D01*
X37516Y-87976D01*
X37464Y-87954D01*
X37515Y-87933D01*
X37573Y-87876D01*
X37604Y-87800D01*
X37605Y-87719D01*
X37573Y-87644D01*
X37516Y-87586D01*
X37440Y-87555D01*
X37359Y-87554D01*
X37284Y-87586D01*
X37226Y-87643D01*
X37195Y-87719D01*
X37194Y-87800D01*
X37226Y-87875D01*
X37283Y-87933D01*
X37335Y-87955D01*
X37284Y-87976D01*
X37226Y-88033D01*
X37195Y-88109D01*
X37194Y-88190D01*
X37226Y-88265D01*
X37283Y-88323D01*
X37323Y-88340D01*
X37284Y-88356D01*
X37226Y-88413D01*
X37195Y-88489D01*
X37194Y-88570D01*
X37226Y-88645D01*
X37283Y-88703D01*
X37359Y-88734D01*
X37440Y-88735D01*
X37359Y-88734D01*
X37284Y-88766D01*
X37226Y-88823D01*
X37195Y-88899D01*
X37194Y-88980D01*
X37226Y-89055D01*
X37283Y-89113D01*
X37347Y-89140D01*
X37284Y-89166D01*
X37226Y-89223D01*
X37195Y-89299D01*
X37194Y-89380D01*
X37226Y-89455D01*
X37283Y-89513D01*
X37335Y-89535D01*
X37284Y-89556D01*
X37226Y-89613D01*
X37195Y-89689D01*
X37194Y-89770D01*
X37226Y-89845D01*
X37283Y-89903D01*
X37347Y-89930D01*
X37284Y-89956D01*
X37226Y-90013D01*
X37195Y-90089D01*
X37194Y-90170D01*
X37226Y-90245D01*
X37283Y-90303D01*
X37335Y-90325D01*
X37284Y-90346D01*
X37226Y-90403D01*
X37195Y-90479D01*
X37194Y-90560D01*
X37226Y-90635D01*
X37283Y-90693D01*
X37359Y-90724D01*
X37440Y-90725D01*
X37515Y-90693D01*
X37573Y-90636D01*
X37604Y-90560D01*
X37605Y-90479D01*
X37605Y-91155D01*
X37085Y-91155D01*
X37085Y-87145D01*
X63509Y-87145D01*
X64829Y-88465D01*
X146500Y-88465D01*
X149755Y-85210D01*
X149755Y-80250D01*
X152330Y-77675D01*
X152100Y-77675D01*
X149585Y-80189D01*
X149585Y-85109D01*
X146420Y-88295D01*
X64890Y-88295D01*
X63580Y-86975D01*
X37605Y-86975D01*
X37605Y-86139D01*
X37573Y-86064D01*
X37516Y-86006D01*
X37464Y-85984D01*
X37515Y-85963D01*
X37573Y-85906D01*
X37604Y-85830D01*
X37605Y-85749D01*
X37573Y-85674D01*
X37516Y-85616D01*
X37452Y-85589D01*
X37515Y-85563D01*
X37573Y-85506D01*
X37604Y-85430D01*
X37605Y-85349D01*
X37573Y-85274D01*
X37516Y-85216D01*
X37464Y-85194D01*
X37515Y-85173D01*
X37573Y-85116D01*
X37604Y-85040D01*
X37605Y-84959D01*
X37573Y-84884D01*
X37516Y-84826D01*
X37452Y-84799D01*
X37515Y-84773D01*
X37573Y-84716D01*
X37604Y-84640D01*
X37605Y-84559D01*
X37573Y-84484D01*
X37516Y-84426D01*
X37464Y-84404D01*
X37515Y-84383D01*
X37573Y-84326D01*
X37604Y-84250D01*
X37605Y-84169D01*
X37573Y-84094D01*
X37516Y-84036D01*
X37452Y-84009D01*
X37515Y-83983D01*
X37573Y-83926D01*
X37604Y-83850D01*
X37605Y-83769D01*
X37573Y-83694D01*
X37516Y-83636D01*
X37464Y-83614D01*
X37515Y-83593D01*
X37573Y-83536D01*
X37604Y-83460D01*
X37605Y-83379D01*
X37573Y-83304D01*
X37516Y-83246D01*
X37440Y-83215D01*
X37359Y-83214D01*
X37284Y-83246D01*
X37226Y-83303D01*
X37195Y-83379D01*
X37194Y-83460D01*
X37226Y-83535D01*
X37283Y-83593D01*
X37335Y-83615D01*
X37284Y-83636D01*
X37226Y-83693D01*
X37195Y-83769D01*
X37194Y-83850D01*
X37226Y-83925D01*
X37283Y-83983D01*
X37347Y-84010D01*
X37284Y-84036D01*
X37226Y-84093D01*
X37195Y-84169D01*
X37194Y-84250D01*
X37226Y-84325D01*
X37283Y-84383D01*
X37335Y-84405D01*
X37284Y-84426D01*
X37226Y-84483D01*
X37195Y-84559D01*
X37194Y-84640D01*
X37226Y-84715D01*
X37283Y-84773D01*
X37347Y-84800D01*
X37284Y-84826D01*
X37226Y-84883D01*
X37195Y-84959D01*
X37194Y-85040D01*
X37226Y-85115D01*
X37283Y-85173D01*
X37335Y-85195D01*
X37284Y-85216D01*
X37226Y-85273D01*
X37195Y-85349D01*
X37194Y-85430D01*
X37226Y-85505D01*
X37283Y-85563D01*
X37347Y-85590D01*
X37284Y-85616D01*
X37226Y-85673D01*
X37195Y-85749D01*
X37194Y-85830D01*
X37226Y-85905D01*
X37283Y-85963D01*
X37335Y-85985D01*
X37284Y-86006D01*
X37226Y-86063D01*
X37195Y-86139D01*
X37194Y-86220D01*
X37226Y-86295D01*
X37283Y-86353D01*
X37359Y-86384D01*
X37440Y-86385D01*
X37515Y-86353D01*
X37573Y-86296D01*
X37604Y-86220D01*
X37605Y-86139D01*
X37605Y-86975D01*
X37085Y-86975D01*
X37085Y-83075D01*
X37550Y-83075D01*
X37700Y-82925D01*
X64274Y-82925D01*
X67874Y-86525D01*
X68900Y-86525D01*
X145400Y-86525D01*
X147815Y-84110D01*
X147815Y-77675D01*
X146415Y-77675D01*
X146415Y-74525D01*
X148625Y-74525D01*
X148622Y-74527D01*
X148565Y-74665D01*
X148565Y-74814D01*
X148586Y-74864D01*
X148586Y-74864D01*
X148585Y-74865D01*
X148585Y-74865D01*
X148578Y-74872D01*
X148578Y-74875D01*
X148562Y-74875D01*
X148538Y-74850D01*
X148467Y-74821D01*
X148462Y-74816D01*
X148455Y-74816D01*
X148444Y-74816D01*
X148437Y-74816D01*
X148432Y-74821D01*
X148362Y-74850D01*
X148338Y-74875D01*
X148322Y-74875D01*
X148322Y-74872D01*
X148265Y-74816D01*
X148247Y-74816D01*
X148165Y-74850D01*
X148101Y-74914D01*
X148067Y-74996D01*
X148067Y-75086D01*
X148067Y-75205D01*
X148123Y-75262D01*
X148165Y-75262D01*
X148165Y-75412D01*
X148123Y-75412D01*
X148067Y-75468D01*
X148067Y-75587D01*
X148067Y-75677D01*
X148101Y-75759D01*
X148165Y-75823D01*
X148165Y-75823D01*
X148165Y-75825D01*
X148169Y-75825D01*
X148247Y-75857D01*
X148265Y-75857D01*
X148298Y-75825D01*
X148366Y-75825D01*
X148432Y-75852D01*
X148437Y-75857D01*
X148444Y-75857D01*
X148455Y-75857D01*
X148462Y-75857D01*
X148467Y-75852D01*
X148533Y-75825D01*
X148602Y-75825D01*
X148634Y-75857D01*
X148652Y-75857D01*
X148730Y-75825D01*
X149154Y-75825D01*
X149232Y-75857D01*
X149250Y-75857D01*
X149282Y-75825D01*
X149351Y-75825D01*
X149416Y-75852D01*
X149421Y-75857D01*
X149429Y-75857D01*
X149439Y-75857D01*
X149447Y-75857D01*
X149452Y-75852D01*
X149517Y-75825D01*
X149547Y-75825D01*
X149613Y-75852D01*
X149618Y-75857D01*
X149625Y-75857D01*
X149636Y-75857D01*
X149643Y-75857D01*
X149649Y-75852D01*
X149714Y-75825D01*
X149783Y-75825D01*
X149815Y-75857D01*
X149833Y-75857D01*
X149911Y-75825D01*
X150335Y-75825D01*
X150413Y-75857D01*
X150431Y-75857D01*
X150463Y-75825D01*
X150532Y-75825D01*
X150597Y-75852D01*
X150602Y-75857D01*
X150610Y-75857D01*
X150620Y-75857D01*
X150628Y-75857D01*
X150633Y-75852D01*
X150698Y-75825D01*
X150729Y-75825D01*
X150794Y-75852D01*
X150799Y-75857D01*
X150806Y-75857D01*
X150817Y-75857D01*
X150825Y-75857D01*
X150830Y-75852D01*
X150835Y-75849D01*
X150835Y-75857D01*
X150843Y-75857D01*
X150815Y-75925D01*
X150815Y-76074D01*
X150872Y-76212D01*
X150977Y-76317D01*
X151111Y-76373D01*
X151023Y-76373D01*
X151019Y-76375D01*
X150998Y-76375D01*
X150994Y-76373D01*
X150944Y-76373D01*
X150826Y-76373D01*
X150823Y-76375D01*
X150801Y-76375D01*
X150797Y-76373D01*
X150748Y-76373D01*
X150630Y-76373D01*
X150626Y-76375D01*
X150604Y-76375D01*
X150601Y-76373D01*
X150551Y-76373D01*
X150433Y-76373D01*
X150429Y-76375D01*
X150407Y-76375D01*
X150404Y-76373D01*
X150354Y-76373D01*
X150236Y-76373D01*
X150232Y-76375D01*
X150211Y-76375D01*
X150207Y-76373D01*
X150157Y-76373D01*
X150039Y-76373D01*
X150035Y-76375D01*
X150014Y-76375D01*
X150010Y-76373D01*
X149960Y-76373D01*
X149842Y-76373D01*
X149838Y-76375D01*
X149817Y-76375D01*
X149813Y-76373D01*
X149763Y-76373D01*
X149645Y-76373D01*
X149641Y-76375D01*
X149620Y-76375D01*
X149616Y-76373D01*
X149567Y-76373D01*
X149448Y-76373D01*
X149445Y-76375D01*
X149423Y-76375D01*
X149419Y-76373D01*
X149370Y-76373D01*
X149252Y-76373D01*
X149248Y-76375D01*
X149226Y-76375D01*
X149223Y-76373D01*
X149173Y-76373D01*
X149055Y-76373D01*
X149051Y-76375D01*
X149030Y-76375D01*
X149026Y-76373D01*
X148976Y-76373D01*
X148858Y-76373D01*
X148854Y-76375D01*
X148833Y-76375D01*
X148829Y-76373D01*
X148799Y-76373D01*
X148798Y-76370D01*
X148735Y-76307D01*
X148652Y-76273D01*
X148634Y-76273D01*
X148578Y-76329D01*
X148578Y-76347D01*
X148538Y-76307D01*
X148467Y-76278D01*
X148462Y-76273D01*
X148455Y-76273D01*
X148444Y-76273D01*
X148437Y-76273D01*
X148432Y-76278D01*
X148362Y-76307D01*
X148322Y-76347D01*
X148322Y-76329D01*
X148265Y-76273D01*
X148251Y-76273D01*
X148207Y-76167D01*
X148092Y-76052D01*
X147941Y-75989D01*
X147778Y-75989D01*
X147627Y-76051D01*
X147511Y-76167D01*
X147449Y-76318D01*
X147449Y-76481D01*
X147511Y-76632D01*
X147626Y-76747D01*
X147777Y-76810D01*
X147940Y-76810D01*
X148091Y-76748D01*
X148122Y-76717D01*
X148123Y-76718D01*
X148165Y-76718D01*
X148165Y-76868D01*
X148123Y-76868D01*
X148067Y-76924D01*
X148067Y-77044D01*
X148067Y-77133D01*
X148101Y-77216D01*
X148165Y-77279D01*
X148247Y-77313D01*
X148265Y-77313D01*
X148322Y-77257D01*
X148322Y-77239D01*
X148362Y-77279D01*
X148432Y-77308D01*
X148437Y-77313D01*
X148444Y-77313D01*
X148455Y-77313D01*
X148462Y-77313D01*
X148467Y-77308D01*
X148473Y-77306D01*
X148473Y-77313D01*
X148545Y-77313D01*
X148545Y-77380D01*
X148576Y-77455D01*
X148634Y-77513D01*
X148709Y-77544D01*
X148727Y-77544D01*
X148756Y-77615D01*
X148814Y-77673D01*
X148889Y-77704D01*
X148971Y-77705D01*
X149046Y-77673D01*
X149104Y-77616D01*
X149133Y-77546D01*
X149161Y-77615D01*
X149219Y-77673D01*
X149294Y-77704D01*
X149376Y-77705D01*
X149451Y-77673D01*
X149509Y-77616D01*
X149533Y-77558D01*
X149556Y-77615D01*
X149614Y-77673D01*
X149689Y-77704D01*
X149771Y-77705D01*
X149846Y-77673D01*
X149904Y-77616D01*
X149925Y-77564D01*
X149946Y-77615D01*
X150004Y-77673D01*
X150079Y-77704D01*
X150161Y-77705D01*
X150236Y-77673D01*
X150294Y-77616D01*
X150318Y-77558D01*
X150341Y-77615D01*
X150399Y-77673D01*
X150474Y-77704D01*
X150556Y-77705D01*
X150631Y-77673D01*
X150689Y-77616D01*
X150713Y-77558D01*
X150737Y-77615D01*
X150794Y-77673D01*
X150870Y-77704D01*
X150951Y-77704D01*
X151026Y-77673D01*
X151084Y-77615D01*
X151108Y-77559D01*
X151131Y-77615D01*
X151189Y-77673D01*
X151264Y-77704D01*
X151346Y-77705D01*
X151421Y-77673D01*
X151479Y-77616D01*
X151503Y-77558D01*
X151526Y-77615D01*
X151584Y-77673D01*
X151659Y-77704D01*
X151741Y-77705D01*
X151816Y-77673D01*
X151874Y-77616D01*
X151905Y-77540D01*
X151905Y-77459D01*
X151874Y-77384D01*
X151838Y-77347D01*
X151838Y-77284D01*
X151865Y-77257D01*
X151865Y-77239D01*
X151905Y-77279D01*
X151975Y-77308D01*
X151980Y-77313D01*
X151988Y-77313D01*
X151998Y-77313D01*
X152006Y-77313D01*
X152011Y-77308D01*
X152081Y-77279D01*
X152091Y-77269D01*
X152102Y-77279D01*
X152172Y-77308D01*
X152177Y-77313D01*
X152184Y-77313D01*
X152195Y-77313D01*
X152202Y-77313D01*
X152208Y-77308D01*
X152278Y-77279D01*
X152288Y-77269D01*
X152299Y-77279D01*
X152369Y-77308D01*
X152374Y-77313D01*
X152381Y-77313D01*
X152392Y-77313D01*
X152399Y-77313D01*
X152404Y-77308D01*
X152410Y-77306D01*
X152410Y-77313D01*
X152465Y-77313D01*
X152465Y-77380D01*
X152496Y-77455D01*
X152554Y-77513D01*
X152629Y-77544D01*
X152677Y-77545D01*
X152706Y-77615D01*
X152764Y-77673D01*
X152839Y-77704D01*
X152921Y-77705D01*
X152996Y-77673D01*
X153054Y-77616D01*
X153078Y-77558D01*
X153101Y-77615D01*
X153159Y-77673D01*
X153234Y-77704D01*
X153316Y-77705D01*
X153391Y-77673D01*
X153449Y-77616D01*
X153470Y-77564D01*
X153491Y-77615D01*
X153549Y-77673D01*
X153624Y-77704D01*
X153706Y-77705D01*
X153781Y-77673D01*
X153839Y-77616D01*
X153863Y-77558D01*
X153886Y-77615D01*
X153944Y-77673D01*
X154019Y-77704D01*
X154101Y-77705D01*
X154176Y-77673D01*
X154234Y-77616D01*
X154258Y-77558D01*
X154281Y-77615D01*
X154339Y-77673D01*
X154414Y-77704D01*
X154496Y-77705D01*
X154571Y-77673D01*
X154629Y-77616D01*
X154650Y-77564D01*
X154671Y-77615D01*
X154729Y-77673D01*
X154804Y-77704D01*
X154886Y-77705D01*
X154961Y-77673D01*
X155019Y-77616D01*
X155043Y-77558D01*
X155066Y-77615D01*
X155124Y-77673D01*
X155199Y-77704D01*
X155281Y-77705D01*
X155356Y-77673D01*
X155414Y-77616D01*
X155435Y-77564D01*
X155456Y-77615D01*
X155514Y-77673D01*
X155589Y-77704D01*
X155671Y-77705D01*
X155746Y-77673D01*
X155804Y-77616D01*
X155835Y-77540D01*
X155835Y-77459D01*
X155804Y-77384D01*
X155775Y-77354D01*
X155775Y-77284D01*
X155802Y-77257D01*
X155802Y-77239D01*
X155842Y-77279D01*
X155912Y-77308D01*
X155917Y-77313D01*
X155925Y-77313D01*
X155935Y-77313D01*
X155943Y-77313D01*
X155948Y-77308D01*
X156018Y-77279D01*
X156058Y-77239D01*
X156058Y-77257D01*
X156114Y-77313D01*
X156132Y-77313D01*
X156215Y-77279D01*
X156215Y-77279D01*
X156278Y-77216D01*
X156312Y-77133D01*
X156312Y-77044D01*
X156312Y-76924D01*
X156256Y-76868D01*
X156215Y-76868D01*
X156215Y-76718D01*
X156256Y-76718D01*
X156257Y-76717D01*
X156288Y-76747D01*
X156439Y-76810D01*
X156602Y-76810D01*
X156753Y-76748D01*
X156868Y-76632D01*
X156931Y-76481D01*
X156931Y-76318D01*
X156869Y-76167D01*
X156753Y-76052D01*
X156603Y-75989D01*
X156439Y-75989D01*
X156288Y-76051D01*
X156215Y-76125D01*
X156173Y-76167D01*
X156129Y-76273D01*
X156114Y-76273D01*
X156058Y-76329D01*
X156058Y-76347D01*
X156018Y-76307D01*
X155948Y-76278D01*
X155943Y-76273D01*
X155935Y-76273D01*
X155925Y-76273D01*
X155917Y-76273D01*
X155912Y-76278D01*
X155842Y-76307D01*
X155802Y-76347D01*
X155802Y-76329D01*
X155746Y-76273D01*
X155728Y-76273D01*
X155645Y-76307D01*
X155582Y-76370D01*
X155581Y-76373D01*
X155551Y-76373D01*
X155547Y-76375D01*
X155526Y-76375D01*
X155522Y-76373D01*
X155472Y-76373D01*
X155354Y-76373D01*
X155350Y-76375D01*
X155329Y-76375D01*
X155325Y-76373D01*
X155275Y-76373D01*
X155157Y-76373D01*
X155153Y-76375D01*
X155132Y-76375D01*
X155128Y-76373D01*
X155078Y-76373D01*
X154960Y-76373D01*
X154956Y-76375D01*
X154935Y-76375D01*
X154931Y-76373D01*
X154881Y-76373D01*
X154763Y-76373D01*
X154760Y-76375D01*
X154738Y-76375D01*
X154734Y-76373D01*
X154685Y-76373D01*
X154567Y-76373D01*
X154563Y-76375D01*
X154541Y-76375D01*
X154538Y-76373D01*
X154488Y-76373D01*
X154370Y-76373D01*
X154366Y-76375D01*
X154344Y-76375D01*
X154341Y-76373D01*
X154291Y-76373D01*
X154173Y-76373D01*
X154169Y-76375D01*
X154148Y-76375D01*
X154144Y-76373D01*
X154094Y-76373D01*
X153976Y-76373D01*
X153972Y-76375D01*
X153951Y-76375D01*
X153947Y-76373D01*
X153897Y-76373D01*
X153779Y-76373D01*
X153775Y-76375D01*
X153754Y-76375D01*
X153750Y-76373D01*
X153700Y-76373D01*
X153582Y-76373D01*
X153578Y-76375D01*
X153557Y-76375D01*
X153553Y-76373D01*
X153504Y-76373D01*
X153385Y-76373D01*
X153382Y-76375D01*
X153360Y-76375D01*
X153356Y-76373D01*
X153307Y-76373D01*
X153189Y-76373D01*
X153185Y-76375D01*
X153163Y-76375D01*
X153160Y-76373D01*
X153110Y-76373D01*
X152992Y-76373D01*
X152988Y-76375D01*
X152967Y-76375D01*
X152963Y-76373D01*
X152913Y-76373D01*
X152795Y-76373D01*
X152791Y-76375D01*
X152770Y-76375D01*
X152766Y-76373D01*
X152736Y-76373D01*
X152735Y-76370D01*
X152672Y-76307D01*
X152589Y-76273D01*
X152571Y-76273D01*
X152515Y-76329D01*
X152515Y-76347D01*
X152475Y-76307D01*
X152404Y-76278D01*
X152399Y-76273D01*
X152392Y-76273D01*
X152381Y-76273D01*
X152374Y-76273D01*
X152369Y-76278D01*
X152299Y-76307D01*
X152288Y-76318D01*
X152278Y-76307D01*
X152208Y-76278D01*
X152202Y-76273D01*
X152195Y-76273D01*
X152184Y-76273D01*
X152177Y-76273D01*
X152172Y-76278D01*
X152102Y-76307D01*
X152091Y-76318D01*
X152081Y-76307D01*
X152011Y-76278D01*
X152006Y-76273D01*
X151998Y-76273D01*
X151988Y-76273D01*
X151980Y-76273D01*
X151975Y-76278D01*
X151905Y-76307D01*
X151865Y-76347D01*
X151865Y-76329D01*
X151809Y-76273D01*
X151791Y-76273D01*
X151708Y-76307D01*
X151645Y-76370D01*
X151644Y-76373D01*
X151614Y-76373D01*
X151610Y-76375D01*
X151589Y-76375D01*
X151585Y-76373D01*
X151535Y-76373D01*
X151417Y-76373D01*
X151413Y-76375D01*
X151392Y-76375D01*
X151388Y-76373D01*
X151338Y-76373D01*
X151268Y-76373D01*
X151402Y-76318D01*
X151508Y-76212D01*
X151565Y-76074D01*
X151565Y-75925D01*
X151537Y-75857D01*
X151576Y-75857D01*
X151576Y-75849D01*
X151581Y-75852D01*
X151587Y-75857D01*
X151594Y-75857D01*
X151605Y-75857D01*
X151612Y-75857D01*
X151617Y-75852D01*
X151683Y-75825D01*
X151713Y-75825D01*
X151778Y-75852D01*
X151783Y-75857D01*
X151791Y-75857D01*
X151802Y-75857D01*
X151809Y-75857D01*
X151814Y-75852D01*
X151879Y-75825D01*
X151910Y-75825D01*
X151975Y-75852D01*
X151980Y-75857D01*
X151988Y-75857D01*
X151998Y-75857D01*
X152006Y-75857D01*
X152011Y-75852D01*
X152076Y-75825D01*
X152106Y-75825D01*
X152172Y-75852D01*
X152177Y-75857D01*
X152184Y-75857D01*
X152195Y-75857D01*
X152202Y-75857D01*
X152208Y-75852D01*
X152273Y-75825D01*
X152303Y-75825D01*
X152369Y-75852D01*
X152374Y-75857D01*
X152381Y-75857D01*
X152392Y-75857D01*
X152399Y-75857D01*
X152404Y-75852D01*
X152470Y-75825D01*
X152500Y-75825D01*
X152566Y-75852D01*
X152571Y-75857D01*
X152578Y-75857D01*
X152589Y-75857D01*
X152596Y-75857D01*
X152601Y-75852D01*
X152667Y-75825D01*
X152697Y-75825D01*
X152763Y-75852D01*
X152768Y-75857D01*
X152775Y-75857D01*
X152786Y-75857D01*
X152793Y-75857D01*
X152798Y-75852D01*
X152864Y-75825D01*
X152894Y-75825D01*
X152959Y-75852D01*
X152965Y-75857D01*
X152972Y-75857D01*
X152983Y-75857D01*
X152990Y-75857D01*
X152995Y-75852D01*
X153061Y-75825D01*
X153091Y-75825D01*
X153156Y-75852D01*
X153161Y-75857D01*
X153169Y-75857D01*
X153179Y-75857D01*
X153187Y-75857D01*
X153192Y-75852D01*
X153257Y-75825D01*
X153326Y-75825D01*
X153358Y-75857D01*
X153376Y-75857D01*
X153454Y-75825D01*
X154075Y-75825D01*
X154153Y-75857D01*
X154171Y-75857D01*
X154203Y-75825D01*
X154295Y-75825D01*
X154276Y-75843D01*
X154245Y-75919D01*
X154245Y-76000D01*
X154276Y-76075D01*
X154334Y-76133D01*
X154409Y-76164D01*
X154491Y-76165D01*
X154566Y-76133D01*
X154624Y-76076D01*
X154650Y-76012D01*
X154676Y-76075D01*
X154734Y-76133D01*
X154809Y-76164D01*
X154891Y-76165D01*
X154966Y-76133D01*
X155024Y-76076D01*
X155053Y-76005D01*
X155086Y-76005D01*
X155161Y-75973D01*
X155185Y-75949D01*
X155189Y-75957D01*
X155252Y-76020D01*
X155335Y-76054D01*
X155424Y-76055D01*
X155507Y-76020D01*
X155570Y-75957D01*
X155604Y-75874D01*
X155604Y-75831D01*
X155620Y-75825D01*
X155650Y-75825D01*
X155715Y-75852D01*
X155720Y-75857D01*
X155728Y-75857D01*
X155739Y-75857D01*
X155746Y-75857D01*
X155751Y-75852D01*
X155816Y-75825D01*
X155847Y-75825D01*
X155912Y-75852D01*
X155917Y-75857D01*
X155925Y-75857D01*
X155935Y-75857D01*
X155943Y-75857D01*
X155948Y-75852D01*
X156013Y-75825D01*
X156082Y-75825D01*
X156114Y-75857D01*
X156132Y-75857D01*
X156210Y-75825D01*
X156215Y-75825D01*
X156215Y-75822D01*
X156278Y-75759D01*
X156312Y-75677D01*
X156312Y-75587D01*
X156312Y-75468D01*
X156256Y-75412D01*
X156215Y-75412D01*
X156215Y-75262D01*
X156256Y-75262D01*
X156312Y-75205D01*
X156312Y-75086D01*
X156312Y-74996D01*
X156278Y-74914D01*
X156215Y-74850D01*
X156132Y-74816D01*
X156114Y-74816D01*
X156058Y-74872D01*
X156058Y-74875D01*
X156042Y-74875D01*
X156018Y-74850D01*
X155948Y-74821D01*
X155943Y-74816D01*
X155935Y-74816D01*
X155925Y-74816D01*
X155917Y-74816D01*
X155912Y-74821D01*
X155842Y-74850D01*
X155832Y-74861D01*
X155821Y-74850D01*
X155751Y-74821D01*
X155746Y-74816D01*
X155739Y-74816D01*
X155728Y-74816D01*
X155720Y-74816D01*
X155715Y-74821D01*
X155645Y-74850D01*
X155635Y-74861D01*
X155624Y-74850D01*
X155554Y-74821D01*
X155549Y-74816D01*
X155542Y-74816D01*
X155531Y-74816D01*
X155524Y-74816D01*
X155518Y-74821D01*
X155448Y-74850D01*
X155424Y-74875D01*
X155408Y-74875D01*
X155408Y-74872D01*
X155352Y-74816D01*
X155334Y-74816D01*
X155251Y-74850D01*
X155227Y-74875D01*
X154467Y-74875D01*
X154443Y-74850D01*
X154361Y-74816D01*
X154343Y-74816D01*
X154332Y-74827D01*
X154332Y-74816D01*
X154266Y-74816D01*
X154244Y-74764D01*
X154186Y-74706D01*
X154111Y-74675D01*
X154075Y-74675D01*
X154075Y-74639D01*
X154044Y-74564D01*
X154005Y-74525D01*
X157965Y-74525D01*
X157965Y-77920D01*
X157965Y-77920D01*
G37*
G54D22*
X157965Y-77920D02*
X156215Y-79670D01*
X154088Y-81797D01*
X154088Y-81797D01*
X153128Y-82757D01*
X153096Y-82804D01*
X153095Y-82809D01*
X153085Y-82819D01*
X153085Y-86640D01*
X148120Y-91605D01*
X67509Y-91605D01*
X67499Y-91615D01*
X67499Y-91615D01*
X67494Y-91616D01*
X67447Y-91647D01*
X65790Y-93305D01*
X37599Y-93305D01*
X37604Y-93290D01*
X37605Y-93209D01*
X37573Y-93134D01*
X37516Y-93076D01*
X37464Y-93054D01*
X37515Y-93033D01*
X37573Y-92976D01*
X37604Y-92900D01*
X37605Y-92819D01*
X37573Y-92744D01*
X37516Y-92686D01*
X37440Y-92655D01*
X37359Y-92654D01*
X37284Y-92686D01*
X37226Y-92743D01*
X37195Y-92819D01*
X37194Y-92900D01*
X37226Y-92975D01*
X37283Y-93033D01*
X37335Y-93055D01*
X37284Y-93076D01*
X37226Y-93133D01*
X37195Y-93209D01*
X37194Y-93290D01*
X37200Y-93305D01*
X37085Y-93305D01*
X37085Y-91325D01*
X37286Y-91325D01*
X37284Y-91326D01*
X37226Y-91383D01*
X37195Y-91459D01*
X37194Y-91540D01*
X37226Y-91615D01*
X37283Y-91673D01*
X37335Y-91695D01*
X37284Y-91716D01*
X37226Y-91773D01*
X37195Y-91849D01*
X37194Y-91930D01*
X37226Y-92005D01*
X37283Y-92063D01*
X37359Y-92094D01*
X37440Y-92095D01*
X37515Y-92063D01*
X37573Y-92006D01*
X37604Y-91930D01*
X37605Y-91849D01*
X37573Y-91774D01*
X37516Y-91716D01*
X37464Y-91694D01*
X37515Y-91673D01*
X37573Y-91616D01*
X37604Y-91540D01*
X37605Y-91459D01*
X37573Y-91384D01*
X37516Y-91326D01*
X37513Y-91325D01*
X63710Y-91325D01*
X64630Y-90405D01*
X147480Y-90405D01*
X151695Y-86190D01*
X151675Y-82070D01*
X156070Y-77675D01*
X155840Y-77675D01*
X151525Y-81989D01*
X151525Y-86129D01*
X147420Y-90235D01*
X64549Y-90235D01*
X63629Y-91155D01*
X37605Y-91155D01*
X37605Y-90479D01*
X37573Y-90404D01*
X37516Y-90346D01*
X37464Y-90324D01*
X37515Y-90303D01*
X37573Y-90246D01*
X37604Y-90170D01*
X37605Y-90089D01*
X37573Y-90014D01*
X37516Y-89956D01*
X37452Y-89929D01*
X37515Y-89903D01*
X37573Y-89846D01*
X37604Y-89770D01*
X37605Y-89689D01*
X37573Y-89614D01*
X37516Y-89556D01*
X37464Y-89534D01*
X37515Y-89513D01*
X37573Y-89456D01*
X37604Y-89380D01*
X37605Y-89299D01*
X37573Y-89224D01*
X37516Y-89166D01*
X37452Y-89139D01*
X37515Y-89113D01*
X37573Y-89056D01*
X37604Y-88980D01*
X37605Y-88899D01*
X37573Y-88824D01*
X37516Y-88766D01*
X37440Y-88735D01*
X37440Y-88735D01*
X37515Y-88703D01*
X37573Y-88646D01*
X37604Y-88570D01*
X37605Y-88489D01*
X37573Y-88414D01*
X37516Y-88356D01*
X37476Y-88339D01*
X37515Y-88323D01*
X37573Y-88266D01*
X37604Y-88190D01*
X37605Y-88109D01*
X37573Y-88034D01*
X37516Y-87976D01*
X37464Y-87954D01*
X37515Y-87933D01*
X37573Y-87876D01*
X37604Y-87800D01*
X37605Y-87719D01*
X37573Y-87644D01*
X37516Y-87586D01*
X37440Y-87555D01*
X37359Y-87554D01*
X37284Y-87586D01*
X37226Y-87643D01*
X37195Y-87719D01*
X37194Y-87800D01*
X37226Y-87875D01*
X37283Y-87933D01*
X37335Y-87955D01*
X37284Y-87976D01*
X37226Y-88033D01*
X37195Y-88109D01*
X37194Y-88190D01*
X37226Y-88265D01*
X37283Y-88323D01*
X37323Y-88340D01*
X37284Y-88356D01*
X37226Y-88413D01*
X37195Y-88489D01*
X37194Y-88570D01*
X37226Y-88645D01*
X37283Y-88703D01*
X37359Y-88734D01*
X37440Y-88735D01*
X37359Y-88734D01*
X37284Y-88766D01*
X37226Y-88823D01*
X37195Y-88899D01*
X37194Y-88980D01*
X37226Y-89055D01*
X37283Y-89113D01*
X37347Y-89140D01*
X37284Y-89166D01*
X37226Y-89223D01*
X37195Y-89299D01*
X37194Y-89380D01*
X37226Y-89455D01*
X37283Y-89513D01*
X37335Y-89535D01*
X37284Y-89556D01*
X37226Y-89613D01*
X37195Y-89689D01*
X37194Y-89770D01*
X37226Y-89845D01*
X37283Y-89903D01*
X37347Y-89930D01*
X37284Y-89956D01*
X37226Y-90013D01*
X37195Y-90089D01*
X37194Y-90170D01*
X37226Y-90245D01*
X37283Y-90303D01*
X37335Y-90325D01*
X37284Y-90346D01*
X37226Y-90403D01*
X37195Y-90479D01*
X37194Y-90560D01*
X37226Y-90635D01*
X37283Y-90693D01*
X37359Y-90724D01*
X37440Y-90725D01*
X37515Y-90693D01*
X37573Y-90636D01*
X37604Y-90560D01*
X37605Y-90479D01*
X37605Y-91155D01*
X37085Y-91155D01*
X37085Y-87145D01*
X63509Y-87145D01*
X64829Y-88465D01*
X146500Y-88465D01*
X149755Y-85210D01*
X149755Y-80250D01*
X152330Y-77675D01*
X152100Y-77675D01*
X149585Y-80189D01*
X149585Y-85109D01*
X146420Y-88295D01*
X64890Y-88295D01*
X63580Y-86975D01*
X37605Y-86975D01*
X37605Y-86139D01*
X37573Y-86064D01*
X37516Y-86006D01*
X37464Y-85984D01*
X37515Y-85963D01*
X37573Y-85906D01*
X37604Y-85830D01*
X37605Y-85749D01*
X37573Y-85674D01*
X37516Y-85616D01*
X37452Y-85589D01*
X37515Y-85563D01*
X37573Y-85506D01*
X37604Y-85430D01*
X37605Y-85349D01*
X37573Y-85274D01*
X37516Y-85216D01*
X37464Y-85194D01*
X37515Y-85173D01*
X37573Y-85116D01*
X37604Y-85040D01*
X37605Y-84959D01*
X37573Y-84884D01*
X37516Y-84826D01*
X37452Y-84799D01*
X37515Y-84773D01*
X37573Y-84716D01*
X37604Y-84640D01*
X37605Y-84559D01*
X37573Y-84484D01*
X37516Y-84426D01*
X37464Y-84404D01*
X37515Y-84383D01*
X37573Y-84326D01*
X37604Y-84250D01*
X37605Y-84169D01*
X37573Y-84094D01*
X37516Y-84036D01*
X37452Y-84009D01*
X37515Y-83983D01*
X37573Y-83926D01*
X37604Y-83850D01*
X37605Y-83769D01*
X37573Y-83694D01*
X37516Y-83636D01*
X37464Y-83614D01*
X37515Y-83593D01*
X37573Y-83536D01*
X37604Y-83460D01*
X37605Y-83379D01*
X37573Y-83304D01*
X37516Y-83246D01*
X37440Y-83215D01*
X37359Y-83214D01*
X37284Y-83246D01*
X37226Y-83303D01*
X37195Y-83379D01*
X37194Y-83460D01*
X37226Y-83535D01*
X37283Y-83593D01*
X37335Y-83615D01*
X37284Y-83636D01*
X37226Y-83693D01*
X37195Y-83769D01*
X37194Y-83850D01*
X37226Y-83925D01*
X37283Y-83983D01*
X37347Y-84010D01*
X37284Y-84036D01*
X37226Y-84093D01*
X37195Y-84169D01*
X37194Y-84250D01*
X37226Y-84325D01*
X37283Y-84383D01*
X37335Y-84405D01*
X37284Y-84426D01*
X37226Y-84483D01*
X37195Y-84559D01*
X37194Y-84640D01*
X37226Y-84715D01*
X37283Y-84773D01*
X37347Y-84800D01*
X37284Y-84826D01*
X37226Y-84883D01*
X37195Y-84959D01*
X37194Y-85040D01*
X37226Y-85115D01*
X37283Y-85173D01*
X37335Y-85195D01*
X37284Y-85216D01*
X37226Y-85273D01*
X37195Y-85349D01*
X37194Y-85430D01*
X37226Y-85505D01*
X37283Y-85563D01*
X37347Y-85590D01*
X37284Y-85616D01*
X37226Y-85673D01*
X37195Y-85749D01*
X37194Y-85830D01*
X37226Y-85905D01*
X37283Y-85963D01*
X37335Y-85985D01*
X37284Y-86006D01*
X37226Y-86063D01*
X37195Y-86139D01*
X37194Y-86220D01*
X37226Y-86295D01*
X37283Y-86353D01*
X37359Y-86384D01*
X37440Y-86385D01*
X37515Y-86353D01*
X37573Y-86296D01*
X37604Y-86220D01*
X37605Y-86139D01*
X37605Y-86975D01*
X37085Y-86975D01*
X37085Y-83075D01*
X37550Y-83075D01*
X37700Y-82925D01*
X64274Y-82925D01*
X67874Y-86525D01*
X68900Y-86525D01*
X145400Y-86525D01*
X147815Y-84110D01*
X147815Y-77675D01*
X146415Y-77675D01*
X146415Y-74525D01*
X148625Y-74525D01*
X148622Y-74527D01*
X148565Y-74665D01*
X148565Y-74814D01*
X148586Y-74864D01*
X148586Y-74864D01*
X148585Y-74865D01*
X148585Y-74865D01*
X148578Y-74872D01*
X148578Y-74875D01*
X148562Y-74875D01*
X148538Y-74850D01*
X148467Y-74821D01*
X148462Y-74816D01*
X148455Y-74816D01*
X148444Y-74816D01*
X148437Y-74816D01*
X148432Y-74821D01*
X148362Y-74850D01*
X148338Y-74875D01*
X148322Y-74875D01*
X148322Y-74872D01*
X148265Y-74816D01*
X148247Y-74816D01*
X148165Y-74850D01*
X148101Y-74914D01*
X148067Y-74996D01*
X148067Y-75086D01*
X148067Y-75205D01*
X148123Y-75262D01*
X148165Y-75262D01*
X148165Y-75412D01*
X148123Y-75412D01*
X148067Y-75468D01*
X148067Y-75587D01*
X148067Y-75677D01*
X148101Y-75759D01*
X148165Y-75823D01*
X148165Y-75823D01*
X148165Y-75825D01*
X148169Y-75825D01*
X148247Y-75857D01*
X148265Y-75857D01*
X148298Y-75825D01*
X148366Y-75825D01*
X148432Y-75852D01*
X148437Y-75857D01*
X148444Y-75857D01*
X148455Y-75857D01*
X148462Y-75857D01*
X148467Y-75852D01*
X148533Y-75825D01*
X148602Y-75825D01*
X148634Y-75857D01*
X148652Y-75857D01*
X148730Y-75825D01*
X149154Y-75825D01*
X149232Y-75857D01*
X149250Y-75857D01*
X149282Y-75825D01*
X149351Y-75825D01*
X149416Y-75852D01*
X149421Y-75857D01*
X149429Y-75857D01*
X149439Y-75857D01*
X149447Y-75857D01*
X149452Y-75852D01*
X149517Y-75825D01*
X149547Y-75825D01*
X149613Y-75852D01*
X149618Y-75857D01*
X149625Y-75857D01*
X149636Y-75857D01*
X149643Y-75857D01*
X149649Y-75852D01*
X149714Y-75825D01*
X149783Y-75825D01*
X149815Y-75857D01*
X149833Y-75857D01*
X149911Y-75825D01*
X150335Y-75825D01*
X150413Y-75857D01*
X150431Y-75857D01*
X150463Y-75825D01*
X150532Y-75825D01*
X150597Y-75852D01*
X150602Y-75857D01*
X150610Y-75857D01*
X150620Y-75857D01*
X150628Y-75857D01*
X150633Y-75852D01*
X150698Y-75825D01*
X150729Y-75825D01*
X150794Y-75852D01*
X150799Y-75857D01*
X150806Y-75857D01*
X150817Y-75857D01*
X150825Y-75857D01*
X150830Y-75852D01*
X150835Y-75849D01*
X150835Y-75857D01*
X150843Y-75857D01*
X150815Y-75925D01*
X150815Y-76074D01*
X150872Y-76212D01*
X150977Y-76317D01*
X151111Y-76373D01*
X151023Y-76373D01*
X151019Y-76375D01*
X150998Y-76375D01*
X150994Y-76373D01*
X150944Y-76373D01*
X150826Y-76373D01*
X150823Y-76375D01*
X150801Y-76375D01*
X150797Y-76373D01*
X150748Y-76373D01*
X150630Y-76373D01*
X150626Y-76375D01*
X150604Y-76375D01*
X150601Y-76373D01*
X150551Y-76373D01*
X150433Y-76373D01*
X150429Y-76375D01*
X150407Y-76375D01*
X150404Y-76373D01*
X150354Y-76373D01*
X150236Y-76373D01*
X150232Y-76375D01*
X150211Y-76375D01*
X150207Y-76373D01*
X150157Y-76373D01*
X150039Y-76373D01*
X150035Y-76375D01*
X150014Y-76375D01*
X150010Y-76373D01*
X149960Y-76373D01*
X149842Y-76373D01*
X149838Y-76375D01*
X149817Y-76375D01*
X149813Y-76373D01*
X149763Y-76373D01*
X149645Y-76373D01*
X149641Y-76375D01*
X149620Y-76375D01*
X149616Y-76373D01*
X149567Y-76373D01*
X149448Y-76373D01*
X149445Y-76375D01*
X149423Y-76375D01*
X149419Y-76373D01*
X149370Y-76373D01*
X149252Y-76373D01*
X149248Y-76375D01*
X149226Y-76375D01*
X149223Y-76373D01*
X149173Y-76373D01*
X149055Y-76373D01*
X149051Y-76375D01*
X149030Y-76375D01*
X149026Y-76373D01*
X148976Y-76373D01*
X148858Y-76373D01*
X148854Y-76375D01*
X148833Y-76375D01*
X148829Y-76373D01*
X148799Y-76373D01*
X148798Y-76370D01*
X148735Y-76307D01*
X148652Y-76273D01*
X148634Y-76273D01*
X148578Y-76329D01*
X148578Y-76347D01*
X148538Y-76307D01*
X148467Y-76278D01*
X148462Y-76273D01*
X148455Y-76273D01*
X148444Y-76273D01*
X148437Y-76273D01*
X148432Y-76278D01*
X148362Y-76307D01*
X148322Y-76347D01*
X148322Y-76329D01*
X148265Y-76273D01*
X148251Y-76273D01*
X148207Y-76167D01*
X148092Y-76052D01*
X147941Y-75989D01*
X147778Y-75989D01*
X147627Y-76051D01*
X147511Y-76167D01*
X147449Y-76318D01*
X147449Y-76481D01*
X147511Y-76632D01*
X147626Y-76747D01*
X147777Y-76810D01*
X147940Y-76810D01*
X148091Y-76748D01*
X148122Y-76717D01*
X148123Y-76718D01*
X148165Y-76718D01*
X148165Y-76868D01*
X148123Y-76868D01*
X148067Y-76924D01*
X148067Y-77044D01*
X148067Y-77133D01*
X148101Y-77216D01*
X148165Y-77279D01*
X148247Y-77313D01*
X148265Y-77313D01*
X148322Y-77257D01*
X148322Y-77239D01*
X148362Y-77279D01*
X148432Y-77308D01*
X148437Y-77313D01*
X148444Y-77313D01*
X148455Y-77313D01*
X148462Y-77313D01*
X148467Y-77308D01*
X148473Y-77306D01*
X148473Y-77313D01*
X148545Y-77313D01*
X148545Y-77380D01*
X148576Y-77455D01*
X148634Y-77513D01*
X148709Y-77544D01*
X148727Y-77544D01*
X148756Y-77615D01*
X148814Y-77673D01*
X148889Y-77704D01*
X148971Y-77705D01*
X149046Y-77673D01*
X149104Y-77616D01*
X149133Y-77546D01*
X149161Y-77615D01*
X149219Y-77673D01*
X149294Y-77704D01*
X149376Y-77705D01*
X149451Y-77673D01*
X149509Y-77616D01*
X149533Y-77558D01*
X149556Y-77615D01*
X149614Y-77673D01*
X149689Y-77704D01*
X149771Y-77705D01*
X149846Y-77673D01*
X149904Y-77616D01*
X149925Y-77564D01*
X149946Y-77615D01*
X150004Y-77673D01*
X150079Y-77704D01*
X150161Y-77705D01*
X150236Y-77673D01*
X150294Y-77616D01*
X150318Y-77558D01*
X150341Y-77615D01*
X150399Y-77673D01*
X150474Y-77704D01*
X150556Y-77705D01*
X150631Y-77673D01*
X150689Y-77616D01*
X150713Y-77558D01*
X150737Y-77615D01*
X150794Y-77673D01*
X150870Y-77704D01*
X150951Y-77704D01*
X151026Y-77673D01*
X151084Y-77615D01*
X151108Y-77559D01*
X151131Y-77615D01*
X151189Y-77673D01*
X151264Y-77704D01*
X151346Y-77705D01*
X151421Y-77673D01*
X151479Y-77616D01*
X151503Y-77558D01*
X151526Y-77615D01*
X151584Y-77673D01*
X151659Y-77704D01*
X151741Y-77705D01*
X151816Y-77673D01*
X151874Y-77616D01*
X151905Y-77540D01*
X151905Y-77459D01*
X151874Y-77384D01*
X151838Y-77347D01*
X151838Y-77284D01*
X151865Y-77257D01*
X151865Y-77239D01*
X151905Y-77279D01*
X151975Y-77308D01*
X151980Y-77313D01*
X151988Y-77313D01*
X151998Y-77313D01*
X152006Y-77313D01*
X152011Y-77308D01*
X152081Y-77279D01*
X152091Y-77269D01*
X152102Y-77279D01*
X152172Y-77308D01*
X152177Y-77313D01*
X152184Y-77313D01*
X152195Y-77313D01*
X152202Y-77313D01*
X152208Y-77308D01*
X152278Y-77279D01*
X152288Y-77269D01*
X152299Y-77279D01*
X152369Y-77308D01*
X152374Y-77313D01*
X152381Y-77313D01*
X152392Y-77313D01*
X152399Y-77313D01*
X152404Y-77308D01*
X152410Y-77306D01*
X152410Y-77313D01*
X152465Y-77313D01*
X152465Y-77380D01*
X152496Y-77455D01*
X152554Y-77513D01*
X152629Y-77544D01*
X152677Y-77545D01*
X152706Y-77615D01*
X152764Y-77673D01*
X152839Y-77704D01*
X152921Y-77705D01*
X152996Y-77673D01*
X153054Y-77616D01*
X153078Y-77558D01*
X153101Y-77615D01*
X153159Y-77673D01*
X153234Y-77704D01*
X153316Y-77705D01*
X153391Y-77673D01*
X153449Y-77616D01*
X153470Y-77564D01*
X153491Y-77615D01*
X153549Y-77673D01*
X153624Y-77704D01*
X153706Y-77705D01*
X153781Y-77673D01*
X153839Y-77616D01*
X153863Y-77558D01*
X153886Y-77615D01*
X153944Y-77673D01*
X154019Y-77704D01*
X154101Y-77705D01*
X154176Y-77673D01*
X154234Y-77616D01*
X154258Y-77558D01*
X154281Y-77615D01*
X154339Y-77673D01*
X154414Y-77704D01*
X154496Y-77705D01*
X154571Y-77673D01*
X154629Y-77616D01*
X154650Y-77564D01*
X154671Y-77615D01*
X154729Y-77673D01*
X154804Y-77704D01*
X154886Y-77705D01*
X154961Y-77673D01*
X155019Y-77616D01*
X155043Y-77558D01*
X155066Y-77615D01*
X155124Y-77673D01*
X155199Y-77704D01*
X155281Y-77705D01*
X155356Y-77673D01*
X155414Y-77616D01*
X155435Y-77564D01*
X155456Y-77615D01*
X155514Y-77673D01*
X155589Y-77704D01*
X155671Y-77705D01*
X155746Y-77673D01*
X155804Y-77616D01*
X155835Y-77540D01*
X155835Y-77459D01*
X155804Y-77384D01*
X155775Y-77354D01*
X155775Y-77284D01*
X155802Y-77257D01*
X155802Y-77239D01*
X155842Y-77279D01*
X155912Y-77308D01*
X155917Y-77313D01*
X155925Y-77313D01*
X155935Y-77313D01*
X155943Y-77313D01*
X155948Y-77308D01*
X156018Y-77279D01*
X156058Y-77239D01*
X156058Y-77257D01*
X156114Y-77313D01*
X156132Y-77313D01*
X156215Y-77279D01*
X156215Y-77279D01*
X156278Y-77216D01*
X156312Y-77133D01*
X156312Y-77044D01*
X156312Y-76924D01*
X156256Y-76868D01*
X156215Y-76868D01*
X156215Y-76718D01*
X156256Y-76718D01*
X156257Y-76717D01*
X156288Y-76747D01*
X156439Y-76810D01*
X156602Y-76810D01*
X156753Y-76748D01*
X156868Y-76632D01*
X156931Y-76481D01*
X156931Y-76318D01*
X156869Y-76167D01*
X156753Y-76052D01*
X156603Y-75989D01*
X156439Y-75989D01*
X156288Y-76051D01*
X156215Y-76125D01*
X156173Y-76167D01*
X156129Y-76273D01*
X156114Y-76273D01*
X156058Y-76329D01*
X156058Y-76347D01*
X156018Y-76307D01*
X155948Y-76278D01*
X155943Y-76273D01*
X155935Y-76273D01*
X155925Y-76273D01*
X155917Y-76273D01*
X155912Y-76278D01*
X155842Y-76307D01*
X155802Y-76347D01*
X155802Y-76329D01*
X155746Y-76273D01*
X155728Y-76273D01*
X155645Y-76307D01*
X155582Y-76370D01*
X155581Y-76373D01*
X155551Y-76373D01*
X155547Y-76375D01*
X155526Y-76375D01*
X155522Y-76373D01*
X155472Y-76373D01*
X155354Y-76373D01*
X155350Y-76375D01*
X155329Y-76375D01*
X155325Y-76373D01*
X155275Y-76373D01*
X155157Y-76373D01*
X155153Y-76375D01*
X155132Y-76375D01*
X155128Y-76373D01*
X155078Y-76373D01*
X154960Y-76373D01*
X154956Y-76375D01*
X154935Y-76375D01*
X154931Y-76373D01*
X154881Y-76373D01*
X154763Y-76373D01*
X154760Y-76375D01*
X154738Y-76375D01*
X154734Y-76373D01*
X154685Y-76373D01*
X154567Y-76373D01*
X154563Y-76375D01*
X154541Y-76375D01*
X154538Y-76373D01*
X154488Y-76373D01*
X154370Y-76373D01*
X154366Y-76375D01*
X154344Y-76375D01*
X154341Y-76373D01*
X154291Y-76373D01*
X154173Y-76373D01*
X154169Y-76375D01*
X154148Y-76375D01*
X154144Y-76373D01*
X154094Y-76373D01*
X153976Y-76373D01*
X153972Y-76375D01*
X153951Y-76375D01*
X153947Y-76373D01*
X153897Y-76373D01*
X153779Y-76373D01*
X153775Y-76375D01*
X153754Y-76375D01*
X153750Y-76373D01*
X153700Y-76373D01*
X153582Y-76373D01*
X153578Y-76375D01*
X153557Y-76375D01*
X153553Y-76373D01*
X153504Y-76373D01*
X153385Y-76373D01*
X153382Y-76375D01*
X153360Y-76375D01*
X153356Y-76373D01*
X153307Y-76373D01*
X153189Y-76373D01*
X153185Y-76375D01*
X153163Y-76375D01*
X153160Y-76373D01*
X153110Y-76373D01*
X152992Y-76373D01*
X152988Y-76375D01*
X152967Y-76375D01*
X152963Y-76373D01*
X152913Y-76373D01*
X152795Y-76373D01*
X152791Y-76375D01*
X152770Y-76375D01*
X152766Y-76373D01*
X152736Y-76373D01*
X152735Y-76370D01*
X152672Y-76307D01*
X152589Y-76273D01*
X152571Y-76273D01*
X152515Y-76329D01*
X152515Y-76347D01*
X152475Y-76307D01*
X152404Y-76278D01*
X152399Y-76273D01*
X152392Y-76273D01*
X152381Y-76273D01*
X152374Y-76273D01*
X152369Y-76278D01*
X152299Y-76307D01*
X152288Y-76318D01*
X152278Y-76307D01*
X152208Y-76278D01*
X152202Y-76273D01*
X152195Y-76273D01*
X152184Y-76273D01*
X152177Y-76273D01*
X152172Y-76278D01*
X152102Y-76307D01*
X152091Y-76318D01*
X152081Y-76307D01*
X152011Y-76278D01*
X152006Y-76273D01*
X151998Y-76273D01*
X151988Y-76273D01*
X151980Y-76273D01*
X151975Y-76278D01*
X151905Y-76307D01*
X151865Y-76347D01*
X151865Y-76329D01*
X151809Y-76273D01*
X151791Y-76273D01*
X151708Y-76307D01*
X151645Y-76370D01*
X151644Y-76373D01*
X151614Y-76373D01*
X151610Y-76375D01*
X151589Y-76375D01*
X151585Y-76373D01*
X151535Y-76373D01*
X151417Y-76373D01*
X151413Y-76375D01*
X151392Y-76375D01*
X151388Y-76373D01*
X151338Y-76373D01*
X151268Y-76373D01*
X151402Y-76318D01*
X151508Y-76212D01*
X151565Y-76074D01*
X151565Y-75925D01*
X151537Y-75857D01*
X151576Y-75857D01*
X151576Y-75849D01*
X151581Y-75852D01*
X151587Y-75857D01*
X151594Y-75857D01*
X151605Y-75857D01*
X151612Y-75857D01*
X151617Y-75852D01*
X151683Y-75825D01*
X151713Y-75825D01*
X151778Y-75852D01*
X151783Y-75857D01*
X151791Y-75857D01*
X151802Y-75857D01*
X151809Y-75857D01*
X151814Y-75852D01*
X151879Y-75825D01*
X151910Y-75825D01*
X151975Y-75852D01*
X151980Y-75857D01*
X151988Y-75857D01*
X151998Y-75857D01*
X152006Y-75857D01*
X152011Y-75852D01*
X152076Y-75825D01*
X152106Y-75825D01*
X152172Y-75852D01*
X152177Y-75857D01*
X152184Y-75857D01*
X152195Y-75857D01*
X152202Y-75857D01*
X152208Y-75852D01*
X152273Y-75825D01*
X152303Y-75825D01*
X152369Y-75852D01*
X152374Y-75857D01*
X152381Y-75857D01*
X152392Y-75857D01*
X152399Y-75857D01*
X152404Y-75852D01*
X152470Y-75825D01*
X152500Y-75825D01*
X152566Y-75852D01*
X152571Y-75857D01*
X152578Y-75857D01*
X152589Y-75857D01*
X152596Y-75857D01*
X152601Y-75852D01*
X152667Y-75825D01*
X152697Y-75825D01*
X152763Y-75852D01*
X152768Y-75857D01*
X152775Y-75857D01*
X152786Y-75857D01*
X152793Y-75857D01*
X152798Y-75852D01*
X152864Y-75825D01*
X152894Y-75825D01*
X152959Y-75852D01*
X152965Y-75857D01*
X152972Y-75857D01*
X152983Y-75857D01*
X152990Y-75857D01*
X152995Y-75852D01*
X153061Y-75825D01*
X153091Y-75825D01*
X153156Y-75852D01*
X153161Y-75857D01*
X153169Y-75857D01*
X153179Y-75857D01*
X153187Y-75857D01*
X153192Y-75852D01*
X153257Y-75825D01*
X153326Y-75825D01*
X153358Y-75857D01*
X153376Y-75857D01*
X153454Y-75825D01*
X154075Y-75825D01*
X154153Y-75857D01*
X154171Y-75857D01*
X154203Y-75825D01*
X154295Y-75825D01*
X154276Y-75843D01*
X154245Y-75919D01*
X154245Y-76000D01*
X154276Y-76075D01*
X154334Y-76133D01*
X154409Y-76164D01*
X154491Y-76165D01*
X154566Y-76133D01*
X154624Y-76076D01*
X154650Y-76012D01*
X154676Y-76075D01*
X154734Y-76133D01*
X154809Y-76164D01*
X154891Y-76165D01*
X154966Y-76133D01*
X155024Y-76076D01*
X155053Y-76005D01*
X155086Y-76005D01*
X155161Y-75973D01*
X155185Y-75949D01*
X155189Y-75957D01*
X155252Y-76020D01*
X155335Y-76054D01*
X155424Y-76055D01*
X155507Y-76020D01*
X155570Y-75957D01*
X155604Y-75874D01*
X155604Y-75831D01*
X155620Y-75825D01*
X155650Y-75825D01*
X155715Y-75852D01*
X155720Y-75857D01*
X155728Y-75857D01*
X155739Y-75857D01*
X155746Y-75857D01*
X155751Y-75852D01*
X155816Y-75825D01*
X155847Y-75825D01*
X155912Y-75852D01*
X155917Y-75857D01*
X155925Y-75857D01*
X155935Y-75857D01*
X155943Y-75857D01*
X155948Y-75852D01*
X156013Y-75825D01*
X156082Y-75825D01*
X156114Y-75857D01*
X156132Y-75857D01*
X156210Y-75825D01*
X156215Y-75825D01*
X156215Y-75822D01*
X156278Y-75759D01*
X156312Y-75677D01*
X156312Y-75587D01*
X156312Y-75468D01*
X156256Y-75412D01*
X156215Y-75412D01*
X156215Y-75262D01*
X156256Y-75262D01*
X156312Y-75205D01*
X156312Y-75086D01*
X156312Y-74996D01*
X156278Y-74914D01*
X156215Y-74850D01*
X156132Y-74816D01*
X156114Y-74816D01*
X156058Y-74872D01*
X156058Y-74875D01*
X156042Y-74875D01*
X156018Y-74850D01*
X155948Y-74821D01*
X155943Y-74816D01*
X155935Y-74816D01*
X155925Y-74816D01*
X155917Y-74816D01*
X155912Y-74821D01*
X155842Y-74850D01*
X155832Y-74861D01*
X155821Y-74850D01*
X155751Y-74821D01*
X155746Y-74816D01*
X155739Y-74816D01*
X155728Y-74816D01*
X155720Y-74816D01*
X155715Y-74821D01*
X155645Y-74850D01*
X155635Y-74861D01*
X155624Y-74850D01*
X155554Y-74821D01*
X155549Y-74816D01*
X155542Y-74816D01*
X155531Y-74816D01*
X155524Y-74816D01*
X155518Y-74821D01*
X155448Y-74850D01*
X155424Y-74875D01*
X155408Y-74875D01*
X155408Y-74872D01*
X155352Y-74816D01*
X155334Y-74816D01*
X155251Y-74850D01*
X155227Y-74875D01*
X154467Y-74875D01*
X154443Y-74850D01*
X154361Y-74816D01*
X154343Y-74816D01*
X154332Y-74827D01*
X154332Y-74816D01*
X154266Y-74816D01*
X154244Y-74764D01*
X154186Y-74706D01*
X154111Y-74675D01*
X154075Y-74675D01*
X154075Y-74639D01*
X154044Y-74564D01*
X154005Y-74525D01*
X157965Y-74525D01*
X157965Y-77920D01*
G54D10*
G36*
X64675Y-82755D02*
X38245Y-82755D01*
X38269Y-82695D01*
X38270Y-82614D01*
X38238Y-82539D01*
X38181Y-82481D01*
X38105Y-82450D01*
X38024Y-82449D01*
X37949Y-82481D01*
X37897Y-82532D01*
X37846Y-82481D01*
X37770Y-82450D01*
X37689Y-82449D01*
X37614Y-82481D01*
X37605Y-82490D01*
X37605Y-82159D01*
X37573Y-82084D01*
X37564Y-82075D01*
X37573Y-82066D01*
X37604Y-81990D01*
X37605Y-81909D01*
X37573Y-81834D01*
X37516Y-81776D01*
X37440Y-81745D01*
X37359Y-81744D01*
X37284Y-81776D01*
X37226Y-81833D01*
X37195Y-81909D01*
X37194Y-81990D01*
X37226Y-82065D01*
X37235Y-82074D01*
X37226Y-82083D01*
X37195Y-82159D01*
X37194Y-82240D01*
X37226Y-82315D01*
X37283Y-82373D01*
X37359Y-82404D01*
X37440Y-82405D01*
X37515Y-82373D01*
X37573Y-82316D01*
X37604Y-82240D01*
X37605Y-82159D01*
X37605Y-82490D01*
X37556Y-82538D01*
X37525Y-82614D01*
X37524Y-82695D01*
X37556Y-82770D01*
X37582Y-82797D01*
X37474Y-82905D01*
X37085Y-82905D01*
X37085Y-80875D01*
X64289Y-80875D01*
X64675Y-81260D01*
X64675Y-82755D01*
X64675Y-82755D01*
G37*
G54D22*
X64675Y-82755D02*
X38245Y-82755D01*
X38269Y-82695D01*
X38270Y-82614D01*
X38238Y-82539D01*
X38181Y-82481D01*
X38105Y-82450D01*
X38024Y-82449D01*
X37949Y-82481D01*
X37897Y-82532D01*
X37846Y-82481D01*
X37770Y-82450D01*
X37689Y-82449D01*
X37614Y-82481D01*
X37605Y-82490D01*
X37605Y-82159D01*
X37573Y-82084D01*
X37564Y-82075D01*
X37573Y-82066D01*
X37604Y-81990D01*
X37605Y-81909D01*
X37573Y-81834D01*
X37516Y-81776D01*
X37440Y-81745D01*
X37359Y-81744D01*
X37284Y-81776D01*
X37226Y-81833D01*
X37195Y-81909D01*
X37194Y-81990D01*
X37226Y-82065D01*
X37235Y-82074D01*
X37226Y-82083D01*
X37195Y-82159D01*
X37194Y-82240D01*
X37226Y-82315D01*
X37283Y-82373D01*
X37359Y-82404D01*
X37440Y-82405D01*
X37515Y-82373D01*
X37573Y-82316D01*
X37604Y-82240D01*
X37605Y-82159D01*
X37605Y-82490D01*
X37556Y-82538D01*
X37525Y-82614D01*
X37524Y-82695D01*
X37556Y-82770D01*
X37582Y-82797D01*
X37474Y-82905D01*
X37085Y-82905D01*
X37085Y-80875D01*
X64289Y-80875D01*
X64675Y-81260D01*
X64675Y-82755D01*
M02*
