  0
SECTION
  2
HEADER
  9
$ANGBASE
  50
0.0
  9
$ANGDIR
  70
  1
  9
$MEASUREMENT
  70
0
  0
ENDSEC
  0
SECTION
  2
TABLES
  0
TABLE
  2
LTYPE
  70
1
  0
LTYPE
  2
CONTINUOUS
  70
0
  3
Solid line
  72
65
  73
0
  40
0.0
  0
ENDTAB
  0
TABLE
  2
STYLE
  70
4
  0
STYLE
  2
KICAD
  70
0
  40
0
  41
1
  42
1
  50
0
  71
0
  3
isocp.shx
  0
STYLE
  2
KICADB
  70
0
  40
0
  41
1
  42
1
  50
0
  71
0
  3
isocp.shx
  0
STYLE
  2
KICADI
  70
0
  40
0
  41
1
  42
1
  50
15
  71
0
  3
isocp.shx
  0
STYLE
  2
KICADBI
  70
0
  40
0
  41
1
  42
1
  50
15
  71
0
  3
isocp.shx
  0
ENDTAB
  0
TABLE
  2
LAYER
  70
30
  0
LAYER
  2
BLACK
  70
0
  62
7
  6
CONTINUOUS
  0
LAYER
  2
GRAY1
  70
0
  62
251
  6
CONTINUOUS
  0
LAYER
  2
GRAY2
  70
0
  62
8
  6
CONTINUOUS
  0
LAYER
  2
GRAY3
  70
0
  62
9
  6
CONTINUOUS
  0
LAYER
  2
WHITE
  70
0
  62
7
  6
CONTINUOUS
  0
LAYER
  2
LYELLOW
  70
0
  62
51
  6
CONTINUOUS
  0
LAYER
  2
BLUE1
  70
0
  62
178
  6
CONTINUOUS
  0
LAYER
  2
GREEN1
  70
0
  62
98
  6
CONTINUOUS
  0
LAYER
  2
CYAN1
  70
0
  62
138
  6
CONTINUOUS
  0
LAYER
  2
RED1
  70
0
  62
18
  6
CONTINUOUS
  0
LAYER
  2
MAGENTA1
  70
0
  62
228
  6
CONTINUOUS
  0
LAYER
  2
BROWN1
  70
0
  62
58
  6
CONTINUOUS
  0
LAYER
  2
BLUE2
  70
0
  62
5
  6
CONTINUOUS
  0
LAYER
  2
GREEN2
  70
0
  62
3
  6
CONTINUOUS
  0
LAYER
  2
CYAN2
  70
0
  62
4
  6
CONTINUOUS
  0
LAYER
  2
RED2
  70
0
  62
1
  6
CONTINUOUS
  0
LAYER
  2
MAGENTA2
  70
0
  62
6
  6
CONTINUOUS
  0
LAYER
  2
BROWN2
  70
0
  62
54
  6
CONTINUOUS
  0
LAYER
  2
BLUE3
  70
0
  62
171
  6
CONTINUOUS
  0
LAYER
  2
GREEN3
  70
0
  62
91
  6
CONTINUOUS
  0
LAYER
  2
CYAN3
  70
0
  62
131
  6
CONTINUOUS
  0
LAYER
  2
RED3
  70
0
  62
11
  6
CONTINUOUS
  0
LAYER
  2
MAGENTA3
  70
0
  62
221
  6
CONTINUOUS
  0
LAYER
  2
YELLOW3
  70
0
  62
2
  6
CONTINUOUS
  0
LAYER
  2
BLUE4
  70
0
  62
5
  6
CONTINUOUS
  0
LAYER
  2
GREEN4
  70
0
  62
3
  6
CONTINUOUS
  0
LAYER
  2
CYAN4
  70
0
  62
4
  6
CONTINUOUS
  0
LAYER
  2
RED4
  70
0
  62
1
  6
CONTINUOUS
  0
LAYER
  2
MAGENTA4
  70
0
  62
6
  6
CONTINUOUS
  0
LAYER
  2
YELLOW4
  70
0
  62
2
  6
CONTINUOUS
  0
ENDTAB
  0
ENDSEC
  0
SECTION
  2
ENTITIES
0
LINE
8
Black
10
208.762
20
-71.8312
11
208.762
21
-58.9788
0
LINE
8
Black
10
208.662
20
-71.8312
11
208.662
21
-58.9788
0
ARC
8
Black
10
208.712
20
-58.9788
40
0.05
50
360
51
540
0
ARC
8
Black
10
208.712
20
-71.8312
40
0.05
50
180
51
360
0
LINE
8
Black
10
218.49
20
-49.2506
11
218.49
21
-48.7426
0
LINE
8
Black
10
218.39
20
-49.2506
11
218.39
21
-48.7426
0
ARC
8
Black
10
218.44
20
-48.7426
40
0.05
50
360
51
540
0
ARC
8
Black
10
218.44
20
-49.2506
40
0.05
50
180
51
360
0
LINE
8
Black
10
184.414
20
-67.3708
11
187.995
21
-63.7894
0
LINE
8
Black
10
184.343
20
-67.3
11
187.925
21
-63.7186
0
ARC
8
Black
10
187.96
20
-63.754
40
0.05
50
315
51
495
0
ARC
8
Black
10
184.379
20
-67.3354
40
0.05
50
135
51
315
0
LINE
8
Black
10
182.245
20
-67.3854
11
184.379
21
-67.3854
0
LINE
8
Black
10
182.245
20
-67.2854
11
184.379
21
-67.2854
0
ARC
8
Black
10
184.379
20
-67.3354
40
0.05
50
270
51
450
0
ARC
8
Black
10
182.245
20
-67.3354
40
0.05
50
90
51
270
0
LINE
8
Black
10
112.979
20
-53.4916
11
113.106
21
-53.4916
0
LINE
8
Black
10
112.979
20
-53.3916
11
113.106
21
-53.3916
0
ARC
8
Black
10
113.106
20
-53.4416
40
0.05
50
270
51
450
0
ARC
8
Black
10
112.979
20
-53.4416
40
0.05
50
90
51
270
0
LINE
8
Black
10
127.035
20
-67.3
11
113.142
21
-53.4062
0
LINE
8
Black
10
126.965
20
-67.3708
11
113.071
21
-53.477
0
ARC
8
Black
10
113.106
20
-53.4416
40
0.05
50
405
51
585
0
ARC
8
Black
10
127
20
-67.3354
40
0.05
50
225
51
405
0
LINE
8
Black
10
96.901
20
-86.029
11
117.297
21
-86.029
0
LINE
8
Black
10
96.901
20
-85.929
11
117.297
21
-85.929
0
ARC
8
Black
10
117.297
20
-85.979
40
0.05
50
270
51
450
0
ARC
8
Black
10
96.901
20
-85.979
40
0.05
50
90
51
270
0
LINE
8
Black
10
96.8756
20
-53.4916
11
112.979
21
-53.4916
0
LINE
8
Black
10
96.8756
20
-53.3916
11
112.979
21
-53.3916
0
ARC
8
Black
10
112.979
20
-53.4416
40
0.05
50
270
51
450
0
ARC
8
Black
10
96.8756
20
-53.4416
40
0.05
50
90
51
270
0
LINE
8
Black
10
218.49
20
-48.7426
11
218.49
21
-40.7162
0
LINE
8
Black
10
218.39
20
-48.7426
11
218.39
21
-40.7162
0
ARC
8
Black
10
218.44
20
-40.7162
40
0.05
50
360
51
540
0
ARC
8
Black
10
218.44
20
-48.7426
40
0.05
50
180
51
360
0
LINE
8
Black
10
208.747
20
-59.0142
11
218.475
21
-49.286
0
LINE
8
Black
10
208.676
20
-58.9434
11
218.405
21
-49.2152
0
ARC
8
Black
10
218.44
20
-49.2506
40
0.05
50
315
51
495
0
ARC
8
Black
10
208.712
20
-58.9788
40
0.05
50
135
51
315
0
LINE
8
Black
10
193.279
20
-87.3352
11
208.747
21
-71.8666
0
LINE
8
Black
10
193.208
20
-87.2644
11
208.676
21
-71.7958
0
ARC
8
Black
10
208.712
20
-71.8312
40
0.05
50
315
51
495
0
ARC
8
Black
10
193.243
20
-87.2998
40
0.05
50
135
51
315
0
LINE
8
Black
10
118.618
20
-87.3498
11
193.243
21
-87.3498
0
LINE
8
Black
10
118.618
20
-87.2498
11
193.243
21
-87.2498
0
ARC
8
Black
10
193.243
20
-87.2998
40
0.05
50
270
51
450
0
ARC
8
Black
10
118.618
20
-87.2998
40
0.05
50
90
51
270
0
LINE
8
Black
10
118.354
20
-87.1066
11
118.583
21
-87.3352
0
LINE
8
Black
10
118.425
20
-87.0358
11
118.653
21
-87.2644
0
ARC
8
Black
10
118.618
20
-87.2998
40
0.05
50
225
51
405
0
ARC
8
Black
10
118.389
20
-87.0712
40
0.05
50
45
51
225
0
LINE
8
Black
10
117.262
20
-86.0144
11
118.354
21
-87.1066
0
LINE
8
Black
10
117.333
20
-85.9436
11
118.425
21
-87.0358
0
ARC
8
Black
10
118.389
20
-87.0712
40
0.05
50
225
51
405
0
ARC
8
Black
10
117.297
20
-85.979
40
0.05
50
45
51
225
0
LINE
8
Black
10
96.9256
20
-53.4416
11
96.9256
21
-52.6542
0
LINE
8
Black
10
96.8256
20
-53.4416
11
96.8256
21
-52.6542
0
ARC
8
Black
10
96.8756
20
-52.6542
40
0.05
50
360
51
540
0
ARC
8
Black
10
96.8756
20
-53.4416
40
0.05
50
180
51
360
0
LINE
8
Black
10
95.7326
20
-52.7042
11
96.8756
21
-52.7042
0
LINE
8
Black
10
95.7326
20
-52.6042
11
96.8756
21
-52.6042
0
ARC
8
Black
10
96.8756
20
-52.6542
40
0.05
50
270
51
450
0
ARC
8
Black
10
95.7326
20
-52.6542
40
0.05
50
90
51
270
0
LINE
8
Black
10
95.4886
20
-52.969
11
95.768
21
-52.6896
0
LINE
8
Black
10
95.4178
20
-52.8982
11
95.6972
21
-52.6188
0
ARC
8
Black
10
95.7326
20
-52.6542
40
0.05
50
315
51
495
0
ARC
8
Black
10
95.4532
20
-52.9336
40
0.05
50
135
51
315
0
LINE
8
Black
10
95.5032
20
-53.1622
11
95.5032
21
-52.9336
0
LINE
8
Black
10
95.4032
20
-53.1622
11
95.4032
21
-52.9336
0
ARC
8
Black
10
95.4532
20
-52.9336
40
0.05
50
360
51
540
0
ARC
8
Black
10
95.4532
20
-53.1622
40
0.05
50
180
51
360
0
LINE
8
Black
10
95.1838
20
-53.5024
11
95.4886
21
-53.1976
0
LINE
8
Black
10
95.113
20
-53.4316
11
95.4178
21
-53.1268
0
ARC
8
Black
10
95.4532
20
-53.1622
40
0.05
50
315
51
495
0
ARC
8
Black
10
95.1484
20
-53.467
40
0.05
50
135
51
315
0
LINE
8
Black
10
95.0722
20
-53.517
11
95.1484
21
-53.517
0
LINE
8
Black
10
95.0722
20
-53.417
11
95.1484
21
-53.417
0
ARC
8
Black
10
95.1484
20
-53.467
40
0.05
50
270
51
450
0
ARC
8
Black
10
95.0722
20
-53.467
40
0.05
50
90
51
270
0
LINE
8
Black
10
94.996
20
-53.517
11
95.0722
21
-53.517
0
LINE
8
Black
10
94.996
20
-53.417
11
95.0722
21
-53.417
0
ARC
8
Black
10
95.0722
20
-53.467
40
0.05
50
270
51
450
0
ARC
8
Black
10
94.996
20
-53.467
40
0.05
50
90
51
270
0
LINE
8
Black
10
94.0816
20
-53.517
11
95.0214
21
-53.517
0
LINE
8
Black
10
94.0816
20
-53.417
11
95.0214
21
-53.417
0
ARC
8
Black
10
95.0214
20
-53.467
40
0.05
50
270
51
450
0
ARC
8
Black
10
94.0816
20
-53.467
40
0.05
50
90
51
270
0
LINE
8
Black
10
94.1316
20
-85.979
11
94.1316
21
-53.467
0
LINE
8
Black
10
94.0316
20
-85.979
11
94.0316
21
-53.467
0
ARC
8
Black
10
94.0816
20
-53.467
40
0.05
50
360
51
540
0
ARC
8
Black
10
94.0816
20
-85.979
40
0.05
50
180
51
360
0
LINE
8
Black
10
96.951
20
-86.7664
11
96.951
21
-85.979
0
LINE
8
Black
10
96.851
20
-86.7664
11
96.851
21
-85.979
0
ARC
8
Black
10
96.901
20
-85.979
40
0.05
50
360
51
540
0
ARC
8
Black
10
96.901
20
-86.7664
40
0.05
50
180
51
360
0
LINE
8
Black
10
95.758
20
-86.8164
11
96.901
21
-86.8164
0
LINE
8
Black
10
95.758
20
-86.7164
11
96.901
21
-86.7164
0
ARC
8
Black
10
96.901
20
-86.7664
40
0.05
50
270
51
450
0
ARC
8
Black
10
95.758
20
-86.7664
40
0.05
50
90
51
270
0
LINE
8
Black
10
95.4178
20
-86.497
11
95.7226
21
-86.8018
0
LINE
8
Black
10
95.4886
20
-86.4262
11
95.7934
21
-86.731
0
ARC
8
Black
10
95.758
20
-86.7664
40
0.05
50
225
51
405
0
ARC
8
Black
10
95.4532
20
-86.4616
40
0.05
50
45
51
225
0
LINE
8
Black
10
95.5032
20
-86.4616
11
95.5032
21
-86.2076
0
LINE
8
Black
10
95.4032
20
-86.4616
11
95.4032
21
-86.2076
0
ARC
8
Black
10
95.4532
20
-86.2076
40
0.05
50
360
51
540
0
ARC
8
Black
10
95.4532
20
-86.4616
40
0.05
50
180
51
360
0
LINE
8
Black
10
95.1892
20
-86.0144
11
95.4178
21
-86.243
0
LINE
8
Black
10
95.26
20
-85.9436
11
95.4886
21
-86.1722
0
ARC
8
Black
10
95.4532
20
-86.2076
40
0.05
50
225
51
405
0
ARC
8
Black
10
95.2246
20
-85.979
40
0.05
50
45
51
225
0
LINE
8
Black
10
94.0816
20
-86.029
11
95.2246
21
-86.029
0
LINE
8
Black
10
94.0816
20
-85.929
11
95.2246
21
-85.929
0
ARC
8
Black
10
95.2246
20
-85.979
40
0.05
50
270
51
450
0
ARC
8
Black
10
94.0816
20
-85.979
40
0.05
50
90
51
270
0
LINE
8
Black
10
188.01
20
-63.754
11
188.01
21
-61.722
0
LINE
8
Black
10
187.91
20
-63.754
11
187.91
21
-61.722
0
ARC
8
Black
10
187.96
20
-61.722
40
0.05
50
360
51
540
0
ARC
8
Black
10
187.96
20
-63.754
40
0.05
50
180
51
360
0
LINE
8
Black
10
188.01
20
-61.7262
11
188.01
21
-57.9628
0
LINE
8
Black
10
187.91
20
-61.7262
11
187.91
21
-57.9628
0
ARC
8
Black
10
187.96
20
-57.9628
40
0.05
50
360
51
540
0
ARC
8
Black
10
187.96
20
-61.7262
40
0.05
50
180
51
360
0
LINE
8
Black
10
127
20
-67.38
11
182.245
21
-67.38
0
LINE
8
Black
10
127
20
-67.28
11
182.245
21
-67.28
0
ARC
8
Black
10
182.245
20
-67.33
40
0.05
50
270
51
450
0
ARC
8
Black
10
127
20
-67.33
40
0.05
50
90
51
270
0
LINE
8
Black
10
187.96
20
-40.77
11
218.44
21
-40.77
0
LINE
8
Black
10
187.96
20
-40.67
11
218.44
21
-40.67
0
ARC
8
Black
10
218.44
20
-40.72
40
0.05
50
270
51
450
0
ARC
8
Black
10
187.96
20
-40.72
40
0.05
50
90
51
270
0
LINE
8
Black
10
188.01
20
-57.9628
11
188.01
21
-40.72
0
LINE
8
Black
10
187.91
20
-57.9628
11
187.91
21
-40.72
0
ARC
8
Black
10
187.96
20
-40.72
40
0.05
50
360
51
540
0
ARC
8
Black
10
187.96
20
-57.9628
40
0.05
50
180
51
360
0
LINE
8
Black
10
209.6
20
-47.47
11
209.6
21
-45.97
0
LINE
8
Black
10
209.6
20
-45.97
11
209.3
21
-45.97
0
LINE
8
Black
10
209.3
20
-45.97
11
209.3
21
-47.47
0
LINE
8
Black
10
209.3
20
-47.47
11
209.6
21
-47.47
0
LINE
8
Black
10
210.1
20
-47.47
11
210.1
21
-45.97
0
LINE
8
Black
10
210.1
20
-45.97
11
209.8
21
-45.97
0
LINE
8
Black
10
209.8
20
-45.97
11
209.8
21
-47.47
0
LINE
8
Black
10
209.8
20
-47.47
11
210.1
21
-47.47
0
LINE
8
Black
10
211.1
20
-47.47
11
211.1
21
-45.97
0
LINE
8
Black
10
211.1
20
-45.97
11
210.8
21
-45.97
0
LINE
8
Black
10
210.8
20
-45.97
11
210.8
21
-47.47
0
LINE
8
Black
10
210.8
20
-47.47
11
211.1
21
-47.47
0
LINE
8
Black
10
210.6
20
-47.47
11
210.6
21
-45.97
0
LINE
8
Black
10
210.6
20
-45.97
11
210.3
21
-45.97
0
LINE
8
Black
10
210.3
20
-45.97
11
210.3
21
-47.47
0
LINE
8
Black
10
210.3
20
-47.47
11
210.6
21
-47.47
0
LINE
8
Black
10
212.6
20
-47.47
11
212.6
21
-45.97
0
LINE
8
Black
10
212.6
20
-45.97
11
212.3
21
-45.97
0
LINE
8
Black
10
212.3
20
-45.97
11
212.3
21
-47.47
0
LINE
8
Black
10
212.3
20
-47.47
11
212.6
21
-47.47
0
LINE
8
Black
10
213.1
20
-47.47
11
213.1
21
-45.97
0
LINE
8
Black
10
213.1
20
-45.97
11
212.8
21
-45.97
0
LINE
8
Black
10
212.8
20
-45.97
11
212.8
21
-47.47
0
LINE
8
Black
10
212.8
20
-47.47
11
213.1
21
-47.47
0
LINE
8
Black
10
212.1
20
-47.47
11
212.1
21
-45.97
0
LINE
8
Black
10
212.1
20
-45.97
11
211.8
21
-45.97
0
LINE
8
Black
10
211.8
20
-45.97
11
211.8
21
-47.47
0
LINE
8
Black
10
211.8
20
-47.47
11
212.1
21
-47.47
0
LINE
8
Black
10
211.6
20
-47.47
11
211.6
21
-45.97
0
LINE
8
Black
10
211.6
20
-45.97
11
211.3
21
-45.97
0
LINE
8
Black
10
211.3
20
-45.97
11
211.3
21
-47.47
0
LINE
8
Black
10
211.3
20
-47.47
11
211.6
21
-47.47
0
LINE
8
Black
10
201.6
20
-47.47
11
201.6
21
-45.97
0
LINE
8
Black
10
201.6
20
-45.97
11
201.3
21
-45.97
0
LINE
8
Black
10
201.3
20
-45.97
11
201.3
21
-47.47
0
LINE
8
Black
10
201.3
20
-47.47
11
201.6
21
-47.47
0
LINE
8
Black
10
202.1
20
-47.47
11
202.1
21
-45.97
0
LINE
8
Black
10
202.1
20
-45.97
11
201.8
21
-45.97
0
LINE
8
Black
10
201.8
20
-45.97
11
201.8
21
-47.47
0
LINE
8
Black
10
201.8
20
-47.47
11
202.1
21
-47.47
0
LINE
8
Black
10
203.1
20
-47.47
11
203.1
21
-45.97
0
LINE
8
Black
10
203.1
20
-45.97
11
202.8
21
-45.97
0
LINE
8
Black
10
202.8
20
-45.97
11
202.8
21
-47.47
0
LINE
8
Black
10
202.8
20
-47.47
11
203.1
21
-47.47
0
LINE
8
Black
10
202.6
20
-47.47
11
202.6
21
-45.97
0
LINE
8
Black
10
202.6
20
-45.97
11
202.3
21
-45.97
0
LINE
8
Black
10
202.3
20
-45.97
11
202.3
21
-47.47
0
LINE
8
Black
10
202.3
20
-47.47
11
202.6
21
-47.47
0
LINE
8
Black
10
204.6
20
-47.47
11
204.6
21
-45.97
0
LINE
8
Black
10
204.6
20
-45.97
11
204.3
21
-45.97
0
LINE
8
Black
10
204.3
20
-45.97
11
204.3
21
-47.47
0
LINE
8
Black
10
204.3
20
-47.47
11
204.6
21
-47.47
0
LINE
8
Black
10
205.1
20
-47.47
11
205.1
21
-45.97
0
LINE
8
Black
10
205.1
20
-45.97
11
204.8
21
-45.97
0
LINE
8
Black
10
204.8
20
-45.97
11
204.8
21
-47.47
0
LINE
8
Black
10
204.8
20
-47.47
11
205.1
21
-47.47
0
LINE
8
Black
10
204.1
20
-47.47
11
204.1
21
-45.97
0
LINE
8
Black
10
204.1
20
-45.97
11
203.8
21
-45.97
0
LINE
8
Black
10
203.8
20
-45.97
11
203.8
21
-47.47
0
LINE
8
Black
10
203.8
20
-47.47
11
204.1
21
-47.47
0
LINE
8
Black
10
203.6
20
-47.47
11
203.6
21
-45.97
0
LINE
8
Black
10
203.6
20
-45.97
11
203.3
21
-45.97
0
LINE
8
Black
10
203.3
20
-45.97
11
203.3
21
-47.47
0
LINE
8
Black
10
203.3
20
-47.47
11
203.6
21
-47.47
0
LINE
8
Black
10
207.6
20
-47.47
11
207.6
21
-45.97
0
LINE
8
Black
10
207.6
20
-45.97
11
207.3
21
-45.97
0
LINE
8
Black
10
207.3
20
-45.97
11
207.3
21
-47.47
0
LINE
8
Black
10
207.3
20
-47.47
11
207.6
21
-47.47
0
LINE
8
Black
10
208.1
20
-47.47
11
208.1
21
-45.97
0
LINE
8
Black
10
208.1
20
-45.97
11
207.8
21
-45.97
0
LINE
8
Black
10
207.8
20
-45.97
11
207.8
21
-47.47
0
LINE
8
Black
10
207.8
20
-47.47
11
208.1
21
-47.47
0
LINE
8
Black
10
209.1
20
-47.47
11
209.1
21
-45.97
0
LINE
8
Black
10
209.1
20
-45.97
11
208.8
21
-45.97
0
LINE
8
Black
10
208.8
20
-45.97
11
208.8
21
-47.47
0
LINE
8
Black
10
208.8
20
-47.47
11
209.1
21
-47.47
0
LINE
8
Black
10
208.6
20
-47.47
11
208.6
21
-45.97
0
LINE
8
Black
10
208.6
20
-45.97
11
208.3
21
-45.97
0
LINE
8
Black
10
208.3
20
-45.97
11
208.3
21
-47.47
0
LINE
8
Black
10
208.3
20
-47.47
11
208.6
21
-47.47
0
LINE
8
Black
10
206.6
20
-47.47
11
206.6
21
-45.97
0
LINE
8
Black
10
206.6
20
-45.97
11
206.3
21
-45.97
0
LINE
8
Black
10
206.3
20
-45.97
11
206.3
21
-47.47
0
LINE
8
Black
10
206.3
20
-47.47
11
206.6
21
-47.47
0
LINE
8
Black
10
207.1
20
-47.47
11
207.1
21
-45.97
0
LINE
8
Black
10
207.1
20
-45.97
11
206.8
21
-45.97
0
LINE
8
Black
10
206.8
20
-45.97
11
206.8
21
-47.47
0
LINE
8
Black
10
206.8
20
-47.47
11
207.1
21
-47.47
0
LINE
8
Black
10
206.1
20
-47.47
11
206.1
21
-45.97
0
LINE
8
Black
10
206.1
20
-45.97
11
205.8
21
-45.97
0
LINE
8
Black
10
205.8
20
-45.97
11
205.8
21
-47.47
0
LINE
8
Black
10
205.8
20
-47.47
11
206.1
21
-47.47
0
LINE
8
Black
10
205.6
20
-47.47
11
205.6
21
-45.97
0
LINE
8
Black
10
205.6
20
-45.97
11
205.3
21
-45.97
0
LINE
8
Black
10
205.3
20
-45.97
11
205.3
21
-47.47
0
LINE
8
Black
10
205.3
20
-47.47
11
205.6
21
-47.47
0
LINE
8
Black
10
197.6
20
-47.47
11
197.6
21
-45.97
0
LINE
8
Black
10
197.6
20
-45.97
11
197.3
21
-45.97
0
LINE
8
Black
10
197.3
20
-45.97
11
197.3
21
-47.47
0
LINE
8
Black
10
197.3
20
-47.47
11
197.6
21
-47.47
0
LINE
8
Black
10
198.1
20
-47.47
11
198.1
21
-45.97
0
LINE
8
Black
10
198.1
20
-45.97
11
197.8
21
-45.97
0
LINE
8
Black
10
197.8
20
-45.97
11
197.8
21
-47.47
0
LINE
8
Black
10
197.8
20
-47.47
11
198.1
21
-47.47
0
LINE
8
Black
10
199.1
20
-47.47
11
199.1
21
-45.97
0
LINE
8
Black
10
199.1
20
-45.97
11
198.8
21
-45.97
0
LINE
8
Black
10
198.8
20
-45.97
11
198.8
21
-47.47
0
LINE
8
Black
10
198.8
20
-47.47
11
199.1
21
-47.47
0
LINE
8
Black
10
198.6
20
-47.47
11
198.6
21
-45.97
0
LINE
8
Black
10
198.6
20
-45.97
11
198.3
21
-45.97
0
LINE
8
Black
10
198.3
20
-45.97
11
198.3
21
-47.47
0
LINE
8
Black
10
198.3
20
-47.47
11
198.6
21
-47.47
0
LINE
8
Black
10
200.6
20
-47.47
11
200.6
21
-45.97
0
LINE
8
Black
10
200.6
20
-45.97
11
200.3
21
-45.97
0
LINE
8
Black
10
200.3
20
-45.97
11
200.3
21
-47.47
0
LINE
8
Black
10
200.3
20
-47.47
11
200.6
21
-47.47
0
LINE
8
Black
10
201.1
20
-47.47
11
201.1
21
-45.97
0
LINE
8
Black
10
201.1
20
-45.97
11
200.8
21
-45.97
0
LINE
8
Black
10
200.8
20
-45.97
11
200.8
21
-47.47
0
LINE
8
Black
10
200.8
20
-47.47
11
201.1
21
-47.47
0
LINE
8
Black
10
200.1
20
-47.47
11
200.1
21
-45.97
0
LINE
8
Black
10
200.1
20
-45.97
11
199.8
21
-45.97
0
LINE
8
Black
10
199.8
20
-45.97
11
199.8
21
-47.47
0
LINE
8
Black
10
199.8
20
-47.47
11
200.1
21
-47.47
0
LINE
8
Black
10
199.6
20
-47.47
11
199.6
21
-45.97
0
LINE
8
Black
10
199.6
20
-45.97
11
199.3
21
-45.97
0
LINE
8
Black
10
199.3
20
-45.97
11
199.3
21
-47.47
0
LINE
8
Black
10
199.3
20
-47.47
11
199.6
21
-47.47
0
LINE
8
Black
10
195.6
20
-47.47
11
195.6
21
-45.97
0
LINE
8
Black
10
195.6
20
-45.97
11
195.3
21
-45.97
0
LINE
8
Black
10
195.3
20
-45.97
11
195.3
21
-47.47
0
LINE
8
Black
10
195.3
20
-47.47
11
195.6
21
-47.47
0
LINE
8
Black
10
196.1
20
-47.47
11
196.1
21
-45.97
0
LINE
8
Black
10
196.1
20
-45.97
11
195.8
21
-45.97
0
LINE
8
Black
10
195.8
20
-45.97
11
195.8
21
-47.47
0
LINE
8
Black
10
195.8
20
-47.47
11
196.1
21
-47.47
0
LINE
8
Black
10
197.1
20
-47.47
11
197.1
21
-45.97
0
LINE
8
Black
10
197.1
20
-45.97
11
196.8
21
-45.97
0
LINE
8
Black
10
196.8
20
-45.97
11
196.8
21
-47.47
0
LINE
8
Black
10
196.8
20
-47.47
11
197.1
21
-47.47
0
LINE
8
Black
10
196.6
20
-47.47
11
196.6
21
-45.97
0
LINE
8
Black
10
196.6
20
-45.97
11
196.3
21
-45.97
0
LINE
8
Black
10
196.3
20
-45.97
11
196.3
21
-47.47
0
LINE
8
Black
10
196.3
20
-47.47
11
196.6
21
-47.47
0
LINE
8
Black
10
194.6
20
-47.47
11
194.6
21
-45.97
0
LINE
8
Black
10
194.6
20
-45.97
11
194.3
21
-45.97
0
LINE
8
Black
10
194.3
20
-45.97
11
194.3
21
-47.47
0
LINE
8
Black
10
194.3
20
-47.47
11
194.6
21
-47.47
0
LINE
8
Black
10
195.1
20
-47.47
11
195.1
21
-45.97
0
LINE
8
Black
10
195.1
20
-45.97
11
194.8
21
-45.97
0
LINE
8
Black
10
194.8
20
-45.97
11
194.8
21
-47.47
0
LINE
8
Black
10
194.8
20
-47.47
11
195.1
21
-47.47
0
LINE
8
Black
10
194.1
20
-47.47
11
194.1
21
-45.97
0
LINE
8
Black
10
194.1
20
-45.97
11
193.8
21
-45.97
0
LINE
8
Black
10
193.8
20
-45.97
11
193.8
21
-47.47
0
LINE
8
Black
10
193.8
20
-47.47
11
194.1
21
-47.47
0
LINE
8
Black
10
209.6
20
-43.77
11
209.6
21
-42.27
0
LINE
8
Black
10
209.6
20
-42.27
11
209.3
21
-42.27
0
LINE
8
Black
10
209.3
20
-42.27
11
209.3
21
-43.77
0
LINE
8
Black
10
209.3
20
-43.77
11
209.6
21
-43.77
0
LINE
8
Black
10
210.1
20
-43.77
11
210.1
21
-42.27
0
LINE
8
Black
10
210.1
20
-42.27
11
209.8
21
-42.27
0
LINE
8
Black
10
209.8
20
-42.27
11
209.8
21
-43.77
0
LINE
8
Black
10
209.8
20
-43.77
11
210.1
21
-43.77
0
LINE
8
Black
10
211.1
20
-43.77
11
211.1
21
-42.27
0
LINE
8
Black
10
211.1
20
-42.27
11
210.8
21
-42.27
0
LINE
8
Black
10
210.8
20
-42.27
11
210.8
21
-43.77
0
LINE
8
Black
10
210.8
20
-43.77
11
211.1
21
-43.77
0
LINE
8
Black
10
210.6
20
-43.77
11
210.6
21
-42.27
0
LINE
8
Black
10
210.6
20
-42.27
11
210.3
21
-42.27
0
LINE
8
Black
10
210.3
20
-42.27
11
210.3
21
-43.77
0
LINE
8
Black
10
210.3
20
-43.77
11
210.6
21
-43.77
0
LINE
8
Black
10
212.6
20
-43.77
11
212.6
21
-42.27
0
LINE
8
Black
10
212.6
20
-42.27
11
212.3
21
-42.27
0
LINE
8
Black
10
212.3
20
-42.27
11
212.3
21
-43.77
0
LINE
8
Black
10
212.3
20
-43.77
11
212.6
21
-43.77
0
LINE
8
Black
10
213.1
20
-43.77
11
213.1
21
-42.27
0
LINE
8
Black
10
213.1
20
-42.27
11
212.8
21
-42.27
0
LINE
8
Black
10
212.8
20
-42.27
11
212.8
21
-43.77
0
LINE
8
Black
10
212.8
20
-43.77
11
213.1
21
-43.77
0
LINE
8
Black
10
212.1
20
-43.77
11
212.1
21
-42.27
0
LINE
8
Black
10
212.1
20
-42.27
11
211.8
21
-42.27
0
LINE
8
Black
10
211.8
20
-42.27
11
211.8
21
-43.77
0
LINE
8
Black
10
211.8
20
-43.77
11
212.1
21
-43.77
0
LINE
8
Black
10
211.6
20
-43.77
11
211.6
21
-42.27
0
LINE
8
Black
10
211.6
20
-42.27
11
211.3
21
-42.27
0
LINE
8
Black
10
211.3
20
-42.27
11
211.3
21
-43.77
0
LINE
8
Black
10
211.3
20
-43.77
11
211.6
21
-43.77
0
LINE
8
Black
10
201.6
20
-43.77
11
201.6
21
-42.27
0
LINE
8
Black
10
201.6
20
-42.27
11
201.3
21
-42.27
0
LINE
8
Black
10
201.3
20
-42.27
11
201.3
21
-43.77
0
LINE
8
Black
10
201.3
20
-43.77
11
201.6
21
-43.77
0
LINE
8
Black
10
202.1
20
-43.77
11
202.1
21
-42.27
0
LINE
8
Black
10
202.1
20
-42.27
11
201.8
21
-42.27
0
LINE
8
Black
10
201.8
20
-42.27
11
201.8
21
-43.77
0
LINE
8
Black
10
201.8
20
-43.77
11
202.1
21
-43.77
0
LINE
8
Black
10
203.1
20
-43.77
11
203.1
21
-42.27
0
LINE
8
Black
10
203.1
20
-42.27
11
202.8
21
-42.27
0
LINE
8
Black
10
202.8
20
-42.27
11
202.8
21
-43.77
0
LINE
8
Black
10
202.8
20
-43.77
11
203.1
21
-43.77
0
LINE
8
Black
10
202.6
20
-43.77
11
202.6
21
-42.27
0
LINE
8
Black
10
202.6
20
-42.27
11
202.3
21
-42.27
0
LINE
8
Black
10
202.3
20
-42.27
11
202.3
21
-43.77
0
LINE
8
Black
10
202.3
20
-43.77
11
202.6
21
-43.77
0
LINE
8
Black
10
204.6
20
-43.77
11
204.6
21
-42.27
0
LINE
8
Black
10
204.6
20
-42.27
11
204.3
21
-42.27
0
LINE
8
Black
10
204.3
20
-42.27
11
204.3
21
-43.77
0
LINE
8
Black
10
204.3
20
-43.77
11
204.6
21
-43.77
0
LINE
8
Black
10
205.1
20
-43.77
11
205.1
21
-42.27
0
LINE
8
Black
10
205.1
20
-42.27
11
204.8
21
-42.27
0
LINE
8
Black
10
204.8
20
-42.27
11
204.8
21
-43.77
0
LINE
8
Black
10
204.8
20
-43.77
11
205.1
21
-43.77
0
LINE
8
Black
10
204.1
20
-43.77
11
204.1
21
-42.27
0
LINE
8
Black
10
204.1
20
-42.27
11
203.8
21
-42.27
0
LINE
8
Black
10
203.8
20
-42.27
11
203.8
21
-43.77
0
LINE
8
Black
10
203.8
20
-43.77
11
204.1
21
-43.77
0
LINE
8
Black
10
203.6
20
-43.77
11
203.6
21
-42.27
0
LINE
8
Black
10
203.6
20
-42.27
11
203.3
21
-42.27
0
LINE
8
Black
10
203.3
20
-42.27
11
203.3
21
-43.77
0
LINE
8
Black
10
203.3
20
-43.77
11
203.6
21
-43.77
0
LINE
8
Black
10
207.6
20
-43.77
11
207.6
21
-42.27
0
LINE
8
Black
10
207.6
20
-42.27
11
207.3
21
-42.27
0
LINE
8
Black
10
207.3
20
-42.27
11
207.3
21
-43.77
0
LINE
8
Black
10
207.3
20
-43.77
11
207.6
21
-43.77
0
LINE
8
Black
10
208.1
20
-43.77
11
208.1
21
-42.27
0
LINE
8
Black
10
208.1
20
-42.27
11
207.8
21
-42.27
0
LINE
8
Black
10
207.8
20
-42.27
11
207.8
21
-43.77
0
LINE
8
Black
10
207.8
20
-43.77
11
208.1
21
-43.77
0
LINE
8
Black
10
209.1
20
-43.77
11
209.1
21
-42.27
0
LINE
8
Black
10
209.1
20
-42.27
11
208.8
21
-42.27
0
LINE
8
Black
10
208.8
20
-42.27
11
208.8
21
-43.77
0
LINE
8
Black
10
208.8
20
-43.77
11
209.1
21
-43.77
0
LINE
8
Black
10
208.6
20
-43.77
11
208.6
21
-42.27
0
LINE
8
Black
10
208.6
20
-42.27
11
208.3
21
-42.27
0
LINE
8
Black
10
208.3
20
-42.27
11
208.3
21
-43.77
0
LINE
8
Black
10
208.3
20
-43.77
11
208.6
21
-43.77
0
LINE
8
Black
10
206.6
20
-43.77
11
206.6
21
-42.27
0
LINE
8
Black
10
206.6
20
-42.27
11
206.3
21
-42.27
0
LINE
8
Black
10
206.3
20
-42.27
11
206.3
21
-43.77
0
LINE
8
Black
10
206.3
20
-43.77
11
206.6
21
-43.77
0
LINE
8
Black
10
207.1
20
-43.77
11
207.1
21
-42.27
0
LINE
8
Black
10
207.1
20
-42.27
11
206.8
21
-42.27
0
LINE
8
Black
10
206.8
20
-42.27
11
206.8
21
-43.77
0
LINE
8
Black
10
206.8
20
-43.77
11
207.1
21
-43.77
0
LINE
8
Black
10
206.1
20
-43.77
11
206.1
21
-42.27
0
LINE
8
Black
10
206.1
20
-42.27
11
205.8
21
-42.27
0
LINE
8
Black
10
205.8
20
-42.27
11
205.8
21
-43.77
0
LINE
8
Black
10
205.8
20
-43.77
11
206.1
21
-43.77
0
LINE
8
Black
10
205.6
20
-43.77
11
205.6
21
-42.27
0
LINE
8
Black
10
205.6
20
-42.27
11
205.3
21
-42.27
0
LINE
8
Black
10
205.3
20
-42.27
11
205.3
21
-43.77
0
LINE
8
Black
10
205.3
20
-43.77
11
205.6
21
-43.77
0
LINE
8
Black
10
197.6
20
-43.77
11
197.6
21
-42.27
0
LINE
8
Black
10
197.6
20
-42.27
11
197.3
21
-42.27
0
LINE
8
Black
10
197.3
20
-42.27
11
197.3
21
-43.77
0
LINE
8
Black
10
197.3
20
-43.77
11
197.6
21
-43.77
0
LINE
8
Black
10
198.1
20
-43.77
11
198.1
21
-42.27
0
LINE
8
Black
10
198.1
20
-42.27
11
197.8
21
-42.27
0
LINE
8
Black
10
197.8
20
-42.27
11
197.8
21
-43.77
0
LINE
8
Black
10
197.8
20
-43.77
11
198.1
21
-43.77
0
LINE
8
Black
10
199.1
20
-43.77
11
199.1
21
-42.27
0
LINE
8
Black
10
199.1
20
-42.27
11
198.8
21
-42.27
0
LINE
8
Black
10
198.8
20
-42.27
11
198.8
21
-43.77
0
LINE
8
Black
10
198.8
20
-43.77
11
199.1
21
-43.77
0
LINE
8
Black
10
198.6
20
-43.77
11
198.6
21
-42.27
0
LINE
8
Black
10
198.6
20
-42.27
11
198.3
21
-42.27
0
LINE
8
Black
10
198.3
20
-42.27
11
198.3
21
-43.77
0
LINE
8
Black
10
198.3
20
-43.77
11
198.6
21
-43.77
0
LINE
8
Black
10
200.6
20
-43.77
11
200.6
21
-42.27
0
LINE
8
Black
10
200.6
20
-42.27
11
200.3
21
-42.27
0
LINE
8
Black
10
200.3
20
-42.27
11
200.3
21
-43.77
0
LINE
8
Black
10
200.3
20
-43.77
11
200.6
21
-43.77
0
LINE
8
Black
10
201.1
20
-43.77
11
201.1
21
-42.27
0
LINE
8
Black
10
201.1
20
-42.27
11
200.8
21
-42.27
0
LINE
8
Black
10
200.8
20
-42.27
11
200.8
21
-43.77
0
LINE
8
Black
10
200.8
20
-43.77
11
201.1
21
-43.77
0
LINE
8
Black
10
200.1
20
-43.77
11
200.1
21
-42.27
0
LINE
8
Black
10
200.1
20
-42.27
11
199.8
21
-42.27
0
LINE
8
Black
10
199.8
20
-42.27
11
199.8
21
-43.77
0
LINE
8
Black
10
199.8
20
-43.77
11
200.1
21
-43.77
0
LINE
8
Black
10
199.6
20
-43.77
11
199.6
21
-42.27
0
LINE
8
Black
10
199.6
20
-42.27
11
199.3
21
-42.27
0
LINE
8
Black
10
199.3
20
-42.27
11
199.3
21
-43.77
0
LINE
8
Black
10
199.3
20
-43.77
11
199.6
21
-43.77
0
LINE
8
Black
10
195.6
20
-43.77
11
195.6
21
-42.27
0
LINE
8
Black
10
195.6
20
-42.27
11
195.3
21
-42.27
0
LINE
8
Black
10
195.3
20
-42.27
11
195.3
21
-43.77
0
LINE
8
Black
10
195.3
20
-43.77
11
195.6
21
-43.77
0
LINE
8
Black
10
196.1
20
-43.77
11
196.1
21
-42.27
0
LINE
8
Black
10
196.1
20
-42.27
11
195.8
21
-42.27
0
LINE
8
Black
10
195.8
20
-42.27
11
195.8
21
-43.77
0
LINE
8
Black
10
195.8
20
-43.77
11
196.1
21
-43.77
0
LINE
8
Black
10
197.1
20
-43.77
11
197.1
21
-42.27
0
LINE
8
Black
10
197.1
20
-42.27
11
196.8
21
-42.27
0
LINE
8
Black
10
196.8
20
-42.27
11
196.8
21
-43.77
0
LINE
8
Black
10
196.8
20
-43.77
11
197.1
21
-43.77
0
LINE
8
Black
10
196.6
20
-43.77
11
196.6
21
-42.27
0
LINE
8
Black
10
196.6
20
-42.27
11
196.3
21
-42.27
0
LINE
8
Black
10
196.3
20
-42.27
11
196.3
21
-43.77
0
LINE
8
Black
10
196.3
20
-43.77
11
196.6
21
-43.77
0
LINE
8
Black
10
194.6
20
-43.77
11
194.6
21
-42.27
0
LINE
8
Black
10
194.6
20
-42.27
11
194.3
21
-42.27
0
LINE
8
Black
10
194.3
20
-42.27
11
194.3
21
-43.77
0
LINE
8
Black
10
194.3
20
-43.77
11
194.6
21
-43.77
0
LINE
8
Black
10
195.1
20
-43.77
11
195.1
21
-42.27
0
LINE
8
Black
10
195.1
20
-42.27
11
194.8
21
-42.27
0
LINE
8
Black
10
194.8
20
-42.27
11
194.8
21
-43.77
0
LINE
8
Black
10
194.8
20
-43.77
11
195.1
21
-43.77
0
LINE
8
Black
10
194.1
20
-43.77
11
194.1
21
-42.27
0
LINE
8
Black
10
194.1
20
-42.27
11
193.8
21
-42.27
0
LINE
8
Black
10
193.8
20
-42.27
11
193.8
21
-43.77
0
LINE
8
Black
10
193.8
20
-43.77
11
194.1
21
-43.77
0
LINE
8
Black
10
193.6
20
-43.77
11
193.6
21
-42.27
0
LINE
8
Black
10
193.6
20
-42.27
11
193.3
21
-42.27
0
LINE
8
Black
10
193.3
20
-42.27
11
193.3
21
-43.77
0
LINE
8
Black
10
193.3
20
-43.77
11
193.6
21
-43.77
0
CIRCLE
8
Black
10
214.2
20
-45.72
40
0.725
0
LINE
8
Black
10
193.6
20
-47.47
11
193.6
21
-45.97
0
LINE
8
Black
10
193.6
20
-45.97
11
193.3
21
-45.97
0
LINE
8
Black
10
193.3
20
-45.97
11
193.3
21
-47.47
0
LINE
8
Black
10
193.3
20
-47.47
11
193.6
21
-47.47
0
CIRCLE
8
Black
10
192.2
20
-45.72
40
0.725
  0
ENDSEC
  0
EOF
