%FSLAX34Y34*%
G04 Gerber Fmt 3.4, Leading zero omitted, Abs format*
G04 (created by PCBNEW (2013-10-07 BZR 4378)-stable) date Fri 19 Dec 2014 04:01:06 PM EST*
%MOIN*%
G01*
G70*
G90*
G04 APERTURE LIST*
%ADD10C,0.005906*%
%ADD11C,0.003937*%
%ADD12R,0.011811X0.059055*%
%ADD13C,0.016000*%
%ADD14C,0.050000*%
%ADD15C,0.010000*%
%ADD16C,0.003000*%
%ADD17C,0.030000*%
%ADD18C,0.075000*%
%ADD19C,0.050000*%
%ADD20C,0.005000*%
G04 APERTURE END LIST*
G54D10*
G54D11*
X130052Y-91750D02*
X67550Y-91750D01*
X135102Y-82860D02*
X135102Y-83000D01*
X136062Y-81900D02*
X135102Y-82860D01*
X135102Y-86700D02*
X135102Y-83000D01*
X130052Y-91750D02*
X135102Y-86700D01*
X33030Y-93450D02*
X33480Y-93450D01*
X33480Y-93450D02*
X33570Y-93540D01*
X33570Y-93540D02*
X33570Y-93640D01*
X33570Y-93640D02*
X33690Y-93760D01*
X33690Y-93760D02*
X34140Y-93760D01*
X34140Y-93760D02*
X34140Y-93450D01*
X33030Y-93450D02*
X33030Y-80650D01*
X33030Y-80650D02*
X33400Y-80650D01*
X33390Y-80650D02*
X33420Y-80650D01*
X33420Y-80650D02*
X33450Y-80650D01*
X33450Y-80650D02*
X33570Y-80530D01*
X33570Y-80530D02*
X33570Y-80440D01*
X33570Y-80440D02*
X33680Y-80330D01*
X33680Y-80330D02*
X34130Y-80330D01*
X34130Y-80330D02*
X34130Y-80640D01*
X140062Y-77900D02*
X136062Y-81900D01*
X65850Y-93450D02*
X67550Y-91750D01*
X33050Y-93450D02*
X65850Y-93450D01*
X33050Y-80650D02*
X33050Y-93450D01*
X64350Y-80650D02*
X33050Y-80650D01*
X68600Y-84900D02*
X64350Y-80650D01*
X126562Y-84900D02*
X68600Y-84900D01*
X128062Y-83400D02*
X126562Y-84900D01*
X128062Y-74300D02*
X128062Y-83400D01*
X140062Y-74300D02*
X140062Y-77900D01*
X140062Y-74300D02*
X128062Y-74300D01*
G54D12*
X136523Y-76793D03*
X136720Y-76793D03*
X137114Y-76793D03*
X136917Y-76793D03*
X137704Y-76793D03*
X137901Y-76793D03*
X137507Y-76793D03*
X137310Y-76793D03*
X133373Y-76793D03*
X133570Y-76793D03*
X133964Y-76793D03*
X133767Y-76793D03*
X134555Y-76793D03*
X134751Y-76793D03*
X134358Y-76793D03*
X134161Y-76793D03*
X135736Y-76793D03*
X135932Y-76793D03*
X136326Y-76793D03*
X136129Y-76793D03*
X135342Y-76793D03*
X135539Y-76793D03*
X135145Y-76793D03*
X134948Y-76793D03*
X131799Y-76793D03*
X131995Y-76793D03*
X132389Y-76793D03*
X132192Y-76793D03*
X132980Y-76793D03*
X133177Y-76793D03*
X132783Y-76793D03*
X132586Y-76793D03*
X131011Y-76793D03*
X131208Y-76793D03*
X131602Y-76793D03*
X131405Y-76793D03*
X130618Y-76793D03*
X130814Y-76793D03*
X130421Y-76793D03*
X136523Y-75337D03*
X136720Y-75337D03*
X137114Y-75337D03*
X136917Y-75337D03*
X137704Y-75337D03*
X137901Y-75337D03*
X137507Y-75337D03*
X137310Y-75337D03*
X133373Y-75337D03*
X133570Y-75337D03*
X133964Y-75337D03*
X133767Y-75337D03*
X134555Y-75337D03*
X134751Y-75337D03*
X134358Y-75337D03*
X134161Y-75337D03*
X135736Y-75337D03*
X135932Y-75337D03*
X136326Y-75337D03*
X136129Y-75337D03*
X135342Y-75337D03*
X135539Y-75337D03*
X135145Y-75337D03*
X134948Y-75337D03*
X131799Y-75337D03*
X131995Y-75337D03*
X132389Y-75337D03*
X132192Y-75337D03*
X132980Y-75337D03*
X133177Y-75337D03*
X132783Y-75337D03*
X132586Y-75337D03*
X131011Y-75337D03*
X131208Y-75337D03*
X131602Y-75337D03*
X131405Y-75337D03*
X130618Y-75337D03*
X130814Y-75337D03*
X130421Y-75337D03*
X130224Y-75337D03*
X130224Y-76793D03*
G54D13*
X37730Y-82650D03*
X38065Y-82655D03*
G54D14*
X133062Y-76000D03*
G54D13*
X37400Y-82200D03*
X37400Y-81950D03*
G54D14*
X131992Y-74740D03*
X130812Y-74740D03*
G54D13*
X135342Y-74620D03*
X135542Y-74900D03*
X37400Y-93250D03*
X130802Y-77500D03*
X130622Y-77340D03*
X37400Y-83420D03*
X135537Y-77500D03*
X37400Y-88530D03*
X135342Y-77340D03*
X135932Y-77500D03*
X37400Y-88940D03*
X135742Y-77340D03*
X136327Y-77500D03*
X37400Y-89340D03*
X136122Y-77340D03*
X136717Y-77500D03*
X37400Y-89730D03*
X136522Y-77340D03*
X137112Y-77500D03*
X136922Y-77340D03*
X37400Y-90130D03*
X137502Y-77500D03*
X137302Y-77340D03*
X37400Y-90520D03*
X131207Y-77500D03*
X131002Y-77340D03*
X37400Y-83810D03*
X131602Y-77500D03*
X131402Y-77340D03*
X37400Y-84210D03*
X131992Y-77500D03*
X131802Y-77340D03*
X37400Y-84600D03*
X132387Y-77500D03*
X132182Y-77340D03*
X37400Y-85000D03*
X132783Y-77499D03*
X132582Y-77340D03*
X37400Y-85390D03*
X133177Y-77500D03*
X132982Y-77340D03*
X37400Y-85790D03*
X133572Y-77500D03*
X133362Y-77340D03*
X37400Y-86180D03*
X134752Y-77500D03*
X134542Y-77340D03*
X37400Y-87760D03*
X135147Y-77500D03*
X37400Y-88150D03*
X134942Y-77340D03*
X137250Y-75830D03*
X135942Y-74880D03*
X37400Y-92860D03*
X135742Y-74680D03*
X136522Y-75800D03*
X136917Y-75800D03*
X136322Y-75960D03*
X37400Y-91500D03*
X136722Y-75960D03*
X37400Y-91890D03*
X37730Y-83210D03*
X38147Y-83092D03*
G54D14*
X139552Y-74810D03*
G54D13*
X38205Y-86555D03*
X37900Y-86765D03*
X37965Y-87535D03*
X37735Y-87345D03*
X37690Y-90890D03*
X37795Y-91460D03*
X37400Y-92265D03*
X68800Y-90165D03*
X66800Y-90168D03*
X73262Y-90166D03*
X77262Y-90166D03*
X81262Y-90166D03*
X85262Y-90166D03*
X89262Y-90166D03*
X93262Y-90166D03*
X91262Y-90166D03*
X87262Y-90166D03*
X83262Y-90166D03*
X79262Y-90166D03*
X75262Y-90166D03*
X71262Y-90166D03*
X99262Y-90166D03*
X103262Y-90166D03*
X107262Y-90166D03*
X105262Y-90166D03*
X101262Y-90166D03*
X97262Y-90166D03*
X95262Y-90166D03*
G54D14*
X132582Y-74740D03*
X131402Y-74740D03*
G54D13*
X64930Y-88225D03*
X63480Y-86885D03*
X55610Y-86890D03*
X59610Y-86890D03*
X61610Y-86890D03*
X57610Y-86890D03*
X53610Y-86890D03*
X37610Y-86890D03*
X66955Y-90635D03*
X68955Y-90635D03*
X64885Y-90705D03*
X70955Y-90635D03*
X55880Y-91705D03*
X59880Y-91705D03*
X61880Y-91705D03*
X57880Y-91705D03*
X53880Y-91700D03*
X63860Y-91715D03*
X74955Y-90635D03*
X78955Y-90635D03*
X82955Y-90635D03*
X86955Y-90635D03*
X90955Y-90635D03*
X94955Y-90635D03*
X98955Y-90635D03*
X102955Y-90635D03*
X100955Y-90635D03*
X96955Y-90635D03*
X92955Y-90635D03*
X88955Y-90635D03*
X84955Y-90635D03*
X80955Y-90635D03*
X76955Y-90635D03*
X72955Y-90635D03*
X104955Y-90635D03*
X106955Y-90635D03*
X109512Y-90625D03*
X125512Y-90625D03*
X127512Y-90625D03*
X130962Y-89180D03*
X129512Y-90625D03*
X136232Y-79785D03*
X135237Y-80780D03*
X133832Y-82210D03*
X133802Y-84210D03*
X137647Y-78370D03*
X133792Y-86350D03*
X132377Y-87765D03*
X66080Y-84830D03*
X56300Y-83050D03*
X60300Y-83050D03*
X62300Y-83050D03*
X58300Y-83050D03*
X54300Y-83050D03*
X38550Y-83050D03*
X64300Y-83050D03*
X37400Y-82860D03*
X37400Y-82450D03*
X67850Y-86595D03*
X95362Y-86595D03*
X54060Y-92580D03*
X56060Y-92990D03*
X58060Y-92580D03*
X60060Y-92990D03*
X62060Y-92580D03*
X65210Y-91900D03*
X65680Y-92320D03*
X37800Y-92990D03*
X37790Y-92580D03*
X70800Y-90165D03*
X53480Y-91060D03*
X57480Y-91060D03*
X61480Y-91060D03*
X59480Y-91060D03*
X55480Y-91060D03*
X63485Y-91055D03*
X64400Y-90165D03*
X37400Y-91060D03*
X63480Y-87230D03*
X55480Y-87230D03*
X59480Y-87230D03*
X61480Y-87230D03*
X57480Y-87230D03*
X53480Y-87230D03*
X37480Y-87230D03*
X96242Y-88225D03*
X96402Y-88530D03*
X64800Y-88530D03*
X130687Y-88750D03*
X131907Y-87530D03*
X130042Y-86885D03*
X129822Y-86655D03*
X98402Y-88530D03*
X102402Y-88530D03*
X106402Y-88530D03*
X110402Y-88530D03*
X126402Y-88530D03*
X124402Y-88530D03*
X108402Y-88530D03*
X104402Y-88530D03*
X100402Y-88530D03*
X68402Y-88530D03*
X72402Y-88530D03*
X76402Y-88530D03*
X80402Y-88530D03*
X84402Y-88530D03*
X88402Y-88530D03*
X92402Y-88530D03*
X94402Y-88530D03*
X90402Y-88530D03*
X86402Y-88530D03*
X82402Y-88530D03*
X78402Y-88530D03*
X74402Y-88530D03*
X70402Y-88530D03*
X98242Y-88225D03*
X102242Y-88225D03*
X106242Y-88225D03*
X110242Y-88225D03*
X126242Y-88225D03*
X124242Y-88225D03*
X108242Y-88225D03*
X104242Y-88225D03*
X100242Y-88225D03*
X68242Y-88225D03*
X72242Y-88225D03*
X76242Y-88225D03*
X80242Y-88225D03*
X84242Y-88225D03*
X88242Y-88225D03*
X92242Y-88225D03*
X94242Y-88225D03*
X90242Y-88225D03*
X86242Y-88225D03*
X82242Y-88225D03*
X78242Y-88225D03*
X74242Y-88225D03*
X70242Y-88225D03*
X131382Y-85090D03*
X133532Y-78000D03*
X131387Y-80160D03*
X131392Y-82660D03*
X128242Y-88225D03*
X128402Y-88530D03*
X131692Y-82740D03*
X133992Y-78000D03*
X131712Y-80280D03*
X131692Y-85225D03*
X133332Y-84100D03*
X133317Y-86115D03*
X127262Y-90165D03*
X125262Y-90165D03*
X109262Y-90165D03*
X69362Y-86595D03*
X73362Y-86595D03*
X77362Y-86595D03*
X81362Y-86595D03*
X85362Y-86595D03*
X89362Y-86595D03*
X93362Y-86595D03*
X91362Y-86595D03*
X87362Y-86595D03*
X83362Y-86595D03*
X79362Y-86595D03*
X75362Y-86595D03*
X71362Y-86595D03*
X99362Y-86595D03*
X103362Y-86595D03*
X107362Y-86595D03*
X125362Y-86595D03*
X109362Y-86595D03*
X105362Y-86595D03*
X101362Y-86595D03*
X97362Y-86595D03*
X133332Y-81990D03*
X134712Y-80585D03*
X135857Y-79435D03*
X127337Y-86565D03*
X37400Y-81700D03*
X37400Y-81450D03*
G54D14*
X128562Y-74800D03*
G54D13*
X137277Y-78015D03*
G54D14*
X134962Y-76100D03*
G54D13*
X128517Y-85375D03*
X129752Y-82000D03*
X129762Y-78000D03*
X129752Y-80000D03*
X129752Y-84000D03*
G54D14*
X134362Y-76100D03*
X133762Y-76100D03*
G54D15*
X132980Y-75337D02*
X132980Y-75917D01*
X132980Y-75917D02*
X133062Y-76000D01*
X132980Y-75917D02*
X133062Y-76000D01*
X133177Y-75337D02*
X133177Y-75885D01*
X133177Y-75885D02*
X133062Y-76000D01*
X131799Y-75337D02*
X131799Y-74933D01*
X131799Y-74933D02*
X131992Y-74740D01*
X132192Y-75337D02*
X132192Y-74939D01*
X131995Y-74743D02*
X131992Y-74740D01*
X131995Y-74743D02*
X131995Y-75337D01*
X132192Y-74939D02*
X131992Y-74740D01*
X130618Y-75337D02*
X130618Y-74934D01*
X130618Y-74934D02*
X130812Y-74740D01*
X131011Y-75337D02*
X131011Y-74938D01*
X130814Y-74741D02*
X130812Y-74740D01*
X130814Y-74741D02*
X130814Y-75337D01*
X131011Y-74938D02*
X130812Y-74740D01*
X135342Y-75337D02*
X135342Y-74620D01*
X135342Y-74620D02*
X135342Y-74620D01*
X135539Y-74903D02*
X135542Y-74900D01*
X135539Y-74903D02*
X135539Y-75337D01*
G54D16*
X130814Y-77488D02*
X130802Y-77500D01*
X130814Y-76793D02*
X130814Y-77488D01*
X130618Y-76793D02*
X130618Y-77335D01*
X130618Y-77335D02*
X130622Y-77340D01*
X135539Y-77498D02*
X135537Y-77500D01*
X135539Y-77498D02*
X135539Y-76793D01*
X135342Y-77339D02*
X135342Y-76793D01*
X135342Y-77339D02*
X135342Y-77340D01*
X135932Y-77499D02*
X135932Y-77500D01*
X135932Y-77499D02*
X135932Y-76793D01*
X135736Y-77333D02*
X135736Y-76793D01*
X135736Y-77333D02*
X135742Y-77340D01*
X136326Y-77498D02*
X136327Y-77500D01*
X136326Y-77498D02*
X136326Y-76793D01*
X136129Y-77333D02*
X136129Y-76793D01*
X136129Y-77333D02*
X136122Y-77340D01*
X136720Y-77497D02*
X136717Y-77500D01*
X136720Y-77497D02*
X136720Y-76793D01*
X136523Y-77339D02*
X136523Y-76793D01*
X136523Y-77339D02*
X136522Y-77340D01*
X137114Y-77498D02*
X137112Y-77500D01*
X137114Y-77498D02*
X137114Y-76793D01*
X136917Y-77334D02*
X136917Y-76793D01*
X136917Y-77334D02*
X136922Y-77340D01*
X137507Y-77495D02*
X137502Y-77500D01*
X137507Y-76793D02*
X137507Y-77495D01*
X137310Y-77331D02*
X137310Y-76793D01*
X137310Y-77331D02*
X137302Y-77340D01*
X131208Y-77499D02*
X131207Y-77500D01*
X131208Y-77499D02*
X131208Y-76793D01*
X131011Y-76793D02*
X131011Y-77331D01*
X131011Y-77331D02*
X131002Y-77340D01*
X131602Y-77499D02*
X131602Y-77500D01*
X131602Y-77499D02*
X131602Y-76793D01*
X131405Y-76793D02*
X131405Y-77337D01*
X131405Y-77337D02*
X131402Y-77340D01*
X131995Y-76793D02*
X131995Y-77496D01*
X131995Y-77496D02*
X131992Y-77500D01*
X131799Y-76793D02*
X131799Y-77336D01*
X131799Y-77336D02*
X131802Y-77340D01*
X132389Y-77498D02*
X132387Y-77500D01*
X132389Y-77498D02*
X132389Y-76793D01*
X132192Y-76793D02*
X132192Y-77330D01*
X132192Y-77330D02*
X132182Y-77340D01*
X132783Y-76793D02*
X132783Y-77499D01*
X132783Y-77499D02*
X132782Y-77500D01*
X132586Y-76793D02*
X132586Y-77336D01*
X132586Y-77336D02*
X132582Y-77340D01*
X133177Y-77499D02*
X133177Y-77500D01*
X133177Y-77499D02*
X133177Y-76793D01*
X132980Y-76793D02*
X132980Y-77337D01*
X132980Y-77337D02*
X132982Y-77340D01*
X133570Y-77497D02*
X133572Y-77500D01*
X133570Y-77497D02*
X133570Y-76793D01*
X133373Y-76793D02*
X133373Y-77328D01*
X133373Y-77328D02*
X133362Y-77340D01*
X134751Y-77498D02*
X134752Y-77500D01*
X134751Y-77498D02*
X134751Y-76793D01*
X134555Y-76793D02*
X134555Y-77327D01*
X134555Y-77327D02*
X134542Y-77340D01*
X135145Y-77497D02*
X135147Y-77500D01*
X135145Y-77497D02*
X135145Y-76793D01*
X134948Y-77334D02*
X134942Y-77340D01*
X134948Y-76793D02*
X134948Y-77334D01*
G54D15*
X137114Y-75694D02*
X137250Y-75830D01*
X137114Y-75337D02*
X137114Y-75694D01*
X135932Y-74889D02*
X135942Y-74880D01*
X135932Y-75337D02*
X135932Y-74889D01*
X135736Y-74686D02*
X135736Y-75337D01*
X135736Y-74686D02*
X135742Y-74680D01*
G54D16*
X136523Y-75799D02*
X136522Y-75800D01*
X136523Y-75337D02*
X136523Y-75799D01*
X136917Y-75799D02*
X136917Y-75800D01*
X136917Y-75799D02*
X136917Y-75337D01*
X136326Y-75956D02*
X136322Y-75960D01*
X136326Y-75337D02*
X136326Y-75956D01*
X136720Y-75337D02*
X136720Y-75957D01*
X136720Y-75957D02*
X136722Y-75960D01*
G54D15*
X137901Y-75337D02*
X137901Y-74918D01*
X137901Y-74918D02*
X138010Y-74810D01*
X137704Y-75337D02*
X137704Y-74885D01*
X137704Y-74885D02*
X137780Y-74810D01*
X137507Y-75337D02*
X137507Y-74872D01*
X137507Y-74872D02*
X137570Y-74810D01*
X137310Y-75337D02*
X137310Y-74849D01*
X137310Y-74849D02*
X137350Y-74810D01*
X137350Y-74810D02*
X137570Y-74810D01*
X138010Y-74810D02*
X139552Y-74810D01*
X138012Y-76030D02*
X137901Y-76030D01*
X138012Y-76030D02*
X139232Y-74810D01*
X139232Y-74810D02*
X139552Y-74810D01*
X137780Y-74810D02*
X138010Y-74810D01*
X137570Y-74810D02*
X137780Y-74810D01*
G54D17*
X128662Y-76350D02*
X128662Y-76900D01*
X128662Y-76900D02*
X129362Y-77600D01*
X129362Y-77600D02*
X129362Y-83900D01*
X129362Y-83900D02*
X127062Y-86200D01*
X127062Y-86200D02*
X68050Y-86200D01*
X68050Y-86200D02*
X64500Y-82650D01*
G54D15*
X68800Y-90165D02*
X66803Y-90165D01*
X66803Y-90165D02*
X66800Y-90168D01*
X71262Y-90186D02*
X73262Y-90186D01*
X75262Y-90186D02*
X77262Y-90186D01*
X79262Y-90186D02*
X81262Y-90186D01*
X83262Y-90186D02*
X85262Y-90186D01*
X87262Y-90186D02*
X89262Y-90186D01*
X91262Y-90186D02*
X93262Y-90186D01*
X95262Y-90186D02*
X93262Y-90186D01*
X89262Y-90186D02*
X91262Y-90186D01*
X85262Y-90186D02*
X87262Y-90186D01*
X81262Y-90186D02*
X83262Y-90186D01*
X77262Y-90186D02*
X79262Y-90186D01*
X73262Y-90186D02*
X75262Y-90186D01*
X69262Y-90186D02*
X71262Y-90186D01*
X97262Y-90186D02*
X99262Y-90186D01*
X101262Y-90186D02*
X103262Y-90186D01*
X105262Y-90186D02*
X107262Y-90186D01*
X107262Y-90186D02*
X109262Y-90186D01*
X103262Y-90186D02*
X105262Y-90186D01*
X99262Y-90186D02*
X101262Y-90186D01*
X95262Y-90186D02*
X97262Y-90186D01*
X68800Y-90186D02*
X95262Y-90186D01*
X97362Y-86600D02*
X99362Y-86600D01*
X95362Y-86600D02*
X97362Y-86600D01*
X99362Y-86600D02*
X101362Y-86600D01*
X103362Y-86600D02*
X105362Y-86600D01*
X107362Y-86600D02*
X109362Y-86600D01*
X111362Y-86600D02*
X113362Y-86600D01*
X115362Y-86600D02*
X117362Y-86600D01*
X119362Y-86600D02*
X121362Y-86600D01*
X123362Y-86600D02*
X125362Y-86600D01*
X127337Y-86570D02*
X125362Y-86600D01*
X121362Y-86600D02*
X123362Y-86600D01*
X117362Y-86600D02*
X119362Y-86600D01*
X113362Y-86600D02*
X115362Y-86600D01*
X109362Y-86600D02*
X111362Y-86600D01*
X105362Y-86600D02*
X107362Y-86600D01*
X101362Y-86600D02*
X103362Y-86600D01*
X132783Y-75337D02*
X132783Y-74940D01*
X132783Y-74940D02*
X132582Y-74740D01*
X132389Y-75337D02*
X132389Y-74933D01*
X132586Y-74743D02*
X132582Y-74740D01*
X132586Y-74743D02*
X132586Y-75337D01*
X132389Y-74933D02*
X132582Y-74740D01*
X131602Y-75337D02*
X131602Y-74939D01*
X131602Y-74939D02*
X131402Y-74740D01*
X131208Y-75337D02*
X131208Y-74934D01*
X131405Y-74742D02*
X131402Y-74740D01*
X131405Y-74742D02*
X131405Y-75337D01*
X131208Y-74934D02*
X131402Y-74740D01*
X64930Y-88225D02*
X64930Y-88207D01*
X37610Y-86890D02*
X39610Y-86890D01*
X41610Y-86890D02*
X43610Y-86890D01*
X45610Y-86890D02*
X47610Y-86890D01*
X49610Y-86890D02*
X51610Y-86890D01*
X53610Y-86890D02*
X55610Y-86890D01*
X57610Y-86890D02*
X59610Y-86890D01*
X61610Y-86890D02*
X63480Y-86885D01*
X59610Y-86890D02*
X61610Y-86890D01*
X55610Y-86890D02*
X57610Y-86890D01*
X51610Y-86890D02*
X53610Y-86890D01*
X47610Y-86890D02*
X49610Y-86890D01*
X43610Y-86890D02*
X45610Y-86890D01*
X39610Y-86890D02*
X41610Y-86890D01*
X63608Y-86885D02*
X63480Y-86885D01*
X64930Y-88207D02*
X63608Y-86885D01*
X133964Y-77268D02*
X134157Y-77268D01*
X134157Y-77268D02*
X134161Y-77272D01*
X134161Y-76793D02*
X134161Y-77272D01*
X134161Y-77272D02*
X134358Y-77469D01*
X133964Y-76793D02*
X133964Y-77268D01*
X133964Y-77268D02*
X133767Y-77465D01*
X130421Y-76793D02*
X130421Y-77289D01*
X130421Y-77289D02*
X130224Y-77486D01*
X130421Y-76793D02*
X130421Y-77099D01*
X137704Y-75986D02*
X137857Y-75986D01*
X137857Y-75986D02*
X137901Y-76030D01*
X137704Y-77534D02*
X137774Y-77534D01*
X137774Y-77534D02*
X137901Y-77407D01*
X130421Y-75337D02*
X130421Y-74702D01*
X130378Y-74660D02*
X130224Y-74660D01*
X130421Y-74702D02*
X130378Y-74660D01*
X130224Y-75337D02*
X130224Y-74660D01*
X130224Y-74660D02*
X130224Y-74655D01*
X130224Y-74655D02*
X130222Y-74654D01*
X130224Y-76002D02*
X130169Y-76002D01*
X130169Y-76002D02*
X129504Y-75337D01*
X130421Y-76024D02*
X130282Y-76024D01*
X130282Y-76024D02*
X130224Y-76082D01*
X130421Y-75337D02*
X130421Y-76024D01*
X130421Y-76024D02*
X130421Y-76793D01*
X138161Y-77856D02*
X138161Y-77841D01*
X138161Y-77841D02*
X138597Y-77405D01*
X66955Y-90635D02*
X68955Y-90635D01*
X66955Y-90635D02*
X64940Y-90650D01*
X64940Y-90650D02*
X64885Y-90705D01*
X68955Y-90635D02*
X70955Y-90635D01*
X53880Y-91700D02*
X55880Y-91705D01*
X57880Y-91705D02*
X59880Y-91705D01*
X61880Y-91705D02*
X63860Y-91715D01*
X59880Y-91705D02*
X61880Y-91705D01*
X55880Y-91705D02*
X57880Y-91705D01*
X65465Y-90635D02*
X64935Y-90650D01*
X64935Y-90650D02*
X63860Y-91715D01*
X66955Y-90635D02*
X65465Y-90635D01*
X70955Y-90635D02*
X72955Y-90635D01*
X67417Y-90635D02*
X69417Y-90635D01*
X71417Y-90635D02*
X73417Y-90635D01*
X75417Y-90635D02*
X77417Y-90635D01*
X79417Y-90635D02*
X81417Y-90635D01*
X83417Y-90635D02*
X85417Y-90635D01*
X87417Y-90635D02*
X89417Y-90635D01*
X91417Y-90635D02*
X93417Y-90635D01*
X93417Y-90635D02*
X95417Y-90635D01*
X89417Y-90635D02*
X91417Y-90635D01*
X85417Y-90635D02*
X87417Y-90635D01*
X81417Y-90635D02*
X83417Y-90635D01*
X77417Y-90635D02*
X79417Y-90635D01*
X73417Y-90635D02*
X75417Y-90635D01*
X69417Y-90635D02*
X71417Y-90635D01*
X65417Y-90635D02*
X67417Y-90635D01*
X74955Y-90635D02*
X72955Y-90635D01*
X76955Y-90635D02*
X78955Y-90635D01*
X80955Y-90635D02*
X82955Y-90635D01*
X84955Y-90635D02*
X86955Y-90635D01*
X88955Y-90635D02*
X90955Y-90635D01*
X92955Y-90635D02*
X94955Y-90635D01*
X96955Y-90635D02*
X98955Y-90635D01*
X100955Y-90635D02*
X102955Y-90635D01*
X104955Y-90635D02*
X102955Y-90635D01*
X98955Y-90635D02*
X100955Y-90635D01*
X94955Y-90635D02*
X96955Y-90635D01*
X90955Y-90635D02*
X92955Y-90635D01*
X86955Y-90635D02*
X88955Y-90635D01*
X82955Y-90635D02*
X84955Y-90635D01*
X78955Y-90635D02*
X80955Y-90635D01*
X74955Y-90635D02*
X76955Y-90635D01*
X104955Y-90635D02*
X106955Y-90635D01*
X95417Y-90635D02*
X97512Y-90625D01*
X99512Y-90575D02*
X101512Y-90575D01*
X103512Y-90575D02*
X105512Y-90575D01*
X107512Y-90575D02*
X109512Y-90575D01*
X111512Y-90575D02*
X113512Y-90575D01*
X115512Y-90575D02*
X117512Y-90575D01*
X119512Y-90575D02*
X121512Y-90575D01*
X123512Y-90575D02*
X125512Y-90575D01*
X129517Y-90630D02*
X127512Y-90575D01*
X125512Y-90575D02*
X127512Y-90575D01*
X121512Y-90575D02*
X123512Y-90575D01*
X117512Y-90575D02*
X119512Y-90575D01*
X113512Y-90575D02*
X115512Y-90575D01*
X109512Y-90575D02*
X111512Y-90575D01*
X105512Y-90575D02*
X107512Y-90575D01*
X101512Y-90575D02*
X103512Y-90575D01*
X97512Y-90575D02*
X99512Y-90575D01*
X129517Y-90630D02*
X127712Y-90575D01*
X130962Y-89180D02*
X130957Y-89180D01*
X132377Y-87765D02*
X130962Y-89180D01*
X130957Y-89180D02*
X129512Y-90625D01*
X133832Y-82210D02*
X133832Y-82185D01*
X133792Y-82250D02*
X133832Y-82210D01*
X133802Y-84210D02*
X133792Y-82250D01*
X133792Y-86350D02*
X133802Y-84210D01*
X133832Y-82185D02*
X135237Y-80780D01*
X135237Y-80780D02*
X136232Y-79785D01*
X136232Y-79785D02*
X137647Y-78370D01*
X132377Y-87765D02*
X133792Y-86350D01*
X137901Y-77170D02*
X137901Y-77407D01*
X137901Y-77407D02*
X137901Y-77428D01*
X137901Y-77428D02*
X138237Y-77765D01*
X138237Y-77765D02*
X138237Y-77780D01*
X138237Y-77780D02*
X138161Y-77856D01*
X138161Y-77856D02*
X137647Y-78370D01*
X68900Y-86600D02*
X67850Y-86600D01*
X65715Y-84465D02*
X64300Y-83050D01*
X66080Y-84830D02*
X65715Y-84465D01*
X67850Y-86600D02*
X66080Y-84830D01*
X68900Y-86600D02*
X95362Y-86600D01*
X38550Y-83050D02*
X40300Y-83050D01*
X42300Y-83050D02*
X44300Y-83050D01*
X46300Y-83050D02*
X48300Y-83050D01*
X50300Y-83050D02*
X52300Y-83050D01*
X54300Y-83050D02*
X56300Y-83050D01*
X58300Y-83050D02*
X60300Y-83050D01*
X62300Y-83050D02*
X64300Y-83050D01*
X60300Y-83050D02*
X62300Y-83050D01*
X56300Y-83050D02*
X58300Y-83050D01*
X52300Y-83050D02*
X54300Y-83050D01*
X48300Y-83050D02*
X50300Y-83050D01*
X44300Y-83050D02*
X46300Y-83050D01*
X40300Y-83050D02*
X42300Y-83050D01*
X37400Y-82450D02*
X37400Y-82860D01*
X56490Y-92780D02*
X54260Y-92780D01*
X54260Y-92780D02*
X54060Y-92580D01*
X58090Y-92780D02*
X56490Y-92780D01*
X56490Y-92780D02*
X56270Y-92780D01*
X56270Y-92780D02*
X56060Y-92990D01*
X60450Y-92780D02*
X58260Y-92780D01*
X58260Y-92780D02*
X58060Y-92580D01*
X62390Y-92780D02*
X60450Y-92780D01*
X60450Y-92780D02*
X60270Y-92780D01*
X60270Y-92780D02*
X60060Y-92990D01*
X62520Y-92780D02*
X62390Y-92780D01*
X62390Y-92780D02*
X62260Y-92780D01*
X62260Y-92780D02*
X62060Y-92580D01*
X66250Y-91540D02*
X65570Y-91540D01*
X65570Y-91540D02*
X65210Y-91900D01*
X66250Y-91330D02*
X66250Y-91540D01*
X66250Y-91540D02*
X66250Y-91750D01*
X66250Y-91750D02*
X65680Y-92320D01*
X38440Y-92780D02*
X38010Y-92780D01*
X38010Y-92780D02*
X37800Y-92990D01*
X37990Y-92780D02*
X37790Y-92580D01*
X64800Y-92780D02*
X62520Y-92780D01*
X62520Y-92780D02*
X58090Y-92780D01*
X58090Y-92780D02*
X38440Y-92780D01*
X38440Y-92780D02*
X37990Y-92780D01*
X66200Y-91380D02*
X66250Y-91330D01*
X138597Y-77405D02*
X138642Y-77450D01*
X138642Y-77450D02*
X139132Y-77450D01*
X139132Y-77450D02*
X139312Y-77630D01*
X139312Y-77630D02*
X139312Y-77880D01*
X139312Y-77880D02*
X134562Y-82630D01*
X134562Y-82630D02*
X134562Y-86620D01*
X134562Y-86620D02*
X129802Y-91380D01*
X129802Y-91380D02*
X66200Y-91380D01*
X66250Y-91330D02*
X64800Y-92780D01*
X70800Y-90115D02*
X97262Y-90115D01*
X39480Y-91060D02*
X41480Y-91060D01*
X43480Y-91060D02*
X45480Y-91060D01*
X47480Y-91060D02*
X49480Y-91060D01*
X51480Y-91060D02*
X53480Y-91060D01*
X55480Y-91060D02*
X57480Y-91060D01*
X59480Y-91060D02*
X61480Y-91060D01*
X61480Y-91060D02*
X63480Y-91060D01*
X57480Y-91060D02*
X59480Y-91060D01*
X53480Y-91060D02*
X55480Y-91060D01*
X49480Y-91060D02*
X51480Y-91060D01*
X45480Y-91060D02*
X47480Y-91060D01*
X41480Y-91060D02*
X43480Y-91060D01*
X37480Y-91060D02*
X39480Y-91060D01*
X64750Y-90115D02*
X64490Y-90115D01*
X64400Y-90115D02*
X63485Y-91055D01*
X63485Y-91055D02*
X63480Y-91060D01*
X37400Y-91060D02*
X63480Y-91060D01*
X37480Y-87230D02*
X39480Y-87230D01*
X41480Y-87230D02*
X43480Y-87230D01*
X45480Y-87230D02*
X47480Y-87230D01*
X49480Y-87230D02*
X51480Y-87230D01*
X53480Y-87230D02*
X55480Y-87230D01*
X57480Y-87230D02*
X59480Y-87230D01*
X61480Y-87230D02*
X63480Y-87230D01*
X59480Y-87230D02*
X61480Y-87230D01*
X55480Y-87230D02*
X57480Y-87230D01*
X51480Y-87230D02*
X53480Y-87230D01*
X47480Y-87230D02*
X49480Y-87230D01*
X43480Y-87230D02*
X45480Y-87230D01*
X39480Y-87230D02*
X41480Y-87230D01*
X37680Y-91060D02*
X37400Y-91060D01*
X37480Y-91060D02*
X37680Y-91060D01*
X69780Y-88210D02*
X96242Y-88210D01*
X69940Y-88550D02*
X96402Y-88550D01*
X65155Y-88210D02*
X64930Y-88210D01*
X63480Y-86885D02*
X37390Y-86890D01*
X64927Y-88207D02*
X64930Y-88210D01*
X96402Y-88550D02*
X98402Y-88550D01*
X100402Y-88550D02*
X102402Y-88550D01*
X104402Y-88550D02*
X106402Y-88550D01*
X108402Y-88550D02*
X110402Y-88550D01*
X112402Y-88550D02*
X114402Y-88550D01*
X116402Y-88550D02*
X118402Y-88550D01*
X120402Y-88550D02*
X122402Y-88550D01*
X124402Y-88550D02*
X126402Y-88550D01*
X128402Y-88550D02*
X126402Y-88550D01*
X122402Y-88550D02*
X124402Y-88550D01*
X118402Y-88550D02*
X120402Y-88550D01*
X114402Y-88550D02*
X116402Y-88550D01*
X110402Y-88550D02*
X112402Y-88550D01*
X106402Y-88550D02*
X108402Y-88550D01*
X102402Y-88550D02*
X104402Y-88550D01*
X98402Y-88550D02*
X100402Y-88550D01*
X66402Y-88550D02*
X68402Y-88550D01*
X70402Y-88550D02*
X72402Y-88550D01*
X74402Y-88550D02*
X76402Y-88550D01*
X78402Y-88550D02*
X80402Y-88550D01*
X82402Y-88550D02*
X84402Y-88550D01*
X86402Y-88550D02*
X88402Y-88550D01*
X90402Y-88550D02*
X92402Y-88550D01*
X96402Y-88550D02*
X94402Y-88550D01*
X92402Y-88550D02*
X94402Y-88550D01*
X88402Y-88550D02*
X90402Y-88550D01*
X84402Y-88550D02*
X86402Y-88550D01*
X80402Y-88550D02*
X82402Y-88550D01*
X76402Y-88550D02*
X78402Y-88550D01*
X72402Y-88550D02*
X74402Y-88550D01*
X68402Y-88550D02*
X70402Y-88550D01*
X128242Y-88210D02*
X126442Y-88210D01*
X96242Y-88210D02*
X98242Y-88210D01*
X100242Y-88210D02*
X102242Y-88210D01*
X104242Y-88210D02*
X106242Y-88210D01*
X108242Y-88210D02*
X110242Y-88210D01*
X112242Y-88210D02*
X114242Y-88210D01*
X116242Y-88210D02*
X118242Y-88210D01*
X120242Y-88210D02*
X122242Y-88210D01*
X124242Y-88210D02*
X126242Y-88210D01*
X128242Y-88210D02*
X126242Y-88210D01*
X122242Y-88210D02*
X124242Y-88210D01*
X118242Y-88210D02*
X120242Y-88210D01*
X114242Y-88210D02*
X116242Y-88210D01*
X110242Y-88210D02*
X112242Y-88210D01*
X106242Y-88210D02*
X108242Y-88210D01*
X102242Y-88210D02*
X104242Y-88210D01*
X98242Y-88210D02*
X100242Y-88210D01*
X66242Y-88210D02*
X68242Y-88210D01*
X70242Y-88210D02*
X72242Y-88210D01*
X74242Y-88210D02*
X76242Y-88210D01*
X78242Y-88210D02*
X80242Y-88210D01*
X82242Y-88210D02*
X84242Y-88210D01*
X86242Y-88210D02*
X88242Y-88210D01*
X90242Y-88210D02*
X92242Y-88210D01*
X96242Y-88210D02*
X94242Y-88210D01*
X92242Y-88210D02*
X94242Y-88210D01*
X88242Y-88210D02*
X90242Y-88210D01*
X84242Y-88210D02*
X86242Y-88210D01*
X80242Y-88210D02*
X82242Y-88210D01*
X76242Y-88210D02*
X78242Y-88210D01*
X72242Y-88210D02*
X74242Y-88210D01*
X68242Y-88210D02*
X70242Y-88210D01*
X133532Y-78000D02*
X131387Y-80160D01*
X133767Y-77765D02*
X133532Y-78000D01*
X131392Y-82660D02*
X131372Y-83800D01*
X131387Y-80160D02*
X131392Y-82660D01*
X133767Y-77465D02*
X133767Y-77765D01*
X131372Y-83800D02*
X131382Y-85090D01*
X131377Y-85095D02*
X131382Y-85090D01*
X131382Y-85090D02*
X131377Y-85095D01*
X133992Y-78000D02*
X131712Y-80280D01*
X134358Y-77634D02*
X133992Y-78000D01*
X131692Y-82740D02*
X131692Y-85225D01*
X131712Y-80280D02*
X131692Y-82740D01*
X131692Y-85225D02*
X130042Y-86885D01*
X134358Y-77469D02*
X134358Y-77634D01*
X129267Y-90170D02*
X127462Y-90115D01*
X97262Y-90115D02*
X99262Y-90115D01*
X101262Y-90115D02*
X103262Y-90115D01*
X105262Y-90115D02*
X107262Y-90115D01*
X109262Y-90115D02*
X111262Y-90115D01*
X113262Y-90115D02*
X115262Y-90115D01*
X117262Y-90115D02*
X119262Y-90115D01*
X121262Y-90115D02*
X123262Y-90115D01*
X125262Y-90115D02*
X127262Y-90115D01*
X129267Y-90170D02*
X127262Y-90115D01*
X123262Y-90115D02*
X125262Y-90115D01*
X119262Y-90115D02*
X121262Y-90115D01*
X115262Y-90115D02*
X117262Y-90115D01*
X111262Y-90115D02*
X113262Y-90115D01*
X107262Y-90115D02*
X109262Y-90115D01*
X103262Y-90115D02*
X105262Y-90115D01*
X99262Y-90115D02*
X101262Y-90115D01*
X67262Y-90115D02*
X69262Y-90115D01*
X71262Y-90115D02*
X73262Y-90115D01*
X75262Y-90115D02*
X77262Y-90115D01*
X79262Y-90115D02*
X81262Y-90115D01*
X83262Y-90115D02*
X85262Y-90115D01*
X87262Y-90115D02*
X89262Y-90115D01*
X91262Y-90115D02*
X93262Y-90115D01*
X97262Y-90115D02*
X95262Y-90115D01*
X93262Y-90115D02*
X95262Y-90115D01*
X89262Y-90115D02*
X91262Y-90115D01*
X85262Y-90115D02*
X87262Y-90115D01*
X81262Y-90115D02*
X83262Y-90115D01*
X77262Y-90115D02*
X79262Y-90115D01*
X73262Y-90115D02*
X75262Y-90115D01*
X69262Y-90115D02*
X71262Y-90115D01*
X65262Y-90115D02*
X67262Y-90115D01*
X133302Y-83960D02*
X133332Y-84100D01*
X133332Y-84100D02*
X133317Y-86115D01*
X129267Y-90170D02*
X130687Y-88750D01*
X130687Y-88750D02*
X131907Y-87530D01*
X131907Y-87530D02*
X133317Y-86115D01*
X64750Y-90115D02*
X64400Y-90115D01*
X71362Y-86600D02*
X73362Y-86600D01*
X75362Y-86600D02*
X77362Y-86600D01*
X79362Y-86600D02*
X81362Y-86600D01*
X83362Y-86600D02*
X85362Y-86600D01*
X87362Y-86600D02*
X89362Y-86600D01*
X91362Y-86600D02*
X93362Y-86600D01*
X95362Y-86600D02*
X93362Y-86600D01*
X89362Y-86600D02*
X91362Y-86600D01*
X85362Y-86600D02*
X87362Y-86600D01*
X81362Y-86600D02*
X83362Y-86600D01*
X77362Y-86600D02*
X79362Y-86600D01*
X73362Y-86600D02*
X75362Y-86600D01*
X69362Y-86600D02*
X71362Y-86600D01*
X65220Y-88550D02*
X64800Y-88550D01*
X63480Y-87230D02*
X37390Y-87230D01*
X64800Y-88550D02*
X63480Y-87230D01*
X134358Y-76793D02*
X134358Y-77469D01*
X64810Y-88550D02*
X64930Y-88550D01*
X128402Y-88550D02*
X67940Y-88550D01*
X67940Y-88550D02*
X65220Y-88550D01*
X65220Y-88550D02*
X64810Y-88550D01*
X130042Y-86885D02*
X128402Y-88550D01*
X133767Y-76793D02*
X133767Y-77465D01*
X128242Y-88210D02*
X67780Y-88210D01*
X67780Y-88210D02*
X65155Y-88210D01*
X131377Y-85095D02*
X129822Y-86655D01*
X129822Y-86655D02*
X128242Y-88210D01*
X134712Y-80585D02*
X133332Y-81990D01*
X133332Y-81990D02*
X133302Y-83960D01*
G54D18*
X68350Y-85500D02*
X64450Y-81600D01*
X69000Y-85500D02*
X68350Y-85500D01*
X128662Y-83600D02*
X126762Y-85500D01*
X126762Y-85500D02*
X69000Y-85500D01*
G54D19*
X128562Y-74800D02*
X128562Y-75800D01*
X128562Y-75800D02*
X128662Y-75900D01*
G54D18*
X128662Y-75900D02*
X128662Y-76350D01*
X128662Y-76350D02*
X128662Y-83600D01*
X64450Y-81600D02*
X63550Y-81600D01*
G54D15*
X137704Y-77558D02*
X137704Y-77534D01*
X137704Y-77534D02*
X137704Y-76793D01*
X137704Y-77558D02*
X137522Y-77740D01*
X137522Y-77740D02*
X137277Y-78015D01*
X134712Y-80585D02*
X135857Y-79435D01*
X135857Y-79435D02*
X137277Y-78015D01*
X129099Y-75337D02*
X129504Y-75337D01*
X129099Y-75337D02*
X128562Y-74800D01*
X136129Y-75337D02*
X136129Y-75833D01*
X135862Y-76100D02*
X134962Y-76100D01*
X136129Y-75833D02*
X135862Y-76100D01*
X137507Y-75337D02*
X137507Y-75924D01*
X137507Y-75924D02*
X137704Y-76121D01*
X137704Y-76793D02*
X137704Y-76121D01*
X137704Y-76121D02*
X137704Y-75986D01*
X137704Y-75986D02*
X137704Y-75337D01*
X137901Y-75337D02*
X137901Y-76030D01*
X137901Y-76030D02*
X137901Y-76793D01*
X137901Y-76793D02*
X137901Y-77170D01*
X137901Y-77170D02*
X137901Y-77401D01*
X128362Y-85600D02*
X127337Y-86570D01*
X129762Y-84200D02*
X128517Y-85375D01*
X128517Y-85375D02*
X128362Y-85600D01*
X129752Y-84000D02*
X129752Y-82000D01*
X129752Y-80000D02*
X129762Y-78000D01*
X130224Y-77538D02*
X129762Y-78000D01*
X130224Y-77486D02*
X130224Y-77538D01*
X129752Y-82000D02*
X129752Y-80000D01*
X129752Y-84000D02*
X129762Y-84200D01*
X130224Y-77296D02*
X130224Y-77486D01*
X130224Y-76793D02*
X130224Y-77296D01*
X127337Y-86570D02*
X125562Y-86600D01*
X130224Y-76793D02*
X130224Y-76082D01*
X130224Y-76082D02*
X130224Y-76002D01*
X130224Y-76002D02*
X130224Y-75337D01*
X135145Y-75337D02*
X135145Y-75917D01*
X134948Y-76085D02*
X134962Y-76100D01*
X134948Y-76085D02*
X134948Y-75337D01*
X135145Y-75917D02*
X134962Y-76100D01*
X134948Y-75337D02*
X134948Y-75814D01*
X134662Y-76100D02*
X134362Y-76100D01*
X134948Y-75814D02*
X134662Y-76100D01*
X134751Y-75337D02*
X134751Y-75711D01*
X134751Y-75711D02*
X134362Y-76100D01*
X134555Y-75337D02*
X134555Y-75907D01*
X134555Y-75907D02*
X134362Y-76100D01*
X133570Y-75337D02*
X133570Y-75907D01*
X133570Y-75907D02*
X133762Y-76100D01*
X133373Y-75337D02*
X133373Y-75711D01*
X133373Y-75711D02*
X133762Y-76100D01*
X133964Y-75337D02*
X133964Y-75898D01*
X133964Y-75898D02*
X133762Y-76100D01*
X134161Y-75337D02*
X134161Y-75898D01*
X134161Y-75898D02*
X134362Y-76100D01*
X134161Y-76793D02*
X134161Y-76301D01*
X134161Y-76301D02*
X134362Y-76100D01*
X133964Y-76793D02*
X133964Y-76301D01*
X133964Y-76301D02*
X133762Y-76100D01*
X134362Y-76100D02*
X134362Y-75341D01*
X134358Y-76104D02*
X134362Y-76100D01*
X134358Y-76793D02*
X134358Y-76104D01*
X134362Y-75341D02*
X134358Y-75337D01*
X133767Y-75337D02*
X133767Y-76095D01*
X133767Y-76104D02*
X133762Y-76100D01*
X133767Y-76104D02*
X133767Y-76793D01*
X133767Y-76095D02*
X133762Y-76100D01*
G54D10*
G36*
X64675Y-82755D02*
X38245Y-82755D01*
X38269Y-82695D01*
X38270Y-82614D01*
X38238Y-82539D01*
X38181Y-82481D01*
X38105Y-82450D01*
X38024Y-82449D01*
X37949Y-82481D01*
X37899Y-82530D01*
X37846Y-82476D01*
X37770Y-82445D01*
X37689Y-82444D01*
X37614Y-82476D01*
X37605Y-82485D01*
X37605Y-82159D01*
X37573Y-82084D01*
X37564Y-82075D01*
X37573Y-82066D01*
X37604Y-81990D01*
X37605Y-81909D01*
X37573Y-81834D01*
X37516Y-81776D01*
X37440Y-81745D01*
X37359Y-81744D01*
X37284Y-81776D01*
X37226Y-81833D01*
X37195Y-81909D01*
X37194Y-81990D01*
X37226Y-82065D01*
X37235Y-82074D01*
X37226Y-82083D01*
X37195Y-82159D01*
X37194Y-82240D01*
X37226Y-82315D01*
X37283Y-82373D01*
X37359Y-82404D01*
X37440Y-82405D01*
X37515Y-82373D01*
X37573Y-82316D01*
X37604Y-82240D01*
X37605Y-82159D01*
X37605Y-82485D01*
X37556Y-82533D01*
X37525Y-82609D01*
X37524Y-82690D01*
X37556Y-82765D01*
X37584Y-82794D01*
X37474Y-82905D01*
X37085Y-82905D01*
X37085Y-80875D01*
X64289Y-80875D01*
X64675Y-81260D01*
X64675Y-82755D01*
X64675Y-82755D01*
G37*
G54D20*
X64675Y-82755D02*
X38245Y-82755D01*
X38269Y-82695D01*
X38270Y-82614D01*
X38238Y-82539D01*
X38181Y-82481D01*
X38105Y-82450D01*
X38024Y-82449D01*
X37949Y-82481D01*
X37899Y-82530D01*
X37846Y-82476D01*
X37770Y-82445D01*
X37689Y-82444D01*
X37614Y-82476D01*
X37605Y-82485D01*
X37605Y-82159D01*
X37573Y-82084D01*
X37564Y-82075D01*
X37573Y-82066D01*
X37604Y-81990D01*
X37605Y-81909D01*
X37573Y-81834D01*
X37516Y-81776D01*
X37440Y-81745D01*
X37359Y-81744D01*
X37284Y-81776D01*
X37226Y-81833D01*
X37195Y-81909D01*
X37194Y-81990D01*
X37226Y-82065D01*
X37235Y-82074D01*
X37226Y-82083D01*
X37195Y-82159D01*
X37194Y-82240D01*
X37226Y-82315D01*
X37283Y-82373D01*
X37359Y-82404D01*
X37440Y-82405D01*
X37515Y-82373D01*
X37573Y-82316D01*
X37604Y-82240D01*
X37605Y-82159D01*
X37605Y-82485D01*
X37556Y-82533D01*
X37525Y-82609D01*
X37524Y-82690D01*
X37556Y-82765D01*
X37584Y-82794D01*
X37474Y-82905D01*
X37085Y-82905D01*
X37085Y-80875D01*
X64289Y-80875D01*
X64675Y-81260D01*
X64675Y-82755D01*
G54D10*
G36*
X131677Y-74525D02*
X131675Y-74527D01*
X131617Y-74665D01*
X131617Y-74814D01*
X131638Y-74864D01*
X131637Y-74866D01*
X131637Y-74867D01*
X131631Y-74872D01*
X131631Y-74875D01*
X131615Y-74875D01*
X131591Y-74850D01*
X131521Y-74821D01*
X131516Y-74816D01*
X131509Y-74816D01*
X131498Y-74816D01*
X131491Y-74816D01*
X131486Y-74821D01*
X131415Y-74850D01*
X131405Y-74861D01*
X131395Y-74850D01*
X131324Y-74821D01*
X131319Y-74816D01*
X131312Y-74816D01*
X131301Y-74816D01*
X131294Y-74816D01*
X131289Y-74821D01*
X131218Y-74850D01*
X131194Y-74875D01*
X131179Y-74875D01*
X131179Y-74872D01*
X131168Y-74862D01*
X131187Y-74814D01*
X131187Y-74665D01*
X131131Y-74527D01*
X131128Y-74525D01*
X131677Y-74525D01*
X131677Y-74525D01*
G37*
G54D20*
X131677Y-74525D02*
X131675Y-74527D01*
X131617Y-74665D01*
X131617Y-74814D01*
X131638Y-74864D01*
X131637Y-74866D01*
X131637Y-74867D01*
X131631Y-74872D01*
X131631Y-74875D01*
X131615Y-74875D01*
X131591Y-74850D01*
X131521Y-74821D01*
X131516Y-74816D01*
X131509Y-74816D01*
X131498Y-74816D01*
X131491Y-74816D01*
X131486Y-74821D01*
X131415Y-74850D01*
X131405Y-74861D01*
X131395Y-74850D01*
X131324Y-74821D01*
X131319Y-74816D01*
X131312Y-74816D01*
X131301Y-74816D01*
X131294Y-74816D01*
X131289Y-74821D01*
X131218Y-74850D01*
X131194Y-74875D01*
X131179Y-74875D01*
X131179Y-74872D01*
X131168Y-74862D01*
X131187Y-74814D01*
X131187Y-74665D01*
X131131Y-74527D01*
X131128Y-74525D01*
X131677Y-74525D01*
G54D10*
G36*
X135167Y-74875D02*
X135159Y-74875D01*
X135135Y-74850D01*
X135064Y-74821D01*
X135059Y-74816D01*
X135052Y-74816D01*
X135041Y-74816D01*
X135034Y-74816D01*
X135029Y-74821D01*
X134959Y-74850D01*
X134948Y-74861D01*
X134938Y-74850D01*
X134868Y-74821D01*
X134862Y-74816D01*
X134855Y-74816D01*
X134844Y-74816D01*
X134837Y-74816D01*
X134832Y-74821D01*
X134762Y-74850D01*
X134751Y-74861D01*
X134741Y-74850D01*
X134671Y-74821D01*
X134666Y-74816D01*
X134658Y-74816D01*
X134648Y-74816D01*
X134640Y-74816D01*
X134635Y-74821D01*
X134565Y-74850D01*
X134555Y-74861D01*
X134544Y-74850D01*
X134474Y-74821D01*
X134469Y-74816D01*
X134462Y-74816D01*
X134451Y-74816D01*
X134443Y-74816D01*
X134438Y-74821D01*
X134368Y-74850D01*
X134358Y-74861D01*
X134347Y-74850D01*
X134277Y-74821D01*
X134272Y-74816D01*
X134265Y-74816D01*
X134254Y-74816D01*
X134247Y-74816D01*
X134241Y-74821D01*
X134171Y-74850D01*
X134161Y-74861D01*
X134150Y-74850D01*
X134080Y-74821D01*
X134075Y-74816D01*
X134068Y-74816D01*
X134057Y-74816D01*
X134050Y-74816D01*
X134045Y-74821D01*
X133974Y-74850D01*
X133964Y-74861D01*
X133954Y-74850D01*
X133883Y-74821D01*
X133878Y-74816D01*
X133871Y-74816D01*
X133860Y-74816D01*
X133853Y-74816D01*
X133848Y-74821D01*
X133777Y-74850D01*
X133767Y-74861D01*
X133757Y-74850D01*
X133686Y-74821D01*
X133681Y-74816D01*
X133674Y-74816D01*
X133663Y-74816D01*
X133656Y-74816D01*
X133651Y-74821D01*
X133581Y-74850D01*
X133570Y-74861D01*
X133560Y-74850D01*
X133490Y-74821D01*
X133485Y-74816D01*
X133477Y-74816D01*
X133466Y-74816D01*
X133459Y-74816D01*
X133454Y-74821D01*
X133384Y-74850D01*
X133360Y-74875D01*
X133344Y-74875D01*
X133344Y-74872D01*
X133288Y-74816D01*
X133270Y-74816D01*
X133187Y-74850D01*
X133163Y-74875D01*
X132993Y-74875D01*
X132969Y-74850D01*
X132887Y-74816D01*
X132869Y-74816D01*
X132812Y-74872D01*
X132812Y-74875D01*
X132797Y-74875D01*
X132773Y-74850D01*
X132702Y-74821D01*
X132697Y-74816D01*
X132690Y-74816D01*
X132679Y-74816D01*
X132672Y-74816D01*
X132667Y-74821D01*
X132596Y-74850D01*
X132586Y-74861D01*
X132576Y-74850D01*
X132505Y-74821D01*
X132500Y-74816D01*
X132493Y-74816D01*
X132482Y-74816D01*
X132475Y-74816D01*
X132470Y-74821D01*
X132400Y-74850D01*
X132376Y-74875D01*
X132360Y-74875D01*
X132360Y-74872D01*
X132348Y-74861D01*
X132367Y-74814D01*
X132367Y-74665D01*
X132311Y-74527D01*
X132308Y-74525D01*
X135160Y-74525D01*
X135137Y-74579D01*
X135137Y-74660D01*
X135167Y-74732D01*
X135167Y-74875D01*
X135167Y-74875D01*
G37*
G54D20*
X135167Y-74875D02*
X135159Y-74875D01*
X135135Y-74850D01*
X135064Y-74821D01*
X135059Y-74816D01*
X135052Y-74816D01*
X135041Y-74816D01*
X135034Y-74816D01*
X135029Y-74821D01*
X134959Y-74850D01*
X134948Y-74861D01*
X134938Y-74850D01*
X134868Y-74821D01*
X134862Y-74816D01*
X134855Y-74816D01*
X134844Y-74816D01*
X134837Y-74816D01*
X134832Y-74821D01*
X134762Y-74850D01*
X134751Y-74861D01*
X134741Y-74850D01*
X134671Y-74821D01*
X134666Y-74816D01*
X134658Y-74816D01*
X134648Y-74816D01*
X134640Y-74816D01*
X134635Y-74821D01*
X134565Y-74850D01*
X134555Y-74861D01*
X134544Y-74850D01*
X134474Y-74821D01*
X134469Y-74816D01*
X134462Y-74816D01*
X134451Y-74816D01*
X134443Y-74816D01*
X134438Y-74821D01*
X134368Y-74850D01*
X134358Y-74861D01*
X134347Y-74850D01*
X134277Y-74821D01*
X134272Y-74816D01*
X134265Y-74816D01*
X134254Y-74816D01*
X134247Y-74816D01*
X134241Y-74821D01*
X134171Y-74850D01*
X134161Y-74861D01*
X134150Y-74850D01*
X134080Y-74821D01*
X134075Y-74816D01*
X134068Y-74816D01*
X134057Y-74816D01*
X134050Y-74816D01*
X134045Y-74821D01*
X133974Y-74850D01*
X133964Y-74861D01*
X133954Y-74850D01*
X133883Y-74821D01*
X133878Y-74816D01*
X133871Y-74816D01*
X133860Y-74816D01*
X133853Y-74816D01*
X133848Y-74821D01*
X133777Y-74850D01*
X133767Y-74861D01*
X133757Y-74850D01*
X133686Y-74821D01*
X133681Y-74816D01*
X133674Y-74816D01*
X133663Y-74816D01*
X133656Y-74816D01*
X133651Y-74821D01*
X133581Y-74850D01*
X133570Y-74861D01*
X133560Y-74850D01*
X133490Y-74821D01*
X133485Y-74816D01*
X133477Y-74816D01*
X133466Y-74816D01*
X133459Y-74816D01*
X133454Y-74821D01*
X133384Y-74850D01*
X133360Y-74875D01*
X133344Y-74875D01*
X133344Y-74872D01*
X133288Y-74816D01*
X133270Y-74816D01*
X133187Y-74850D01*
X133163Y-74875D01*
X132993Y-74875D01*
X132969Y-74850D01*
X132887Y-74816D01*
X132869Y-74816D01*
X132812Y-74872D01*
X132812Y-74875D01*
X132797Y-74875D01*
X132773Y-74850D01*
X132702Y-74821D01*
X132697Y-74816D01*
X132690Y-74816D01*
X132679Y-74816D01*
X132672Y-74816D01*
X132667Y-74821D01*
X132596Y-74850D01*
X132586Y-74861D01*
X132576Y-74850D01*
X132505Y-74821D01*
X132500Y-74816D01*
X132493Y-74816D01*
X132482Y-74816D01*
X132475Y-74816D01*
X132470Y-74821D01*
X132400Y-74850D01*
X132376Y-74875D01*
X132360Y-74875D01*
X132360Y-74872D01*
X132348Y-74861D01*
X132367Y-74814D01*
X132367Y-74665D01*
X132311Y-74527D01*
X132308Y-74525D01*
X135160Y-74525D01*
X135137Y-74579D01*
X135137Y-74660D01*
X135167Y-74732D01*
X135167Y-74875D01*
G54D10*
G36*
X139837Y-77920D02*
X138087Y-79670D01*
X135960Y-81797D01*
X135960Y-81797D01*
X135000Y-82757D01*
X134969Y-82804D01*
X134968Y-82809D01*
X134957Y-82819D01*
X134957Y-86640D01*
X129993Y-91605D01*
X67509Y-91605D01*
X67499Y-91615D01*
X67499Y-91615D01*
X67494Y-91616D01*
X67447Y-91647D01*
X65790Y-93305D01*
X37599Y-93305D01*
X37604Y-93290D01*
X37605Y-93209D01*
X37573Y-93134D01*
X37516Y-93076D01*
X37464Y-93054D01*
X37515Y-93033D01*
X37573Y-92976D01*
X37604Y-92900D01*
X37605Y-92819D01*
X37573Y-92744D01*
X37516Y-92686D01*
X37440Y-92655D01*
X37359Y-92654D01*
X37284Y-92686D01*
X37226Y-92743D01*
X37195Y-92819D01*
X37194Y-92900D01*
X37226Y-92975D01*
X37283Y-93033D01*
X37335Y-93055D01*
X37284Y-93076D01*
X37226Y-93133D01*
X37195Y-93209D01*
X37194Y-93290D01*
X37200Y-93305D01*
X37085Y-93305D01*
X37085Y-91325D01*
X37286Y-91325D01*
X37284Y-91326D01*
X37226Y-91383D01*
X37195Y-91459D01*
X37194Y-91540D01*
X37226Y-91615D01*
X37283Y-91673D01*
X37335Y-91695D01*
X37284Y-91716D01*
X37226Y-91773D01*
X37195Y-91849D01*
X37194Y-91930D01*
X37226Y-92005D01*
X37283Y-92063D01*
X37359Y-92094D01*
X37440Y-92095D01*
X37515Y-92063D01*
X37573Y-92006D01*
X37604Y-91930D01*
X37605Y-91849D01*
X37573Y-91774D01*
X37516Y-91716D01*
X37464Y-91694D01*
X37515Y-91673D01*
X37573Y-91616D01*
X37604Y-91540D01*
X37605Y-91459D01*
X37573Y-91384D01*
X37516Y-91326D01*
X37513Y-91325D01*
X63710Y-91325D01*
X64630Y-90405D01*
X129353Y-90405D01*
X133567Y-86190D01*
X133547Y-82070D01*
X137943Y-77675D01*
X137712Y-77675D01*
X133397Y-81989D01*
X133397Y-86129D01*
X129292Y-90235D01*
X64549Y-90235D01*
X63629Y-91155D01*
X37605Y-91155D01*
X37605Y-90479D01*
X37573Y-90404D01*
X37516Y-90346D01*
X37464Y-90324D01*
X37515Y-90303D01*
X37573Y-90246D01*
X37604Y-90170D01*
X37605Y-90089D01*
X37573Y-90014D01*
X37516Y-89956D01*
X37452Y-89929D01*
X37515Y-89903D01*
X37573Y-89846D01*
X37604Y-89770D01*
X37605Y-89689D01*
X37573Y-89614D01*
X37516Y-89556D01*
X37464Y-89534D01*
X37515Y-89513D01*
X37573Y-89456D01*
X37604Y-89380D01*
X37605Y-89299D01*
X37573Y-89224D01*
X37516Y-89166D01*
X37452Y-89139D01*
X37515Y-89113D01*
X37573Y-89056D01*
X37604Y-88980D01*
X37605Y-88899D01*
X37573Y-88824D01*
X37516Y-88766D01*
X37440Y-88735D01*
X37440Y-88735D01*
X37515Y-88703D01*
X37573Y-88646D01*
X37604Y-88570D01*
X37605Y-88489D01*
X37573Y-88414D01*
X37516Y-88356D01*
X37476Y-88339D01*
X37515Y-88323D01*
X37573Y-88266D01*
X37604Y-88190D01*
X37605Y-88109D01*
X37573Y-88034D01*
X37516Y-87976D01*
X37464Y-87954D01*
X37515Y-87933D01*
X37573Y-87876D01*
X37604Y-87800D01*
X37605Y-87719D01*
X37573Y-87644D01*
X37516Y-87586D01*
X37440Y-87555D01*
X37359Y-87554D01*
X37284Y-87586D01*
X37226Y-87643D01*
X37195Y-87719D01*
X37194Y-87800D01*
X37226Y-87875D01*
X37283Y-87933D01*
X37335Y-87955D01*
X37284Y-87976D01*
X37226Y-88033D01*
X37195Y-88109D01*
X37194Y-88190D01*
X37226Y-88265D01*
X37283Y-88323D01*
X37323Y-88340D01*
X37284Y-88356D01*
X37226Y-88413D01*
X37195Y-88489D01*
X37194Y-88570D01*
X37226Y-88645D01*
X37283Y-88703D01*
X37359Y-88734D01*
X37440Y-88735D01*
X37359Y-88734D01*
X37284Y-88766D01*
X37226Y-88823D01*
X37195Y-88899D01*
X37194Y-88980D01*
X37226Y-89055D01*
X37283Y-89113D01*
X37347Y-89140D01*
X37284Y-89166D01*
X37226Y-89223D01*
X37195Y-89299D01*
X37194Y-89380D01*
X37226Y-89455D01*
X37283Y-89513D01*
X37335Y-89535D01*
X37284Y-89556D01*
X37226Y-89613D01*
X37195Y-89689D01*
X37194Y-89770D01*
X37226Y-89845D01*
X37283Y-89903D01*
X37347Y-89930D01*
X37284Y-89956D01*
X37226Y-90013D01*
X37195Y-90089D01*
X37194Y-90170D01*
X37226Y-90245D01*
X37283Y-90303D01*
X37335Y-90325D01*
X37284Y-90346D01*
X37226Y-90403D01*
X37195Y-90479D01*
X37194Y-90560D01*
X37226Y-90635D01*
X37283Y-90693D01*
X37359Y-90724D01*
X37440Y-90725D01*
X37515Y-90693D01*
X37573Y-90636D01*
X37604Y-90560D01*
X37605Y-90479D01*
X37605Y-91155D01*
X37085Y-91155D01*
X37085Y-87145D01*
X63509Y-87145D01*
X64829Y-88465D01*
X128373Y-88465D01*
X131627Y-85210D01*
X131627Y-80250D01*
X134203Y-77675D01*
X133972Y-77675D01*
X131457Y-80189D01*
X131457Y-85109D01*
X128292Y-88295D01*
X64890Y-88295D01*
X63580Y-86975D01*
X37605Y-86975D01*
X37605Y-86139D01*
X37573Y-86064D01*
X37516Y-86006D01*
X37464Y-85984D01*
X37515Y-85963D01*
X37573Y-85906D01*
X37604Y-85830D01*
X37605Y-85749D01*
X37573Y-85674D01*
X37516Y-85616D01*
X37452Y-85589D01*
X37515Y-85563D01*
X37573Y-85506D01*
X37604Y-85430D01*
X37605Y-85349D01*
X37573Y-85274D01*
X37516Y-85216D01*
X37464Y-85194D01*
X37515Y-85173D01*
X37573Y-85116D01*
X37604Y-85040D01*
X37605Y-84959D01*
X37573Y-84884D01*
X37516Y-84826D01*
X37452Y-84799D01*
X37515Y-84773D01*
X37573Y-84716D01*
X37604Y-84640D01*
X37605Y-84559D01*
X37573Y-84484D01*
X37516Y-84426D01*
X37464Y-84404D01*
X37515Y-84383D01*
X37573Y-84326D01*
X37604Y-84250D01*
X37605Y-84169D01*
X37573Y-84094D01*
X37516Y-84036D01*
X37452Y-84009D01*
X37515Y-83983D01*
X37573Y-83926D01*
X37604Y-83850D01*
X37605Y-83769D01*
X37573Y-83694D01*
X37516Y-83636D01*
X37464Y-83614D01*
X37515Y-83593D01*
X37573Y-83536D01*
X37604Y-83460D01*
X37605Y-83379D01*
X37573Y-83304D01*
X37516Y-83246D01*
X37440Y-83215D01*
X37359Y-83214D01*
X37284Y-83246D01*
X37226Y-83303D01*
X37195Y-83379D01*
X37194Y-83460D01*
X37226Y-83535D01*
X37283Y-83593D01*
X37335Y-83615D01*
X37284Y-83636D01*
X37226Y-83693D01*
X37195Y-83769D01*
X37194Y-83850D01*
X37226Y-83925D01*
X37283Y-83983D01*
X37347Y-84010D01*
X37284Y-84036D01*
X37226Y-84093D01*
X37195Y-84169D01*
X37194Y-84250D01*
X37226Y-84325D01*
X37283Y-84383D01*
X37335Y-84405D01*
X37284Y-84426D01*
X37226Y-84483D01*
X37195Y-84559D01*
X37194Y-84640D01*
X37226Y-84715D01*
X37283Y-84773D01*
X37347Y-84800D01*
X37284Y-84826D01*
X37226Y-84883D01*
X37195Y-84959D01*
X37194Y-85040D01*
X37226Y-85115D01*
X37283Y-85173D01*
X37335Y-85195D01*
X37284Y-85216D01*
X37226Y-85273D01*
X37195Y-85349D01*
X37194Y-85430D01*
X37226Y-85505D01*
X37283Y-85563D01*
X37347Y-85590D01*
X37284Y-85616D01*
X37226Y-85673D01*
X37195Y-85749D01*
X37194Y-85830D01*
X37226Y-85905D01*
X37283Y-85963D01*
X37335Y-85985D01*
X37284Y-86006D01*
X37226Y-86063D01*
X37195Y-86139D01*
X37194Y-86220D01*
X37226Y-86295D01*
X37283Y-86353D01*
X37359Y-86384D01*
X37440Y-86385D01*
X37515Y-86353D01*
X37573Y-86296D01*
X37604Y-86220D01*
X37605Y-86139D01*
X37605Y-86975D01*
X37085Y-86975D01*
X37085Y-83075D01*
X37550Y-83075D01*
X37700Y-82925D01*
X64274Y-82925D01*
X67874Y-86525D01*
X68900Y-86525D01*
X127273Y-86525D01*
X129687Y-84110D01*
X129687Y-77675D01*
X128287Y-77675D01*
X128287Y-74525D01*
X130497Y-74525D01*
X130495Y-74527D01*
X130437Y-74665D01*
X130437Y-74814D01*
X130458Y-74864D01*
X130458Y-74864D01*
X130457Y-74866D01*
X130457Y-74866D01*
X130450Y-74872D01*
X130450Y-74875D01*
X130434Y-74875D01*
X130410Y-74850D01*
X130340Y-74821D01*
X130335Y-74816D01*
X130328Y-74816D01*
X130317Y-74816D01*
X130310Y-74816D01*
X130304Y-74821D01*
X130234Y-74850D01*
X130210Y-74875D01*
X130194Y-74875D01*
X130194Y-74872D01*
X130138Y-74816D01*
X130120Y-74816D01*
X130037Y-74850D01*
X129974Y-74914D01*
X129940Y-74996D01*
X129940Y-75086D01*
X129940Y-75205D01*
X129996Y-75262D01*
X130037Y-75262D01*
X130037Y-75412D01*
X129996Y-75412D01*
X129940Y-75468D01*
X129940Y-75587D01*
X129940Y-75677D01*
X129974Y-75759D01*
X130037Y-75823D01*
X130037Y-75823D01*
X130037Y-75825D01*
X130042Y-75825D01*
X130120Y-75857D01*
X130138Y-75857D01*
X130170Y-75825D01*
X130239Y-75825D01*
X130304Y-75852D01*
X130310Y-75857D01*
X130317Y-75857D01*
X130328Y-75857D01*
X130335Y-75857D01*
X130340Y-75852D01*
X130406Y-75825D01*
X130474Y-75825D01*
X130506Y-75857D01*
X130524Y-75857D01*
X130602Y-75825D01*
X131026Y-75825D01*
X131104Y-75857D01*
X131122Y-75857D01*
X131155Y-75825D01*
X131223Y-75825D01*
X131289Y-75852D01*
X131294Y-75857D01*
X131301Y-75857D01*
X131312Y-75857D01*
X131319Y-75857D01*
X131324Y-75852D01*
X131390Y-75825D01*
X131420Y-75825D01*
X131486Y-75852D01*
X131491Y-75857D01*
X131498Y-75857D01*
X131509Y-75857D01*
X131516Y-75857D01*
X131521Y-75852D01*
X131587Y-75825D01*
X131655Y-75825D01*
X131688Y-75857D01*
X131706Y-75857D01*
X131784Y-75825D01*
X132207Y-75825D01*
X132285Y-75857D01*
X132303Y-75857D01*
X132336Y-75825D01*
X132404Y-75825D01*
X132470Y-75852D01*
X132475Y-75857D01*
X132482Y-75857D01*
X132493Y-75857D01*
X132500Y-75857D01*
X132505Y-75852D01*
X132571Y-75825D01*
X132601Y-75825D01*
X132667Y-75852D01*
X132672Y-75857D01*
X132679Y-75857D01*
X132690Y-75857D01*
X132697Y-75857D01*
X132702Y-75852D01*
X132708Y-75849D01*
X132708Y-75857D01*
X132716Y-75857D01*
X132687Y-75925D01*
X132687Y-76074D01*
X132744Y-76212D01*
X132850Y-76317D01*
X132984Y-76373D01*
X132896Y-76373D01*
X132892Y-76375D01*
X132871Y-76375D01*
X132867Y-76373D01*
X132817Y-76373D01*
X132699Y-76373D01*
X132695Y-76375D01*
X132674Y-76375D01*
X132670Y-76373D01*
X132620Y-76373D01*
X132502Y-76373D01*
X132498Y-76375D01*
X132477Y-76375D01*
X132473Y-76373D01*
X132423Y-76373D01*
X132305Y-76373D01*
X132301Y-76375D01*
X132280Y-76375D01*
X132276Y-76373D01*
X132227Y-76373D01*
X132108Y-76373D01*
X132105Y-76375D01*
X132083Y-76375D01*
X132079Y-76373D01*
X132030Y-76373D01*
X131912Y-76373D01*
X131908Y-76375D01*
X131886Y-76375D01*
X131883Y-76373D01*
X131833Y-76373D01*
X131715Y-76373D01*
X131711Y-76375D01*
X131690Y-76375D01*
X131686Y-76373D01*
X131636Y-76373D01*
X131518Y-76373D01*
X131514Y-76375D01*
X131493Y-76375D01*
X131489Y-76373D01*
X131439Y-76373D01*
X131321Y-76373D01*
X131317Y-76375D01*
X131296Y-76375D01*
X131292Y-76373D01*
X131242Y-76373D01*
X131124Y-76373D01*
X131120Y-76375D01*
X131099Y-76375D01*
X131095Y-76373D01*
X131045Y-76373D01*
X130927Y-76373D01*
X130924Y-76375D01*
X130902Y-76375D01*
X130898Y-76373D01*
X130849Y-76373D01*
X130730Y-76373D01*
X130727Y-76375D01*
X130705Y-76375D01*
X130701Y-76373D01*
X130672Y-76373D01*
X130670Y-76370D01*
X130607Y-76307D01*
X130524Y-76273D01*
X130506Y-76273D01*
X130450Y-76329D01*
X130450Y-76347D01*
X130410Y-76307D01*
X130340Y-76278D01*
X130335Y-76273D01*
X130328Y-76273D01*
X130317Y-76273D01*
X130310Y-76273D01*
X130304Y-76278D01*
X130234Y-76307D01*
X130194Y-76347D01*
X130194Y-76329D01*
X130138Y-76273D01*
X130123Y-76273D01*
X130080Y-76167D01*
X129964Y-76052D01*
X129814Y-75989D01*
X129650Y-75989D01*
X129500Y-76051D01*
X129384Y-76167D01*
X129321Y-76318D01*
X129321Y-76481D01*
X129384Y-76632D01*
X129499Y-76747D01*
X129650Y-76810D01*
X129813Y-76810D01*
X129964Y-76748D01*
X129995Y-76717D01*
X129996Y-76718D01*
X130037Y-76718D01*
X130037Y-76868D01*
X129996Y-76868D01*
X129940Y-76924D01*
X129940Y-77044D01*
X129940Y-77133D01*
X129974Y-77216D01*
X130037Y-77279D01*
X130120Y-77313D01*
X130138Y-77313D01*
X130194Y-77257D01*
X130194Y-77239D01*
X130234Y-77279D01*
X130304Y-77308D01*
X130310Y-77313D01*
X130317Y-77313D01*
X130328Y-77313D01*
X130335Y-77313D01*
X130340Y-77308D01*
X130346Y-77306D01*
X130346Y-77313D01*
X130417Y-77313D01*
X130417Y-77380D01*
X130449Y-77455D01*
X130506Y-77513D01*
X130581Y-77544D01*
X130599Y-77544D01*
X130629Y-77615D01*
X130686Y-77673D01*
X130761Y-77704D01*
X130843Y-77705D01*
X130918Y-77673D01*
X130976Y-77616D01*
X131005Y-77546D01*
X131034Y-77615D01*
X131091Y-77673D01*
X131166Y-77704D01*
X131248Y-77705D01*
X131323Y-77673D01*
X131381Y-77616D01*
X131405Y-77558D01*
X131429Y-77615D01*
X131486Y-77673D01*
X131561Y-77704D01*
X131643Y-77705D01*
X131718Y-77673D01*
X131776Y-77616D01*
X131797Y-77564D01*
X131819Y-77615D01*
X131876Y-77673D01*
X131951Y-77704D01*
X132033Y-77705D01*
X132108Y-77673D01*
X132166Y-77616D01*
X132190Y-77558D01*
X132214Y-77615D01*
X132271Y-77673D01*
X132346Y-77704D01*
X132428Y-77705D01*
X132503Y-77673D01*
X132561Y-77616D01*
X132585Y-77558D01*
X132609Y-77615D01*
X132667Y-77673D01*
X132742Y-77704D01*
X132823Y-77704D01*
X132899Y-77673D01*
X132957Y-77615D01*
X132980Y-77559D01*
X133004Y-77615D01*
X133061Y-77673D01*
X133136Y-77704D01*
X133218Y-77705D01*
X133293Y-77673D01*
X133351Y-77616D01*
X133375Y-77558D01*
X133399Y-77615D01*
X133456Y-77673D01*
X133531Y-77704D01*
X133613Y-77705D01*
X133688Y-77673D01*
X133746Y-77616D01*
X133777Y-77540D01*
X133777Y-77459D01*
X133746Y-77384D01*
X133710Y-77347D01*
X133710Y-77285D01*
X133738Y-77257D01*
X133738Y-77239D01*
X133777Y-77279D01*
X133848Y-77308D01*
X133853Y-77313D01*
X133860Y-77313D01*
X133871Y-77313D01*
X133878Y-77313D01*
X133883Y-77308D01*
X133954Y-77279D01*
X133964Y-77269D01*
X133974Y-77279D01*
X134045Y-77308D01*
X134050Y-77313D01*
X134057Y-77313D01*
X134068Y-77313D01*
X134075Y-77313D01*
X134080Y-77308D01*
X134150Y-77279D01*
X134161Y-77269D01*
X134171Y-77279D01*
X134241Y-77308D01*
X134247Y-77313D01*
X134254Y-77313D01*
X134265Y-77313D01*
X134272Y-77313D01*
X134277Y-77308D01*
X134283Y-77306D01*
X134283Y-77313D01*
X134337Y-77313D01*
X134337Y-77380D01*
X134369Y-77455D01*
X134426Y-77513D01*
X134501Y-77544D01*
X134549Y-77545D01*
X134579Y-77615D01*
X134636Y-77673D01*
X134711Y-77704D01*
X134793Y-77705D01*
X134868Y-77673D01*
X134926Y-77616D01*
X134950Y-77558D01*
X134974Y-77615D01*
X135031Y-77673D01*
X135106Y-77704D01*
X135188Y-77705D01*
X135263Y-77673D01*
X135321Y-77616D01*
X135342Y-77564D01*
X135364Y-77615D01*
X135421Y-77673D01*
X135496Y-77704D01*
X135578Y-77705D01*
X135653Y-77673D01*
X135711Y-77616D01*
X135735Y-77558D01*
X135759Y-77615D01*
X135816Y-77673D01*
X135891Y-77704D01*
X135973Y-77705D01*
X136048Y-77673D01*
X136106Y-77616D01*
X136130Y-77558D01*
X136154Y-77615D01*
X136211Y-77673D01*
X136286Y-77704D01*
X136368Y-77705D01*
X136443Y-77673D01*
X136501Y-77616D01*
X136522Y-77564D01*
X136544Y-77615D01*
X136601Y-77673D01*
X136676Y-77704D01*
X136758Y-77705D01*
X136833Y-77673D01*
X136891Y-77616D01*
X136915Y-77558D01*
X136939Y-77615D01*
X136996Y-77673D01*
X137071Y-77704D01*
X137153Y-77705D01*
X137228Y-77673D01*
X137286Y-77616D01*
X137307Y-77564D01*
X137329Y-77615D01*
X137386Y-77673D01*
X137461Y-77704D01*
X137543Y-77705D01*
X137618Y-77673D01*
X137676Y-77616D01*
X137707Y-77540D01*
X137707Y-77459D01*
X137676Y-77384D01*
X137647Y-77354D01*
X137647Y-77285D01*
X137675Y-77257D01*
X137675Y-77239D01*
X137714Y-77279D01*
X137785Y-77308D01*
X137790Y-77313D01*
X137797Y-77313D01*
X137808Y-77313D01*
X137815Y-77313D01*
X137820Y-77308D01*
X137891Y-77279D01*
X137931Y-77239D01*
X137931Y-77257D01*
X137987Y-77313D01*
X138005Y-77313D01*
X138087Y-77279D01*
X138088Y-77279D01*
X138151Y-77216D01*
X138185Y-77133D01*
X138185Y-77044D01*
X138185Y-76924D01*
X138129Y-76868D01*
X138087Y-76868D01*
X138087Y-76718D01*
X138129Y-76718D01*
X138130Y-76717D01*
X138160Y-76747D01*
X138311Y-76810D01*
X138474Y-76810D01*
X138625Y-76748D01*
X138741Y-76632D01*
X138803Y-76481D01*
X138804Y-76318D01*
X138741Y-76167D01*
X138626Y-76052D01*
X138475Y-75989D01*
X138312Y-75989D01*
X138161Y-76051D01*
X138087Y-76125D01*
X138045Y-76167D01*
X138001Y-76273D01*
X137987Y-76273D01*
X137931Y-76329D01*
X137931Y-76347D01*
X137891Y-76307D01*
X137820Y-76278D01*
X137815Y-76273D01*
X137808Y-76273D01*
X137797Y-76273D01*
X137790Y-76273D01*
X137785Y-76278D01*
X137714Y-76307D01*
X137675Y-76347D01*
X137675Y-76329D01*
X137618Y-76273D01*
X137600Y-76273D01*
X137518Y-76307D01*
X137454Y-76370D01*
X137453Y-76373D01*
X137423Y-76373D01*
X137420Y-76375D01*
X137398Y-76375D01*
X137394Y-76373D01*
X137345Y-76373D01*
X137227Y-76373D01*
X137223Y-76375D01*
X137201Y-76375D01*
X137198Y-76373D01*
X137148Y-76373D01*
X137030Y-76373D01*
X137026Y-76375D01*
X137004Y-76375D01*
X137001Y-76373D01*
X136951Y-76373D01*
X136833Y-76373D01*
X136829Y-76375D01*
X136808Y-76375D01*
X136804Y-76373D01*
X136754Y-76373D01*
X136636Y-76373D01*
X136632Y-76375D01*
X136611Y-76375D01*
X136607Y-76373D01*
X136557Y-76373D01*
X136439Y-76373D01*
X136435Y-76375D01*
X136414Y-76375D01*
X136410Y-76373D01*
X136360Y-76373D01*
X136242Y-76373D01*
X136238Y-76375D01*
X136217Y-76375D01*
X136213Y-76373D01*
X136164Y-76373D01*
X136045Y-76373D01*
X136042Y-76375D01*
X136020Y-76375D01*
X136016Y-76373D01*
X135967Y-76373D01*
X135849Y-76373D01*
X135845Y-76375D01*
X135823Y-76375D01*
X135820Y-76373D01*
X135770Y-76373D01*
X135652Y-76373D01*
X135648Y-76375D01*
X135627Y-76375D01*
X135623Y-76373D01*
X135573Y-76373D01*
X135455Y-76373D01*
X135451Y-76375D01*
X135430Y-76375D01*
X135426Y-76373D01*
X135376Y-76373D01*
X135258Y-76373D01*
X135254Y-76375D01*
X135233Y-76375D01*
X135229Y-76373D01*
X135179Y-76373D01*
X135061Y-76373D01*
X135057Y-76375D01*
X135036Y-76375D01*
X135032Y-76373D01*
X134982Y-76373D01*
X134864Y-76373D01*
X134861Y-76375D01*
X134839Y-76375D01*
X134835Y-76373D01*
X134786Y-76373D01*
X134667Y-76373D01*
X134664Y-76375D01*
X134642Y-76375D01*
X134638Y-76373D01*
X134609Y-76373D01*
X134607Y-76370D01*
X134544Y-76307D01*
X134462Y-76273D01*
X134443Y-76273D01*
X134387Y-76329D01*
X134387Y-76347D01*
X134347Y-76307D01*
X134277Y-76278D01*
X134272Y-76273D01*
X134265Y-76273D01*
X134254Y-76273D01*
X134247Y-76273D01*
X134241Y-76278D01*
X134171Y-76307D01*
X134161Y-76318D01*
X134150Y-76307D01*
X134080Y-76278D01*
X134075Y-76273D01*
X134068Y-76273D01*
X134057Y-76273D01*
X134050Y-76273D01*
X134045Y-76278D01*
X133974Y-76307D01*
X133964Y-76318D01*
X133954Y-76307D01*
X133883Y-76278D01*
X133878Y-76273D01*
X133871Y-76273D01*
X133860Y-76273D01*
X133853Y-76273D01*
X133848Y-76278D01*
X133777Y-76307D01*
X133738Y-76347D01*
X133738Y-76329D01*
X133681Y-76273D01*
X133663Y-76273D01*
X133581Y-76307D01*
X133517Y-76370D01*
X133516Y-76373D01*
X133486Y-76373D01*
X133483Y-76375D01*
X133461Y-76375D01*
X133457Y-76373D01*
X133408Y-76373D01*
X133290Y-76373D01*
X133286Y-76375D01*
X133264Y-76375D01*
X133261Y-76373D01*
X133211Y-76373D01*
X133141Y-76373D01*
X133275Y-76318D01*
X133380Y-76212D01*
X133437Y-76074D01*
X133437Y-75925D01*
X133409Y-75857D01*
X133448Y-75857D01*
X133448Y-75849D01*
X133454Y-75852D01*
X133459Y-75857D01*
X133466Y-75857D01*
X133477Y-75857D01*
X133485Y-75857D01*
X133490Y-75852D01*
X133555Y-75825D01*
X133585Y-75825D01*
X133651Y-75852D01*
X133656Y-75857D01*
X133663Y-75857D01*
X133674Y-75857D01*
X133681Y-75857D01*
X133686Y-75852D01*
X133752Y-75825D01*
X133782Y-75825D01*
X133848Y-75852D01*
X133853Y-75857D01*
X133860Y-75857D01*
X133871Y-75857D01*
X133878Y-75857D01*
X133883Y-75852D01*
X133949Y-75825D01*
X133979Y-75825D01*
X134045Y-75852D01*
X134050Y-75857D01*
X134057Y-75857D01*
X134068Y-75857D01*
X134075Y-75857D01*
X134080Y-75852D01*
X134146Y-75825D01*
X134176Y-75825D01*
X134241Y-75852D01*
X134247Y-75857D01*
X134254Y-75857D01*
X134265Y-75857D01*
X134272Y-75857D01*
X134277Y-75852D01*
X134343Y-75825D01*
X134373Y-75825D01*
X134438Y-75852D01*
X134443Y-75857D01*
X134451Y-75857D01*
X134462Y-75857D01*
X134469Y-75857D01*
X134474Y-75852D01*
X134539Y-75825D01*
X134570Y-75825D01*
X134635Y-75852D01*
X134640Y-75857D01*
X134648Y-75857D01*
X134658Y-75857D01*
X134666Y-75857D01*
X134671Y-75852D01*
X134736Y-75825D01*
X134766Y-75825D01*
X134832Y-75852D01*
X134837Y-75857D01*
X134844Y-75857D01*
X134855Y-75857D01*
X134862Y-75857D01*
X134868Y-75852D01*
X134933Y-75825D01*
X134963Y-75825D01*
X135029Y-75852D01*
X135034Y-75857D01*
X135041Y-75857D01*
X135052Y-75857D01*
X135059Y-75857D01*
X135064Y-75852D01*
X135130Y-75825D01*
X135199Y-75825D01*
X135231Y-75857D01*
X135249Y-75857D01*
X135327Y-75825D01*
X135948Y-75825D01*
X136026Y-75857D01*
X136044Y-75857D01*
X136076Y-75825D01*
X136167Y-75825D01*
X136149Y-75843D01*
X136117Y-75919D01*
X136117Y-76000D01*
X136149Y-76075D01*
X136206Y-76133D01*
X136281Y-76164D01*
X136363Y-76165D01*
X136438Y-76133D01*
X136496Y-76076D01*
X136522Y-76012D01*
X136549Y-76075D01*
X136606Y-76133D01*
X136681Y-76164D01*
X136763Y-76165D01*
X136838Y-76133D01*
X136896Y-76076D01*
X136926Y-76005D01*
X136958Y-76005D01*
X137033Y-75973D01*
X137071Y-75935D01*
X137076Y-75945D01*
X137133Y-76003D01*
X137209Y-76034D01*
X137290Y-76035D01*
X137365Y-76003D01*
X137423Y-75946D01*
X137454Y-75870D01*
X137454Y-75840D01*
X137492Y-75825D01*
X137522Y-75825D01*
X137588Y-75852D01*
X137593Y-75857D01*
X137600Y-75857D01*
X137611Y-75857D01*
X137618Y-75857D01*
X137624Y-75852D01*
X137689Y-75825D01*
X137719Y-75825D01*
X137785Y-75852D01*
X137790Y-75857D01*
X137797Y-75857D01*
X137808Y-75857D01*
X137815Y-75857D01*
X137820Y-75852D01*
X137886Y-75825D01*
X137954Y-75825D01*
X137987Y-75857D01*
X138005Y-75857D01*
X138083Y-75825D01*
X138087Y-75825D01*
X138087Y-75823D01*
X138088Y-75823D01*
X138151Y-75759D01*
X138185Y-75677D01*
X138185Y-75587D01*
X138185Y-75468D01*
X138129Y-75412D01*
X138087Y-75412D01*
X138087Y-75262D01*
X138129Y-75262D01*
X138185Y-75205D01*
X138185Y-75086D01*
X138185Y-74996D01*
X138151Y-74914D01*
X138088Y-74850D01*
X138005Y-74816D01*
X137987Y-74816D01*
X137931Y-74872D01*
X137931Y-74875D01*
X137915Y-74875D01*
X137891Y-74850D01*
X137820Y-74821D01*
X137815Y-74816D01*
X137808Y-74816D01*
X137797Y-74816D01*
X137790Y-74816D01*
X137785Y-74821D01*
X137714Y-74850D01*
X137704Y-74861D01*
X137694Y-74850D01*
X137624Y-74821D01*
X137618Y-74816D01*
X137611Y-74816D01*
X137600Y-74816D01*
X137593Y-74816D01*
X137588Y-74821D01*
X137518Y-74850D01*
X137507Y-74861D01*
X137497Y-74850D01*
X137427Y-74821D01*
X137422Y-74816D01*
X137414Y-74816D01*
X137403Y-74816D01*
X137396Y-74816D01*
X137391Y-74821D01*
X137321Y-74850D01*
X137297Y-74875D01*
X137281Y-74875D01*
X137281Y-74872D01*
X137225Y-74816D01*
X137207Y-74816D01*
X137124Y-74850D01*
X137100Y-74875D01*
X136340Y-74875D01*
X136316Y-74850D01*
X136233Y-74816D01*
X136215Y-74816D01*
X136204Y-74827D01*
X136204Y-74816D01*
X136138Y-74816D01*
X136116Y-74764D01*
X136059Y-74706D01*
X135983Y-74675D01*
X135947Y-74675D01*
X135947Y-74639D01*
X135916Y-74564D01*
X135877Y-74525D01*
X139837Y-74525D01*
X139837Y-77920D01*
X139837Y-77920D01*
G37*
G54D20*
X139837Y-77920D02*
X138087Y-79670D01*
X135960Y-81797D01*
X135960Y-81797D01*
X135000Y-82757D01*
X134969Y-82804D01*
X134968Y-82809D01*
X134957Y-82819D01*
X134957Y-86640D01*
X129993Y-91605D01*
X67509Y-91605D01*
X67499Y-91615D01*
X67499Y-91615D01*
X67494Y-91616D01*
X67447Y-91647D01*
X65790Y-93305D01*
X37599Y-93305D01*
X37604Y-93290D01*
X37605Y-93209D01*
X37573Y-93134D01*
X37516Y-93076D01*
X37464Y-93054D01*
X37515Y-93033D01*
X37573Y-92976D01*
X37604Y-92900D01*
X37605Y-92819D01*
X37573Y-92744D01*
X37516Y-92686D01*
X37440Y-92655D01*
X37359Y-92654D01*
X37284Y-92686D01*
X37226Y-92743D01*
X37195Y-92819D01*
X37194Y-92900D01*
X37226Y-92975D01*
X37283Y-93033D01*
X37335Y-93055D01*
X37284Y-93076D01*
X37226Y-93133D01*
X37195Y-93209D01*
X37194Y-93290D01*
X37200Y-93305D01*
X37085Y-93305D01*
X37085Y-91325D01*
X37286Y-91325D01*
X37284Y-91326D01*
X37226Y-91383D01*
X37195Y-91459D01*
X37194Y-91540D01*
X37226Y-91615D01*
X37283Y-91673D01*
X37335Y-91695D01*
X37284Y-91716D01*
X37226Y-91773D01*
X37195Y-91849D01*
X37194Y-91930D01*
X37226Y-92005D01*
X37283Y-92063D01*
X37359Y-92094D01*
X37440Y-92095D01*
X37515Y-92063D01*
X37573Y-92006D01*
X37604Y-91930D01*
X37605Y-91849D01*
X37573Y-91774D01*
X37516Y-91716D01*
X37464Y-91694D01*
X37515Y-91673D01*
X37573Y-91616D01*
X37604Y-91540D01*
X37605Y-91459D01*
X37573Y-91384D01*
X37516Y-91326D01*
X37513Y-91325D01*
X63710Y-91325D01*
X64630Y-90405D01*
X129353Y-90405D01*
X133567Y-86190D01*
X133547Y-82070D01*
X137943Y-77675D01*
X137712Y-77675D01*
X133397Y-81989D01*
X133397Y-86129D01*
X129292Y-90235D01*
X64549Y-90235D01*
X63629Y-91155D01*
X37605Y-91155D01*
X37605Y-90479D01*
X37573Y-90404D01*
X37516Y-90346D01*
X37464Y-90324D01*
X37515Y-90303D01*
X37573Y-90246D01*
X37604Y-90170D01*
X37605Y-90089D01*
X37573Y-90014D01*
X37516Y-89956D01*
X37452Y-89929D01*
X37515Y-89903D01*
X37573Y-89846D01*
X37604Y-89770D01*
X37605Y-89689D01*
X37573Y-89614D01*
X37516Y-89556D01*
X37464Y-89534D01*
X37515Y-89513D01*
X37573Y-89456D01*
X37604Y-89380D01*
X37605Y-89299D01*
X37573Y-89224D01*
X37516Y-89166D01*
X37452Y-89139D01*
X37515Y-89113D01*
X37573Y-89056D01*
X37604Y-88980D01*
X37605Y-88899D01*
X37573Y-88824D01*
X37516Y-88766D01*
X37440Y-88735D01*
X37440Y-88735D01*
X37515Y-88703D01*
X37573Y-88646D01*
X37604Y-88570D01*
X37605Y-88489D01*
X37573Y-88414D01*
X37516Y-88356D01*
X37476Y-88339D01*
X37515Y-88323D01*
X37573Y-88266D01*
X37604Y-88190D01*
X37605Y-88109D01*
X37573Y-88034D01*
X37516Y-87976D01*
X37464Y-87954D01*
X37515Y-87933D01*
X37573Y-87876D01*
X37604Y-87800D01*
X37605Y-87719D01*
X37573Y-87644D01*
X37516Y-87586D01*
X37440Y-87555D01*
X37359Y-87554D01*
X37284Y-87586D01*
X37226Y-87643D01*
X37195Y-87719D01*
X37194Y-87800D01*
X37226Y-87875D01*
X37283Y-87933D01*
X37335Y-87955D01*
X37284Y-87976D01*
X37226Y-88033D01*
X37195Y-88109D01*
X37194Y-88190D01*
X37226Y-88265D01*
X37283Y-88323D01*
X37323Y-88340D01*
X37284Y-88356D01*
X37226Y-88413D01*
X37195Y-88489D01*
X37194Y-88570D01*
X37226Y-88645D01*
X37283Y-88703D01*
X37359Y-88734D01*
X37440Y-88735D01*
X37359Y-88734D01*
X37284Y-88766D01*
X37226Y-88823D01*
X37195Y-88899D01*
X37194Y-88980D01*
X37226Y-89055D01*
X37283Y-89113D01*
X37347Y-89140D01*
X37284Y-89166D01*
X37226Y-89223D01*
X37195Y-89299D01*
X37194Y-89380D01*
X37226Y-89455D01*
X37283Y-89513D01*
X37335Y-89535D01*
X37284Y-89556D01*
X37226Y-89613D01*
X37195Y-89689D01*
X37194Y-89770D01*
X37226Y-89845D01*
X37283Y-89903D01*
X37347Y-89930D01*
X37284Y-89956D01*
X37226Y-90013D01*
X37195Y-90089D01*
X37194Y-90170D01*
X37226Y-90245D01*
X37283Y-90303D01*
X37335Y-90325D01*
X37284Y-90346D01*
X37226Y-90403D01*
X37195Y-90479D01*
X37194Y-90560D01*
X37226Y-90635D01*
X37283Y-90693D01*
X37359Y-90724D01*
X37440Y-90725D01*
X37515Y-90693D01*
X37573Y-90636D01*
X37604Y-90560D01*
X37605Y-90479D01*
X37605Y-91155D01*
X37085Y-91155D01*
X37085Y-87145D01*
X63509Y-87145D01*
X64829Y-88465D01*
X128373Y-88465D01*
X131627Y-85210D01*
X131627Y-80250D01*
X134203Y-77675D01*
X133972Y-77675D01*
X131457Y-80189D01*
X131457Y-85109D01*
X128292Y-88295D01*
X64890Y-88295D01*
X63580Y-86975D01*
X37605Y-86975D01*
X37605Y-86139D01*
X37573Y-86064D01*
X37516Y-86006D01*
X37464Y-85984D01*
X37515Y-85963D01*
X37573Y-85906D01*
X37604Y-85830D01*
X37605Y-85749D01*
X37573Y-85674D01*
X37516Y-85616D01*
X37452Y-85589D01*
X37515Y-85563D01*
X37573Y-85506D01*
X37604Y-85430D01*
X37605Y-85349D01*
X37573Y-85274D01*
X37516Y-85216D01*
X37464Y-85194D01*
X37515Y-85173D01*
X37573Y-85116D01*
X37604Y-85040D01*
X37605Y-84959D01*
X37573Y-84884D01*
X37516Y-84826D01*
X37452Y-84799D01*
X37515Y-84773D01*
X37573Y-84716D01*
X37604Y-84640D01*
X37605Y-84559D01*
X37573Y-84484D01*
X37516Y-84426D01*
X37464Y-84404D01*
X37515Y-84383D01*
X37573Y-84326D01*
X37604Y-84250D01*
X37605Y-84169D01*
X37573Y-84094D01*
X37516Y-84036D01*
X37452Y-84009D01*
X37515Y-83983D01*
X37573Y-83926D01*
X37604Y-83850D01*
X37605Y-83769D01*
X37573Y-83694D01*
X37516Y-83636D01*
X37464Y-83614D01*
X37515Y-83593D01*
X37573Y-83536D01*
X37604Y-83460D01*
X37605Y-83379D01*
X37573Y-83304D01*
X37516Y-83246D01*
X37440Y-83215D01*
X37359Y-83214D01*
X37284Y-83246D01*
X37226Y-83303D01*
X37195Y-83379D01*
X37194Y-83460D01*
X37226Y-83535D01*
X37283Y-83593D01*
X37335Y-83615D01*
X37284Y-83636D01*
X37226Y-83693D01*
X37195Y-83769D01*
X37194Y-83850D01*
X37226Y-83925D01*
X37283Y-83983D01*
X37347Y-84010D01*
X37284Y-84036D01*
X37226Y-84093D01*
X37195Y-84169D01*
X37194Y-84250D01*
X37226Y-84325D01*
X37283Y-84383D01*
X37335Y-84405D01*
X37284Y-84426D01*
X37226Y-84483D01*
X37195Y-84559D01*
X37194Y-84640D01*
X37226Y-84715D01*
X37283Y-84773D01*
X37347Y-84800D01*
X37284Y-84826D01*
X37226Y-84883D01*
X37195Y-84959D01*
X37194Y-85040D01*
X37226Y-85115D01*
X37283Y-85173D01*
X37335Y-85195D01*
X37284Y-85216D01*
X37226Y-85273D01*
X37195Y-85349D01*
X37194Y-85430D01*
X37226Y-85505D01*
X37283Y-85563D01*
X37347Y-85590D01*
X37284Y-85616D01*
X37226Y-85673D01*
X37195Y-85749D01*
X37194Y-85830D01*
X37226Y-85905D01*
X37283Y-85963D01*
X37335Y-85985D01*
X37284Y-86006D01*
X37226Y-86063D01*
X37195Y-86139D01*
X37194Y-86220D01*
X37226Y-86295D01*
X37283Y-86353D01*
X37359Y-86384D01*
X37440Y-86385D01*
X37515Y-86353D01*
X37573Y-86296D01*
X37604Y-86220D01*
X37605Y-86139D01*
X37605Y-86975D01*
X37085Y-86975D01*
X37085Y-83075D01*
X37550Y-83075D01*
X37700Y-82925D01*
X64274Y-82925D01*
X67874Y-86525D01*
X68900Y-86525D01*
X127273Y-86525D01*
X129687Y-84110D01*
X129687Y-77675D01*
X128287Y-77675D01*
X128287Y-74525D01*
X130497Y-74525D01*
X130495Y-74527D01*
X130437Y-74665D01*
X130437Y-74814D01*
X130458Y-74864D01*
X130458Y-74864D01*
X130457Y-74866D01*
X130457Y-74866D01*
X130450Y-74872D01*
X130450Y-74875D01*
X130434Y-74875D01*
X130410Y-74850D01*
X130340Y-74821D01*
X130335Y-74816D01*
X130328Y-74816D01*
X130317Y-74816D01*
X130310Y-74816D01*
X130304Y-74821D01*
X130234Y-74850D01*
X130210Y-74875D01*
X130194Y-74875D01*
X130194Y-74872D01*
X130138Y-74816D01*
X130120Y-74816D01*
X130037Y-74850D01*
X129974Y-74914D01*
X129940Y-74996D01*
X129940Y-75086D01*
X129940Y-75205D01*
X129996Y-75262D01*
X130037Y-75262D01*
X130037Y-75412D01*
X129996Y-75412D01*
X129940Y-75468D01*
X129940Y-75587D01*
X129940Y-75677D01*
X129974Y-75759D01*
X130037Y-75823D01*
X130037Y-75823D01*
X130037Y-75825D01*
X130042Y-75825D01*
X130120Y-75857D01*
X130138Y-75857D01*
X130170Y-75825D01*
X130239Y-75825D01*
X130304Y-75852D01*
X130310Y-75857D01*
X130317Y-75857D01*
X130328Y-75857D01*
X130335Y-75857D01*
X130340Y-75852D01*
X130406Y-75825D01*
X130474Y-75825D01*
X130506Y-75857D01*
X130524Y-75857D01*
X130602Y-75825D01*
X131026Y-75825D01*
X131104Y-75857D01*
X131122Y-75857D01*
X131155Y-75825D01*
X131223Y-75825D01*
X131289Y-75852D01*
X131294Y-75857D01*
X131301Y-75857D01*
X131312Y-75857D01*
X131319Y-75857D01*
X131324Y-75852D01*
X131390Y-75825D01*
X131420Y-75825D01*
X131486Y-75852D01*
X131491Y-75857D01*
X131498Y-75857D01*
X131509Y-75857D01*
X131516Y-75857D01*
X131521Y-75852D01*
X131587Y-75825D01*
X131655Y-75825D01*
X131688Y-75857D01*
X131706Y-75857D01*
X131784Y-75825D01*
X132207Y-75825D01*
X132285Y-75857D01*
X132303Y-75857D01*
X132336Y-75825D01*
X132404Y-75825D01*
X132470Y-75852D01*
X132475Y-75857D01*
X132482Y-75857D01*
X132493Y-75857D01*
X132500Y-75857D01*
X132505Y-75852D01*
X132571Y-75825D01*
X132601Y-75825D01*
X132667Y-75852D01*
X132672Y-75857D01*
X132679Y-75857D01*
X132690Y-75857D01*
X132697Y-75857D01*
X132702Y-75852D01*
X132708Y-75849D01*
X132708Y-75857D01*
X132716Y-75857D01*
X132687Y-75925D01*
X132687Y-76074D01*
X132744Y-76212D01*
X132850Y-76317D01*
X132984Y-76373D01*
X132896Y-76373D01*
X132892Y-76375D01*
X132871Y-76375D01*
X132867Y-76373D01*
X132817Y-76373D01*
X132699Y-76373D01*
X132695Y-76375D01*
X132674Y-76375D01*
X132670Y-76373D01*
X132620Y-76373D01*
X132502Y-76373D01*
X132498Y-76375D01*
X132477Y-76375D01*
X132473Y-76373D01*
X132423Y-76373D01*
X132305Y-76373D01*
X132301Y-76375D01*
X132280Y-76375D01*
X132276Y-76373D01*
X132227Y-76373D01*
X132108Y-76373D01*
X132105Y-76375D01*
X132083Y-76375D01*
X132079Y-76373D01*
X132030Y-76373D01*
X131912Y-76373D01*
X131908Y-76375D01*
X131886Y-76375D01*
X131883Y-76373D01*
X131833Y-76373D01*
X131715Y-76373D01*
X131711Y-76375D01*
X131690Y-76375D01*
X131686Y-76373D01*
X131636Y-76373D01*
X131518Y-76373D01*
X131514Y-76375D01*
X131493Y-76375D01*
X131489Y-76373D01*
X131439Y-76373D01*
X131321Y-76373D01*
X131317Y-76375D01*
X131296Y-76375D01*
X131292Y-76373D01*
X131242Y-76373D01*
X131124Y-76373D01*
X131120Y-76375D01*
X131099Y-76375D01*
X131095Y-76373D01*
X131045Y-76373D01*
X130927Y-76373D01*
X130924Y-76375D01*
X130902Y-76375D01*
X130898Y-76373D01*
X130849Y-76373D01*
X130730Y-76373D01*
X130727Y-76375D01*
X130705Y-76375D01*
X130701Y-76373D01*
X130672Y-76373D01*
X130670Y-76370D01*
X130607Y-76307D01*
X130524Y-76273D01*
X130506Y-76273D01*
X130450Y-76329D01*
X130450Y-76347D01*
X130410Y-76307D01*
X130340Y-76278D01*
X130335Y-76273D01*
X130328Y-76273D01*
X130317Y-76273D01*
X130310Y-76273D01*
X130304Y-76278D01*
X130234Y-76307D01*
X130194Y-76347D01*
X130194Y-76329D01*
X130138Y-76273D01*
X130123Y-76273D01*
X130080Y-76167D01*
X129964Y-76052D01*
X129814Y-75989D01*
X129650Y-75989D01*
X129500Y-76051D01*
X129384Y-76167D01*
X129321Y-76318D01*
X129321Y-76481D01*
X129384Y-76632D01*
X129499Y-76747D01*
X129650Y-76810D01*
X129813Y-76810D01*
X129964Y-76748D01*
X129995Y-76717D01*
X129996Y-76718D01*
X130037Y-76718D01*
X130037Y-76868D01*
X129996Y-76868D01*
X129940Y-76924D01*
X129940Y-77044D01*
X129940Y-77133D01*
X129974Y-77216D01*
X130037Y-77279D01*
X130120Y-77313D01*
X130138Y-77313D01*
X130194Y-77257D01*
X130194Y-77239D01*
X130234Y-77279D01*
X130304Y-77308D01*
X130310Y-77313D01*
X130317Y-77313D01*
X130328Y-77313D01*
X130335Y-77313D01*
X130340Y-77308D01*
X130346Y-77306D01*
X130346Y-77313D01*
X130417Y-77313D01*
X130417Y-77380D01*
X130449Y-77455D01*
X130506Y-77513D01*
X130581Y-77544D01*
X130599Y-77544D01*
X130629Y-77615D01*
X130686Y-77673D01*
X130761Y-77704D01*
X130843Y-77705D01*
X130918Y-77673D01*
X130976Y-77616D01*
X131005Y-77546D01*
X131034Y-77615D01*
X131091Y-77673D01*
X131166Y-77704D01*
X131248Y-77705D01*
X131323Y-77673D01*
X131381Y-77616D01*
X131405Y-77558D01*
X131429Y-77615D01*
X131486Y-77673D01*
X131561Y-77704D01*
X131643Y-77705D01*
X131718Y-77673D01*
X131776Y-77616D01*
X131797Y-77564D01*
X131819Y-77615D01*
X131876Y-77673D01*
X131951Y-77704D01*
X132033Y-77705D01*
X132108Y-77673D01*
X132166Y-77616D01*
X132190Y-77558D01*
X132214Y-77615D01*
X132271Y-77673D01*
X132346Y-77704D01*
X132428Y-77705D01*
X132503Y-77673D01*
X132561Y-77616D01*
X132585Y-77558D01*
X132609Y-77615D01*
X132667Y-77673D01*
X132742Y-77704D01*
X132823Y-77704D01*
X132899Y-77673D01*
X132957Y-77615D01*
X132980Y-77559D01*
X133004Y-77615D01*
X133061Y-77673D01*
X133136Y-77704D01*
X133218Y-77705D01*
X133293Y-77673D01*
X133351Y-77616D01*
X133375Y-77558D01*
X133399Y-77615D01*
X133456Y-77673D01*
X133531Y-77704D01*
X133613Y-77705D01*
X133688Y-77673D01*
X133746Y-77616D01*
X133777Y-77540D01*
X133777Y-77459D01*
X133746Y-77384D01*
X133710Y-77347D01*
X133710Y-77285D01*
X133738Y-77257D01*
X133738Y-77239D01*
X133777Y-77279D01*
X133848Y-77308D01*
X133853Y-77313D01*
X133860Y-77313D01*
X133871Y-77313D01*
X133878Y-77313D01*
X133883Y-77308D01*
X133954Y-77279D01*
X133964Y-77269D01*
X133974Y-77279D01*
X134045Y-77308D01*
X134050Y-77313D01*
X134057Y-77313D01*
X134068Y-77313D01*
X134075Y-77313D01*
X134080Y-77308D01*
X134150Y-77279D01*
X134161Y-77269D01*
X134171Y-77279D01*
X134241Y-77308D01*
X134247Y-77313D01*
X134254Y-77313D01*
X134265Y-77313D01*
X134272Y-77313D01*
X134277Y-77308D01*
X134283Y-77306D01*
X134283Y-77313D01*
X134337Y-77313D01*
X134337Y-77380D01*
X134369Y-77455D01*
X134426Y-77513D01*
X134501Y-77544D01*
X134549Y-77545D01*
X134579Y-77615D01*
X134636Y-77673D01*
X134711Y-77704D01*
X134793Y-77705D01*
X134868Y-77673D01*
X134926Y-77616D01*
X134950Y-77558D01*
X134974Y-77615D01*
X135031Y-77673D01*
X135106Y-77704D01*
X135188Y-77705D01*
X135263Y-77673D01*
X135321Y-77616D01*
X135342Y-77564D01*
X135364Y-77615D01*
X135421Y-77673D01*
X135496Y-77704D01*
X135578Y-77705D01*
X135653Y-77673D01*
X135711Y-77616D01*
X135735Y-77558D01*
X135759Y-77615D01*
X135816Y-77673D01*
X135891Y-77704D01*
X135973Y-77705D01*
X136048Y-77673D01*
X136106Y-77616D01*
X136130Y-77558D01*
X136154Y-77615D01*
X136211Y-77673D01*
X136286Y-77704D01*
X136368Y-77705D01*
X136443Y-77673D01*
X136501Y-77616D01*
X136522Y-77564D01*
X136544Y-77615D01*
X136601Y-77673D01*
X136676Y-77704D01*
X136758Y-77705D01*
X136833Y-77673D01*
X136891Y-77616D01*
X136915Y-77558D01*
X136939Y-77615D01*
X136996Y-77673D01*
X137071Y-77704D01*
X137153Y-77705D01*
X137228Y-77673D01*
X137286Y-77616D01*
X137307Y-77564D01*
X137329Y-77615D01*
X137386Y-77673D01*
X137461Y-77704D01*
X137543Y-77705D01*
X137618Y-77673D01*
X137676Y-77616D01*
X137707Y-77540D01*
X137707Y-77459D01*
X137676Y-77384D01*
X137647Y-77354D01*
X137647Y-77285D01*
X137675Y-77257D01*
X137675Y-77239D01*
X137714Y-77279D01*
X137785Y-77308D01*
X137790Y-77313D01*
X137797Y-77313D01*
X137808Y-77313D01*
X137815Y-77313D01*
X137820Y-77308D01*
X137891Y-77279D01*
X137931Y-77239D01*
X137931Y-77257D01*
X137987Y-77313D01*
X138005Y-77313D01*
X138087Y-77279D01*
X138088Y-77279D01*
X138151Y-77216D01*
X138185Y-77133D01*
X138185Y-77044D01*
X138185Y-76924D01*
X138129Y-76868D01*
X138087Y-76868D01*
X138087Y-76718D01*
X138129Y-76718D01*
X138130Y-76717D01*
X138160Y-76747D01*
X138311Y-76810D01*
X138474Y-76810D01*
X138625Y-76748D01*
X138741Y-76632D01*
X138803Y-76481D01*
X138804Y-76318D01*
X138741Y-76167D01*
X138626Y-76052D01*
X138475Y-75989D01*
X138312Y-75989D01*
X138161Y-76051D01*
X138087Y-76125D01*
X138045Y-76167D01*
X138001Y-76273D01*
X137987Y-76273D01*
X137931Y-76329D01*
X137931Y-76347D01*
X137891Y-76307D01*
X137820Y-76278D01*
X137815Y-76273D01*
X137808Y-76273D01*
X137797Y-76273D01*
X137790Y-76273D01*
X137785Y-76278D01*
X137714Y-76307D01*
X137675Y-76347D01*
X137675Y-76329D01*
X137618Y-76273D01*
X137600Y-76273D01*
X137518Y-76307D01*
X137454Y-76370D01*
X137453Y-76373D01*
X137423Y-76373D01*
X137420Y-76375D01*
X137398Y-76375D01*
X137394Y-76373D01*
X137345Y-76373D01*
X137227Y-76373D01*
X137223Y-76375D01*
X137201Y-76375D01*
X137198Y-76373D01*
X137148Y-76373D01*
X137030Y-76373D01*
X137026Y-76375D01*
X137004Y-76375D01*
X137001Y-76373D01*
X136951Y-76373D01*
X136833Y-76373D01*
X136829Y-76375D01*
X136808Y-76375D01*
X136804Y-76373D01*
X136754Y-76373D01*
X136636Y-76373D01*
X136632Y-76375D01*
X136611Y-76375D01*
X136607Y-76373D01*
X136557Y-76373D01*
X136439Y-76373D01*
X136435Y-76375D01*
X136414Y-76375D01*
X136410Y-76373D01*
X136360Y-76373D01*
X136242Y-76373D01*
X136238Y-76375D01*
X136217Y-76375D01*
X136213Y-76373D01*
X136164Y-76373D01*
X136045Y-76373D01*
X136042Y-76375D01*
X136020Y-76375D01*
X136016Y-76373D01*
X135967Y-76373D01*
X135849Y-76373D01*
X135845Y-76375D01*
X135823Y-76375D01*
X135820Y-76373D01*
X135770Y-76373D01*
X135652Y-76373D01*
X135648Y-76375D01*
X135627Y-76375D01*
X135623Y-76373D01*
X135573Y-76373D01*
X135455Y-76373D01*
X135451Y-76375D01*
X135430Y-76375D01*
X135426Y-76373D01*
X135376Y-76373D01*
X135258Y-76373D01*
X135254Y-76375D01*
X135233Y-76375D01*
X135229Y-76373D01*
X135179Y-76373D01*
X135061Y-76373D01*
X135057Y-76375D01*
X135036Y-76375D01*
X135032Y-76373D01*
X134982Y-76373D01*
X134864Y-76373D01*
X134861Y-76375D01*
X134839Y-76375D01*
X134835Y-76373D01*
X134786Y-76373D01*
X134667Y-76373D01*
X134664Y-76375D01*
X134642Y-76375D01*
X134638Y-76373D01*
X134609Y-76373D01*
X134607Y-76370D01*
X134544Y-76307D01*
X134462Y-76273D01*
X134443Y-76273D01*
X134387Y-76329D01*
X134387Y-76347D01*
X134347Y-76307D01*
X134277Y-76278D01*
X134272Y-76273D01*
X134265Y-76273D01*
X134254Y-76273D01*
X134247Y-76273D01*
X134241Y-76278D01*
X134171Y-76307D01*
X134161Y-76318D01*
X134150Y-76307D01*
X134080Y-76278D01*
X134075Y-76273D01*
X134068Y-76273D01*
X134057Y-76273D01*
X134050Y-76273D01*
X134045Y-76278D01*
X133974Y-76307D01*
X133964Y-76318D01*
X133954Y-76307D01*
X133883Y-76278D01*
X133878Y-76273D01*
X133871Y-76273D01*
X133860Y-76273D01*
X133853Y-76273D01*
X133848Y-76278D01*
X133777Y-76307D01*
X133738Y-76347D01*
X133738Y-76329D01*
X133681Y-76273D01*
X133663Y-76273D01*
X133581Y-76307D01*
X133517Y-76370D01*
X133516Y-76373D01*
X133486Y-76373D01*
X133483Y-76375D01*
X133461Y-76375D01*
X133457Y-76373D01*
X133408Y-76373D01*
X133290Y-76373D01*
X133286Y-76375D01*
X133264Y-76375D01*
X133261Y-76373D01*
X133211Y-76373D01*
X133141Y-76373D01*
X133275Y-76318D01*
X133380Y-76212D01*
X133437Y-76074D01*
X133437Y-75925D01*
X133409Y-75857D01*
X133448Y-75857D01*
X133448Y-75849D01*
X133454Y-75852D01*
X133459Y-75857D01*
X133466Y-75857D01*
X133477Y-75857D01*
X133485Y-75857D01*
X133490Y-75852D01*
X133555Y-75825D01*
X133585Y-75825D01*
X133651Y-75852D01*
X133656Y-75857D01*
X133663Y-75857D01*
X133674Y-75857D01*
X133681Y-75857D01*
X133686Y-75852D01*
X133752Y-75825D01*
X133782Y-75825D01*
X133848Y-75852D01*
X133853Y-75857D01*
X133860Y-75857D01*
X133871Y-75857D01*
X133878Y-75857D01*
X133883Y-75852D01*
X133949Y-75825D01*
X133979Y-75825D01*
X134045Y-75852D01*
X134050Y-75857D01*
X134057Y-75857D01*
X134068Y-75857D01*
X134075Y-75857D01*
X134080Y-75852D01*
X134146Y-75825D01*
X134176Y-75825D01*
X134241Y-75852D01*
X134247Y-75857D01*
X134254Y-75857D01*
X134265Y-75857D01*
X134272Y-75857D01*
X134277Y-75852D01*
X134343Y-75825D01*
X134373Y-75825D01*
X134438Y-75852D01*
X134443Y-75857D01*
X134451Y-75857D01*
X134462Y-75857D01*
X134469Y-75857D01*
X134474Y-75852D01*
X134539Y-75825D01*
X134570Y-75825D01*
X134635Y-75852D01*
X134640Y-75857D01*
X134648Y-75857D01*
X134658Y-75857D01*
X134666Y-75857D01*
X134671Y-75852D01*
X134736Y-75825D01*
X134766Y-75825D01*
X134832Y-75852D01*
X134837Y-75857D01*
X134844Y-75857D01*
X134855Y-75857D01*
X134862Y-75857D01*
X134868Y-75852D01*
X134933Y-75825D01*
X134963Y-75825D01*
X135029Y-75852D01*
X135034Y-75857D01*
X135041Y-75857D01*
X135052Y-75857D01*
X135059Y-75857D01*
X135064Y-75852D01*
X135130Y-75825D01*
X135199Y-75825D01*
X135231Y-75857D01*
X135249Y-75857D01*
X135327Y-75825D01*
X135948Y-75825D01*
X136026Y-75857D01*
X136044Y-75857D01*
X136076Y-75825D01*
X136167Y-75825D01*
X136149Y-75843D01*
X136117Y-75919D01*
X136117Y-76000D01*
X136149Y-76075D01*
X136206Y-76133D01*
X136281Y-76164D01*
X136363Y-76165D01*
X136438Y-76133D01*
X136496Y-76076D01*
X136522Y-76012D01*
X136549Y-76075D01*
X136606Y-76133D01*
X136681Y-76164D01*
X136763Y-76165D01*
X136838Y-76133D01*
X136896Y-76076D01*
X136926Y-76005D01*
X136958Y-76005D01*
X137033Y-75973D01*
X137071Y-75935D01*
X137076Y-75945D01*
X137133Y-76003D01*
X137209Y-76034D01*
X137290Y-76035D01*
X137365Y-76003D01*
X137423Y-75946D01*
X137454Y-75870D01*
X137454Y-75840D01*
X137492Y-75825D01*
X137522Y-75825D01*
X137588Y-75852D01*
X137593Y-75857D01*
X137600Y-75857D01*
X137611Y-75857D01*
X137618Y-75857D01*
X137624Y-75852D01*
X137689Y-75825D01*
X137719Y-75825D01*
X137785Y-75852D01*
X137790Y-75857D01*
X137797Y-75857D01*
X137808Y-75857D01*
X137815Y-75857D01*
X137820Y-75852D01*
X137886Y-75825D01*
X137954Y-75825D01*
X137987Y-75857D01*
X138005Y-75857D01*
X138083Y-75825D01*
X138087Y-75825D01*
X138087Y-75823D01*
X138088Y-75823D01*
X138151Y-75759D01*
X138185Y-75677D01*
X138185Y-75587D01*
X138185Y-75468D01*
X138129Y-75412D01*
X138087Y-75412D01*
X138087Y-75262D01*
X138129Y-75262D01*
X138185Y-75205D01*
X138185Y-75086D01*
X138185Y-74996D01*
X138151Y-74914D01*
X138088Y-74850D01*
X138005Y-74816D01*
X137987Y-74816D01*
X137931Y-74872D01*
X137931Y-74875D01*
X137915Y-74875D01*
X137891Y-74850D01*
X137820Y-74821D01*
X137815Y-74816D01*
X137808Y-74816D01*
X137797Y-74816D01*
X137790Y-74816D01*
X137785Y-74821D01*
X137714Y-74850D01*
X137704Y-74861D01*
X137694Y-74850D01*
X137624Y-74821D01*
X137618Y-74816D01*
X137611Y-74816D01*
X137600Y-74816D01*
X137593Y-74816D01*
X137588Y-74821D01*
X137518Y-74850D01*
X137507Y-74861D01*
X137497Y-74850D01*
X137427Y-74821D01*
X137422Y-74816D01*
X137414Y-74816D01*
X137403Y-74816D01*
X137396Y-74816D01*
X137391Y-74821D01*
X137321Y-74850D01*
X137297Y-74875D01*
X137281Y-74875D01*
X137281Y-74872D01*
X137225Y-74816D01*
X137207Y-74816D01*
X137124Y-74850D01*
X137100Y-74875D01*
X136340Y-74875D01*
X136316Y-74850D01*
X136233Y-74816D01*
X136215Y-74816D01*
X136204Y-74827D01*
X136204Y-74816D01*
X136138Y-74816D01*
X136116Y-74764D01*
X136059Y-74706D01*
X135983Y-74675D01*
X135947Y-74675D01*
X135947Y-74639D01*
X135916Y-74564D01*
X135877Y-74525D01*
X139837Y-74525D01*
X139837Y-77920D01*
M02*
