PCBNEW-LibModule-V1  Thu 16 Oct 2014 03:51:19 PM EDT
# encoding utf-8
Units mm
$INDEX
LSHM-1-40-025-F-DV-N
$EndINDEX
$MODULE LSHM-1-40-025-F-DV-N
Po 0 0 0 15 544021B1 00000000 ~~
Li LSHM-1-40-025-F-DV-N
Sc 0
AR 
Op 0 0 0
T0 -0.0254 -10.6934 1 1 0 0.15 N V 21 N "LSHM-1-40-025-F-DV-N"
T1 0.0254 9.4488 1 1 0 0.15 N V 21 N "VAL**"
DS -12.3444 -3.3392 12.3444 -3.3392 0.15 21
DS 12.3444 -3.3392 12.3444 1.6392 0.15 21
DS 12.3444 1.6392 -12.3444 1.6392 0.15 21
DS -12.3444 1.6392 -12.3444 -3.3392 0.15 21
$PAD
Sh "65" R 0.299999 1.5 0 0 0
Dr 0 0 0
At SMD N 00888000
Ne 0 ""
Po -6.250007 1.000001
.LocalClearance 0.09906
$EndPAD
$PAD
Sh "67" R 0.299999 1.5 0 0 0
Dr 0 0 0
At SMD N 00888000
Ne 0 ""
Po -6.750007 1.000001
.LocalClearance 0.09906
$EndPAD
$PAD
Sh "71" R 0.299999 1.5 0 0 0
Dr 0 0 0
At SMD N 00888000
Ne 0 ""
Po -7.750007 1.000001
.LocalClearance 0.09906
$EndPAD
$PAD
Sh "69" R 0.299999 1.5 0 0 0
Dr 0 0 0
At SMD N 00888000
Ne 0 ""
Po -7.250007 1.000001
.LocalClearance 0.09906
$EndPAD
$PAD
Sh "77" R 0.299999 1.5 0 0 0
Dr 0 0 0
At SMD N 00888000
Ne 0 ""
Po -9.250007 1.000001
.LocalClearance 0.09906
$EndPAD
$PAD
Sh "79" R 0.299999 1.5 0 0 0
Dr 0 0 0
At SMD N 00888000
Ne 0 ""
Po -9.750007 1.000001
.LocalClearance 0.09906
$EndPAD
$PAD
Sh "75" R 0.299999 1.5 0 0 0
Dr 0 0 0
At SMD N 00888000
Ne 0 ""
Po -8.750007 1.000001
.LocalClearance 0.09906
$EndPAD
$PAD
Sh "73" R 0.299999 1.5 0 0 0
Dr 0 0 0
At SMD N 00888000
Ne 0 ""
Po -8.250007 1.000001
.LocalClearance 0.09906
$EndPAD
$PAD
Sh "33" R 0.299999 1.5 0 0 0
Dr 0 0 0
At SMD N 00888000
Ne 0 ""
Po 1.749993 1.000001
.LocalClearance 0.09906
$EndPAD
$PAD
Sh "35" R 0.299999 1.5 0 0 0
Dr 0 0 0
At SMD N 00888000
Ne 0 ""
Po 1.249993 1.000001
.LocalClearance 0.09906
$EndPAD
$PAD
Sh "39" R 0.299999 1.5 0 0 0
Dr 0 0 0
At SMD N 00888000
Ne 0 ""
Po 0.249993 1.000001
.LocalClearance 0.09906
$EndPAD
$PAD
Sh "37" R 0.299999 1.5 0 0 0
Dr 0 0 0
At SMD N 00888000
Ne 0 ""
Po 0.749993 1.000001
.LocalClearance 0.09906
$EndPAD
$PAD
Sh "45" R 0.299999 1.5 0 0 0
Dr 0 0 0
At SMD N 00888000
Ne 0 ""
Po -1.250007 1.000001
.LocalClearance 0.09906
$EndPAD
$PAD
Sh "47" R 0.299999 1.5 0 0 0
Dr 0 0 0
At SMD N 00888000
Ne 0 ""
Po -1.750007 1.000001
.LocalClearance 0.09906
$EndPAD
$PAD
Sh "43" R 0.299999 1.5 0 0 0
Dr 0 0 0
At SMD N 00888000
Ne 0 ""
Po -0.750007 1.000001
.LocalClearance 0.09906
$EndPAD
$PAD
Sh "41" R 0.299999 1.5 0 0 0
Dr 0 0 0
At SMD N 00888000
Ne 0 ""
Po -0.250007 1.000001
.LocalClearance 0.09906
$EndPAD
$PAD
Sh "57" R 0.299999 1.5 0 0 0
Dr 0 0 0
At SMD N 00888000
Ne 0 ""
Po -4.250007 1.000001
.LocalClearance 0.09906
$EndPAD
$PAD
Sh "59" R 0.299999 1.5 0 0 0
Dr 0 0 0
At SMD N 00888000
Ne 0 ""
Po -4.750007 1.000001
.LocalClearance 0.09906
$EndPAD
$PAD
Sh "63" R 0.299999 1.5 0 0 0
Dr 0 0 0
At SMD N 00888000
Ne 0 ""
Po -5.750007 1.000001
.LocalClearance 0.09906
$EndPAD
$PAD
Sh "61" R 0.299999 1.5 0 0 0
Dr 0 0 0
At SMD N 00888000
Ne 0 ""
Po -5.250007 1.000001
.LocalClearance 0.09906
$EndPAD
$PAD
Sh "53" R 0.299999 1.5 0 0 0
Dr 0 0 0
At SMD N 00888000
Ne 0 ""
Po -3.250007 1.000001
.LocalClearance 0.09906
$EndPAD
$PAD
Sh "55" R 0.299999 1.5 0 0 0
Dr 0 0 0
At SMD N 00888000
Ne 0 ""
Po -3.750007 1.000001
.LocalClearance 0.09906
$EndPAD
$PAD
Sh "51" R 0.299999 1.5 0 0 0
Dr 0 0 0
At SMD N 00888000
Ne 0 ""
Po -2.750007 1.000001
.LocalClearance 0.09906
$EndPAD
$PAD
Sh "49" R 0.299999 1.5 0 0 0
Dr 0 0 0
At SMD N 00888000
Ne 0 ""
Po -2.250007 1.000001
.LocalClearance 0.09906
$EndPAD
$PAD
Sh "17" R 0.299999 1.5 0 0 0
Dr 0 0 0
At SMD N 00888000
Ne 0 ""
Po 5.749993 1.000001
.LocalClearance 0.09906
$EndPAD
$PAD
Sh "19" R 0.299999 1.5 0 0 0
Dr 0 0 0
At SMD N 00888000
Ne 0 ""
Po 5.249993 1.000001
.LocalClearance 0.09906
$EndPAD
$PAD
Sh "23" R 0.299999 1.5 0 0 0
Dr 0 0 0
At SMD N 00888000
Ne 0 ""
Po 4.249993 1.000001
.LocalClearance 0.09906
$EndPAD
$PAD
Sh "21" R 0.299999 1.5 0 0 0
Dr 0 0 0
At SMD N 00888000
Ne 0 ""
Po 4.749993 1.000001
.LocalClearance 0.09906
$EndPAD
$PAD
Sh "29" R 0.299999 1.5 0 0 0
Dr 0 0 0
At SMD N 00888000
Ne 0 ""
Po 2.749993 1.000001
.LocalClearance 0.09906
$EndPAD
$PAD
Sh "31" R 0.299999 1.5 0 0 0
Dr 0 0 0
At SMD N 00888000
Ne 0 ""
Po 2.249993 1.000001
.LocalClearance 0.09906
$EndPAD
$PAD
Sh "27" R 0.299999 1.5 0 0 0
Dr 0 0 0
At SMD N 00888000
Ne 0 ""
Po 3.249993 1.000001
.LocalClearance 0.09906
$EndPAD
$PAD
Sh "25" R 0.299999 1.5 0 0 0
Dr 0 0 0
At SMD N 00888000
Ne 0 ""
Po 3.749993 1.000001
.LocalClearance 0.09906
$EndPAD
$PAD
Sh "9" R 0.299999 1.5 0 0 0
Dr 0 0 0
At SMD N 00888000
Ne 0 ""
Po 7.749993 1.000001
.LocalClearance 0.09906
$EndPAD
$PAD
Sh "11" R 0.299999 1.5 0 0 0
Dr 0 0 0
At SMD N 00888000
Ne 0 ""
Po 7.249993 1.000001
.LocalClearance 0.09906
$EndPAD
$PAD
Sh "15" R 0.299999 1.5 0 0 0
Dr 0 0 0
At SMD N 00888000
Ne 0 ""
Po 6.249993 1.000001
.LocalClearance 0.09906
$EndPAD
$PAD
Sh "13" R 0.299999 1.5 0 0 0
Dr 0 0 0
At SMD N 00888000
Ne 0 ""
Po 6.749993 1.000001
.LocalClearance 0.09906
$EndPAD
$PAD
Sh "5" R 0.299999 1.5 0 0 0
Dr 0 0 0
At SMD N 00888000
Ne 0 ""
Po 8.749993 1.000001
.LocalClearance 0.09906
$EndPAD
$PAD
Sh "7" R 0.299999 1.5 0 0 0
Dr 0 0 0
At SMD N 00888000
Ne 0 ""
Po 8.249993 1.000001
.LocalClearance 0.09906
$EndPAD
$PAD
Sh "3" R 0.299999 1.5 0 0 0
Dr 0 0 0
At SMD N 00888000
Ne 0 ""
Po 9.249993 1.000001
.LocalClearance 0.09906
$EndPAD
$PAD
Sh "66" R 0.299999 1.5 0 0 0
Dr 0 0 0
At SMD N 00888000
Ne 0 ""
Po -6.250007 -2.700001
.LocalClearance 0.09906
$EndPAD
$PAD
Sh "68" R 0.299999 1.5 0 0 0
Dr 0 0 0
At SMD N 00888000
Ne 0 ""
Po -6.750007 -2.700001
.LocalClearance 0.09906
$EndPAD
$PAD
Sh "72" R 0.299999 1.5 0 0 0
Dr 0 0 0
At SMD N 00888000
Ne 0 ""
Po -7.750007 -2.700001
.LocalClearance 0.09906
$EndPAD
$PAD
Sh "70" R 0.299999 1.5 0 0 0
Dr 0 0 0
At SMD N 00888000
Ne 0 ""
Po -7.250007 -2.700001
.LocalClearance 0.09906
$EndPAD
$PAD
Sh "78" R 0.299999 1.5 0 0 0
Dr 0 0 0
At SMD N 00888000
Ne 0 ""
Po -9.250007 -2.700001
.SolderMask 0.1
.SolderPaste 0.1
.LocalClearance 0.1
$EndPAD
$PAD
Sh "80" R 0.299999 1.5 0 0 0
Dr 0 0 0
At SMD N 00888000
Ne 0 ""
Po -9.750007 -2.700001
.SolderMask 0.1
.SolderPaste 0.1
.LocalClearance 0.1
$EndPAD
$PAD
Sh "76" R 0.299999 1.5 0 0 0
Dr 0 0 0
At SMD N 00888000
Ne 0 ""
Po -8.750007 -2.700001
.LocalClearance 0.09906
$EndPAD
$PAD
Sh "74" R 0.299999 1.5 0 0 0
Dr 0 0 0
At SMD N 00888000
Ne 0 ""
Po -8.250007 -2.700001
.LocalClearance 0.09906
$EndPAD
$PAD
Sh "34" R 0.299999 1.5 0 0 0
Dr 0 0 0
At SMD N 00888000
Ne 0 ""
Po 1.749993 -2.700001
.LocalClearance 0.09906
$EndPAD
$PAD
Sh "36" R 0.299999 1.5 0 0 0
Dr 0 0 0
At SMD N 00888000
Ne 0 ""
Po 1.249993 -2.700001
.LocalClearance 0.09906
$EndPAD
$PAD
Sh "40" R 0.299999 1.5 0 0 0
Dr 0 0 0
At SMD N 00888000
Ne 0 ""
Po 0.249993 -2.700001
.LocalClearance 0.09906
$EndPAD
$PAD
Sh "38" R 0.299999 1.5 0 0 0
Dr 0 0 0
At SMD N 00888000
Ne 0 ""
Po 0.749993 -2.700001
.LocalClearance 0.09906
$EndPAD
$PAD
Sh "46" R 0.299999 1.5 0 0 0
Dr 0 0 0
At SMD N 00888000
Ne 0 ""
Po -1.250007 -2.700001
.LocalClearance 0.09906
$EndPAD
$PAD
Sh "48" R 0.299999 1.5 0 0 0
Dr 0 0 0
At SMD N 00888000
Ne 0 ""
Po -1.750007 -2.700001
.LocalClearance 0.09906
$EndPAD
$PAD
Sh "44" R 0.299999 1.5 0 0 0
Dr 0 0 0
At SMD N 00888000
Ne 0 ""
Po -0.750007 -2.700001
.LocalClearance 0.09906
$EndPAD
$PAD
Sh "42" R 0.299999 1.5 0 0 0
Dr 0 0 0
At SMD N 00888000
Ne 0 ""
Po -0.250007 -2.700001
.LocalClearance 0.09906
$EndPAD
$PAD
Sh "58" R 0.299999 1.5 0 0 0
Dr 0 0 0
At SMD N 00888000
Ne 0 ""
Po -4.250007 -2.700001
.LocalClearance 0.09906
$EndPAD
$PAD
Sh "60" R 0.299999 1.5 0 0 0
Dr 0 0 0
At SMD N 00888000
Ne 0 ""
Po -4.750007 -2.700001
.LocalClearance 0.09906
$EndPAD
$PAD
Sh "64" R 0.299999 1.5 0 0 0
Dr 0 0 0
At SMD N 00888000
Ne 0 ""
Po -5.750007 -2.700001
.LocalClearance 0.09906
$EndPAD
$PAD
Sh "62" R 0.299999 1.5 0 0 0
Dr 0 0 0
At SMD N 00888000
Ne 0 ""
Po -5.250007 -2.700001
.LocalClearance 0.09906
$EndPAD
$PAD
Sh "54" R 0.299999 1.5 0 0 0
Dr 0 0 0
At SMD N 00888000
Ne 0 ""
Po -3.250007 -2.700001
.LocalClearance 0.09906
$EndPAD
$PAD
Sh "56" R 0.299999 1.5 0 0 0
Dr 0 0 0
At SMD N 00888000
Ne 0 ""
Po -3.750007 -2.700001
.LocalClearance 0.09906
$EndPAD
$PAD
Sh "52" R 0.299999 1.5 0 0 0
Dr 0 0 0
At SMD N 00888000
Ne 0 ""
Po -2.750007 -2.700001
.LocalClearance 0.09906
$EndPAD
$PAD
Sh "50" R 0.299999 1.5 0 0 0
Dr 0 0 0
At SMD N 00888000
Ne 0 ""
Po -2.250007 -2.700001
.LocalClearance 0.09906
$EndPAD
$PAD
Sh "18" R 0.299999 1.5 0 0 0
Dr 0 0 0
At SMD N 00888000
Ne 0 ""
Po 5.749993 -2.700001
.LocalClearance 0.09906
$EndPAD
$PAD
Sh "20" R 0.299999 1.5 0 0 0
Dr 0 0 0
At SMD N 00888000
Ne 0 ""
Po 5.249993 -2.700001
.LocalClearance 0.09906
$EndPAD
$PAD
Sh "24" R 0.299999 1.5 0 0 0
Dr 0 0 0
At SMD N 00888000
Ne 0 ""
Po 4.249993 -2.700001
.LocalClearance 0.09906
$EndPAD
$PAD
Sh "22" R 0.299999 1.5 0 0 0
Dr 0 0 0
At SMD N 00888000
Ne 0 ""
Po 4.749993 -2.700001
.LocalClearance 0.09906
$EndPAD
$PAD
Sh "30" R 0.299999 1.5 0 0 0
Dr 0 0 0
At SMD N 00888000
Ne 0 ""
Po 2.749993 -2.700001
.LocalClearance 0.09906
$EndPAD
$PAD
Sh "32" R 0.299999 1.5 0 0 0
Dr 0 0 0
At SMD N 00888000
Ne 0 ""
Po 2.249993 -2.700001
.LocalClearance 0.09906
$EndPAD
$PAD
Sh "28" R 0.299999 1.5 0 0 0
Dr 0 0 0
At SMD N 00888000
Ne 0 ""
Po 3.249993 -2.700001
.LocalClearance 0.09906
$EndPAD
$PAD
Sh "26" R 0.299999 1.5 0 0 0
Dr 0 0 0
At SMD N 00888000
Ne 0 ""
Po 3.749993 -2.700001
.LocalClearance 0.09906
$EndPAD
$PAD
Sh "10" R 0.299999 1.5 0 0 0
Dr 0 0 0
At SMD N 00888000
Ne 0 ""
Po 7.749993 -2.700001
.LocalClearance 0.09906
$EndPAD
$PAD
Sh "12" R 0.299999 1.5 0 0 0
Dr 0 0 0
At SMD N 00888000
Ne 0 ""
Po 7.249993 -2.700001
.LocalClearance 0.09906
$EndPAD
$PAD
Sh "16" R 0.299999 1.5 0 0 0
Dr 0 0 0
At SMD N 00888000
Ne 0 ""
Po 6.249993 -2.700001
.LocalClearance 0.09906
$EndPAD
$PAD
Sh "14" R 0.299999 1.5 0 0 0
Dr 0 0 0
At SMD N 00888000
Ne 0 ""
Po 6.749993 -2.700001
.LocalClearance 0.09906
$EndPAD
$PAD
Sh "6" R 0.299999 1.5 0 0 0
Dr 0 0 0
At SMD N 00888000
Ne 0 ""
Po 8.749993 -2.700001
.LocalClearance 0.09906
$EndPAD
$PAD
Sh "8" R 0.299999 1.5 0 0 0
Dr 0 0 0
At SMD N 00888000
Ne 0 ""
Po 8.249993 -2.700001
.LocalClearance 0.09906
$EndPAD
$PAD
Sh "4" R 0.299999 1.5 0 0 0
Dr 0 0 0
At SMD N 00888000
Ne 0 ""
Po 9.249993 -2.700001
.LocalClearance 0.09906
$EndPAD
$PAD
Sh "2" R 0.299999 1.5 0 0 0
Dr 0 0 0
At SMD N 00888000
Ne 0 ""
Po 9.749993 -2.700001
.LocalClearance 0.09906
$EndPAD
$PAD
Sh "" C 1.45 1.45 0 0 0
Dr 1.45 0 0
At HOLE N 00E0FFFF
Ne 0 ""
Po -11.000003 0
.LocalClearance 0.09906
$EndPAD
$PAD
Sh "1" R 0.299999 1.5 0 0 0
Dr 0 0 0
At SMD N 00888000
Ne 0 ""
Po 9.749993 1.000001
.LocalClearance 0.09906
$EndPAD
$PAD
Sh "" C 1.45 1.45 0 0 0
Dr 1.45 0 0
At HOLE N 00E0FFFF
Ne 0 ""
Po 11.000003 0
.LocalClearance 0.09906
$EndPAD
$EndMODULE LSHM-1-40-025-F-DV-N
$EndLIBRARY
