%FSLAX34Y34*%
G04 Gerber Fmt 3.4, Leading zero omitted, Abs format*
G04 (created by PCBNEW (2013-10-07 BZR 4378)-stable) date Fri 19 Dec 2014 03:56:25 PM EST*
%MOIN*%
G01*
G70*
G90*
G04 APERTURE LIST*
%ADD10C,0.005906*%
%ADD11C,0.003937*%
%ADD12R,0.139764X0.013779*%
%ADD13C,0.016000*%
%ADD14C,0.050000*%
%ADD15C,0.020000*%
%ADD16C,0.030000*%
%ADD17C,0.010000*%
%ADD18C,0.075000*%
%ADD19C,0.050000*%
%ADD20C,0.003000*%
%ADD21C,0.020000*%
G04 APERTURE END LIST*
G54D10*
G54D11*
X187590Y-91750D02*
X67550Y-91750D01*
X192640Y-82860D02*
X192640Y-83000D01*
X193600Y-81900D02*
X192640Y-82860D01*
X192640Y-86700D02*
X192640Y-83000D01*
X187590Y-91750D02*
X192640Y-86700D01*
X33030Y-93450D02*
X33480Y-93450D01*
X33480Y-93450D02*
X33570Y-93540D01*
X33570Y-93540D02*
X33570Y-93640D01*
X33570Y-93640D02*
X33690Y-93760D01*
X33690Y-93760D02*
X34140Y-93760D01*
X34140Y-93760D02*
X34140Y-93450D01*
X33030Y-93450D02*
X33030Y-80650D01*
X33030Y-80650D02*
X33400Y-80650D01*
X33390Y-80650D02*
X33420Y-80650D01*
X33420Y-80650D02*
X33450Y-80650D01*
X33450Y-80650D02*
X33570Y-80530D01*
X33570Y-80530D02*
X33570Y-80440D01*
X33570Y-80440D02*
X33680Y-80330D01*
X33680Y-80330D02*
X34130Y-80330D01*
X34130Y-80330D02*
X34130Y-80640D01*
X197600Y-77900D02*
X193600Y-81900D01*
X65850Y-93450D02*
X67550Y-91750D01*
X33050Y-93450D02*
X65850Y-93450D01*
X33050Y-80650D02*
X33050Y-93450D01*
X64350Y-80650D02*
X33050Y-80650D01*
X68600Y-84900D02*
X64350Y-80650D01*
X184100Y-84900D02*
X68600Y-84900D01*
X185600Y-83400D02*
X184100Y-84900D01*
X185600Y-74300D02*
X185600Y-83400D01*
X197600Y-74300D02*
X197600Y-77900D01*
X197600Y-74300D02*
X185600Y-74300D01*
G54D12*
X33730Y-90101D03*
X33730Y-89904D03*
X33730Y-89510D03*
X33730Y-89707D03*
X33730Y-88920D03*
X33730Y-88723D03*
X33730Y-89116D03*
X33730Y-89313D03*
X33730Y-87738D03*
X33730Y-87542D03*
X33730Y-87148D03*
X33730Y-87345D03*
X33730Y-88132D03*
X33730Y-87935D03*
X33730Y-88329D03*
X33730Y-88526D03*
X33730Y-91675D03*
X33730Y-91479D03*
X33730Y-91085D03*
X33730Y-91282D03*
X33730Y-90494D03*
X33730Y-90298D03*
X33730Y-90691D03*
X33730Y-90888D03*
X33730Y-92463D03*
X33730Y-92266D03*
X33730Y-91872D03*
X33730Y-92069D03*
X33730Y-92857D03*
X33730Y-92660D03*
X33730Y-93053D03*
X33730Y-93250D03*
X33730Y-83998D03*
X33730Y-84195D03*
X33730Y-84589D03*
X33730Y-84392D03*
X33730Y-85179D03*
X33730Y-85376D03*
X33730Y-84983D03*
X33730Y-84786D03*
X33730Y-86361D03*
X33730Y-86557D03*
X33730Y-86951D03*
X33730Y-86754D03*
X33730Y-85967D03*
X33730Y-86164D03*
X33730Y-85770D03*
X33730Y-85573D03*
X33730Y-82424D03*
X33730Y-82620D03*
X33730Y-83014D03*
X33730Y-82817D03*
X33730Y-83605D03*
X33730Y-83801D03*
X33730Y-83408D03*
X33730Y-83211D03*
X33730Y-81636D03*
X33730Y-81833D03*
X33730Y-82227D03*
X33730Y-82030D03*
X33730Y-81242D03*
X33730Y-81439D03*
X33730Y-81046D03*
X33730Y-80849D03*
G54D13*
X37730Y-82655D03*
X38065Y-82650D03*
G54D14*
X190600Y-76000D03*
G54D13*
X37400Y-82200D03*
X37400Y-81950D03*
G54D14*
X189530Y-74740D03*
X188350Y-74740D03*
G54D13*
X192880Y-74620D03*
X193080Y-74900D03*
X37400Y-93250D03*
X188340Y-77500D03*
X188160Y-77340D03*
X37400Y-83420D03*
X193075Y-77500D03*
X37400Y-88530D03*
X192880Y-77340D03*
X193470Y-77500D03*
X37400Y-88940D03*
X193280Y-77340D03*
X193865Y-77500D03*
X193660Y-77340D03*
X37400Y-89340D03*
X194255Y-77500D03*
X37400Y-89730D03*
X194060Y-77340D03*
X194650Y-77500D03*
X194460Y-77340D03*
X37400Y-90130D03*
X195040Y-77500D03*
X194840Y-77340D03*
X37400Y-90520D03*
X188745Y-77500D03*
X188540Y-77340D03*
X37400Y-83810D03*
X189140Y-77500D03*
X188940Y-77340D03*
X37400Y-84210D03*
X189530Y-77500D03*
X189340Y-77340D03*
X37400Y-84600D03*
X189925Y-77500D03*
X189720Y-77340D03*
X37400Y-85000D03*
X190320Y-77499D03*
X190120Y-77340D03*
X37400Y-85390D03*
X190715Y-77500D03*
X190520Y-77340D03*
X37400Y-85790D03*
X191110Y-77500D03*
X190900Y-77340D03*
X37400Y-86180D03*
X192290Y-77500D03*
X192080Y-77340D03*
X37400Y-87760D03*
X192685Y-77500D03*
X37400Y-88150D03*
X192480Y-77340D03*
G54D15*
X194740Y-75840D03*
G54D13*
X193480Y-74880D03*
X37400Y-92860D03*
X193280Y-74680D03*
X194060Y-75800D03*
X194455Y-75800D03*
X193860Y-75960D03*
X37400Y-91500D03*
X194260Y-75960D03*
X37400Y-91890D03*
X37730Y-83210D03*
X38148Y-83093D03*
X106955Y-90635D03*
X110955Y-90635D03*
X108955Y-90635D03*
X104955Y-90635D03*
X72955Y-90635D03*
X76955Y-90635D03*
X80955Y-90635D03*
X84955Y-90635D03*
X88955Y-90635D03*
X92955Y-90635D03*
X96955Y-90635D03*
X100955Y-90635D03*
X102955Y-90635D03*
X98955Y-90635D03*
X94955Y-90635D03*
X90955Y-90635D03*
X86955Y-90635D03*
X82955Y-90635D03*
X78955Y-90635D03*
X74955Y-90635D03*
X124955Y-90635D03*
X128955Y-90635D03*
X132955Y-90635D03*
X136955Y-90635D03*
X140955Y-90635D03*
X144955Y-90635D03*
X148955Y-90635D03*
X152955Y-90635D03*
X150955Y-90635D03*
X146955Y-90635D03*
X142955Y-90635D03*
X138955Y-90635D03*
X134955Y-90635D03*
X130955Y-90635D03*
X126955Y-90635D03*
X155050Y-90625D03*
X70955Y-90635D03*
X68955Y-90635D03*
X66955Y-90635D03*
X37770Y-91460D03*
X37360Y-92250D03*
G54D14*
X197090Y-74810D03*
G54D13*
X37700Y-90900D03*
X38000Y-87540D03*
X37740Y-87350D03*
X38140Y-86560D03*
X37860Y-86750D03*
X64885Y-90705D03*
X55880Y-91705D03*
X59880Y-91705D03*
X61880Y-91705D03*
X57880Y-91705D03*
X53880Y-91700D03*
X63860Y-91715D03*
X159050Y-90625D03*
X163050Y-90625D03*
X167050Y-90625D03*
X171050Y-90625D03*
X175050Y-90625D03*
X179050Y-90625D03*
X183050Y-90625D03*
X185050Y-90625D03*
X181050Y-90625D03*
X177050Y-90625D03*
X173050Y-90625D03*
X169050Y-90625D03*
X165050Y-90625D03*
X161050Y-90625D03*
X157050Y-90625D03*
X188500Y-89180D03*
X187050Y-90625D03*
X193770Y-79785D03*
X192775Y-80780D03*
X191370Y-82210D03*
X191340Y-84210D03*
X195185Y-78370D03*
X191330Y-86350D03*
X189915Y-87765D03*
X37400Y-82860D03*
X37400Y-82450D03*
X64300Y-83050D03*
X38570Y-83050D03*
X54300Y-83050D03*
X58300Y-83050D03*
X62300Y-83050D03*
X60300Y-83050D03*
X56300Y-83050D03*
X66080Y-84830D03*
X67850Y-86595D03*
X152900Y-86595D03*
X54060Y-92580D03*
X56060Y-92990D03*
X58060Y-92580D03*
X60060Y-92990D03*
X62060Y-92580D03*
X65210Y-91900D03*
X65680Y-92320D03*
X37800Y-92990D03*
X37790Y-92580D03*
X66800Y-90165D03*
X68800Y-90165D03*
X70800Y-90165D03*
X154800Y-90165D03*
X53480Y-91060D03*
X57480Y-91060D03*
X61480Y-91060D03*
X59480Y-91060D03*
X55480Y-91060D03*
X63485Y-91055D03*
X64400Y-90165D03*
X37400Y-91060D03*
X63480Y-87230D03*
X55480Y-87230D03*
X59480Y-87230D03*
X61480Y-87230D03*
X57480Y-87230D03*
X53480Y-87230D03*
X37480Y-87230D03*
X63480Y-86885D03*
X37610Y-86890D03*
X53610Y-86890D03*
X57610Y-86890D03*
X61610Y-86890D03*
X59610Y-86890D03*
X55610Y-86890D03*
X64930Y-88225D03*
X67780Y-88225D03*
X69780Y-88225D03*
X153780Y-88225D03*
X67940Y-88530D03*
X69940Y-88530D03*
X153940Y-88530D03*
X64800Y-88530D03*
X188225Y-88750D03*
X189445Y-87530D03*
X187580Y-86885D03*
X187360Y-86655D03*
X155940Y-88530D03*
X159940Y-88530D03*
X163940Y-88530D03*
X167940Y-88530D03*
X171940Y-88530D03*
X175940Y-88530D03*
X179940Y-88530D03*
X183940Y-88530D03*
X181940Y-88530D03*
X177940Y-88530D03*
X173940Y-88530D03*
X169940Y-88530D03*
X165940Y-88530D03*
X161940Y-88530D03*
X157940Y-88530D03*
X125940Y-88530D03*
X129940Y-88530D03*
X133940Y-88530D03*
X137940Y-88530D03*
X141940Y-88530D03*
X145940Y-88530D03*
X149940Y-88530D03*
X151940Y-88530D03*
X147940Y-88530D03*
X143940Y-88530D03*
X139940Y-88530D03*
X135940Y-88530D03*
X131940Y-88530D03*
X127940Y-88530D03*
X73940Y-88530D03*
X77940Y-88530D03*
X81940Y-88530D03*
X85940Y-88530D03*
X89940Y-88530D03*
X93940Y-88530D03*
X97940Y-88530D03*
X101940Y-88530D03*
X99940Y-88530D03*
X95940Y-88530D03*
X91940Y-88530D03*
X87940Y-88530D03*
X83940Y-88530D03*
X79940Y-88530D03*
X75940Y-88530D03*
X71940Y-88530D03*
X103940Y-88530D03*
X107940Y-88530D03*
X109940Y-88530D03*
X105940Y-88530D03*
X155780Y-88225D03*
X159780Y-88225D03*
X163780Y-88225D03*
X167780Y-88225D03*
X171780Y-88225D03*
X175780Y-88225D03*
X179780Y-88225D03*
X183780Y-88225D03*
X181780Y-88225D03*
X177780Y-88225D03*
X173780Y-88225D03*
X169780Y-88225D03*
X165780Y-88225D03*
X161780Y-88225D03*
X157780Y-88225D03*
X125780Y-88225D03*
X129780Y-88225D03*
X133780Y-88225D03*
X137780Y-88225D03*
X141780Y-88225D03*
X145780Y-88225D03*
X149780Y-88225D03*
X151780Y-88225D03*
X147780Y-88225D03*
X143780Y-88225D03*
X139780Y-88225D03*
X135780Y-88225D03*
X131780Y-88225D03*
X127780Y-88225D03*
X73780Y-88225D03*
X77780Y-88225D03*
X81780Y-88225D03*
X85780Y-88225D03*
X89780Y-88225D03*
X93780Y-88225D03*
X97780Y-88225D03*
X101780Y-88225D03*
X99780Y-88225D03*
X95780Y-88225D03*
X91780Y-88225D03*
X87780Y-88225D03*
X83780Y-88225D03*
X79780Y-88225D03*
X75780Y-88225D03*
X71780Y-88225D03*
X103780Y-88225D03*
X107780Y-88225D03*
X109780Y-88225D03*
X105780Y-88225D03*
X188920Y-85090D03*
X191070Y-78000D03*
X188925Y-80160D03*
X188930Y-82660D03*
X185780Y-88225D03*
X185940Y-88530D03*
X189230Y-82740D03*
X191530Y-78000D03*
X189250Y-80280D03*
X189230Y-85225D03*
X190870Y-84100D03*
X190855Y-86115D03*
X156800Y-90165D03*
X160800Y-90165D03*
X164800Y-90165D03*
X168800Y-90165D03*
X172800Y-90165D03*
X176800Y-90165D03*
X180800Y-90165D03*
X184800Y-90165D03*
X182800Y-90165D03*
X178800Y-90165D03*
X174800Y-90165D03*
X170800Y-90165D03*
X166800Y-90165D03*
X162800Y-90165D03*
X158800Y-90165D03*
X126800Y-90165D03*
X130800Y-90165D03*
X134800Y-90165D03*
X138800Y-90165D03*
X142800Y-90165D03*
X146800Y-90165D03*
X150800Y-90165D03*
X152800Y-90165D03*
X148800Y-90165D03*
X144800Y-90165D03*
X140800Y-90165D03*
X136800Y-90165D03*
X132800Y-90165D03*
X128800Y-90165D03*
X124800Y-90165D03*
X74800Y-90165D03*
X78800Y-90165D03*
X82800Y-90165D03*
X86800Y-90165D03*
X90800Y-90165D03*
X94800Y-90165D03*
X98800Y-90165D03*
X102800Y-90165D03*
X100800Y-90165D03*
X96800Y-90165D03*
X92800Y-90165D03*
X88800Y-90165D03*
X84800Y-90165D03*
X80800Y-90165D03*
X76800Y-90165D03*
X72800Y-90165D03*
X104800Y-90165D03*
X108800Y-90165D03*
X110800Y-90165D03*
X106800Y-90165D03*
X186805Y-90170D03*
X104900Y-86595D03*
X108900Y-86595D03*
X110900Y-86595D03*
X106900Y-86595D03*
X102900Y-86595D03*
X70900Y-86595D03*
X74900Y-86595D03*
X78900Y-86595D03*
X82900Y-86595D03*
X86900Y-86595D03*
X90900Y-86595D03*
X94900Y-86595D03*
X98900Y-86595D03*
X100900Y-86595D03*
X96900Y-86595D03*
X92900Y-86595D03*
X88900Y-86595D03*
X84900Y-86595D03*
X80900Y-86595D03*
X76900Y-86595D03*
X72900Y-86595D03*
X126900Y-86595D03*
X130900Y-86595D03*
X134900Y-86595D03*
X138900Y-86595D03*
X142900Y-86595D03*
X146900Y-86595D03*
X150900Y-86595D03*
X148900Y-86595D03*
X144900Y-86595D03*
X140900Y-86595D03*
X136900Y-86595D03*
X132900Y-86595D03*
X128900Y-86595D03*
X124900Y-86595D03*
X156900Y-86595D03*
X160900Y-86595D03*
X164900Y-86595D03*
X168900Y-86595D03*
X172900Y-86595D03*
X176900Y-86595D03*
X180900Y-86595D03*
X182900Y-86595D03*
X178900Y-86595D03*
X174900Y-86595D03*
X170900Y-86595D03*
X166900Y-86595D03*
X162900Y-86595D03*
X158900Y-86595D03*
X154900Y-86595D03*
X190870Y-81990D03*
X192250Y-80585D03*
X193395Y-79435D03*
X184875Y-86565D03*
X37400Y-81700D03*
X37400Y-81450D03*
G54D14*
X186100Y-74800D03*
G54D13*
X194815Y-78015D03*
G54D14*
X192500Y-76100D03*
G54D13*
X186055Y-85375D03*
X187290Y-82000D03*
X187300Y-78000D03*
X187290Y-80000D03*
X187290Y-84000D03*
G54D14*
X191900Y-76100D03*
X191300Y-76100D03*
X190120Y-74740D03*
X188940Y-74740D03*
G54D16*
X37730Y-82655D02*
X38060Y-82655D01*
X38060Y-82655D02*
X38065Y-82650D01*
X37735Y-82650D02*
X64500Y-82650D01*
X188500Y-76000D02*
X190600Y-76000D01*
X186900Y-77600D02*
X188500Y-76000D01*
X186900Y-83900D02*
X186900Y-77600D01*
X184600Y-86200D02*
X186900Y-83900D01*
X68050Y-86200D02*
X184600Y-86200D01*
X64500Y-82650D02*
X68050Y-86200D01*
G54D17*
X37735Y-82650D02*
X36735Y-82650D01*
X36509Y-82424D02*
X33730Y-82424D01*
X36735Y-82650D02*
X36509Y-82424D01*
X37250Y-82200D02*
X37400Y-82200D01*
X33730Y-81833D02*
X36883Y-81833D01*
X36883Y-81833D02*
X37250Y-82200D01*
X36986Y-81636D02*
X37300Y-81950D01*
X37300Y-81950D02*
X37400Y-81950D01*
X36936Y-81636D02*
X33730Y-81636D01*
X36936Y-81636D02*
X36986Y-81636D01*
X37900Y-81250D02*
X37600Y-81250D01*
X37396Y-81046D02*
X33730Y-81046D01*
X37600Y-81250D02*
X37396Y-81046D01*
X37900Y-81250D02*
X37900Y-81250D01*
G54D18*
X68350Y-85500D02*
X64100Y-81250D01*
X64100Y-81250D02*
X37900Y-81250D01*
X186200Y-75900D02*
X186200Y-83600D01*
G54D19*
X187360Y-74740D02*
X186200Y-75900D01*
X188350Y-74740D02*
X187360Y-74740D01*
G54D18*
X184300Y-85500D02*
X69000Y-85500D01*
X186200Y-83600D02*
X184300Y-85500D01*
X69000Y-85500D02*
X68350Y-85500D01*
G54D17*
X37499Y-80849D02*
X33730Y-80849D01*
X37900Y-81250D02*
X37499Y-80849D01*
X33730Y-93053D02*
X37473Y-93053D01*
X197200Y-77860D02*
X197200Y-75480D01*
X192360Y-82700D02*
X197200Y-77860D01*
X192360Y-86650D02*
X192360Y-82700D01*
X187500Y-91510D02*
X192360Y-86650D01*
X66900Y-91510D02*
X187500Y-91510D01*
X65210Y-93200D02*
X66900Y-91510D01*
X37620Y-93200D02*
X65210Y-93200D01*
X37473Y-93053D02*
X37620Y-93200D01*
X192880Y-74620D02*
X193020Y-74480D01*
X197200Y-75480D02*
X197200Y-77740D01*
X196200Y-74480D02*
X197200Y-75480D01*
X193020Y-74480D02*
X196200Y-74480D01*
X37060Y-93250D02*
X37400Y-93250D01*
X33730Y-93250D02*
X37060Y-93250D01*
X37400Y-93250D02*
X37400Y-93249D01*
G54D20*
X64380Y-83510D02*
X67650Y-86780D01*
X37560Y-83510D02*
X64380Y-83510D01*
X33730Y-83605D02*
X37464Y-83605D01*
X37464Y-83605D02*
X37560Y-83510D01*
X67650Y-86780D02*
X185000Y-86780D01*
X185000Y-86780D02*
X187480Y-84300D01*
X187480Y-84300D02*
X187480Y-78400D01*
X187480Y-78400D02*
X188340Y-77540D01*
X188340Y-77540D02*
X188340Y-77500D01*
X188340Y-77500D02*
X188380Y-77500D01*
X185000Y-86780D02*
X68900Y-86780D01*
X187480Y-84300D02*
X185000Y-86780D01*
X187480Y-78400D02*
X187480Y-84300D01*
X188380Y-77500D02*
X187480Y-78400D01*
X37280Y-83408D02*
X37400Y-83420D01*
X37388Y-83408D02*
X37400Y-83420D01*
X37388Y-83408D02*
X37280Y-83408D01*
X37280Y-83408D02*
X33730Y-83408D01*
X193075Y-77500D02*
X193075Y-77525D01*
X37464Y-88735D02*
X37560Y-88640D01*
X33730Y-88735D02*
X37464Y-88735D01*
X63510Y-88640D02*
X37560Y-88640D01*
X63950Y-89080D02*
X63510Y-88640D01*
X186220Y-89080D02*
X63950Y-89080D01*
X189780Y-85520D02*
X186220Y-89080D01*
X189780Y-80820D02*
X189780Y-85520D01*
X193075Y-77525D02*
X189780Y-80820D01*
X37309Y-88538D02*
X37400Y-88530D01*
X37388Y-88538D02*
X37400Y-88550D01*
X33730Y-88538D02*
X37309Y-88538D01*
X37309Y-88538D02*
X37388Y-88538D01*
X37560Y-89030D02*
X63340Y-89030D01*
X33730Y-89125D02*
X37464Y-89125D01*
X37464Y-89125D02*
X37560Y-89030D01*
X193470Y-77530D02*
X193470Y-77500D01*
X189960Y-81040D02*
X193470Y-77530D01*
X189960Y-85620D02*
X189960Y-81040D01*
X186320Y-89260D02*
X189960Y-85620D01*
X63570Y-89260D02*
X186320Y-89260D01*
X63340Y-89030D02*
X63570Y-89260D01*
X37400Y-88940D02*
X37306Y-88928D01*
X33730Y-88928D02*
X37306Y-88928D01*
X193865Y-77500D02*
X193865Y-77515D01*
X37464Y-89525D02*
X37560Y-89430D01*
X33730Y-89525D02*
X37464Y-89525D01*
X63180Y-89430D02*
X37560Y-89430D01*
X63190Y-89440D02*
X63180Y-89430D01*
X186420Y-89440D02*
X63190Y-89440D01*
X190140Y-85720D02*
X186420Y-89440D01*
X190140Y-81240D02*
X190140Y-85720D01*
X193865Y-77515D02*
X190140Y-81240D01*
X37300Y-89328D02*
X37400Y-89340D01*
X33730Y-89328D02*
X37300Y-89328D01*
X37560Y-89820D02*
X63370Y-89820D01*
X33730Y-89915D02*
X37464Y-89915D01*
X37464Y-89915D02*
X37560Y-89820D01*
X194255Y-77525D02*
X194255Y-77500D01*
X190320Y-81460D02*
X194255Y-77525D01*
X190320Y-85820D02*
X190320Y-81460D01*
X186520Y-89620D02*
X190320Y-85820D01*
X63570Y-89620D02*
X186520Y-89620D01*
X63370Y-89820D02*
X63570Y-89620D01*
X37310Y-89718D02*
X37400Y-89730D01*
X33730Y-89718D02*
X37310Y-89718D01*
X37310Y-89718D02*
X37388Y-89718D01*
X37388Y-89718D02*
X37400Y-89730D01*
X194650Y-77500D02*
X194650Y-77530D01*
X33730Y-90315D02*
X37464Y-90315D01*
X37464Y-90315D02*
X37560Y-90220D01*
X63530Y-90220D02*
X37560Y-90220D01*
X63950Y-89800D02*
X63530Y-90220D01*
X186620Y-89800D02*
X63950Y-89800D01*
X190500Y-85920D02*
X186620Y-89800D01*
X190500Y-81680D02*
X190500Y-85920D01*
X194650Y-77530D02*
X190500Y-81680D01*
X37300Y-90118D02*
X37400Y-90130D01*
X33730Y-90118D02*
X37300Y-90118D01*
X37300Y-90118D02*
X37388Y-90118D01*
X37388Y-90118D02*
X37400Y-90130D01*
X37560Y-90610D02*
X63700Y-90610D01*
X37464Y-90705D02*
X37560Y-90610D01*
X33730Y-90705D02*
X37464Y-90705D01*
X64330Y-89980D02*
X186720Y-89980D01*
X63700Y-90610D02*
X64330Y-89980D01*
X186720Y-89980D02*
X190680Y-86020D01*
X190680Y-86020D02*
X190680Y-81880D01*
X190680Y-81880D02*
X195040Y-77520D01*
X195040Y-77520D02*
X195040Y-77500D01*
X195040Y-77500D02*
X195040Y-77520D01*
X186720Y-89980D02*
X68940Y-89980D01*
X190680Y-86020D02*
X186720Y-89980D01*
X190680Y-81880D02*
X190680Y-86020D01*
X195040Y-77520D02*
X190680Y-81880D01*
X37300Y-90508D02*
X37400Y-90520D01*
X33730Y-90508D02*
X37300Y-90508D01*
X188745Y-77500D02*
X188745Y-77515D01*
X33730Y-83995D02*
X37464Y-83995D01*
X37464Y-83995D02*
X37560Y-83900D01*
X64210Y-83900D02*
X37560Y-83900D01*
X67270Y-86960D02*
X64210Y-83900D01*
X185100Y-86960D02*
X67270Y-86960D01*
X187660Y-84400D02*
X185100Y-86960D01*
X187660Y-78600D02*
X187660Y-84400D01*
X188745Y-77515D02*
X187660Y-78600D01*
X37400Y-83810D02*
X37306Y-83798D01*
X37306Y-83798D02*
X33730Y-83798D01*
X189140Y-77500D02*
X189140Y-77520D01*
X64050Y-84300D02*
X66890Y-87140D01*
X66890Y-87140D02*
X185200Y-87140D01*
X185200Y-87140D02*
X187840Y-84500D01*
X187840Y-84500D02*
X187840Y-78820D01*
X187840Y-78820D02*
X188940Y-77720D01*
X37464Y-84395D02*
X37560Y-84300D01*
X33730Y-84395D02*
X37464Y-84395D01*
X37560Y-84300D02*
X64050Y-84300D01*
X189140Y-77520D02*
X188940Y-77720D01*
X37400Y-84210D02*
X37306Y-84198D01*
X37306Y-84198D02*
X33730Y-84198D01*
X189530Y-77500D02*
X189530Y-77530D01*
X63890Y-84690D02*
X66520Y-87320D01*
X66520Y-87320D02*
X185300Y-87320D01*
X185300Y-87320D02*
X188020Y-84600D01*
X188020Y-84600D02*
X188020Y-79040D01*
X188020Y-79040D02*
X189340Y-77720D01*
X37464Y-84785D02*
X33730Y-84785D01*
X37464Y-84785D02*
X37560Y-84690D01*
X37560Y-84690D02*
X63890Y-84690D01*
X189530Y-77530D02*
X189340Y-77720D01*
X37400Y-84600D02*
X37306Y-84588D01*
X37306Y-84588D02*
X33730Y-84588D01*
X37560Y-85090D02*
X63730Y-85090D01*
X33730Y-85185D02*
X37464Y-85185D01*
X37464Y-85185D02*
X37560Y-85090D01*
X189925Y-77515D02*
X189925Y-77500D01*
X188200Y-79240D02*
X189925Y-77515D01*
X188200Y-84700D02*
X188200Y-79240D01*
X185400Y-87500D02*
X188200Y-84700D01*
X66140Y-87500D02*
X185400Y-87500D01*
X63730Y-85090D02*
X66140Y-87500D01*
X37400Y-85000D02*
X37306Y-84988D01*
X37306Y-84988D02*
X33730Y-84988D01*
X190320Y-77499D02*
X190320Y-77519D01*
X190320Y-77519D02*
X188380Y-79460D01*
X188380Y-79460D02*
X188380Y-84800D01*
X188380Y-84800D02*
X185500Y-87680D01*
X185500Y-87680D02*
X65760Y-87680D01*
X65760Y-87680D02*
X63560Y-85480D01*
X63560Y-85480D02*
X37560Y-85480D01*
X37464Y-85575D02*
X33730Y-85575D01*
X37464Y-85575D02*
X37560Y-85480D01*
X37400Y-85390D02*
X37294Y-85378D01*
X37294Y-85378D02*
X33730Y-85378D01*
X37560Y-85880D02*
X63400Y-85880D01*
X37464Y-85975D02*
X37560Y-85880D01*
X33730Y-85975D02*
X37464Y-85975D01*
X190715Y-77525D02*
X190715Y-77500D01*
X188560Y-79680D02*
X190715Y-77525D01*
X188560Y-84900D02*
X188560Y-79680D01*
X185600Y-87860D02*
X188560Y-84900D01*
X65380Y-87860D02*
X185600Y-87860D01*
X63400Y-85880D02*
X65380Y-87860D01*
X37400Y-85790D02*
X37306Y-85778D01*
X37306Y-85778D02*
X33730Y-85778D01*
X191110Y-77500D02*
X191110Y-77510D01*
X33730Y-86365D02*
X37464Y-86365D01*
X37464Y-86365D02*
X37560Y-86270D01*
X63240Y-86270D02*
X37560Y-86270D01*
X65010Y-88040D02*
X63240Y-86270D01*
X185700Y-88040D02*
X65010Y-88040D01*
X188740Y-85000D02*
X185700Y-88040D01*
X188740Y-79880D02*
X188740Y-85000D01*
X191110Y-77510D02*
X188740Y-79880D01*
X37400Y-86180D02*
X37306Y-86168D01*
X37306Y-86168D02*
X33730Y-86168D01*
X192290Y-77500D02*
X192290Y-77510D01*
X33730Y-87945D02*
X37464Y-87945D01*
X37464Y-87945D02*
X37560Y-87850D01*
X63840Y-87850D02*
X37560Y-87850D01*
X64710Y-88720D02*
X63840Y-87850D01*
X186020Y-88720D02*
X64710Y-88720D01*
X189420Y-85320D02*
X186020Y-88720D01*
X189420Y-80380D02*
X189420Y-85320D01*
X192290Y-77510D02*
X189420Y-80380D01*
X37400Y-87760D02*
X37306Y-87748D01*
X37306Y-87748D02*
X33730Y-87748D01*
X37560Y-88240D02*
X63670Y-88240D01*
X37464Y-88335D02*
X37560Y-88240D01*
X33730Y-88335D02*
X37464Y-88335D01*
X192685Y-77515D02*
X192685Y-77500D01*
X189600Y-80600D02*
X192685Y-77515D01*
X189600Y-85420D02*
X189600Y-80600D01*
X186120Y-88900D02*
X189600Y-85420D01*
X64330Y-88900D02*
X186120Y-88900D01*
X63670Y-88240D02*
X64330Y-88900D01*
X37400Y-88150D02*
X37306Y-88138D01*
X37306Y-88138D02*
X33730Y-88138D01*
G54D17*
X37620Y-92380D02*
X37605Y-92380D01*
X37521Y-92463D02*
X33730Y-92463D01*
X37605Y-92380D02*
X37521Y-92463D01*
X191840Y-86470D02*
X191840Y-86570D01*
X64320Y-92380D02*
X37620Y-92380D01*
X65600Y-91100D02*
X64320Y-92380D01*
X187310Y-91100D02*
X65600Y-91100D01*
X191840Y-86570D02*
X187310Y-91100D01*
X194740Y-75840D02*
X196060Y-75840D01*
X191840Y-82440D02*
X191840Y-86470D01*
X191840Y-86470D02*
X191840Y-86560D01*
X196420Y-77860D02*
X191840Y-82440D01*
X196420Y-76200D02*
X196420Y-77860D01*
X196060Y-75840D02*
X196420Y-76200D01*
X33730Y-92857D02*
X37397Y-92857D01*
X37397Y-92857D02*
X37400Y-92860D01*
X37393Y-92853D02*
X37400Y-92860D01*
X33730Y-92660D02*
X37515Y-92660D01*
X193560Y-74680D02*
X193680Y-74800D01*
X193680Y-74800D02*
X196080Y-74800D01*
X196080Y-74800D02*
X196740Y-75460D01*
X196740Y-75460D02*
X196740Y-77720D01*
X193280Y-74680D02*
X193560Y-74680D01*
X196740Y-77930D02*
X196740Y-77720D01*
X192100Y-82570D02*
X196740Y-77930D01*
X192100Y-86600D02*
X192100Y-82570D01*
X187400Y-91300D02*
X192100Y-86600D01*
X66260Y-91300D02*
X187400Y-91300D01*
X64780Y-92780D02*
X66260Y-91300D01*
X37635Y-92780D02*
X64780Y-92780D01*
X37515Y-92660D02*
X37635Y-92780D01*
G54D20*
X38405Y-91370D02*
X63735Y-91370D01*
X38089Y-91685D02*
X38405Y-91370D01*
X38089Y-91685D02*
X33730Y-91685D01*
X194060Y-76155D02*
X194060Y-75800D01*
X194225Y-76320D02*
X194060Y-76155D01*
X195080Y-76320D02*
X194225Y-76320D01*
X195240Y-76480D02*
X195080Y-76320D01*
X195240Y-77970D02*
X195240Y-76480D01*
X191135Y-82075D02*
X195240Y-77970D01*
X191135Y-86215D02*
X191135Y-82075D01*
X186905Y-90445D02*
X191135Y-86215D01*
X64660Y-90445D02*
X186905Y-90445D01*
X63735Y-91370D02*
X64660Y-90445D01*
X194455Y-75800D02*
X194455Y-76065D01*
X33730Y-92075D02*
X37464Y-92075D01*
X37464Y-92075D02*
X37505Y-92035D01*
X64040Y-92035D02*
X37505Y-92035D01*
X65250Y-90825D02*
X64040Y-92035D01*
X187195Y-90825D02*
X65250Y-90825D01*
X191565Y-86455D02*
X187195Y-90825D01*
X191565Y-82325D02*
X191565Y-86455D01*
X195440Y-78450D02*
X191565Y-82325D01*
X195440Y-76440D02*
X195440Y-78450D01*
X195140Y-76140D02*
X195440Y-76440D01*
X194530Y-76140D02*
X195140Y-76140D01*
X194455Y-76065D02*
X194530Y-76140D01*
X37300Y-91488D02*
X37400Y-91500D01*
X37300Y-91488D02*
X33730Y-91488D01*
X37290Y-91878D02*
X37400Y-91890D01*
X37388Y-91878D02*
X37400Y-91890D01*
X37388Y-91878D02*
X37290Y-91878D01*
X37290Y-91878D02*
X33730Y-91878D01*
G54D17*
X38470Y-83150D02*
X38205Y-83150D01*
X38205Y-83150D02*
X38148Y-83093D01*
X37730Y-83210D02*
X38410Y-83210D01*
X37728Y-83211D02*
X37730Y-83210D01*
X36461Y-83211D02*
X37728Y-83211D01*
X38410Y-83210D02*
X38470Y-83150D01*
X38470Y-83150D02*
X38570Y-83050D01*
G54D21*
X38570Y-83050D02*
X38191Y-83050D01*
X38191Y-83050D02*
X38131Y-83110D01*
X38131Y-83110D02*
X36450Y-83110D01*
G54D17*
X36380Y-83020D02*
X36380Y-83211D01*
X36380Y-83020D02*
X36380Y-83130D01*
X36380Y-83130D02*
X36461Y-83211D01*
X38135Y-83080D02*
X38148Y-83093D01*
X37110Y-91085D02*
X37110Y-90888D01*
X37110Y-86754D02*
X37110Y-86557D01*
X37110Y-86951D02*
X37110Y-86754D01*
X37100Y-87340D02*
X37100Y-87542D01*
X37100Y-87148D02*
X37100Y-87340D01*
X37100Y-87340D02*
X37100Y-87345D01*
X37177Y-91282D02*
X37592Y-91282D01*
X33730Y-91282D02*
X37177Y-91282D01*
X37592Y-91282D02*
X37770Y-91460D01*
X33730Y-92266D02*
X37343Y-92266D01*
X37343Y-92266D02*
X37360Y-92250D01*
X36310Y-90888D02*
X36940Y-90888D01*
X36940Y-90888D02*
X37110Y-90888D01*
X37110Y-90888D02*
X37688Y-90888D01*
X37688Y-90888D02*
X37700Y-90900D01*
X36760Y-87542D02*
X37100Y-87542D01*
X37100Y-87542D02*
X37997Y-87542D01*
X37997Y-87542D02*
X38000Y-87540D01*
X36710Y-87345D02*
X37100Y-87345D01*
X37100Y-87345D02*
X37735Y-87345D01*
X37735Y-87345D02*
X37740Y-87350D01*
X36990Y-83120D02*
X37500Y-83120D01*
X36970Y-86557D02*
X37110Y-86557D01*
X37110Y-86557D02*
X38137Y-86557D01*
X38137Y-86557D02*
X38140Y-86560D01*
X36980Y-86754D02*
X37110Y-86754D01*
X37110Y-86754D02*
X37855Y-86754D01*
X37855Y-86754D02*
X37860Y-86750D01*
X36480Y-83040D02*
X36520Y-83080D01*
X36520Y-83080D02*
X36560Y-83120D01*
X37890Y-83120D02*
X38570Y-83050D01*
X36990Y-83120D02*
X37890Y-83120D01*
X36560Y-83120D02*
X36990Y-83120D01*
X37400Y-82860D02*
X36580Y-82860D01*
X36340Y-82620D02*
X33730Y-82620D01*
X36580Y-82860D02*
X36340Y-82620D01*
X36257Y-82817D02*
X36480Y-83040D01*
X36480Y-83040D02*
X36460Y-83020D01*
X36110Y-83211D02*
X36380Y-83211D01*
X36380Y-83211D02*
X36461Y-83211D01*
X33730Y-91085D02*
X37110Y-91085D01*
X37110Y-91085D02*
X37374Y-91085D01*
X37374Y-91085D02*
X37400Y-91060D01*
X33730Y-90888D02*
X36310Y-90888D01*
X36310Y-90888D02*
X37228Y-90888D01*
X33730Y-87542D02*
X36760Y-87542D01*
X36760Y-87542D02*
X37167Y-87542D01*
X33730Y-87345D02*
X36710Y-87345D01*
X36710Y-87345D02*
X37364Y-87345D01*
X33730Y-87148D02*
X37100Y-87148D01*
X37100Y-87148D02*
X37398Y-87148D01*
X37398Y-87148D02*
X37480Y-87230D01*
X33730Y-86951D02*
X37110Y-86951D01*
X37110Y-86951D02*
X37548Y-86951D01*
X37548Y-86951D02*
X37610Y-86890D01*
X33730Y-86754D02*
X36980Y-86754D01*
X36980Y-86754D02*
X37474Y-86754D01*
X33730Y-86557D02*
X36970Y-86557D01*
X36970Y-86557D02*
X37277Y-86557D01*
X36460Y-83020D02*
X36380Y-83020D01*
X36380Y-83020D02*
X33735Y-83020D01*
X33735Y-83020D02*
X33730Y-83014D01*
X33730Y-83211D02*
X36110Y-83211D01*
X36110Y-83211D02*
X36438Y-83211D01*
X33730Y-82817D02*
X36240Y-82817D01*
X33730Y-82227D02*
X36727Y-82227D01*
X36830Y-82030D02*
X37250Y-82450D01*
X37250Y-82450D02*
X37400Y-82450D01*
X36830Y-82030D02*
X33730Y-82030D01*
X36950Y-82450D02*
X37400Y-82450D01*
X36727Y-82227D02*
X36950Y-82450D01*
X36650Y-81439D02*
X37139Y-81439D01*
X36650Y-81439D02*
X37089Y-81439D01*
X33730Y-81439D02*
X36650Y-81439D01*
X37139Y-81439D02*
X37400Y-81700D01*
X36400Y-81242D02*
X37192Y-81242D01*
X37142Y-81242D02*
X36550Y-81242D01*
X37192Y-81242D02*
X37400Y-81450D01*
X33730Y-81242D02*
X36400Y-81242D01*
X36550Y-81242D02*
X37092Y-81242D01*
M02*
