%FSLAX34Y34*%
G04 Gerber Fmt 3.4, Leading zero omitted, Abs format*
G04 (created by PCBNEW (2013-10-07 BZR 4378)-stable) date Mon 15 Dec 2014 11:44:29 AM EST*
%MOIN*%
G01*
G70*
G90*
G04 APERTURE LIST*
%ADD10C,0.005906*%
%ADD11C,0.003937*%
%ADD12R,0.011811X0.059055*%
%ADD13C,0.050000*%
%ADD14C,0.018000*%
%ADD15C,0.016000*%
%ADD16C,0.020000*%
%ADD17C,0.010000*%
%ADD18C,0.003000*%
%ADD19C,0.030000*%
%ADD20C,0.075000*%
%ADD21C,0.050000*%
%ADD22C,0.005000*%
G04 APERTURE END LIST*
G54D10*
G54D11*
X187590Y-91750D02*
X67550Y-91750D01*
X192640Y-82860D02*
X192640Y-83000D01*
X193600Y-81900D02*
X192640Y-82860D01*
X192640Y-86700D02*
X192640Y-83000D01*
X187590Y-91750D02*
X192640Y-86700D01*
X33030Y-93450D02*
X33480Y-93450D01*
X33480Y-93450D02*
X33570Y-93540D01*
X33570Y-93540D02*
X33570Y-93640D01*
X33570Y-93640D02*
X33690Y-93760D01*
X33690Y-93760D02*
X34140Y-93760D01*
X34140Y-93760D02*
X34140Y-93450D01*
X33030Y-93450D02*
X33030Y-80650D01*
X33030Y-80650D02*
X33400Y-80650D01*
X33390Y-80650D02*
X33420Y-80650D01*
X33420Y-80650D02*
X33450Y-80650D01*
X33450Y-80650D02*
X33570Y-80530D01*
X33570Y-80530D02*
X33570Y-80440D01*
X33570Y-80440D02*
X33680Y-80330D01*
X33680Y-80330D02*
X34130Y-80330D01*
X34130Y-80330D02*
X34130Y-80640D01*
X197600Y-77900D02*
X193600Y-81900D01*
X65850Y-93450D02*
X67550Y-91750D01*
X33050Y-93450D02*
X65850Y-93450D01*
X33050Y-80650D02*
X33050Y-93450D01*
X64350Y-80650D02*
X33050Y-80650D01*
X68600Y-84900D02*
X64350Y-80650D01*
X184100Y-84900D02*
X68600Y-84900D01*
X185600Y-83400D02*
X184100Y-84900D01*
X185600Y-74300D02*
X185600Y-83400D01*
X197600Y-74300D02*
X197600Y-77900D01*
X197600Y-74300D02*
X185600Y-74300D01*
G54D12*
X194060Y-76793D03*
X194257Y-76793D03*
X194651Y-76793D03*
X194454Y-76793D03*
X195241Y-76793D03*
X195438Y-76793D03*
X195044Y-76793D03*
X194848Y-76793D03*
X190911Y-76793D03*
X191107Y-76793D03*
X191501Y-76793D03*
X191304Y-76793D03*
X192092Y-76793D03*
X192288Y-76793D03*
X191895Y-76793D03*
X191698Y-76793D03*
X193273Y-76793D03*
X193470Y-76793D03*
X193863Y-76793D03*
X193666Y-76793D03*
X192879Y-76793D03*
X193076Y-76793D03*
X192682Y-76793D03*
X192485Y-76793D03*
X189336Y-76793D03*
X189533Y-76793D03*
X189926Y-76793D03*
X189729Y-76793D03*
X190517Y-76793D03*
X190714Y-76793D03*
X190320Y-76793D03*
X190123Y-76793D03*
X188548Y-76793D03*
X188745Y-76793D03*
X189139Y-76793D03*
X188942Y-76793D03*
X188155Y-76793D03*
X188351Y-76793D03*
X187958Y-76793D03*
X194060Y-75337D03*
X194257Y-75337D03*
X194651Y-75337D03*
X194454Y-75337D03*
X195241Y-75337D03*
X195438Y-75337D03*
X195044Y-75337D03*
X194848Y-75337D03*
X190911Y-75337D03*
X191107Y-75337D03*
X191501Y-75337D03*
X191304Y-75337D03*
X192092Y-75337D03*
X192288Y-75337D03*
X191895Y-75337D03*
X191698Y-75337D03*
X193273Y-75337D03*
X193470Y-75337D03*
X193863Y-75337D03*
X193666Y-75337D03*
X192879Y-75337D03*
X193076Y-75337D03*
X192682Y-75337D03*
X192485Y-75337D03*
X189336Y-75337D03*
X189533Y-75337D03*
X189926Y-75337D03*
X189729Y-75337D03*
X190517Y-75337D03*
X190714Y-75337D03*
X190320Y-75337D03*
X190123Y-75337D03*
X188548Y-75337D03*
X188745Y-75337D03*
X189139Y-75337D03*
X188942Y-75337D03*
X188155Y-75337D03*
X188351Y-75337D03*
X187958Y-75337D03*
X187761Y-75337D03*
X187761Y-76793D03*
G54D13*
X197090Y-74810D03*
X190600Y-76000D03*
G54D14*
X37400Y-82200D03*
X37400Y-81950D03*
G54D13*
X189530Y-74740D03*
X188350Y-74740D03*
G54D14*
X192880Y-74620D03*
X193080Y-74900D03*
X37400Y-93250D03*
G54D15*
X188340Y-77500D03*
X188160Y-77340D03*
X37400Y-83420D03*
G54D14*
X193075Y-77500D03*
G54D15*
X37400Y-88550D03*
X192880Y-77340D03*
G54D14*
X193470Y-77500D03*
G54D15*
X37400Y-88940D03*
X193280Y-77340D03*
G54D14*
X193865Y-77500D03*
G54D15*
X37400Y-89340D03*
X193660Y-77340D03*
G54D14*
X194255Y-77500D03*
G54D15*
X37400Y-89730D03*
X194060Y-77340D03*
G54D14*
X194650Y-77500D03*
G54D15*
X194460Y-77340D03*
X37400Y-90130D03*
X195040Y-77500D03*
X194840Y-77340D03*
X37400Y-90520D03*
G54D14*
X188745Y-77500D03*
G54D15*
X188540Y-77340D03*
X37400Y-83810D03*
G54D14*
X189140Y-77500D03*
G54D15*
X188940Y-77340D03*
X37400Y-84210D03*
G54D14*
X189530Y-77500D03*
G54D15*
X189340Y-77340D03*
X37400Y-84600D03*
G54D14*
X189925Y-77500D03*
G54D15*
X189720Y-77340D03*
X37400Y-85000D03*
G54D14*
X190320Y-77499D03*
G54D15*
X190120Y-77340D03*
X37400Y-85390D03*
G54D14*
X190715Y-77500D03*
G54D15*
X190520Y-77340D03*
X37400Y-85790D03*
G54D14*
X191110Y-77500D03*
G54D15*
X190900Y-77340D03*
X37400Y-86180D03*
G54D14*
X192290Y-77500D03*
G54D15*
X192080Y-77340D03*
X37400Y-87760D03*
G54D14*
X192685Y-77500D03*
G54D15*
X37400Y-88150D03*
X192480Y-77340D03*
G54D16*
X195880Y-75040D03*
G54D14*
X37400Y-92265D03*
X194740Y-75840D03*
X37400Y-92860D03*
X193480Y-74880D03*
X193280Y-74680D03*
G54D15*
X194060Y-75800D03*
G54D14*
X194455Y-75800D03*
G54D15*
X193860Y-75960D03*
X37400Y-91500D03*
X194260Y-75960D03*
X37400Y-91890D03*
G54D14*
X62060Y-92580D03*
X65210Y-91900D03*
X65680Y-92320D03*
X37800Y-92990D03*
X37790Y-92580D03*
X39740Y-91430D03*
X43740Y-91430D03*
X47740Y-91430D03*
X51740Y-91430D03*
X55740Y-91430D03*
X59740Y-91430D03*
X61740Y-91430D03*
X57740Y-91430D03*
X53740Y-91430D03*
X49740Y-91430D03*
X45740Y-91430D03*
X41740Y-91430D03*
X63740Y-91430D03*
X186960Y-90430D03*
X69030Y-90430D03*
X37630Y-91430D03*
X66800Y-90140D03*
X68800Y-90140D03*
X70800Y-90140D03*
X154800Y-90140D03*
X70960Y-90430D03*
X154960Y-90430D03*
X106960Y-90430D03*
X110960Y-90430D03*
X114960Y-90430D03*
X118960Y-90430D03*
X120960Y-90430D03*
X116960Y-90430D03*
X112960Y-90430D03*
X108960Y-90430D03*
X104960Y-90430D03*
X72960Y-90430D03*
X76960Y-90430D03*
X80960Y-90430D03*
X84960Y-90430D03*
X88960Y-90430D03*
X92960Y-90430D03*
X96960Y-90430D03*
X100960Y-90430D03*
X102960Y-90430D03*
X98960Y-90430D03*
X94960Y-90430D03*
X90960Y-90430D03*
X86960Y-90430D03*
X82960Y-90430D03*
X78960Y-90430D03*
X74960Y-90430D03*
X124960Y-90430D03*
X128960Y-90430D03*
X132960Y-90430D03*
X136960Y-90430D03*
X140960Y-90430D03*
X144960Y-90430D03*
X148960Y-90430D03*
X152960Y-90430D03*
X150960Y-90430D03*
X146960Y-90430D03*
X142960Y-90430D03*
X138960Y-90430D03*
X134960Y-90430D03*
X130960Y-90430D03*
X126960Y-90430D03*
X122960Y-90430D03*
X158960Y-90430D03*
X162960Y-90430D03*
X166960Y-90430D03*
X170960Y-90430D03*
X174960Y-90430D03*
X178960Y-90430D03*
X182960Y-90430D03*
X184960Y-90430D03*
X180960Y-90430D03*
X176960Y-90430D03*
X172960Y-90430D03*
X168960Y-90430D03*
X164960Y-90430D03*
X160960Y-90430D03*
X156960Y-90430D03*
X41480Y-91060D03*
X45480Y-91060D03*
X49480Y-91060D03*
X53480Y-91060D03*
X57480Y-91060D03*
X61480Y-91060D03*
X59480Y-91060D03*
X55480Y-91060D03*
X51480Y-91060D03*
X47480Y-91060D03*
X43480Y-91060D03*
X39480Y-91060D03*
X63485Y-91055D03*
X64400Y-90140D03*
X37400Y-91060D03*
X63480Y-87230D03*
X39480Y-87230D03*
X43480Y-87230D03*
X47480Y-87230D03*
X51480Y-87230D03*
X55480Y-87230D03*
X59480Y-87230D03*
X61480Y-87230D03*
X57480Y-87230D03*
X53480Y-87230D03*
X49480Y-87230D03*
X45480Y-87230D03*
X41480Y-87230D03*
X37480Y-87230D03*
X63610Y-86890D03*
X37610Y-86890D03*
X41610Y-86890D03*
X45610Y-86890D03*
X49610Y-86890D03*
X53610Y-86890D03*
X57610Y-86890D03*
X61610Y-86890D03*
X59610Y-86890D03*
X55610Y-86890D03*
X51610Y-86890D03*
X47610Y-86890D03*
X43610Y-86890D03*
X39610Y-86890D03*
X64930Y-88210D03*
X67780Y-88210D03*
X69780Y-88210D03*
X153780Y-88210D03*
X67940Y-88550D03*
X69940Y-88550D03*
X153940Y-88550D03*
X64800Y-88550D03*
X38300Y-83050D03*
X42300Y-83050D03*
X46300Y-83050D03*
X50300Y-83050D03*
X54300Y-83050D03*
X58300Y-83050D03*
X62300Y-83050D03*
X60300Y-83050D03*
X56300Y-83050D03*
X52300Y-83050D03*
X48300Y-83050D03*
X44300Y-83050D03*
X40300Y-83050D03*
X66080Y-84830D03*
X64300Y-83050D03*
X67850Y-86600D03*
X188375Y-89015D03*
X189745Y-87645D03*
X188210Y-88730D03*
X189430Y-87510D03*
X187595Y-86895D03*
X187345Y-86645D03*
X155940Y-88550D03*
X159940Y-88550D03*
X163940Y-88550D03*
X167940Y-88550D03*
X171940Y-88550D03*
X175940Y-88550D03*
X179940Y-88550D03*
X183940Y-88550D03*
X181940Y-88550D03*
X177940Y-88550D03*
X173940Y-88550D03*
X169940Y-88550D03*
X165940Y-88550D03*
X161940Y-88550D03*
X157940Y-88550D03*
X121940Y-88550D03*
X125940Y-88550D03*
X129940Y-88550D03*
X133940Y-88550D03*
X137940Y-88550D03*
X141940Y-88550D03*
X145940Y-88550D03*
X149940Y-88550D03*
X151940Y-88550D03*
X147940Y-88550D03*
X143940Y-88550D03*
X139940Y-88550D03*
X135940Y-88550D03*
X131940Y-88550D03*
X127940Y-88550D03*
X123940Y-88550D03*
X73940Y-88550D03*
X77940Y-88550D03*
X81940Y-88550D03*
X85940Y-88550D03*
X89940Y-88550D03*
X93940Y-88550D03*
X97940Y-88550D03*
X101940Y-88550D03*
X99940Y-88550D03*
X95940Y-88550D03*
X91940Y-88550D03*
X87940Y-88550D03*
X83940Y-88550D03*
X79940Y-88550D03*
X75940Y-88550D03*
X71940Y-88550D03*
X103940Y-88550D03*
X107940Y-88550D03*
X111940Y-88550D03*
X115940Y-88550D03*
X119940Y-88550D03*
X117940Y-88550D03*
X113940Y-88550D03*
X109940Y-88550D03*
X105940Y-88550D03*
X155780Y-88210D03*
X159780Y-88210D03*
X163780Y-88210D03*
X167780Y-88210D03*
X171780Y-88210D03*
X175780Y-88210D03*
X179780Y-88210D03*
X183780Y-88210D03*
X181780Y-88210D03*
X177780Y-88210D03*
X173780Y-88210D03*
X169780Y-88210D03*
X165780Y-88210D03*
X161780Y-88210D03*
X157780Y-88210D03*
X121780Y-88210D03*
X125780Y-88210D03*
X129780Y-88210D03*
X133780Y-88210D03*
X137780Y-88210D03*
X141780Y-88210D03*
X145780Y-88210D03*
X149780Y-88210D03*
X151780Y-88210D03*
X147780Y-88210D03*
X143780Y-88210D03*
X139780Y-88210D03*
X135780Y-88210D03*
X131780Y-88210D03*
X127780Y-88210D03*
X123780Y-88210D03*
X73780Y-88210D03*
X77780Y-88210D03*
X81780Y-88210D03*
X85780Y-88210D03*
X89780Y-88210D03*
X93780Y-88210D03*
X97780Y-88210D03*
X101780Y-88210D03*
X99780Y-88210D03*
X95780Y-88210D03*
X91780Y-88210D03*
X87780Y-88210D03*
X83780Y-88210D03*
X79780Y-88210D03*
X75780Y-88210D03*
X71780Y-88210D03*
X103780Y-88210D03*
X107780Y-88210D03*
X111780Y-88210D03*
X115780Y-88210D03*
X119780Y-88210D03*
X117780Y-88210D03*
X113780Y-88210D03*
X109780Y-88210D03*
X105780Y-88210D03*
X188910Y-85080D03*
X185780Y-88210D03*
X185940Y-88550D03*
X188910Y-82660D03*
X189250Y-82740D03*
X189250Y-85240D03*
X190840Y-84100D03*
X190840Y-86100D03*
X189250Y-80280D03*
X188910Y-80160D03*
X191530Y-78000D03*
X191070Y-78000D03*
X156800Y-90140D03*
X160800Y-90140D03*
X164800Y-90140D03*
X168800Y-90140D03*
X172800Y-90140D03*
X176800Y-90140D03*
X180800Y-90140D03*
X184800Y-90140D03*
X182800Y-90140D03*
X178800Y-90140D03*
X174800Y-90140D03*
X170800Y-90140D03*
X166800Y-90140D03*
X162800Y-90140D03*
X158800Y-90140D03*
X122800Y-90140D03*
X126800Y-90140D03*
X130800Y-90140D03*
X134800Y-90140D03*
X138800Y-90140D03*
X142800Y-90140D03*
X146800Y-90140D03*
X150800Y-90140D03*
X152800Y-90140D03*
X148800Y-90140D03*
X144800Y-90140D03*
X140800Y-90140D03*
X136800Y-90140D03*
X132800Y-90140D03*
X128800Y-90140D03*
X124800Y-90140D03*
X74800Y-90140D03*
X78800Y-90140D03*
X82800Y-90140D03*
X86800Y-90140D03*
X90800Y-90140D03*
X94800Y-90140D03*
X98800Y-90140D03*
X102800Y-90140D03*
X100800Y-90140D03*
X96800Y-90140D03*
X92800Y-90140D03*
X88800Y-90140D03*
X84800Y-90140D03*
X80800Y-90140D03*
X76800Y-90140D03*
X72800Y-90140D03*
X104800Y-90140D03*
X108800Y-90140D03*
X112800Y-90140D03*
X116800Y-90140D03*
X120800Y-90140D03*
X118800Y-90140D03*
X114800Y-90140D03*
X110800Y-90140D03*
X106800Y-90140D03*
X186800Y-90140D03*
X191160Y-84230D03*
X104900Y-86600D03*
X108900Y-86600D03*
X112900Y-86600D03*
X116900Y-86600D03*
X118900Y-86600D03*
X114900Y-86600D03*
X110900Y-86600D03*
X106900Y-86600D03*
X102900Y-86600D03*
X70900Y-86600D03*
X74900Y-86600D03*
X78900Y-86600D03*
X82900Y-86600D03*
X86900Y-86600D03*
X90900Y-86600D03*
X94900Y-86600D03*
X98900Y-86600D03*
X100900Y-86600D03*
X96900Y-86600D03*
X92900Y-86600D03*
X88900Y-86600D03*
X84900Y-86600D03*
X80900Y-86600D03*
X76900Y-86600D03*
X72900Y-86600D03*
X122900Y-86600D03*
X126900Y-86600D03*
X130900Y-86600D03*
X134900Y-86600D03*
X138900Y-86600D03*
X142900Y-86600D03*
X146900Y-86600D03*
X150900Y-86600D03*
X148900Y-86600D03*
X144900Y-86600D03*
X140900Y-86600D03*
X136900Y-86600D03*
X132900Y-86600D03*
X128900Y-86600D03*
X124900Y-86600D03*
X120900Y-86600D03*
X152900Y-86600D03*
X156900Y-86600D03*
X160900Y-86600D03*
X164900Y-86600D03*
X168900Y-86600D03*
X172900Y-86600D03*
X176900Y-86600D03*
X180900Y-86600D03*
X182900Y-86600D03*
X178900Y-86600D03*
X174900Y-86600D03*
X170900Y-86600D03*
X166900Y-86600D03*
X162900Y-86600D03*
X158900Y-86600D03*
X154900Y-86600D03*
X190840Y-81960D03*
X192230Y-80570D03*
X193380Y-79420D03*
X37400Y-83050D03*
X184900Y-86600D03*
X37400Y-82450D03*
X37400Y-81700D03*
X37400Y-81450D03*
G54D13*
X186100Y-74800D03*
G54D14*
X194700Y-78560D03*
X191160Y-82100D03*
X191160Y-86230D03*
X194800Y-78000D03*
G54D13*
X192500Y-76100D03*
G54D14*
X186100Y-85400D03*
X187300Y-82000D03*
X187300Y-78000D03*
X187300Y-80000D03*
X187300Y-84000D03*
G54D13*
X191900Y-76100D03*
X191300Y-76100D03*
X190120Y-74740D03*
X188940Y-74740D03*
G54D17*
X195900Y-74640D02*
X196920Y-74640D01*
X196920Y-74640D02*
X197090Y-74810D01*
X196197Y-75337D02*
X196200Y-75340D01*
X190517Y-75337D02*
X190517Y-75917D01*
X190517Y-75917D02*
X190600Y-76000D01*
X190517Y-75917D02*
X190600Y-76000D01*
X190714Y-75337D02*
X190714Y-75885D01*
X190714Y-75885D02*
X190600Y-76000D01*
X189336Y-75337D02*
X189336Y-74933D01*
X189336Y-74933D02*
X189530Y-74740D01*
X189729Y-75337D02*
X189729Y-74939D01*
X189533Y-74743D02*
X189530Y-74740D01*
X189533Y-74743D02*
X189533Y-75337D01*
X189729Y-74939D02*
X189530Y-74740D01*
X188155Y-75337D02*
X188155Y-74934D01*
X188155Y-74934D02*
X188350Y-74740D01*
X188548Y-75337D02*
X188548Y-74938D01*
X188351Y-74741D02*
X188350Y-74740D01*
X188351Y-74741D02*
X188351Y-75337D01*
X188548Y-74938D02*
X188350Y-74740D01*
X192879Y-75337D02*
X192879Y-74620D01*
X192879Y-74620D02*
X192880Y-74620D01*
X193076Y-74903D02*
X193080Y-74900D01*
X193076Y-74903D02*
X193076Y-75337D01*
G54D18*
X188351Y-77488D02*
X188340Y-77500D01*
X188351Y-76793D02*
X188351Y-77488D01*
X188155Y-76793D02*
X188155Y-77335D01*
X188155Y-77335D02*
X188160Y-77340D01*
X193076Y-77498D02*
X193075Y-77500D01*
X193076Y-77498D02*
X193076Y-76793D01*
X192879Y-77339D02*
X192879Y-76793D01*
X192879Y-77339D02*
X192880Y-77340D01*
X193470Y-77499D02*
X193470Y-77500D01*
X193470Y-77499D02*
X193470Y-76793D01*
X193273Y-77333D02*
X193273Y-76793D01*
X193273Y-77333D02*
X193280Y-77340D01*
X193863Y-77498D02*
X193865Y-77500D01*
X193863Y-77498D02*
X193863Y-76793D01*
X193666Y-77333D02*
X193666Y-76793D01*
X193666Y-77333D02*
X193660Y-77340D01*
X194257Y-77497D02*
X194255Y-77500D01*
X194257Y-77497D02*
X194257Y-76793D01*
X194060Y-77339D02*
X194060Y-76793D01*
X194060Y-77339D02*
X194060Y-77340D01*
X194651Y-77498D02*
X194650Y-77500D01*
X194651Y-77498D02*
X194651Y-76793D01*
X194454Y-77334D02*
X194454Y-76793D01*
X194454Y-77334D02*
X194460Y-77340D01*
X195044Y-77495D02*
X195040Y-77500D01*
X195044Y-76793D02*
X195044Y-77495D01*
X194848Y-77331D02*
X194848Y-76793D01*
X194848Y-77331D02*
X194840Y-77340D01*
X188745Y-77499D02*
X188745Y-77500D01*
X188745Y-77499D02*
X188745Y-76793D01*
X188548Y-76793D02*
X188548Y-77331D01*
X188548Y-77331D02*
X188540Y-77340D01*
X189139Y-77499D02*
X189140Y-77500D01*
X189139Y-77499D02*
X189139Y-76793D01*
X188942Y-76793D02*
X188942Y-77337D01*
X188942Y-77337D02*
X188940Y-77340D01*
X189533Y-76793D02*
X189533Y-77496D01*
X189533Y-77496D02*
X189530Y-77500D01*
X189336Y-76793D02*
X189336Y-77336D01*
X189336Y-77336D02*
X189340Y-77340D01*
X189926Y-77498D02*
X189925Y-77500D01*
X189926Y-77498D02*
X189926Y-76793D01*
X189729Y-76793D02*
X189729Y-77330D01*
X189729Y-77330D02*
X189720Y-77340D01*
X190320Y-76793D02*
X190320Y-77499D01*
X190320Y-77499D02*
X190320Y-77500D01*
X190123Y-76793D02*
X190123Y-77336D01*
X190123Y-77336D02*
X190120Y-77340D01*
X190714Y-77499D02*
X190715Y-77500D01*
X190714Y-77499D02*
X190714Y-76793D01*
X190517Y-76793D02*
X190517Y-77337D01*
X190517Y-77337D02*
X190520Y-77340D01*
X191107Y-77497D02*
X191110Y-77500D01*
X191107Y-77497D02*
X191107Y-76793D01*
X190911Y-76793D02*
X190911Y-77328D01*
X190911Y-77328D02*
X190900Y-77340D01*
X192288Y-77498D02*
X192290Y-77500D01*
X192288Y-77498D02*
X192288Y-76793D01*
X192092Y-76793D02*
X192092Y-77327D01*
X192092Y-77327D02*
X192080Y-77340D01*
X192682Y-77497D02*
X192685Y-77500D01*
X192682Y-77497D02*
X192682Y-76793D01*
X192485Y-77334D02*
X192480Y-77340D01*
X192485Y-76793D02*
X192485Y-77334D01*
G54D17*
X194848Y-74871D02*
X194880Y-74840D01*
X194880Y-74840D02*
X195680Y-74840D01*
X195680Y-74840D02*
X195880Y-75040D01*
X194848Y-75337D02*
X194848Y-74871D01*
X194651Y-75711D02*
X194651Y-75751D01*
X194651Y-75711D02*
X194651Y-75337D01*
X194651Y-75751D02*
X194740Y-75840D01*
X193470Y-74889D02*
X193480Y-74880D01*
X193470Y-75337D02*
X193470Y-74889D01*
X193273Y-74686D02*
X193273Y-75337D01*
X193273Y-74686D02*
X193280Y-74680D01*
G54D18*
X194060Y-75799D02*
X194060Y-75800D01*
X194060Y-75337D02*
X194060Y-75799D01*
X194454Y-75799D02*
X194455Y-75800D01*
X194454Y-75799D02*
X194454Y-75337D01*
X193863Y-75337D02*
X193863Y-75956D01*
X193863Y-75956D02*
X193860Y-75960D01*
X194257Y-75957D02*
X194260Y-75960D01*
X194257Y-75337D02*
X194257Y-75957D01*
G54D17*
X195438Y-77390D02*
X196120Y-77390D01*
X196120Y-77390D02*
X196180Y-77450D01*
X187958Y-75337D02*
X187958Y-74801D01*
X187950Y-74810D02*
X187761Y-74810D01*
X187958Y-74801D02*
X187950Y-74810D01*
X187761Y-75337D02*
X187761Y-74810D01*
X187761Y-74810D02*
X187761Y-74771D01*
X187761Y-74771D02*
X187732Y-74800D01*
X187732Y-74800D02*
X186100Y-74800D01*
X62520Y-92780D02*
X62260Y-92780D01*
X62260Y-92780D02*
X62060Y-92580D01*
X66250Y-91540D02*
X65570Y-91540D01*
X65570Y-91540D02*
X65210Y-91900D01*
X66250Y-91330D02*
X66250Y-91540D01*
X66250Y-91540D02*
X66250Y-91750D01*
X66250Y-91750D02*
X65680Y-92320D01*
X38440Y-92780D02*
X38010Y-92780D01*
X38010Y-92780D02*
X37800Y-92990D01*
X37990Y-92780D02*
X37790Y-92580D01*
X64800Y-92780D02*
X62520Y-92780D01*
X62520Y-92780D02*
X38440Y-92780D01*
X38440Y-92780D02*
X37990Y-92780D01*
X66200Y-91380D02*
X66250Y-91330D01*
X196180Y-77450D02*
X196670Y-77450D01*
X196670Y-77450D02*
X196850Y-77630D01*
X196850Y-77630D02*
X196850Y-77880D01*
X196850Y-77880D02*
X192100Y-82630D01*
X192100Y-82630D02*
X192100Y-86620D01*
X192100Y-86620D02*
X187340Y-91380D01*
X187340Y-91380D02*
X66200Y-91380D01*
X66250Y-91330D02*
X64800Y-92780D01*
X37740Y-91430D02*
X39740Y-91430D01*
X41740Y-91430D02*
X43740Y-91430D01*
X45740Y-91430D02*
X47740Y-91430D01*
X49740Y-91430D02*
X51740Y-91430D01*
X53740Y-91430D02*
X55740Y-91430D01*
X57740Y-91430D02*
X59740Y-91430D01*
X61740Y-91430D02*
X63740Y-91430D01*
X59740Y-91430D02*
X61740Y-91430D01*
X55740Y-91430D02*
X57740Y-91430D01*
X51740Y-91430D02*
X53740Y-91430D01*
X47740Y-91430D02*
X49740Y-91430D01*
X43740Y-91430D02*
X45740Y-91430D01*
X39740Y-91430D02*
X41740Y-91430D01*
X37630Y-91430D02*
X63740Y-91430D01*
X64740Y-90430D02*
X63740Y-91430D01*
X69030Y-90430D02*
X186960Y-90430D01*
X69030Y-90430D02*
X64740Y-90430D01*
X70800Y-90140D02*
X154800Y-90140D01*
X70960Y-90430D02*
X154960Y-90430D01*
X104960Y-90430D02*
X106960Y-90430D01*
X108960Y-90430D02*
X110960Y-90430D01*
X112960Y-90430D02*
X114960Y-90430D01*
X116960Y-90430D02*
X118960Y-90430D01*
X120960Y-90430D02*
X122960Y-90430D01*
X118960Y-90430D02*
X120960Y-90430D01*
X114960Y-90430D02*
X116960Y-90430D01*
X110960Y-90430D02*
X112960Y-90430D01*
X106960Y-90430D02*
X108960Y-90430D01*
X74960Y-90430D02*
X76960Y-90430D01*
X78960Y-90430D02*
X80960Y-90430D01*
X82960Y-90430D02*
X84960Y-90430D01*
X86960Y-90430D02*
X88960Y-90430D01*
X90960Y-90430D02*
X92960Y-90430D01*
X94960Y-90430D02*
X96960Y-90430D01*
X98960Y-90430D02*
X100960Y-90430D01*
X104960Y-90430D02*
X102960Y-90430D01*
X100960Y-90430D02*
X102960Y-90430D01*
X96960Y-90430D02*
X98960Y-90430D01*
X92960Y-90430D02*
X94960Y-90430D01*
X88960Y-90430D02*
X90960Y-90430D01*
X84960Y-90430D02*
X86960Y-90430D01*
X80960Y-90430D02*
X82960Y-90430D01*
X76960Y-90430D02*
X78960Y-90430D01*
X72960Y-90430D02*
X74960Y-90430D01*
X122960Y-90430D02*
X124960Y-90430D01*
X126960Y-90430D02*
X128960Y-90430D01*
X130960Y-90430D02*
X132960Y-90430D01*
X134960Y-90430D02*
X136960Y-90430D01*
X138960Y-90430D02*
X140960Y-90430D01*
X142960Y-90430D02*
X144960Y-90430D01*
X146960Y-90430D02*
X148960Y-90430D01*
X150960Y-90430D02*
X152960Y-90430D01*
X154960Y-90430D02*
X152960Y-90430D01*
X148960Y-90430D02*
X150960Y-90430D01*
X144960Y-90430D02*
X146960Y-90430D01*
X140960Y-90430D02*
X142960Y-90430D01*
X136960Y-90430D02*
X138960Y-90430D01*
X132960Y-90430D02*
X134960Y-90430D01*
X128960Y-90430D02*
X130960Y-90430D01*
X124960Y-90430D02*
X126960Y-90430D01*
X156960Y-90430D02*
X158960Y-90430D01*
X160960Y-90430D02*
X162960Y-90430D01*
X164960Y-90430D02*
X166960Y-90430D01*
X168960Y-90430D02*
X170960Y-90430D01*
X172960Y-90430D02*
X174960Y-90430D01*
X176960Y-90430D02*
X178960Y-90430D01*
X180960Y-90430D02*
X182960Y-90430D01*
X186960Y-90430D02*
X184960Y-90430D01*
X182960Y-90430D02*
X184960Y-90430D01*
X178960Y-90430D02*
X180960Y-90430D01*
X174960Y-90430D02*
X176960Y-90430D01*
X170960Y-90430D02*
X172960Y-90430D01*
X166960Y-90430D02*
X168960Y-90430D01*
X162960Y-90430D02*
X164960Y-90430D01*
X158960Y-90430D02*
X160960Y-90430D01*
X154960Y-90430D02*
X156960Y-90430D01*
X186960Y-90430D02*
X185160Y-90430D01*
X39480Y-91060D02*
X41480Y-91060D01*
X43480Y-91060D02*
X45480Y-91060D01*
X47480Y-91060D02*
X49480Y-91060D01*
X51480Y-91060D02*
X53480Y-91060D01*
X55480Y-91060D02*
X57480Y-91060D01*
X59480Y-91060D02*
X61480Y-91060D01*
X61480Y-91060D02*
X63480Y-91060D01*
X57480Y-91060D02*
X59480Y-91060D01*
X53480Y-91060D02*
X55480Y-91060D01*
X49480Y-91060D02*
X51480Y-91060D01*
X45480Y-91060D02*
X47480Y-91060D01*
X41480Y-91060D02*
X43480Y-91060D01*
X37480Y-91060D02*
X39480Y-91060D01*
X64750Y-90140D02*
X64490Y-90140D01*
X64400Y-90140D02*
X63485Y-91055D01*
X63485Y-91055D02*
X63480Y-91060D01*
X37400Y-91060D02*
X63480Y-91060D01*
X37480Y-87230D02*
X39480Y-87230D01*
X41480Y-87230D02*
X43480Y-87230D01*
X45480Y-87230D02*
X47480Y-87230D01*
X49480Y-87230D02*
X51480Y-87230D01*
X53480Y-87230D02*
X55480Y-87230D01*
X57480Y-87230D02*
X59480Y-87230D01*
X61480Y-87230D02*
X63480Y-87230D01*
X59480Y-87230D02*
X61480Y-87230D01*
X55480Y-87230D02*
X57480Y-87230D01*
X51480Y-87230D02*
X53480Y-87230D01*
X47480Y-87230D02*
X49480Y-87230D01*
X43480Y-87230D02*
X45480Y-87230D01*
X39480Y-87230D02*
X41480Y-87230D01*
X39610Y-86890D02*
X41610Y-86890D01*
X43610Y-86890D02*
X45610Y-86890D01*
X47610Y-86890D02*
X49610Y-86890D01*
X51610Y-86890D02*
X53610Y-86890D01*
X55610Y-86890D02*
X57610Y-86890D01*
X59610Y-86890D02*
X61610Y-86890D01*
X61610Y-86890D02*
X63610Y-86890D01*
X57610Y-86890D02*
X59610Y-86890D01*
X53610Y-86890D02*
X55610Y-86890D01*
X49610Y-86890D02*
X51610Y-86890D01*
X45610Y-86890D02*
X47610Y-86890D01*
X41610Y-86890D02*
X43610Y-86890D01*
X37610Y-86890D02*
X39610Y-86890D01*
X37680Y-91060D02*
X37400Y-91060D01*
X37480Y-91060D02*
X37680Y-91060D01*
X69780Y-88210D02*
X153780Y-88210D01*
X69940Y-88550D02*
X153940Y-88550D01*
X65155Y-88210D02*
X64930Y-88210D01*
X64927Y-88207D02*
X63610Y-86890D01*
X63610Y-86890D02*
X37390Y-86890D01*
X64927Y-88207D02*
X64930Y-88210D01*
X40300Y-83050D02*
X42300Y-83050D01*
X44300Y-83050D02*
X46300Y-83050D01*
X48300Y-83050D02*
X50300Y-83050D01*
X52300Y-83050D02*
X54300Y-83050D01*
X56300Y-83050D02*
X58300Y-83050D01*
X60300Y-83050D02*
X62300Y-83050D01*
X62300Y-83050D02*
X64300Y-83050D01*
X58300Y-83050D02*
X60300Y-83050D01*
X54300Y-83050D02*
X56300Y-83050D01*
X50300Y-83050D02*
X52300Y-83050D01*
X46300Y-83050D02*
X48300Y-83050D01*
X42300Y-83050D02*
X44300Y-83050D01*
X38300Y-83050D02*
X40300Y-83050D01*
X153940Y-88550D02*
X155940Y-88550D01*
X157940Y-88550D02*
X159940Y-88550D01*
X161940Y-88550D02*
X163940Y-88550D01*
X165940Y-88550D02*
X167940Y-88550D01*
X169940Y-88550D02*
X171940Y-88550D01*
X173940Y-88550D02*
X175940Y-88550D01*
X177940Y-88550D02*
X179940Y-88550D01*
X181940Y-88550D02*
X183940Y-88550D01*
X185940Y-88550D02*
X183940Y-88550D01*
X179940Y-88550D02*
X181940Y-88550D01*
X175940Y-88550D02*
X177940Y-88550D01*
X171940Y-88550D02*
X173940Y-88550D01*
X167940Y-88550D02*
X169940Y-88550D01*
X163940Y-88550D02*
X165940Y-88550D01*
X159940Y-88550D02*
X161940Y-88550D01*
X155940Y-88550D02*
X157940Y-88550D01*
X123940Y-88550D02*
X125940Y-88550D01*
X127940Y-88550D02*
X129940Y-88550D01*
X131940Y-88550D02*
X133940Y-88550D01*
X135940Y-88550D02*
X137940Y-88550D01*
X139940Y-88550D02*
X141940Y-88550D01*
X143940Y-88550D02*
X145940Y-88550D01*
X147940Y-88550D02*
X149940Y-88550D01*
X153940Y-88550D02*
X151940Y-88550D01*
X149940Y-88550D02*
X151940Y-88550D01*
X145940Y-88550D02*
X147940Y-88550D01*
X141940Y-88550D02*
X143940Y-88550D01*
X137940Y-88550D02*
X139940Y-88550D01*
X133940Y-88550D02*
X135940Y-88550D01*
X129940Y-88550D02*
X131940Y-88550D01*
X125940Y-88550D02*
X127940Y-88550D01*
X121940Y-88550D02*
X123940Y-88550D01*
X71940Y-88550D02*
X73940Y-88550D01*
X75940Y-88550D02*
X77940Y-88550D01*
X79940Y-88550D02*
X81940Y-88550D01*
X83940Y-88550D02*
X85940Y-88550D01*
X87940Y-88550D02*
X89940Y-88550D01*
X91940Y-88550D02*
X93940Y-88550D01*
X95940Y-88550D02*
X97940Y-88550D01*
X99940Y-88550D02*
X101940Y-88550D01*
X103940Y-88550D02*
X101940Y-88550D01*
X97940Y-88550D02*
X99940Y-88550D01*
X93940Y-88550D02*
X95940Y-88550D01*
X89940Y-88550D02*
X91940Y-88550D01*
X85940Y-88550D02*
X87940Y-88550D01*
X81940Y-88550D02*
X83940Y-88550D01*
X77940Y-88550D02*
X79940Y-88550D01*
X73940Y-88550D02*
X75940Y-88550D01*
X105940Y-88550D02*
X107940Y-88550D01*
X109940Y-88550D02*
X111940Y-88550D01*
X113940Y-88550D02*
X115940Y-88550D01*
X117940Y-88550D02*
X119940Y-88550D01*
X119940Y-88550D02*
X121940Y-88550D01*
X115940Y-88550D02*
X117940Y-88550D01*
X111940Y-88550D02*
X113940Y-88550D01*
X107940Y-88550D02*
X109940Y-88550D01*
X103940Y-88550D02*
X105940Y-88550D01*
X185780Y-88210D02*
X183980Y-88210D01*
X153780Y-88210D02*
X155780Y-88210D01*
X157780Y-88210D02*
X159780Y-88210D01*
X161780Y-88210D02*
X163780Y-88210D01*
X165780Y-88210D02*
X167780Y-88210D01*
X169780Y-88210D02*
X171780Y-88210D01*
X173780Y-88210D02*
X175780Y-88210D01*
X177780Y-88210D02*
X179780Y-88210D01*
X181780Y-88210D02*
X183780Y-88210D01*
X185780Y-88210D02*
X183780Y-88210D01*
X179780Y-88210D02*
X181780Y-88210D01*
X175780Y-88210D02*
X177780Y-88210D01*
X171780Y-88210D02*
X173780Y-88210D01*
X167780Y-88210D02*
X169780Y-88210D01*
X163780Y-88210D02*
X165780Y-88210D01*
X159780Y-88210D02*
X161780Y-88210D01*
X155780Y-88210D02*
X157780Y-88210D01*
X123780Y-88210D02*
X125780Y-88210D01*
X127780Y-88210D02*
X129780Y-88210D01*
X131780Y-88210D02*
X133780Y-88210D01*
X135780Y-88210D02*
X137780Y-88210D01*
X139780Y-88210D02*
X141780Y-88210D01*
X143780Y-88210D02*
X145780Y-88210D01*
X147780Y-88210D02*
X149780Y-88210D01*
X153780Y-88210D02*
X151780Y-88210D01*
X149780Y-88210D02*
X151780Y-88210D01*
X145780Y-88210D02*
X147780Y-88210D01*
X141780Y-88210D02*
X143780Y-88210D01*
X137780Y-88210D02*
X139780Y-88210D01*
X133780Y-88210D02*
X135780Y-88210D01*
X129780Y-88210D02*
X131780Y-88210D01*
X125780Y-88210D02*
X127780Y-88210D01*
X121780Y-88210D02*
X123780Y-88210D01*
X71780Y-88210D02*
X73780Y-88210D01*
X75780Y-88210D02*
X77780Y-88210D01*
X79780Y-88210D02*
X81780Y-88210D01*
X83780Y-88210D02*
X85780Y-88210D01*
X87780Y-88210D02*
X89780Y-88210D01*
X91780Y-88210D02*
X93780Y-88210D01*
X95780Y-88210D02*
X97780Y-88210D01*
X99780Y-88210D02*
X101780Y-88210D01*
X103780Y-88210D02*
X101780Y-88210D01*
X97780Y-88210D02*
X99780Y-88210D01*
X93780Y-88210D02*
X95780Y-88210D01*
X89780Y-88210D02*
X91780Y-88210D01*
X85780Y-88210D02*
X87780Y-88210D01*
X81780Y-88210D02*
X83780Y-88210D01*
X77780Y-88210D02*
X79780Y-88210D01*
X73780Y-88210D02*
X75780Y-88210D01*
X105780Y-88210D02*
X107780Y-88210D01*
X109780Y-88210D02*
X111780Y-88210D01*
X113780Y-88210D02*
X115780Y-88210D01*
X117780Y-88210D02*
X119780Y-88210D01*
X119780Y-88210D02*
X121780Y-88210D01*
X115780Y-88210D02*
X117780Y-88210D01*
X111780Y-88210D02*
X113780Y-88210D01*
X107780Y-88210D02*
X109780Y-88210D01*
X103780Y-88210D02*
X105780Y-88210D01*
X188910Y-83800D02*
X188910Y-85080D01*
X188905Y-85085D02*
X188910Y-85080D01*
X188910Y-85080D02*
X188905Y-85085D01*
X186800Y-90140D02*
X185000Y-90140D01*
X154800Y-90140D02*
X156800Y-90140D01*
X158800Y-90140D02*
X160800Y-90140D01*
X162800Y-90140D02*
X164800Y-90140D01*
X166800Y-90140D02*
X168800Y-90140D01*
X170800Y-90140D02*
X172800Y-90140D01*
X174800Y-90140D02*
X176800Y-90140D01*
X178800Y-90140D02*
X180800Y-90140D01*
X182800Y-90140D02*
X184800Y-90140D01*
X186800Y-90140D02*
X184800Y-90140D01*
X180800Y-90140D02*
X182800Y-90140D01*
X176800Y-90140D02*
X178800Y-90140D01*
X172800Y-90140D02*
X174800Y-90140D01*
X168800Y-90140D02*
X170800Y-90140D01*
X164800Y-90140D02*
X166800Y-90140D01*
X160800Y-90140D02*
X162800Y-90140D01*
X156800Y-90140D02*
X158800Y-90140D01*
X124800Y-90140D02*
X126800Y-90140D01*
X128800Y-90140D02*
X130800Y-90140D01*
X132800Y-90140D02*
X134800Y-90140D01*
X136800Y-90140D02*
X138800Y-90140D01*
X140800Y-90140D02*
X142800Y-90140D01*
X144800Y-90140D02*
X146800Y-90140D01*
X148800Y-90140D02*
X150800Y-90140D01*
X154800Y-90140D02*
X152800Y-90140D01*
X150800Y-90140D02*
X152800Y-90140D01*
X146800Y-90140D02*
X148800Y-90140D01*
X142800Y-90140D02*
X144800Y-90140D01*
X138800Y-90140D02*
X140800Y-90140D01*
X134800Y-90140D02*
X136800Y-90140D01*
X130800Y-90140D02*
X132800Y-90140D01*
X126800Y-90140D02*
X128800Y-90140D01*
X122800Y-90140D02*
X124800Y-90140D01*
X72800Y-90140D02*
X74800Y-90140D01*
X76800Y-90140D02*
X78800Y-90140D01*
X80800Y-90140D02*
X82800Y-90140D01*
X84800Y-90140D02*
X86800Y-90140D01*
X88800Y-90140D02*
X90800Y-90140D01*
X92800Y-90140D02*
X94800Y-90140D01*
X96800Y-90140D02*
X98800Y-90140D01*
X100800Y-90140D02*
X102800Y-90140D01*
X104800Y-90140D02*
X102800Y-90140D01*
X98800Y-90140D02*
X100800Y-90140D01*
X94800Y-90140D02*
X96800Y-90140D01*
X90800Y-90140D02*
X92800Y-90140D01*
X86800Y-90140D02*
X88800Y-90140D01*
X82800Y-90140D02*
X84800Y-90140D01*
X78800Y-90140D02*
X80800Y-90140D01*
X74800Y-90140D02*
X76800Y-90140D01*
X106800Y-90140D02*
X108800Y-90140D01*
X110800Y-90140D02*
X112800Y-90140D01*
X114800Y-90140D02*
X116800Y-90140D01*
X118800Y-90140D02*
X120800Y-90140D01*
X120800Y-90140D02*
X122800Y-90140D01*
X116800Y-90140D02*
X118800Y-90140D01*
X112800Y-90140D02*
X114800Y-90140D01*
X108800Y-90140D02*
X110800Y-90140D01*
X104800Y-90140D02*
X106800Y-90140D01*
X190840Y-83960D02*
X190840Y-84100D01*
X190840Y-84100D02*
X190840Y-86100D01*
X69020Y-90140D02*
X186800Y-90140D01*
X186800Y-90140D02*
X188210Y-88730D01*
X188210Y-88730D02*
X189430Y-87510D01*
X189430Y-87510D02*
X190840Y-86100D01*
X69020Y-90140D02*
X68800Y-90140D01*
X68800Y-90140D02*
X67020Y-90140D01*
X67020Y-90140D02*
X66800Y-90140D01*
X66800Y-90140D02*
X64750Y-90140D01*
X64750Y-90140D02*
X64400Y-90140D01*
X102900Y-86600D02*
X104900Y-86600D01*
X106900Y-86600D02*
X108900Y-86600D01*
X110900Y-86600D02*
X112900Y-86600D01*
X114900Y-86600D02*
X116900Y-86600D01*
X118900Y-86600D02*
X120900Y-86600D01*
X116900Y-86600D02*
X118900Y-86600D01*
X112900Y-86600D02*
X114900Y-86600D01*
X108900Y-86600D02*
X110900Y-86600D01*
X104900Y-86600D02*
X106900Y-86600D01*
X72900Y-86600D02*
X74900Y-86600D01*
X76900Y-86600D02*
X78900Y-86600D01*
X80900Y-86600D02*
X82900Y-86600D01*
X84900Y-86600D02*
X86900Y-86600D01*
X88900Y-86600D02*
X90900Y-86600D01*
X92900Y-86600D02*
X94900Y-86600D01*
X96900Y-86600D02*
X98900Y-86600D01*
X102900Y-86600D02*
X100900Y-86600D01*
X98900Y-86600D02*
X100900Y-86600D01*
X94900Y-86600D02*
X96900Y-86600D01*
X90900Y-86600D02*
X92900Y-86600D01*
X86900Y-86600D02*
X88900Y-86600D01*
X82900Y-86600D02*
X84900Y-86600D01*
X78900Y-86600D02*
X80900Y-86600D01*
X74900Y-86600D02*
X76900Y-86600D01*
X70900Y-86600D02*
X72900Y-86600D01*
X120900Y-86600D02*
X122900Y-86600D01*
X124900Y-86600D02*
X126900Y-86600D01*
X128900Y-86600D02*
X130900Y-86600D01*
X132900Y-86600D02*
X134900Y-86600D01*
X136900Y-86600D02*
X138900Y-86600D01*
X140900Y-86600D02*
X142900Y-86600D01*
X144900Y-86600D02*
X146900Y-86600D01*
X148900Y-86600D02*
X150900Y-86600D01*
X152900Y-86600D02*
X150900Y-86600D01*
X146900Y-86600D02*
X148900Y-86600D01*
X142900Y-86600D02*
X144900Y-86600D01*
X138900Y-86600D02*
X140900Y-86600D01*
X134900Y-86600D02*
X136900Y-86600D01*
X130900Y-86600D02*
X132900Y-86600D01*
X126900Y-86600D02*
X128900Y-86600D01*
X122900Y-86600D02*
X124900Y-86600D01*
X68900Y-86600D02*
X152900Y-86600D01*
X154900Y-86600D02*
X156900Y-86600D01*
X158900Y-86600D02*
X160900Y-86600D01*
X162900Y-86600D02*
X164900Y-86600D01*
X166900Y-86600D02*
X168900Y-86600D01*
X170900Y-86600D02*
X172900Y-86600D01*
X174900Y-86600D02*
X176900Y-86600D01*
X178900Y-86600D02*
X180900Y-86600D01*
X184900Y-86600D02*
X182900Y-86600D01*
X180900Y-86600D02*
X182900Y-86600D01*
X176900Y-86600D02*
X178900Y-86600D01*
X172900Y-86600D02*
X174900Y-86600D01*
X168900Y-86600D02*
X170900Y-86600D01*
X164900Y-86600D02*
X166900Y-86600D01*
X160900Y-86600D02*
X162900Y-86600D01*
X156900Y-86600D02*
X158900Y-86600D01*
X152900Y-86600D02*
X154900Y-86600D01*
X65220Y-88550D02*
X64800Y-88550D01*
X63480Y-87230D02*
X37390Y-87230D01*
X64800Y-88550D02*
X63480Y-87230D01*
X191895Y-76793D02*
X191895Y-77634D01*
X64810Y-88550D02*
X64930Y-88550D01*
X185940Y-88550D02*
X67940Y-88550D01*
X67940Y-88550D02*
X65220Y-88550D01*
X65220Y-88550D02*
X64810Y-88550D01*
X189250Y-85240D02*
X187595Y-86895D01*
X187595Y-86895D02*
X185940Y-88550D01*
X189250Y-80280D02*
X189250Y-82740D01*
X189250Y-82740D02*
X189250Y-85240D01*
X191895Y-77634D02*
X191530Y-78000D01*
X191530Y-78000D02*
X189250Y-80280D01*
X191304Y-76793D02*
X191304Y-77765D01*
X185780Y-88210D02*
X67780Y-88210D01*
X67780Y-88210D02*
X65155Y-88210D01*
X188905Y-85085D02*
X187345Y-86645D01*
X187345Y-86645D02*
X185780Y-88210D01*
X188910Y-80160D02*
X188910Y-82660D01*
X188910Y-82660D02*
X188910Y-83800D01*
X191304Y-77765D02*
X191070Y-78000D01*
X191070Y-78000D02*
X188910Y-80160D01*
X192230Y-80570D02*
X190840Y-81960D01*
X190840Y-81960D02*
X190840Y-83960D01*
G54D19*
X186200Y-76350D02*
X186200Y-76900D01*
X38200Y-82650D02*
X37700Y-82150D01*
X64500Y-82650D02*
X38200Y-82650D01*
X68050Y-86200D02*
X64500Y-82650D01*
X184600Y-86200D02*
X68050Y-86200D01*
X186900Y-83900D02*
X184600Y-86200D01*
X186900Y-77600D02*
X186900Y-83900D01*
X186200Y-76900D02*
X186900Y-77600D01*
G54D17*
X67850Y-86600D02*
X66080Y-84830D01*
X66080Y-84830D02*
X65715Y-84465D01*
X65715Y-84465D02*
X64300Y-83050D01*
X64300Y-83050D02*
X37400Y-83050D01*
X68900Y-86600D02*
X67850Y-86600D01*
G54D20*
X68350Y-85500D02*
X64450Y-81600D01*
X69000Y-85500D02*
X68350Y-85500D01*
X186200Y-83600D02*
X184300Y-85500D01*
X184300Y-85500D02*
X69000Y-85500D01*
G54D21*
X186100Y-74800D02*
X186100Y-75800D01*
G54D20*
X186200Y-75900D02*
X186200Y-76350D01*
G54D21*
X186100Y-75800D02*
X186200Y-75900D01*
G54D20*
X186200Y-76350D02*
X186200Y-83600D01*
X64450Y-81600D02*
X63550Y-81600D01*
G54D17*
X191160Y-86230D02*
X189745Y-87645D01*
X189745Y-87645D02*
X189740Y-87650D01*
X189740Y-87650D02*
X188375Y-89015D01*
X188375Y-89015D02*
X186960Y-90430D01*
X191160Y-82100D02*
X194700Y-78560D01*
X195060Y-78200D02*
X194700Y-78560D01*
X195060Y-78200D02*
X195060Y-77740D01*
X191160Y-82100D02*
X191160Y-84230D01*
X191160Y-84230D02*
X191160Y-86230D01*
X195241Y-77558D02*
X195241Y-76793D01*
X195241Y-77558D02*
X195060Y-77740D01*
X195060Y-77740D02*
X194800Y-78000D01*
X192230Y-80570D02*
X193380Y-79420D01*
X193380Y-79420D02*
X194800Y-78000D01*
X193666Y-75337D02*
X193666Y-75833D01*
X193400Y-76100D02*
X192500Y-76100D01*
X193666Y-75833D02*
X193400Y-76100D01*
X195044Y-75337D02*
X195044Y-75924D01*
X195044Y-75924D02*
X195241Y-76121D01*
X195241Y-76793D02*
X195241Y-76121D01*
X195241Y-76121D02*
X195241Y-75337D01*
X195438Y-75337D02*
X195438Y-76793D01*
X195438Y-76793D02*
X195438Y-77390D01*
X195438Y-77390D02*
X195438Y-77401D01*
X185900Y-85600D02*
X184900Y-86600D01*
X187300Y-84200D02*
X186100Y-85400D01*
X186100Y-85400D02*
X185900Y-85600D01*
X187300Y-84000D02*
X187300Y-82000D01*
X187300Y-80000D02*
X187300Y-78000D01*
X187761Y-77538D02*
X187300Y-78000D01*
X187761Y-76793D02*
X187761Y-77538D01*
X187300Y-82000D02*
X187300Y-80000D01*
X187300Y-84000D02*
X187300Y-84200D01*
X184900Y-86600D02*
X183100Y-86600D01*
X187958Y-76793D02*
X187958Y-75337D01*
X187761Y-76793D02*
X187761Y-75337D01*
X192682Y-75337D02*
X192682Y-75917D01*
X192485Y-76085D02*
X192500Y-76100D01*
X192485Y-76085D02*
X192485Y-75337D01*
X192682Y-75917D02*
X192500Y-76100D01*
X192485Y-75337D02*
X192485Y-75814D01*
X192200Y-76100D02*
X191900Y-76100D01*
X192485Y-75814D02*
X192200Y-76100D01*
X192288Y-75337D02*
X192288Y-75711D01*
X192288Y-75711D02*
X191900Y-76100D01*
X192092Y-75337D02*
X192092Y-75907D01*
X192092Y-75907D02*
X191900Y-76100D01*
X191107Y-75337D02*
X191107Y-75907D01*
X191107Y-75907D02*
X191300Y-76100D01*
X190911Y-75337D02*
X190911Y-75711D01*
X190911Y-75711D02*
X191300Y-76100D01*
X191501Y-75337D02*
X191501Y-75898D01*
X191501Y-75898D02*
X191300Y-76100D01*
X191698Y-75337D02*
X191698Y-75898D01*
X191698Y-75898D02*
X191900Y-76100D01*
X191698Y-76793D02*
X191698Y-76301D01*
X191698Y-76301D02*
X191900Y-76100D01*
X191501Y-76793D02*
X191501Y-76301D01*
X191501Y-76301D02*
X191300Y-76100D01*
X191900Y-76100D02*
X191900Y-75341D01*
X191895Y-76104D02*
X191900Y-76100D01*
X191895Y-76793D02*
X191895Y-76104D01*
X191900Y-75341D02*
X191895Y-75337D01*
X191304Y-75337D02*
X191304Y-76095D01*
X191304Y-76104D02*
X191300Y-76100D01*
X191304Y-76104D02*
X191304Y-76793D01*
X191304Y-76095D02*
X191300Y-76100D01*
X190320Y-75337D02*
X190320Y-74940D01*
X190320Y-74940D02*
X190120Y-74740D01*
X189926Y-75337D02*
X189926Y-74933D01*
X190123Y-74743D02*
X190120Y-74740D01*
X190123Y-74743D02*
X190123Y-75337D01*
X189926Y-74933D02*
X190120Y-74740D01*
X189139Y-75337D02*
X189139Y-74939D01*
X189139Y-74939D02*
X188940Y-74740D01*
X188745Y-75337D02*
X188745Y-74934D01*
X188942Y-74742D02*
X188940Y-74740D01*
X188942Y-74742D02*
X188942Y-75337D01*
X188745Y-74934D02*
X188940Y-74740D01*
G54D10*
G36*
X189285Y-74525D02*
X189254Y-74555D01*
X189205Y-74675D01*
X189204Y-74804D01*
X189214Y-74827D01*
X189168Y-74872D01*
X189168Y-74875D01*
X189153Y-74875D01*
X189129Y-74850D01*
X189058Y-74821D01*
X189053Y-74816D01*
X189046Y-74816D01*
X189035Y-74816D01*
X189028Y-74816D01*
X189023Y-74821D01*
X188952Y-74850D01*
X188942Y-74861D01*
X188932Y-74850D01*
X188861Y-74821D01*
X188856Y-74816D01*
X188849Y-74816D01*
X188838Y-74816D01*
X188831Y-74816D01*
X188826Y-74821D01*
X188756Y-74850D01*
X188732Y-74875D01*
X188716Y-74875D01*
X188716Y-74872D01*
X188667Y-74823D01*
X188674Y-74804D01*
X188675Y-74675D01*
X188625Y-74556D01*
X188594Y-74525D01*
X189285Y-74525D01*
X189285Y-74525D01*
G37*
G54D22*
X189285Y-74525D02*
X189254Y-74555D01*
X189205Y-74675D01*
X189204Y-74804D01*
X189214Y-74827D01*
X189168Y-74872D01*
X189168Y-74875D01*
X189153Y-74875D01*
X189129Y-74850D01*
X189058Y-74821D01*
X189053Y-74816D01*
X189046Y-74816D01*
X189035Y-74816D01*
X189028Y-74816D01*
X189023Y-74821D01*
X188952Y-74850D01*
X188942Y-74861D01*
X188932Y-74850D01*
X188861Y-74821D01*
X188856Y-74816D01*
X188849Y-74816D01*
X188838Y-74816D01*
X188831Y-74816D01*
X188826Y-74821D01*
X188756Y-74850D01*
X188732Y-74875D01*
X188716Y-74875D01*
X188716Y-74872D01*
X188667Y-74823D01*
X188674Y-74804D01*
X188675Y-74675D01*
X188625Y-74556D01*
X188594Y-74525D01*
X189285Y-74525D01*
G54D10*
G36*
X192754Y-74830D02*
X192712Y-74872D01*
X192712Y-74875D01*
X192696Y-74875D01*
X192672Y-74850D01*
X192602Y-74821D01*
X192596Y-74816D01*
X192589Y-74816D01*
X192578Y-74816D01*
X192571Y-74816D01*
X192566Y-74821D01*
X192496Y-74850D01*
X192485Y-74861D01*
X192475Y-74850D01*
X192405Y-74821D01*
X192400Y-74816D01*
X192392Y-74816D01*
X192382Y-74816D01*
X192374Y-74816D01*
X192369Y-74821D01*
X192299Y-74850D01*
X192288Y-74861D01*
X192278Y-74850D01*
X192208Y-74821D01*
X192203Y-74816D01*
X192195Y-74816D01*
X192185Y-74816D01*
X192177Y-74816D01*
X192172Y-74821D01*
X192102Y-74850D01*
X192092Y-74861D01*
X192081Y-74850D01*
X192011Y-74821D01*
X192006Y-74816D01*
X191999Y-74816D01*
X191988Y-74816D01*
X191981Y-74816D01*
X191975Y-74821D01*
X191905Y-74850D01*
X191895Y-74861D01*
X191884Y-74850D01*
X191814Y-74821D01*
X191809Y-74816D01*
X191802Y-74816D01*
X191791Y-74816D01*
X191784Y-74816D01*
X191779Y-74821D01*
X191708Y-74850D01*
X191698Y-74861D01*
X191688Y-74850D01*
X191617Y-74821D01*
X191612Y-74816D01*
X191605Y-74816D01*
X191594Y-74816D01*
X191587Y-74816D01*
X191582Y-74821D01*
X191511Y-74850D01*
X191501Y-74861D01*
X191491Y-74850D01*
X191420Y-74821D01*
X191415Y-74816D01*
X191408Y-74816D01*
X191397Y-74816D01*
X191390Y-74816D01*
X191385Y-74821D01*
X191315Y-74850D01*
X191304Y-74861D01*
X191294Y-74850D01*
X191224Y-74821D01*
X191218Y-74816D01*
X191211Y-74816D01*
X191200Y-74816D01*
X191193Y-74816D01*
X191188Y-74821D01*
X191118Y-74850D01*
X191107Y-74861D01*
X191097Y-74850D01*
X191027Y-74821D01*
X191022Y-74816D01*
X191014Y-74816D01*
X191004Y-74816D01*
X190996Y-74816D01*
X190991Y-74821D01*
X190921Y-74850D01*
X190897Y-74875D01*
X190881Y-74875D01*
X190881Y-74872D01*
X190825Y-74816D01*
X190807Y-74816D01*
X190724Y-74850D01*
X190700Y-74875D01*
X190530Y-74875D01*
X190506Y-74850D01*
X190424Y-74816D01*
X190406Y-74816D01*
X190350Y-74872D01*
X190350Y-74875D01*
X190334Y-74875D01*
X190310Y-74850D01*
X190239Y-74821D01*
X190234Y-74816D01*
X190227Y-74816D01*
X190216Y-74816D01*
X190209Y-74816D01*
X190204Y-74821D01*
X190133Y-74850D01*
X190123Y-74861D01*
X190113Y-74850D01*
X190042Y-74821D01*
X190037Y-74816D01*
X190030Y-74816D01*
X190019Y-74816D01*
X190012Y-74816D01*
X190007Y-74821D01*
X189937Y-74850D01*
X189913Y-74875D01*
X189897Y-74875D01*
X189897Y-74872D01*
X189847Y-74823D01*
X189854Y-74804D01*
X189855Y-74675D01*
X189805Y-74556D01*
X189774Y-74525D01*
X192741Y-74525D01*
X192740Y-74526D01*
X192715Y-74587D01*
X192714Y-74652D01*
X192740Y-74713D01*
X192754Y-74727D01*
X192754Y-74830D01*
X192754Y-74830D01*
G37*
G54D22*
X192754Y-74830D02*
X192712Y-74872D01*
X192712Y-74875D01*
X192696Y-74875D01*
X192672Y-74850D01*
X192602Y-74821D01*
X192596Y-74816D01*
X192589Y-74816D01*
X192578Y-74816D01*
X192571Y-74816D01*
X192566Y-74821D01*
X192496Y-74850D01*
X192485Y-74861D01*
X192475Y-74850D01*
X192405Y-74821D01*
X192400Y-74816D01*
X192392Y-74816D01*
X192382Y-74816D01*
X192374Y-74816D01*
X192369Y-74821D01*
X192299Y-74850D01*
X192288Y-74861D01*
X192278Y-74850D01*
X192208Y-74821D01*
X192203Y-74816D01*
X192195Y-74816D01*
X192185Y-74816D01*
X192177Y-74816D01*
X192172Y-74821D01*
X192102Y-74850D01*
X192092Y-74861D01*
X192081Y-74850D01*
X192011Y-74821D01*
X192006Y-74816D01*
X191999Y-74816D01*
X191988Y-74816D01*
X191981Y-74816D01*
X191975Y-74821D01*
X191905Y-74850D01*
X191895Y-74861D01*
X191884Y-74850D01*
X191814Y-74821D01*
X191809Y-74816D01*
X191802Y-74816D01*
X191791Y-74816D01*
X191784Y-74816D01*
X191779Y-74821D01*
X191708Y-74850D01*
X191698Y-74861D01*
X191688Y-74850D01*
X191617Y-74821D01*
X191612Y-74816D01*
X191605Y-74816D01*
X191594Y-74816D01*
X191587Y-74816D01*
X191582Y-74821D01*
X191511Y-74850D01*
X191501Y-74861D01*
X191491Y-74850D01*
X191420Y-74821D01*
X191415Y-74816D01*
X191408Y-74816D01*
X191397Y-74816D01*
X191390Y-74816D01*
X191385Y-74821D01*
X191315Y-74850D01*
X191304Y-74861D01*
X191294Y-74850D01*
X191224Y-74821D01*
X191218Y-74816D01*
X191211Y-74816D01*
X191200Y-74816D01*
X191193Y-74816D01*
X191188Y-74821D01*
X191118Y-74850D01*
X191107Y-74861D01*
X191097Y-74850D01*
X191027Y-74821D01*
X191022Y-74816D01*
X191014Y-74816D01*
X191004Y-74816D01*
X190996Y-74816D01*
X190991Y-74821D01*
X190921Y-74850D01*
X190897Y-74875D01*
X190881Y-74875D01*
X190881Y-74872D01*
X190825Y-74816D01*
X190807Y-74816D01*
X190724Y-74850D01*
X190700Y-74875D01*
X190530Y-74875D01*
X190506Y-74850D01*
X190424Y-74816D01*
X190406Y-74816D01*
X190350Y-74872D01*
X190350Y-74875D01*
X190334Y-74875D01*
X190310Y-74850D01*
X190239Y-74821D01*
X190234Y-74816D01*
X190227Y-74816D01*
X190216Y-74816D01*
X190209Y-74816D01*
X190204Y-74821D01*
X190133Y-74850D01*
X190123Y-74861D01*
X190113Y-74850D01*
X190042Y-74821D01*
X190037Y-74816D01*
X190030Y-74816D01*
X190019Y-74816D01*
X190012Y-74816D01*
X190007Y-74821D01*
X189937Y-74850D01*
X189913Y-74875D01*
X189897Y-74875D01*
X189897Y-74872D01*
X189847Y-74823D01*
X189854Y-74804D01*
X189855Y-74675D01*
X189805Y-74556D01*
X189774Y-74525D01*
X192741Y-74525D01*
X192740Y-74526D01*
X192715Y-74587D01*
X192714Y-74652D01*
X192740Y-74713D01*
X192754Y-74727D01*
X192754Y-74830D01*
G54D10*
G36*
X197375Y-77939D02*
X192495Y-82819D01*
X192495Y-86659D01*
X187549Y-91605D01*
X67509Y-91605D01*
X65809Y-93305D01*
X37555Y-93305D01*
X37564Y-93282D01*
X37565Y-93217D01*
X37539Y-93156D01*
X37493Y-93110D01*
X37432Y-93085D01*
X37367Y-93084D01*
X37315Y-93106D01*
X37315Y-93003D01*
X37367Y-93024D01*
X37432Y-93025D01*
X37493Y-92999D01*
X37539Y-92953D01*
X37564Y-92892D01*
X37565Y-92827D01*
X37539Y-92766D01*
X37493Y-92720D01*
X37432Y-92695D01*
X37367Y-92694D01*
X37315Y-92716D01*
X37315Y-92408D01*
X37367Y-92429D01*
X37432Y-92430D01*
X37493Y-92404D01*
X37539Y-92358D01*
X37564Y-92297D01*
X37565Y-92245D01*
X64110Y-92245D01*
X65320Y-91035D01*
X187250Y-91035D01*
X191775Y-86510D01*
X191775Y-82400D01*
X196500Y-77675D01*
X196341Y-77675D01*
X196341Y-76318D01*
X196324Y-76279D01*
X196324Y-75340D01*
X196315Y-75292D01*
X196288Y-75251D01*
X196285Y-75248D01*
X196244Y-75221D01*
X196197Y-75212D01*
X196149Y-75221D01*
X196108Y-75248D01*
X196081Y-75289D01*
X196072Y-75337D01*
X196081Y-75384D01*
X196108Y-75425D01*
X196111Y-75428D01*
X196152Y-75455D01*
X196200Y-75464D01*
X196247Y-75455D01*
X196288Y-75428D01*
X196315Y-75387D01*
X196324Y-75340D01*
X196324Y-76279D01*
X196278Y-76167D01*
X196163Y-76052D01*
X196012Y-75989D01*
X195849Y-75989D01*
X195698Y-76051D01*
X195625Y-76125D01*
X195582Y-76167D01*
X195538Y-76273D01*
X195524Y-76273D01*
X195468Y-76329D01*
X195468Y-76347D01*
X195428Y-76307D01*
X195357Y-76278D01*
X195352Y-76273D01*
X195345Y-76273D01*
X195334Y-76273D01*
X195327Y-76273D01*
X195322Y-76278D01*
X195252Y-76307D01*
X195212Y-76347D01*
X195212Y-76329D01*
X195155Y-76273D01*
X195137Y-76273D01*
X195055Y-76307D01*
X194991Y-76370D01*
X194990Y-76375D01*
X192146Y-76375D01*
X192145Y-76370D01*
X192081Y-76307D01*
X191999Y-76273D01*
X191981Y-76273D01*
X191924Y-76329D01*
X191924Y-76347D01*
X191884Y-76307D01*
X191814Y-76278D01*
X191809Y-76273D01*
X191802Y-76273D01*
X191791Y-76273D01*
X191784Y-76273D01*
X191779Y-76278D01*
X191708Y-76307D01*
X191698Y-76318D01*
X191688Y-76307D01*
X191617Y-76278D01*
X191612Y-76273D01*
X191605Y-76273D01*
X191594Y-76273D01*
X191587Y-76273D01*
X191582Y-76278D01*
X191511Y-76307D01*
X191501Y-76318D01*
X191491Y-76307D01*
X191420Y-76278D01*
X191415Y-76273D01*
X191408Y-76273D01*
X191397Y-76273D01*
X191390Y-76273D01*
X191385Y-76278D01*
X191315Y-76307D01*
X191275Y-76347D01*
X191275Y-76329D01*
X191218Y-76273D01*
X191200Y-76273D01*
X191118Y-76307D01*
X191054Y-76370D01*
X191053Y-76375D01*
X188209Y-76375D01*
X188208Y-76370D01*
X188144Y-76307D01*
X188062Y-76273D01*
X188044Y-76273D01*
X187987Y-76329D01*
X187987Y-76347D01*
X187947Y-76307D01*
X187877Y-76278D01*
X187872Y-76273D01*
X187865Y-76273D01*
X187854Y-76273D01*
X187847Y-76273D01*
X187842Y-76278D01*
X187771Y-76307D01*
X187731Y-76347D01*
X187731Y-76329D01*
X187675Y-76273D01*
X187661Y-76273D01*
X187617Y-76167D01*
X187502Y-76052D01*
X187351Y-75989D01*
X187188Y-75989D01*
X187037Y-76051D01*
X186921Y-76167D01*
X186858Y-76318D01*
X186858Y-76481D01*
X186921Y-76632D01*
X187036Y-76747D01*
X187187Y-76810D01*
X187350Y-76810D01*
X187501Y-76748D01*
X187532Y-76717D01*
X187533Y-76718D01*
X187575Y-76718D01*
X187575Y-76868D01*
X187533Y-76868D01*
X187477Y-76924D01*
X187477Y-77044D01*
X187477Y-77133D01*
X187511Y-77216D01*
X187574Y-77279D01*
X187657Y-77313D01*
X187675Y-77313D01*
X187731Y-77257D01*
X187731Y-77239D01*
X187771Y-77279D01*
X187842Y-77308D01*
X187847Y-77313D01*
X187854Y-77313D01*
X187865Y-77313D01*
X187872Y-77313D01*
X187877Y-77308D01*
X187947Y-77279D01*
X187987Y-77239D01*
X187987Y-77257D01*
X188015Y-77284D01*
X188005Y-77309D01*
X188004Y-77370D01*
X188028Y-77427D01*
X188072Y-77471D01*
X188129Y-77494D01*
X188185Y-77495D01*
X188184Y-77530D01*
X188208Y-77587D01*
X188252Y-77631D01*
X188309Y-77654D01*
X188370Y-77655D01*
X188427Y-77631D01*
X188471Y-77587D01*
X188494Y-77530D01*
X188495Y-77489D01*
X188509Y-77494D01*
X188570Y-77495D01*
X188580Y-77491D01*
X188579Y-77532D01*
X188605Y-77593D01*
X188651Y-77639D01*
X188712Y-77664D01*
X188777Y-77665D01*
X188838Y-77639D01*
X188884Y-77593D01*
X188909Y-77532D01*
X188910Y-77494D01*
X188970Y-77495D01*
X188975Y-77493D01*
X188974Y-77532D01*
X189000Y-77593D01*
X189046Y-77639D01*
X189107Y-77664D01*
X189172Y-77665D01*
X189233Y-77639D01*
X189279Y-77593D01*
X189304Y-77532D01*
X189305Y-77493D01*
X189309Y-77494D01*
X189365Y-77495D01*
X189364Y-77532D01*
X189390Y-77593D01*
X189436Y-77639D01*
X189497Y-77664D01*
X189562Y-77665D01*
X189623Y-77639D01*
X189669Y-77593D01*
X189694Y-77532D01*
X189695Y-77494D01*
X189750Y-77495D01*
X189760Y-77491D01*
X189759Y-77532D01*
X189785Y-77593D01*
X189831Y-77639D01*
X189892Y-77664D01*
X189957Y-77665D01*
X190018Y-77639D01*
X190064Y-77593D01*
X190089Y-77532D01*
X190090Y-77494D01*
X190150Y-77495D01*
X190155Y-77493D01*
X190155Y-77532D01*
X190180Y-77592D01*
X190226Y-77639D01*
X190287Y-77664D01*
X190353Y-77664D01*
X190413Y-77639D01*
X190460Y-77593D01*
X190485Y-77532D01*
X190485Y-77493D01*
X190489Y-77494D01*
X190550Y-77495D01*
X190549Y-77532D01*
X190575Y-77593D01*
X190621Y-77639D01*
X190682Y-77664D01*
X190747Y-77665D01*
X190808Y-77639D01*
X190854Y-77593D01*
X190879Y-77532D01*
X190880Y-77494D01*
X190930Y-77495D01*
X190945Y-77489D01*
X190944Y-77532D01*
X190970Y-77593D01*
X191016Y-77639D01*
X191077Y-77664D01*
X191142Y-77665D01*
X191203Y-77639D01*
X191249Y-77593D01*
X191274Y-77532D01*
X191275Y-77467D01*
X191249Y-77406D01*
X191203Y-77360D01*
X191197Y-77357D01*
X191197Y-77312D01*
X191200Y-77313D01*
X191218Y-77313D01*
X191275Y-77257D01*
X191275Y-77239D01*
X191315Y-77279D01*
X191385Y-77308D01*
X191390Y-77313D01*
X191397Y-77313D01*
X191408Y-77313D01*
X191415Y-77313D01*
X191420Y-77308D01*
X191491Y-77279D01*
X191501Y-77269D01*
X191511Y-77279D01*
X191582Y-77308D01*
X191587Y-77313D01*
X191594Y-77313D01*
X191605Y-77313D01*
X191612Y-77313D01*
X191617Y-77308D01*
X191688Y-77279D01*
X191698Y-77269D01*
X191708Y-77279D01*
X191779Y-77308D01*
X191784Y-77313D01*
X191791Y-77313D01*
X191802Y-77313D01*
X191809Y-77313D01*
X191814Y-77308D01*
X191884Y-77279D01*
X191924Y-77239D01*
X191924Y-77257D01*
X191940Y-77272D01*
X191925Y-77309D01*
X191924Y-77370D01*
X191948Y-77427D01*
X191992Y-77471D01*
X192049Y-77494D01*
X192110Y-77495D01*
X192125Y-77489D01*
X192124Y-77532D01*
X192150Y-77593D01*
X192196Y-77639D01*
X192257Y-77664D01*
X192322Y-77665D01*
X192383Y-77639D01*
X192429Y-77593D01*
X192454Y-77532D01*
X192455Y-77494D01*
X192510Y-77495D01*
X192520Y-77491D01*
X192519Y-77532D01*
X192545Y-77593D01*
X192591Y-77639D01*
X192652Y-77664D01*
X192717Y-77665D01*
X192778Y-77639D01*
X192824Y-77593D01*
X192849Y-77532D01*
X192850Y-77494D01*
X192910Y-77495D01*
X192909Y-77532D01*
X192935Y-77593D01*
X192981Y-77639D01*
X193042Y-77664D01*
X193107Y-77665D01*
X193168Y-77639D01*
X193214Y-77593D01*
X193239Y-77532D01*
X193240Y-77491D01*
X193249Y-77494D01*
X193305Y-77495D01*
X193304Y-77532D01*
X193330Y-77593D01*
X193376Y-77639D01*
X193437Y-77664D01*
X193502Y-77665D01*
X193563Y-77639D01*
X193609Y-77593D01*
X193634Y-77532D01*
X193635Y-77494D01*
X193690Y-77495D01*
X193700Y-77491D01*
X193699Y-77532D01*
X193725Y-77593D01*
X193771Y-77639D01*
X193832Y-77664D01*
X193897Y-77665D01*
X193958Y-77639D01*
X194004Y-77593D01*
X194029Y-77532D01*
X194030Y-77494D01*
X194090Y-77495D01*
X194089Y-77532D01*
X194115Y-77593D01*
X194161Y-77639D01*
X194222Y-77664D01*
X194287Y-77665D01*
X194348Y-77639D01*
X194394Y-77593D01*
X194419Y-77532D01*
X194420Y-77491D01*
X194429Y-77494D01*
X194485Y-77495D01*
X194484Y-77532D01*
X194510Y-77593D01*
X194556Y-77639D01*
X194617Y-77664D01*
X194682Y-77665D01*
X194743Y-77639D01*
X194789Y-77593D01*
X194814Y-77532D01*
X194815Y-77494D01*
X194870Y-77495D01*
X194885Y-77489D01*
X194884Y-77530D01*
X194908Y-77587D01*
X194952Y-77631D01*
X195009Y-77654D01*
X195070Y-77655D01*
X195127Y-77631D01*
X195171Y-77587D01*
X195194Y-77530D01*
X195195Y-77469D01*
X195171Y-77412D01*
X195134Y-77375D01*
X195134Y-77312D01*
X195137Y-77313D01*
X195155Y-77313D01*
X195212Y-77257D01*
X195212Y-77239D01*
X195252Y-77279D01*
X195322Y-77308D01*
X195327Y-77313D01*
X195334Y-77313D01*
X195345Y-77313D01*
X195352Y-77313D01*
X195357Y-77308D01*
X195428Y-77279D01*
X195468Y-77239D01*
X195468Y-77257D01*
X195524Y-77313D01*
X195542Y-77313D01*
X195625Y-77279D01*
X195625Y-77279D01*
X195688Y-77216D01*
X195722Y-77133D01*
X195722Y-77044D01*
X195722Y-76924D01*
X195666Y-76868D01*
X195625Y-76868D01*
X195625Y-76718D01*
X195666Y-76718D01*
X195667Y-76717D01*
X195697Y-76747D01*
X195848Y-76810D01*
X196011Y-76810D01*
X196162Y-76748D01*
X196278Y-76632D01*
X196341Y-76481D01*
X196341Y-76318D01*
X196341Y-77675D01*
X196269Y-77675D01*
X195625Y-78319D01*
X195582Y-78362D01*
X191605Y-82339D01*
X191605Y-86469D01*
X187209Y-90865D01*
X65279Y-90865D01*
X64059Y-92075D01*
X37315Y-92075D01*
X37315Y-92022D01*
X37369Y-92044D01*
X37430Y-92045D01*
X37487Y-92021D01*
X37531Y-91977D01*
X37554Y-91920D01*
X37555Y-91859D01*
X37531Y-91802D01*
X37487Y-91758D01*
X37430Y-91735D01*
X37369Y-91734D01*
X37315Y-91757D01*
X37315Y-91632D01*
X37369Y-91654D01*
X37430Y-91655D01*
X37487Y-91631D01*
X37531Y-91587D01*
X37554Y-91530D01*
X37555Y-91469D01*
X37531Y-91412D01*
X37487Y-91368D01*
X37430Y-91345D01*
X37369Y-91344D01*
X37315Y-91367D01*
X37315Y-91325D01*
X63710Y-91325D01*
X64630Y-90405D01*
X186890Y-90405D01*
X191105Y-86190D01*
X191085Y-82070D01*
X195480Y-77675D01*
X195249Y-77675D01*
X190935Y-81989D01*
X190935Y-86129D01*
X186829Y-90235D01*
X64549Y-90235D01*
X63629Y-91155D01*
X37315Y-91155D01*
X37315Y-90652D01*
X37369Y-90674D01*
X37430Y-90675D01*
X37487Y-90651D01*
X37531Y-90607D01*
X37554Y-90550D01*
X37555Y-90489D01*
X37531Y-90432D01*
X37487Y-90388D01*
X37430Y-90365D01*
X37369Y-90364D01*
X37315Y-90387D01*
X37315Y-90262D01*
X37369Y-90284D01*
X37430Y-90285D01*
X37487Y-90261D01*
X37531Y-90217D01*
X37554Y-90160D01*
X37555Y-90099D01*
X37531Y-90042D01*
X37487Y-89998D01*
X37430Y-89975D01*
X37369Y-89974D01*
X37315Y-89997D01*
X37315Y-89862D01*
X37369Y-89884D01*
X37430Y-89885D01*
X37487Y-89861D01*
X37531Y-89817D01*
X37554Y-89760D01*
X37555Y-89699D01*
X37531Y-89642D01*
X37487Y-89598D01*
X37430Y-89575D01*
X37369Y-89574D01*
X37315Y-89597D01*
X37315Y-89472D01*
X37369Y-89494D01*
X37430Y-89495D01*
X37487Y-89471D01*
X37531Y-89427D01*
X37554Y-89370D01*
X37555Y-89309D01*
X37531Y-89252D01*
X37487Y-89208D01*
X37430Y-89185D01*
X37369Y-89184D01*
X37315Y-89207D01*
X37315Y-89072D01*
X37369Y-89094D01*
X37430Y-89095D01*
X37487Y-89071D01*
X37531Y-89027D01*
X37554Y-88970D01*
X37555Y-88909D01*
X37531Y-88852D01*
X37487Y-88808D01*
X37430Y-88785D01*
X37369Y-88784D01*
X37315Y-88807D01*
X37315Y-88682D01*
X37369Y-88704D01*
X37430Y-88705D01*
X37487Y-88681D01*
X37531Y-88637D01*
X37554Y-88580D01*
X37555Y-88519D01*
X37531Y-88462D01*
X37487Y-88418D01*
X37430Y-88395D01*
X37369Y-88394D01*
X37315Y-88417D01*
X37315Y-88282D01*
X37369Y-88304D01*
X37430Y-88305D01*
X37487Y-88281D01*
X37531Y-88237D01*
X37554Y-88180D01*
X37555Y-88119D01*
X37531Y-88062D01*
X37487Y-88018D01*
X37430Y-87995D01*
X37369Y-87994D01*
X37315Y-88017D01*
X37315Y-87892D01*
X37369Y-87914D01*
X37430Y-87915D01*
X37487Y-87891D01*
X37531Y-87847D01*
X37554Y-87790D01*
X37555Y-87729D01*
X37531Y-87672D01*
X37487Y-87628D01*
X37430Y-87605D01*
X37369Y-87604D01*
X37315Y-87627D01*
X37315Y-87145D01*
X63509Y-87145D01*
X64829Y-88465D01*
X185910Y-88465D01*
X189165Y-85210D01*
X189165Y-80250D01*
X191740Y-77675D01*
X191509Y-77675D01*
X188995Y-80189D01*
X188995Y-85109D01*
X185829Y-88295D01*
X64890Y-88295D01*
X63580Y-86975D01*
X37315Y-86975D01*
X37315Y-86312D01*
X37369Y-86334D01*
X37430Y-86335D01*
X37487Y-86311D01*
X37531Y-86267D01*
X37554Y-86210D01*
X37555Y-86149D01*
X37531Y-86092D01*
X37487Y-86048D01*
X37430Y-86025D01*
X37369Y-86024D01*
X37315Y-86047D01*
X37315Y-85922D01*
X37369Y-85944D01*
X37430Y-85945D01*
X37487Y-85921D01*
X37531Y-85877D01*
X37554Y-85820D01*
X37555Y-85759D01*
X37531Y-85702D01*
X37487Y-85658D01*
X37430Y-85635D01*
X37369Y-85634D01*
X37315Y-85657D01*
X37315Y-85522D01*
X37369Y-85544D01*
X37430Y-85545D01*
X37487Y-85521D01*
X37531Y-85477D01*
X37554Y-85420D01*
X37555Y-85359D01*
X37531Y-85302D01*
X37487Y-85258D01*
X37430Y-85235D01*
X37369Y-85234D01*
X37315Y-85257D01*
X37315Y-85132D01*
X37369Y-85154D01*
X37430Y-85155D01*
X37487Y-85131D01*
X37531Y-85087D01*
X37554Y-85030D01*
X37555Y-84969D01*
X37531Y-84912D01*
X37487Y-84868D01*
X37430Y-84845D01*
X37369Y-84844D01*
X37315Y-84867D01*
X37315Y-84732D01*
X37369Y-84754D01*
X37430Y-84755D01*
X37487Y-84731D01*
X37531Y-84687D01*
X37554Y-84630D01*
X37555Y-84569D01*
X37531Y-84512D01*
X37487Y-84468D01*
X37430Y-84445D01*
X37369Y-84444D01*
X37315Y-84467D01*
X37315Y-84342D01*
X37369Y-84364D01*
X37430Y-84365D01*
X37487Y-84341D01*
X37531Y-84297D01*
X37554Y-84240D01*
X37555Y-84179D01*
X37531Y-84122D01*
X37487Y-84078D01*
X37430Y-84055D01*
X37369Y-84054D01*
X37315Y-84077D01*
X37315Y-83942D01*
X37369Y-83964D01*
X37430Y-83965D01*
X37487Y-83941D01*
X37531Y-83897D01*
X37554Y-83840D01*
X37555Y-83779D01*
X37531Y-83722D01*
X37487Y-83678D01*
X37430Y-83655D01*
X37369Y-83654D01*
X37315Y-83677D01*
X37315Y-83552D01*
X37369Y-83574D01*
X37430Y-83575D01*
X37487Y-83551D01*
X37531Y-83507D01*
X37554Y-83450D01*
X37555Y-83389D01*
X37531Y-83332D01*
X37487Y-83288D01*
X37430Y-83265D01*
X37369Y-83264D01*
X37315Y-83287D01*
X37315Y-82925D01*
X64159Y-82925D01*
X67182Y-85947D01*
X67719Y-86525D01*
X68900Y-86525D01*
X184810Y-86525D01*
X187225Y-84110D01*
X187225Y-77675D01*
X185825Y-77675D01*
X185825Y-74525D01*
X188105Y-74525D01*
X188074Y-74555D01*
X188025Y-74675D01*
X188024Y-74804D01*
X188034Y-74826D01*
X187987Y-74872D01*
X187987Y-74875D01*
X187971Y-74875D01*
X187947Y-74850D01*
X187877Y-74821D01*
X187872Y-74816D01*
X187865Y-74816D01*
X187854Y-74816D01*
X187847Y-74816D01*
X187842Y-74821D01*
X187771Y-74850D01*
X187747Y-74875D01*
X187731Y-74875D01*
X187731Y-74872D01*
X187675Y-74816D01*
X187657Y-74816D01*
X187574Y-74850D01*
X187511Y-74914D01*
X187477Y-74996D01*
X187477Y-75086D01*
X187477Y-75205D01*
X187533Y-75262D01*
X187575Y-75262D01*
X187575Y-75412D01*
X187533Y-75412D01*
X187477Y-75468D01*
X187477Y-75587D01*
X187477Y-75677D01*
X187511Y-75759D01*
X187574Y-75823D01*
X187575Y-75823D01*
X187575Y-75825D01*
X187579Y-75825D01*
X187657Y-75857D01*
X187675Y-75857D01*
X187707Y-75825D01*
X187776Y-75825D01*
X187842Y-75852D01*
X187847Y-75857D01*
X187854Y-75857D01*
X187865Y-75857D01*
X187872Y-75857D01*
X187877Y-75852D01*
X187943Y-75825D01*
X188011Y-75825D01*
X188044Y-75857D01*
X188062Y-75857D01*
X188140Y-75825D01*
X188563Y-75825D01*
X188641Y-75857D01*
X188659Y-75857D01*
X188692Y-75825D01*
X188760Y-75825D01*
X188826Y-75852D01*
X188831Y-75857D01*
X188838Y-75857D01*
X188849Y-75857D01*
X188856Y-75857D01*
X188861Y-75852D01*
X188927Y-75825D01*
X188957Y-75825D01*
X189023Y-75852D01*
X189028Y-75857D01*
X189035Y-75857D01*
X189046Y-75857D01*
X189053Y-75857D01*
X189058Y-75852D01*
X189124Y-75825D01*
X189192Y-75825D01*
X189225Y-75857D01*
X189243Y-75857D01*
X189321Y-75825D01*
X189745Y-75825D01*
X189822Y-75857D01*
X189840Y-75857D01*
X189873Y-75825D01*
X189941Y-75825D01*
X190007Y-75852D01*
X190012Y-75857D01*
X190019Y-75857D01*
X190030Y-75857D01*
X190037Y-75857D01*
X190042Y-75852D01*
X190108Y-75825D01*
X190138Y-75825D01*
X190204Y-75852D01*
X190209Y-75857D01*
X190216Y-75857D01*
X190227Y-75857D01*
X190234Y-75857D01*
X190239Y-75852D01*
X190245Y-75849D01*
X190245Y-75857D01*
X190307Y-75857D01*
X190275Y-75935D01*
X190274Y-76064D01*
X190324Y-76183D01*
X190415Y-76275D01*
X190535Y-76324D01*
X190664Y-76325D01*
X190783Y-76275D01*
X190875Y-76184D01*
X190924Y-76064D01*
X190925Y-75935D01*
X190879Y-75825D01*
X190926Y-75825D01*
X190991Y-75852D01*
X190996Y-75857D01*
X191004Y-75857D01*
X191014Y-75857D01*
X191022Y-75857D01*
X191027Y-75852D01*
X191092Y-75825D01*
X191122Y-75825D01*
X191188Y-75852D01*
X191193Y-75857D01*
X191200Y-75857D01*
X191211Y-75857D01*
X191218Y-75857D01*
X191224Y-75852D01*
X191289Y-75825D01*
X191319Y-75825D01*
X191385Y-75852D01*
X191390Y-75857D01*
X191397Y-75857D01*
X191408Y-75857D01*
X191415Y-75857D01*
X191420Y-75852D01*
X191486Y-75825D01*
X191516Y-75825D01*
X191582Y-75852D01*
X191587Y-75857D01*
X191594Y-75857D01*
X191605Y-75857D01*
X191612Y-75857D01*
X191617Y-75852D01*
X191683Y-75825D01*
X191713Y-75825D01*
X191779Y-75852D01*
X191784Y-75857D01*
X191791Y-75857D01*
X191802Y-75857D01*
X191809Y-75857D01*
X191814Y-75852D01*
X191880Y-75825D01*
X191910Y-75825D01*
X191975Y-75852D01*
X191981Y-75857D01*
X191988Y-75857D01*
X191999Y-75857D01*
X192006Y-75857D01*
X192011Y-75852D01*
X192077Y-75825D01*
X192107Y-75825D01*
X192172Y-75852D01*
X192177Y-75857D01*
X192185Y-75857D01*
X192195Y-75857D01*
X192203Y-75857D01*
X192208Y-75852D01*
X192273Y-75825D01*
X192304Y-75825D01*
X192369Y-75852D01*
X192374Y-75857D01*
X192382Y-75857D01*
X192392Y-75857D01*
X192400Y-75857D01*
X192405Y-75852D01*
X192470Y-75825D01*
X192500Y-75825D01*
X192566Y-75852D01*
X192571Y-75857D01*
X192578Y-75857D01*
X192589Y-75857D01*
X192596Y-75857D01*
X192602Y-75852D01*
X192667Y-75825D01*
X192736Y-75825D01*
X192768Y-75857D01*
X192786Y-75857D01*
X192864Y-75825D01*
X193485Y-75825D01*
X193563Y-75857D01*
X193581Y-75857D01*
X193613Y-75825D01*
X193720Y-75825D01*
X193748Y-75852D01*
X193728Y-75872D01*
X193705Y-75929D01*
X193704Y-75990D01*
X193728Y-76047D01*
X193772Y-76091D01*
X193829Y-76114D01*
X193890Y-76115D01*
X193947Y-76091D01*
X193991Y-76047D01*
X194014Y-75990D01*
X194015Y-75949D01*
X194029Y-75954D01*
X194090Y-75955D01*
X194105Y-75949D01*
X194104Y-75990D01*
X194128Y-76047D01*
X194172Y-76091D01*
X194229Y-76114D01*
X194290Y-76115D01*
X194347Y-76091D01*
X194391Y-76047D01*
X194414Y-75990D01*
X194414Y-75962D01*
X194422Y-75964D01*
X194487Y-75965D01*
X194548Y-75939D01*
X194586Y-75901D01*
X194600Y-75933D01*
X194646Y-75979D01*
X194707Y-76004D01*
X194772Y-76005D01*
X194833Y-75979D01*
X194879Y-75933D01*
X194904Y-75872D01*
X194904Y-75842D01*
X194941Y-75857D01*
X194959Y-75857D01*
X194991Y-75825D01*
X195059Y-75825D01*
X195125Y-75852D01*
X195130Y-75857D01*
X195137Y-75857D01*
X195148Y-75857D01*
X195155Y-75857D01*
X195161Y-75852D01*
X195226Y-75825D01*
X195256Y-75825D01*
X195322Y-75852D01*
X195327Y-75857D01*
X195334Y-75857D01*
X195345Y-75857D01*
X195352Y-75857D01*
X195357Y-75852D01*
X195423Y-75825D01*
X195492Y-75825D01*
X195524Y-75857D01*
X195542Y-75857D01*
X195620Y-75825D01*
X195625Y-75825D01*
X195625Y-75823D01*
X195625Y-75823D01*
X195688Y-75759D01*
X195722Y-75677D01*
X195722Y-75587D01*
X195722Y-75468D01*
X195666Y-75412D01*
X195625Y-75412D01*
X195625Y-75262D01*
X195666Y-75262D01*
X195722Y-75205D01*
X195722Y-75117D01*
X195731Y-75139D01*
X195780Y-75188D01*
X195845Y-75214D01*
X195914Y-75215D01*
X195979Y-75188D01*
X196028Y-75139D01*
X196054Y-75074D01*
X196055Y-75005D01*
X196028Y-74941D01*
X195979Y-74891D01*
X195914Y-74865D01*
X195881Y-74865D01*
X195768Y-74751D01*
X195727Y-74724D01*
X195680Y-74715D01*
X194880Y-74715D01*
X194832Y-74724D01*
X194791Y-74751D01*
X194759Y-74783D01*
X194732Y-74824D01*
X194723Y-74871D01*
X194723Y-74875D01*
X193877Y-74875D01*
X193853Y-74850D01*
X193770Y-74816D01*
X193752Y-74816D01*
X193696Y-74872D01*
X193696Y-74875D01*
X193645Y-74875D01*
X193645Y-74847D01*
X193619Y-74786D01*
X193573Y-74740D01*
X193512Y-74715D01*
X193447Y-74714D01*
X193443Y-74716D01*
X193444Y-74712D01*
X193445Y-74647D01*
X193419Y-74586D01*
X193373Y-74540D01*
X193336Y-74525D01*
X195851Y-74525D01*
X195811Y-74551D01*
X195784Y-74592D01*
X195775Y-74640D01*
X195784Y-74687D01*
X195811Y-74728D01*
X195852Y-74755D01*
X195900Y-74765D01*
X196765Y-74765D01*
X196764Y-74874D01*
X196814Y-74993D01*
X196905Y-75085D01*
X197025Y-75134D01*
X197154Y-75135D01*
X197273Y-75085D01*
X197365Y-74994D01*
X197375Y-74971D01*
X197375Y-77939D01*
X197375Y-77939D01*
G37*
G54D22*
X197375Y-77939D02*
X192495Y-82819D01*
X192495Y-86659D01*
X187549Y-91605D01*
X67509Y-91605D01*
X65809Y-93305D01*
X37555Y-93305D01*
X37564Y-93282D01*
X37565Y-93217D01*
X37539Y-93156D01*
X37493Y-93110D01*
X37432Y-93085D01*
X37367Y-93084D01*
X37315Y-93106D01*
X37315Y-93003D01*
X37367Y-93024D01*
X37432Y-93025D01*
X37493Y-92999D01*
X37539Y-92953D01*
X37564Y-92892D01*
X37565Y-92827D01*
X37539Y-92766D01*
X37493Y-92720D01*
X37432Y-92695D01*
X37367Y-92694D01*
X37315Y-92716D01*
X37315Y-92408D01*
X37367Y-92429D01*
X37432Y-92430D01*
X37493Y-92404D01*
X37539Y-92358D01*
X37564Y-92297D01*
X37565Y-92245D01*
X64110Y-92245D01*
X65320Y-91035D01*
X187250Y-91035D01*
X191775Y-86510D01*
X191775Y-82400D01*
X196500Y-77675D01*
X196341Y-77675D01*
X196341Y-76318D01*
X196324Y-76279D01*
X196324Y-75340D01*
X196315Y-75292D01*
X196288Y-75251D01*
X196285Y-75248D01*
X196244Y-75221D01*
X196197Y-75212D01*
X196149Y-75221D01*
X196108Y-75248D01*
X196081Y-75289D01*
X196072Y-75337D01*
X196081Y-75384D01*
X196108Y-75425D01*
X196111Y-75428D01*
X196152Y-75455D01*
X196200Y-75464D01*
X196247Y-75455D01*
X196288Y-75428D01*
X196315Y-75387D01*
X196324Y-75340D01*
X196324Y-76279D01*
X196278Y-76167D01*
X196163Y-76052D01*
X196012Y-75989D01*
X195849Y-75989D01*
X195698Y-76051D01*
X195625Y-76125D01*
X195582Y-76167D01*
X195538Y-76273D01*
X195524Y-76273D01*
X195468Y-76329D01*
X195468Y-76347D01*
X195428Y-76307D01*
X195357Y-76278D01*
X195352Y-76273D01*
X195345Y-76273D01*
X195334Y-76273D01*
X195327Y-76273D01*
X195322Y-76278D01*
X195252Y-76307D01*
X195212Y-76347D01*
X195212Y-76329D01*
X195155Y-76273D01*
X195137Y-76273D01*
X195055Y-76307D01*
X194991Y-76370D01*
X194990Y-76375D01*
X192146Y-76375D01*
X192145Y-76370D01*
X192081Y-76307D01*
X191999Y-76273D01*
X191981Y-76273D01*
X191924Y-76329D01*
X191924Y-76347D01*
X191884Y-76307D01*
X191814Y-76278D01*
X191809Y-76273D01*
X191802Y-76273D01*
X191791Y-76273D01*
X191784Y-76273D01*
X191779Y-76278D01*
X191708Y-76307D01*
X191698Y-76318D01*
X191688Y-76307D01*
X191617Y-76278D01*
X191612Y-76273D01*
X191605Y-76273D01*
X191594Y-76273D01*
X191587Y-76273D01*
X191582Y-76278D01*
X191511Y-76307D01*
X191501Y-76318D01*
X191491Y-76307D01*
X191420Y-76278D01*
X191415Y-76273D01*
X191408Y-76273D01*
X191397Y-76273D01*
X191390Y-76273D01*
X191385Y-76278D01*
X191315Y-76307D01*
X191275Y-76347D01*
X191275Y-76329D01*
X191218Y-76273D01*
X191200Y-76273D01*
X191118Y-76307D01*
X191054Y-76370D01*
X191053Y-76375D01*
X188209Y-76375D01*
X188208Y-76370D01*
X188144Y-76307D01*
X188062Y-76273D01*
X188044Y-76273D01*
X187987Y-76329D01*
X187987Y-76347D01*
X187947Y-76307D01*
X187877Y-76278D01*
X187872Y-76273D01*
X187865Y-76273D01*
X187854Y-76273D01*
X187847Y-76273D01*
X187842Y-76278D01*
X187771Y-76307D01*
X187731Y-76347D01*
X187731Y-76329D01*
X187675Y-76273D01*
X187661Y-76273D01*
X187617Y-76167D01*
X187502Y-76052D01*
X187351Y-75989D01*
X187188Y-75989D01*
X187037Y-76051D01*
X186921Y-76167D01*
X186858Y-76318D01*
X186858Y-76481D01*
X186921Y-76632D01*
X187036Y-76747D01*
X187187Y-76810D01*
X187350Y-76810D01*
X187501Y-76748D01*
X187532Y-76717D01*
X187533Y-76718D01*
X187575Y-76718D01*
X187575Y-76868D01*
X187533Y-76868D01*
X187477Y-76924D01*
X187477Y-77044D01*
X187477Y-77133D01*
X187511Y-77216D01*
X187574Y-77279D01*
X187657Y-77313D01*
X187675Y-77313D01*
X187731Y-77257D01*
X187731Y-77239D01*
X187771Y-77279D01*
X187842Y-77308D01*
X187847Y-77313D01*
X187854Y-77313D01*
X187865Y-77313D01*
X187872Y-77313D01*
X187877Y-77308D01*
X187947Y-77279D01*
X187987Y-77239D01*
X187987Y-77257D01*
X188015Y-77284D01*
X188005Y-77309D01*
X188004Y-77370D01*
X188028Y-77427D01*
X188072Y-77471D01*
X188129Y-77494D01*
X188185Y-77495D01*
X188184Y-77530D01*
X188208Y-77587D01*
X188252Y-77631D01*
X188309Y-77654D01*
X188370Y-77655D01*
X188427Y-77631D01*
X188471Y-77587D01*
X188494Y-77530D01*
X188495Y-77489D01*
X188509Y-77494D01*
X188570Y-77495D01*
X188580Y-77491D01*
X188579Y-77532D01*
X188605Y-77593D01*
X188651Y-77639D01*
X188712Y-77664D01*
X188777Y-77665D01*
X188838Y-77639D01*
X188884Y-77593D01*
X188909Y-77532D01*
X188910Y-77494D01*
X188970Y-77495D01*
X188975Y-77493D01*
X188974Y-77532D01*
X189000Y-77593D01*
X189046Y-77639D01*
X189107Y-77664D01*
X189172Y-77665D01*
X189233Y-77639D01*
X189279Y-77593D01*
X189304Y-77532D01*
X189305Y-77493D01*
X189309Y-77494D01*
X189365Y-77495D01*
X189364Y-77532D01*
X189390Y-77593D01*
X189436Y-77639D01*
X189497Y-77664D01*
X189562Y-77665D01*
X189623Y-77639D01*
X189669Y-77593D01*
X189694Y-77532D01*
X189695Y-77494D01*
X189750Y-77495D01*
X189760Y-77491D01*
X189759Y-77532D01*
X189785Y-77593D01*
X189831Y-77639D01*
X189892Y-77664D01*
X189957Y-77665D01*
X190018Y-77639D01*
X190064Y-77593D01*
X190089Y-77532D01*
X190090Y-77494D01*
X190150Y-77495D01*
X190155Y-77493D01*
X190155Y-77532D01*
X190180Y-77592D01*
X190226Y-77639D01*
X190287Y-77664D01*
X190353Y-77664D01*
X190413Y-77639D01*
X190460Y-77593D01*
X190485Y-77532D01*
X190485Y-77493D01*
X190489Y-77494D01*
X190550Y-77495D01*
X190549Y-77532D01*
X190575Y-77593D01*
X190621Y-77639D01*
X190682Y-77664D01*
X190747Y-77665D01*
X190808Y-77639D01*
X190854Y-77593D01*
X190879Y-77532D01*
X190880Y-77494D01*
X190930Y-77495D01*
X190945Y-77489D01*
X190944Y-77532D01*
X190970Y-77593D01*
X191016Y-77639D01*
X191077Y-77664D01*
X191142Y-77665D01*
X191203Y-77639D01*
X191249Y-77593D01*
X191274Y-77532D01*
X191275Y-77467D01*
X191249Y-77406D01*
X191203Y-77360D01*
X191197Y-77357D01*
X191197Y-77312D01*
X191200Y-77313D01*
X191218Y-77313D01*
X191275Y-77257D01*
X191275Y-77239D01*
X191315Y-77279D01*
X191385Y-77308D01*
X191390Y-77313D01*
X191397Y-77313D01*
X191408Y-77313D01*
X191415Y-77313D01*
X191420Y-77308D01*
X191491Y-77279D01*
X191501Y-77269D01*
X191511Y-77279D01*
X191582Y-77308D01*
X191587Y-77313D01*
X191594Y-77313D01*
X191605Y-77313D01*
X191612Y-77313D01*
X191617Y-77308D01*
X191688Y-77279D01*
X191698Y-77269D01*
X191708Y-77279D01*
X191779Y-77308D01*
X191784Y-77313D01*
X191791Y-77313D01*
X191802Y-77313D01*
X191809Y-77313D01*
X191814Y-77308D01*
X191884Y-77279D01*
X191924Y-77239D01*
X191924Y-77257D01*
X191940Y-77272D01*
X191925Y-77309D01*
X191924Y-77370D01*
X191948Y-77427D01*
X191992Y-77471D01*
X192049Y-77494D01*
X192110Y-77495D01*
X192125Y-77489D01*
X192124Y-77532D01*
X192150Y-77593D01*
X192196Y-77639D01*
X192257Y-77664D01*
X192322Y-77665D01*
X192383Y-77639D01*
X192429Y-77593D01*
X192454Y-77532D01*
X192455Y-77494D01*
X192510Y-77495D01*
X192520Y-77491D01*
X192519Y-77532D01*
X192545Y-77593D01*
X192591Y-77639D01*
X192652Y-77664D01*
X192717Y-77665D01*
X192778Y-77639D01*
X192824Y-77593D01*
X192849Y-77532D01*
X192850Y-77494D01*
X192910Y-77495D01*
X192909Y-77532D01*
X192935Y-77593D01*
X192981Y-77639D01*
X193042Y-77664D01*
X193107Y-77665D01*
X193168Y-77639D01*
X193214Y-77593D01*
X193239Y-77532D01*
X193240Y-77491D01*
X193249Y-77494D01*
X193305Y-77495D01*
X193304Y-77532D01*
X193330Y-77593D01*
X193376Y-77639D01*
X193437Y-77664D01*
X193502Y-77665D01*
X193563Y-77639D01*
X193609Y-77593D01*
X193634Y-77532D01*
X193635Y-77494D01*
X193690Y-77495D01*
X193700Y-77491D01*
X193699Y-77532D01*
X193725Y-77593D01*
X193771Y-77639D01*
X193832Y-77664D01*
X193897Y-77665D01*
X193958Y-77639D01*
X194004Y-77593D01*
X194029Y-77532D01*
X194030Y-77494D01*
X194090Y-77495D01*
X194089Y-77532D01*
X194115Y-77593D01*
X194161Y-77639D01*
X194222Y-77664D01*
X194287Y-77665D01*
X194348Y-77639D01*
X194394Y-77593D01*
X194419Y-77532D01*
X194420Y-77491D01*
X194429Y-77494D01*
X194485Y-77495D01*
X194484Y-77532D01*
X194510Y-77593D01*
X194556Y-77639D01*
X194617Y-77664D01*
X194682Y-77665D01*
X194743Y-77639D01*
X194789Y-77593D01*
X194814Y-77532D01*
X194815Y-77494D01*
X194870Y-77495D01*
X194885Y-77489D01*
X194884Y-77530D01*
X194908Y-77587D01*
X194952Y-77631D01*
X195009Y-77654D01*
X195070Y-77655D01*
X195127Y-77631D01*
X195171Y-77587D01*
X195194Y-77530D01*
X195195Y-77469D01*
X195171Y-77412D01*
X195134Y-77375D01*
X195134Y-77312D01*
X195137Y-77313D01*
X195155Y-77313D01*
X195212Y-77257D01*
X195212Y-77239D01*
X195252Y-77279D01*
X195322Y-77308D01*
X195327Y-77313D01*
X195334Y-77313D01*
X195345Y-77313D01*
X195352Y-77313D01*
X195357Y-77308D01*
X195428Y-77279D01*
X195468Y-77239D01*
X195468Y-77257D01*
X195524Y-77313D01*
X195542Y-77313D01*
X195625Y-77279D01*
X195625Y-77279D01*
X195688Y-77216D01*
X195722Y-77133D01*
X195722Y-77044D01*
X195722Y-76924D01*
X195666Y-76868D01*
X195625Y-76868D01*
X195625Y-76718D01*
X195666Y-76718D01*
X195667Y-76717D01*
X195697Y-76747D01*
X195848Y-76810D01*
X196011Y-76810D01*
X196162Y-76748D01*
X196278Y-76632D01*
X196341Y-76481D01*
X196341Y-76318D01*
X196341Y-77675D01*
X196269Y-77675D01*
X195625Y-78319D01*
X195582Y-78362D01*
X191605Y-82339D01*
X191605Y-86469D01*
X187209Y-90865D01*
X65279Y-90865D01*
X64059Y-92075D01*
X37315Y-92075D01*
X37315Y-92022D01*
X37369Y-92044D01*
X37430Y-92045D01*
X37487Y-92021D01*
X37531Y-91977D01*
X37554Y-91920D01*
X37555Y-91859D01*
X37531Y-91802D01*
X37487Y-91758D01*
X37430Y-91735D01*
X37369Y-91734D01*
X37315Y-91757D01*
X37315Y-91632D01*
X37369Y-91654D01*
X37430Y-91655D01*
X37487Y-91631D01*
X37531Y-91587D01*
X37554Y-91530D01*
X37555Y-91469D01*
X37531Y-91412D01*
X37487Y-91368D01*
X37430Y-91345D01*
X37369Y-91344D01*
X37315Y-91367D01*
X37315Y-91325D01*
X63710Y-91325D01*
X64630Y-90405D01*
X186890Y-90405D01*
X191105Y-86190D01*
X191085Y-82070D01*
X195480Y-77675D01*
X195249Y-77675D01*
X190935Y-81989D01*
X190935Y-86129D01*
X186829Y-90235D01*
X64549Y-90235D01*
X63629Y-91155D01*
X37315Y-91155D01*
X37315Y-90652D01*
X37369Y-90674D01*
X37430Y-90675D01*
X37487Y-90651D01*
X37531Y-90607D01*
X37554Y-90550D01*
X37555Y-90489D01*
X37531Y-90432D01*
X37487Y-90388D01*
X37430Y-90365D01*
X37369Y-90364D01*
X37315Y-90387D01*
X37315Y-90262D01*
X37369Y-90284D01*
X37430Y-90285D01*
X37487Y-90261D01*
X37531Y-90217D01*
X37554Y-90160D01*
X37555Y-90099D01*
X37531Y-90042D01*
X37487Y-89998D01*
X37430Y-89975D01*
X37369Y-89974D01*
X37315Y-89997D01*
X37315Y-89862D01*
X37369Y-89884D01*
X37430Y-89885D01*
X37487Y-89861D01*
X37531Y-89817D01*
X37554Y-89760D01*
X37555Y-89699D01*
X37531Y-89642D01*
X37487Y-89598D01*
X37430Y-89575D01*
X37369Y-89574D01*
X37315Y-89597D01*
X37315Y-89472D01*
X37369Y-89494D01*
X37430Y-89495D01*
X37487Y-89471D01*
X37531Y-89427D01*
X37554Y-89370D01*
X37555Y-89309D01*
X37531Y-89252D01*
X37487Y-89208D01*
X37430Y-89185D01*
X37369Y-89184D01*
X37315Y-89207D01*
X37315Y-89072D01*
X37369Y-89094D01*
X37430Y-89095D01*
X37487Y-89071D01*
X37531Y-89027D01*
X37554Y-88970D01*
X37555Y-88909D01*
X37531Y-88852D01*
X37487Y-88808D01*
X37430Y-88785D01*
X37369Y-88784D01*
X37315Y-88807D01*
X37315Y-88682D01*
X37369Y-88704D01*
X37430Y-88705D01*
X37487Y-88681D01*
X37531Y-88637D01*
X37554Y-88580D01*
X37555Y-88519D01*
X37531Y-88462D01*
X37487Y-88418D01*
X37430Y-88395D01*
X37369Y-88394D01*
X37315Y-88417D01*
X37315Y-88282D01*
X37369Y-88304D01*
X37430Y-88305D01*
X37487Y-88281D01*
X37531Y-88237D01*
X37554Y-88180D01*
X37555Y-88119D01*
X37531Y-88062D01*
X37487Y-88018D01*
X37430Y-87995D01*
X37369Y-87994D01*
X37315Y-88017D01*
X37315Y-87892D01*
X37369Y-87914D01*
X37430Y-87915D01*
X37487Y-87891D01*
X37531Y-87847D01*
X37554Y-87790D01*
X37555Y-87729D01*
X37531Y-87672D01*
X37487Y-87628D01*
X37430Y-87605D01*
X37369Y-87604D01*
X37315Y-87627D01*
X37315Y-87145D01*
X63509Y-87145D01*
X64829Y-88465D01*
X185910Y-88465D01*
X189165Y-85210D01*
X189165Y-80250D01*
X191740Y-77675D01*
X191509Y-77675D01*
X188995Y-80189D01*
X188995Y-85109D01*
X185829Y-88295D01*
X64890Y-88295D01*
X63580Y-86975D01*
X37315Y-86975D01*
X37315Y-86312D01*
X37369Y-86334D01*
X37430Y-86335D01*
X37487Y-86311D01*
X37531Y-86267D01*
X37554Y-86210D01*
X37555Y-86149D01*
X37531Y-86092D01*
X37487Y-86048D01*
X37430Y-86025D01*
X37369Y-86024D01*
X37315Y-86047D01*
X37315Y-85922D01*
X37369Y-85944D01*
X37430Y-85945D01*
X37487Y-85921D01*
X37531Y-85877D01*
X37554Y-85820D01*
X37555Y-85759D01*
X37531Y-85702D01*
X37487Y-85658D01*
X37430Y-85635D01*
X37369Y-85634D01*
X37315Y-85657D01*
X37315Y-85522D01*
X37369Y-85544D01*
X37430Y-85545D01*
X37487Y-85521D01*
X37531Y-85477D01*
X37554Y-85420D01*
X37555Y-85359D01*
X37531Y-85302D01*
X37487Y-85258D01*
X37430Y-85235D01*
X37369Y-85234D01*
X37315Y-85257D01*
X37315Y-85132D01*
X37369Y-85154D01*
X37430Y-85155D01*
X37487Y-85131D01*
X37531Y-85087D01*
X37554Y-85030D01*
X37555Y-84969D01*
X37531Y-84912D01*
X37487Y-84868D01*
X37430Y-84845D01*
X37369Y-84844D01*
X37315Y-84867D01*
X37315Y-84732D01*
X37369Y-84754D01*
X37430Y-84755D01*
X37487Y-84731D01*
X37531Y-84687D01*
X37554Y-84630D01*
X37555Y-84569D01*
X37531Y-84512D01*
X37487Y-84468D01*
X37430Y-84445D01*
X37369Y-84444D01*
X37315Y-84467D01*
X37315Y-84342D01*
X37369Y-84364D01*
X37430Y-84365D01*
X37487Y-84341D01*
X37531Y-84297D01*
X37554Y-84240D01*
X37555Y-84179D01*
X37531Y-84122D01*
X37487Y-84078D01*
X37430Y-84055D01*
X37369Y-84054D01*
X37315Y-84077D01*
X37315Y-83942D01*
X37369Y-83964D01*
X37430Y-83965D01*
X37487Y-83941D01*
X37531Y-83897D01*
X37554Y-83840D01*
X37555Y-83779D01*
X37531Y-83722D01*
X37487Y-83678D01*
X37430Y-83655D01*
X37369Y-83654D01*
X37315Y-83677D01*
X37315Y-83552D01*
X37369Y-83574D01*
X37430Y-83575D01*
X37487Y-83551D01*
X37531Y-83507D01*
X37554Y-83450D01*
X37555Y-83389D01*
X37531Y-83332D01*
X37487Y-83288D01*
X37430Y-83265D01*
X37369Y-83264D01*
X37315Y-83287D01*
X37315Y-82925D01*
X64159Y-82925D01*
X67182Y-85947D01*
X67719Y-86525D01*
X68900Y-86525D01*
X184810Y-86525D01*
X187225Y-84110D01*
X187225Y-77675D01*
X185825Y-77675D01*
X185825Y-74525D01*
X188105Y-74525D01*
X188074Y-74555D01*
X188025Y-74675D01*
X188024Y-74804D01*
X188034Y-74826D01*
X187987Y-74872D01*
X187987Y-74875D01*
X187971Y-74875D01*
X187947Y-74850D01*
X187877Y-74821D01*
X187872Y-74816D01*
X187865Y-74816D01*
X187854Y-74816D01*
X187847Y-74816D01*
X187842Y-74821D01*
X187771Y-74850D01*
X187747Y-74875D01*
X187731Y-74875D01*
X187731Y-74872D01*
X187675Y-74816D01*
X187657Y-74816D01*
X187574Y-74850D01*
X187511Y-74914D01*
X187477Y-74996D01*
X187477Y-75086D01*
X187477Y-75205D01*
X187533Y-75262D01*
X187575Y-75262D01*
X187575Y-75412D01*
X187533Y-75412D01*
X187477Y-75468D01*
X187477Y-75587D01*
X187477Y-75677D01*
X187511Y-75759D01*
X187574Y-75823D01*
X187575Y-75823D01*
X187575Y-75825D01*
X187579Y-75825D01*
X187657Y-75857D01*
X187675Y-75857D01*
X187707Y-75825D01*
X187776Y-75825D01*
X187842Y-75852D01*
X187847Y-75857D01*
X187854Y-75857D01*
X187865Y-75857D01*
X187872Y-75857D01*
X187877Y-75852D01*
X187943Y-75825D01*
X188011Y-75825D01*
X188044Y-75857D01*
X188062Y-75857D01*
X188140Y-75825D01*
X188563Y-75825D01*
X188641Y-75857D01*
X188659Y-75857D01*
X188692Y-75825D01*
X188760Y-75825D01*
X188826Y-75852D01*
X188831Y-75857D01*
X188838Y-75857D01*
X188849Y-75857D01*
X188856Y-75857D01*
X188861Y-75852D01*
X188927Y-75825D01*
X188957Y-75825D01*
X189023Y-75852D01*
X189028Y-75857D01*
X189035Y-75857D01*
X189046Y-75857D01*
X189053Y-75857D01*
X189058Y-75852D01*
X189124Y-75825D01*
X189192Y-75825D01*
X189225Y-75857D01*
X189243Y-75857D01*
X189321Y-75825D01*
X189745Y-75825D01*
X189822Y-75857D01*
X189840Y-75857D01*
X189873Y-75825D01*
X189941Y-75825D01*
X190007Y-75852D01*
X190012Y-75857D01*
X190019Y-75857D01*
X190030Y-75857D01*
X190037Y-75857D01*
X190042Y-75852D01*
X190108Y-75825D01*
X190138Y-75825D01*
X190204Y-75852D01*
X190209Y-75857D01*
X190216Y-75857D01*
X190227Y-75857D01*
X190234Y-75857D01*
X190239Y-75852D01*
X190245Y-75849D01*
X190245Y-75857D01*
X190307Y-75857D01*
X190275Y-75935D01*
X190274Y-76064D01*
X190324Y-76183D01*
X190415Y-76275D01*
X190535Y-76324D01*
X190664Y-76325D01*
X190783Y-76275D01*
X190875Y-76184D01*
X190924Y-76064D01*
X190925Y-75935D01*
X190879Y-75825D01*
X190926Y-75825D01*
X190991Y-75852D01*
X190996Y-75857D01*
X191004Y-75857D01*
X191014Y-75857D01*
X191022Y-75857D01*
X191027Y-75852D01*
X191092Y-75825D01*
X191122Y-75825D01*
X191188Y-75852D01*
X191193Y-75857D01*
X191200Y-75857D01*
X191211Y-75857D01*
X191218Y-75857D01*
X191224Y-75852D01*
X191289Y-75825D01*
X191319Y-75825D01*
X191385Y-75852D01*
X191390Y-75857D01*
X191397Y-75857D01*
X191408Y-75857D01*
X191415Y-75857D01*
X191420Y-75852D01*
X191486Y-75825D01*
X191516Y-75825D01*
X191582Y-75852D01*
X191587Y-75857D01*
X191594Y-75857D01*
X191605Y-75857D01*
X191612Y-75857D01*
X191617Y-75852D01*
X191683Y-75825D01*
X191713Y-75825D01*
X191779Y-75852D01*
X191784Y-75857D01*
X191791Y-75857D01*
X191802Y-75857D01*
X191809Y-75857D01*
X191814Y-75852D01*
X191880Y-75825D01*
X191910Y-75825D01*
X191975Y-75852D01*
X191981Y-75857D01*
X191988Y-75857D01*
X191999Y-75857D01*
X192006Y-75857D01*
X192011Y-75852D01*
X192077Y-75825D01*
X192107Y-75825D01*
X192172Y-75852D01*
X192177Y-75857D01*
X192185Y-75857D01*
X192195Y-75857D01*
X192203Y-75857D01*
X192208Y-75852D01*
X192273Y-75825D01*
X192304Y-75825D01*
X192369Y-75852D01*
X192374Y-75857D01*
X192382Y-75857D01*
X192392Y-75857D01*
X192400Y-75857D01*
X192405Y-75852D01*
X192470Y-75825D01*
X192500Y-75825D01*
X192566Y-75852D01*
X192571Y-75857D01*
X192578Y-75857D01*
X192589Y-75857D01*
X192596Y-75857D01*
X192602Y-75852D01*
X192667Y-75825D01*
X192736Y-75825D01*
X192768Y-75857D01*
X192786Y-75857D01*
X192864Y-75825D01*
X193485Y-75825D01*
X193563Y-75857D01*
X193581Y-75857D01*
X193613Y-75825D01*
X193720Y-75825D01*
X193748Y-75852D01*
X193728Y-75872D01*
X193705Y-75929D01*
X193704Y-75990D01*
X193728Y-76047D01*
X193772Y-76091D01*
X193829Y-76114D01*
X193890Y-76115D01*
X193947Y-76091D01*
X193991Y-76047D01*
X194014Y-75990D01*
X194015Y-75949D01*
X194029Y-75954D01*
X194090Y-75955D01*
X194105Y-75949D01*
X194104Y-75990D01*
X194128Y-76047D01*
X194172Y-76091D01*
X194229Y-76114D01*
X194290Y-76115D01*
X194347Y-76091D01*
X194391Y-76047D01*
X194414Y-75990D01*
X194414Y-75962D01*
X194422Y-75964D01*
X194487Y-75965D01*
X194548Y-75939D01*
X194586Y-75901D01*
X194600Y-75933D01*
X194646Y-75979D01*
X194707Y-76004D01*
X194772Y-76005D01*
X194833Y-75979D01*
X194879Y-75933D01*
X194904Y-75872D01*
X194904Y-75842D01*
X194941Y-75857D01*
X194959Y-75857D01*
X194991Y-75825D01*
X195059Y-75825D01*
X195125Y-75852D01*
X195130Y-75857D01*
X195137Y-75857D01*
X195148Y-75857D01*
X195155Y-75857D01*
X195161Y-75852D01*
X195226Y-75825D01*
X195256Y-75825D01*
X195322Y-75852D01*
X195327Y-75857D01*
X195334Y-75857D01*
X195345Y-75857D01*
X195352Y-75857D01*
X195357Y-75852D01*
X195423Y-75825D01*
X195492Y-75825D01*
X195524Y-75857D01*
X195542Y-75857D01*
X195620Y-75825D01*
X195625Y-75825D01*
X195625Y-75823D01*
X195625Y-75823D01*
X195688Y-75759D01*
X195722Y-75677D01*
X195722Y-75587D01*
X195722Y-75468D01*
X195666Y-75412D01*
X195625Y-75412D01*
X195625Y-75262D01*
X195666Y-75262D01*
X195722Y-75205D01*
X195722Y-75117D01*
X195731Y-75139D01*
X195780Y-75188D01*
X195845Y-75214D01*
X195914Y-75215D01*
X195979Y-75188D01*
X196028Y-75139D01*
X196054Y-75074D01*
X196055Y-75005D01*
X196028Y-74941D01*
X195979Y-74891D01*
X195914Y-74865D01*
X195881Y-74865D01*
X195768Y-74751D01*
X195727Y-74724D01*
X195680Y-74715D01*
X194880Y-74715D01*
X194832Y-74724D01*
X194791Y-74751D01*
X194759Y-74783D01*
X194732Y-74824D01*
X194723Y-74871D01*
X194723Y-74875D01*
X193877Y-74875D01*
X193853Y-74850D01*
X193770Y-74816D01*
X193752Y-74816D01*
X193696Y-74872D01*
X193696Y-74875D01*
X193645Y-74875D01*
X193645Y-74847D01*
X193619Y-74786D01*
X193573Y-74740D01*
X193512Y-74715D01*
X193447Y-74714D01*
X193443Y-74716D01*
X193444Y-74712D01*
X193445Y-74647D01*
X193419Y-74586D01*
X193373Y-74540D01*
X193336Y-74525D01*
X195851Y-74525D01*
X195811Y-74551D01*
X195784Y-74592D01*
X195775Y-74640D01*
X195784Y-74687D01*
X195811Y-74728D01*
X195852Y-74755D01*
X195900Y-74765D01*
X196765Y-74765D01*
X196764Y-74874D01*
X196814Y-74993D01*
X196905Y-75085D01*
X197025Y-75134D01*
X197154Y-75135D01*
X197273Y-75085D01*
X197365Y-74994D01*
X197375Y-74971D01*
X197375Y-77939D01*
G54D10*
G36*
X64675Y-82755D02*
X37315Y-82755D01*
X37315Y-82343D01*
X37367Y-82364D01*
X37432Y-82365D01*
X37493Y-82339D01*
X37539Y-82293D01*
X37564Y-82232D01*
X37565Y-82167D01*
X37539Y-82106D01*
X37508Y-82074D01*
X37539Y-82043D01*
X37564Y-81982D01*
X37565Y-81917D01*
X37539Y-81856D01*
X37493Y-81810D01*
X37432Y-81785D01*
X37367Y-81784D01*
X37315Y-81806D01*
X37315Y-80875D01*
X64289Y-80875D01*
X64675Y-81260D01*
X64675Y-82755D01*
X64675Y-82755D01*
G37*
G54D22*
X64675Y-82755D02*
X37315Y-82755D01*
X37315Y-82343D01*
X37367Y-82364D01*
X37432Y-82365D01*
X37493Y-82339D01*
X37539Y-82293D01*
X37564Y-82232D01*
X37565Y-82167D01*
X37539Y-82106D01*
X37508Y-82074D01*
X37539Y-82043D01*
X37564Y-81982D01*
X37565Y-81917D01*
X37539Y-81856D01*
X37493Y-81810D01*
X37432Y-81785D01*
X37367Y-81784D01*
X37315Y-81806D01*
X37315Y-80875D01*
X64289Y-80875D01*
X64675Y-81260D01*
X64675Y-82755D01*
M02*
