%FSLAX34Y34*%
G04 Gerber Fmt 3.4, Leading zero omitted, Abs format*
G04 (created by PCBNEW (2013-10-07 BZR 4378)-stable) date Fri 19 Dec 2014 04:01:06 PM EST*
%MOIN*%
G01*
G70*
G90*
G04 APERTURE LIST*
%ADD10C,0.005906*%
%ADD11C,0.003937*%
%ADD12R,0.139764X0.013779*%
%ADD13C,0.016000*%
%ADD14C,0.050000*%
%ADD15C,0.030000*%
%ADD16C,0.010000*%
%ADD17C,0.075000*%
%ADD18C,0.050000*%
%ADD19C,0.003000*%
%ADD20C,0.020000*%
G04 APERTURE END LIST*
G54D10*
G54D11*
X130052Y-91750D02*
X67550Y-91750D01*
X135102Y-82860D02*
X135102Y-83000D01*
X136062Y-81900D02*
X135102Y-82860D01*
X135102Y-86700D02*
X135102Y-83000D01*
X130052Y-91750D02*
X135102Y-86700D01*
X33030Y-93450D02*
X33480Y-93450D01*
X33480Y-93450D02*
X33570Y-93540D01*
X33570Y-93540D02*
X33570Y-93640D01*
X33570Y-93640D02*
X33690Y-93760D01*
X33690Y-93760D02*
X34140Y-93760D01*
X34140Y-93760D02*
X34140Y-93450D01*
X33030Y-93450D02*
X33030Y-80650D01*
X33030Y-80650D02*
X33400Y-80650D01*
X33390Y-80650D02*
X33420Y-80650D01*
X33420Y-80650D02*
X33450Y-80650D01*
X33450Y-80650D02*
X33570Y-80530D01*
X33570Y-80530D02*
X33570Y-80440D01*
X33570Y-80440D02*
X33680Y-80330D01*
X33680Y-80330D02*
X34130Y-80330D01*
X34130Y-80330D02*
X34130Y-80640D01*
X140062Y-77900D02*
X136062Y-81900D01*
X65850Y-93450D02*
X67550Y-91750D01*
X33050Y-93450D02*
X65850Y-93450D01*
X33050Y-80650D02*
X33050Y-93450D01*
X64350Y-80650D02*
X33050Y-80650D01*
X68600Y-84900D02*
X64350Y-80650D01*
X126562Y-84900D02*
X68600Y-84900D01*
X128062Y-83400D02*
X126562Y-84900D01*
X128062Y-74300D02*
X128062Y-83400D01*
X140062Y-74300D02*
X140062Y-77900D01*
X140062Y-74300D02*
X128062Y-74300D01*
G54D12*
X33730Y-90101D03*
X33730Y-89904D03*
X33730Y-89510D03*
X33730Y-89707D03*
X33730Y-88920D03*
X33730Y-88723D03*
X33730Y-89116D03*
X33730Y-89313D03*
X33730Y-87738D03*
X33730Y-87542D03*
X33730Y-87148D03*
X33730Y-87345D03*
X33730Y-88132D03*
X33730Y-87935D03*
X33730Y-88329D03*
X33730Y-88526D03*
X33730Y-91675D03*
X33730Y-91479D03*
X33730Y-91085D03*
X33730Y-91282D03*
X33730Y-90494D03*
X33730Y-90298D03*
X33730Y-90691D03*
X33730Y-90888D03*
X33730Y-92463D03*
X33730Y-92266D03*
X33730Y-91872D03*
X33730Y-92069D03*
X33730Y-92857D03*
X33730Y-92660D03*
X33730Y-93053D03*
X33730Y-93250D03*
X33730Y-83998D03*
X33730Y-84195D03*
X33730Y-84589D03*
X33730Y-84392D03*
X33730Y-85179D03*
X33730Y-85376D03*
X33730Y-84983D03*
X33730Y-84786D03*
X33730Y-86361D03*
X33730Y-86557D03*
X33730Y-86951D03*
X33730Y-86754D03*
X33730Y-85967D03*
X33730Y-86164D03*
X33730Y-85770D03*
X33730Y-85573D03*
X33730Y-82424D03*
X33730Y-82620D03*
X33730Y-83014D03*
X33730Y-82817D03*
X33730Y-83605D03*
X33730Y-83801D03*
X33730Y-83408D03*
X33730Y-83211D03*
X33730Y-81636D03*
X33730Y-81833D03*
X33730Y-82227D03*
X33730Y-82030D03*
X33730Y-81242D03*
X33730Y-81439D03*
X33730Y-81046D03*
X33730Y-80849D03*
G54D13*
X37730Y-82650D03*
X38065Y-82655D03*
G54D14*
X133062Y-76000D03*
G54D13*
X37400Y-82200D03*
X37400Y-81950D03*
G54D14*
X131992Y-74740D03*
X130812Y-74740D03*
G54D13*
X135342Y-74620D03*
X135542Y-74900D03*
X37400Y-93250D03*
X130802Y-77500D03*
X130622Y-77340D03*
X37400Y-83420D03*
X135537Y-77500D03*
X37400Y-88530D03*
X135342Y-77340D03*
X135932Y-77500D03*
X37400Y-88940D03*
X135742Y-77340D03*
X136327Y-77500D03*
X37400Y-89340D03*
X136122Y-77340D03*
X136717Y-77500D03*
X37400Y-89730D03*
X136522Y-77340D03*
X137112Y-77500D03*
X136922Y-77340D03*
X37400Y-90130D03*
X137502Y-77500D03*
X137302Y-77340D03*
X37400Y-90520D03*
X131207Y-77500D03*
X131002Y-77340D03*
X37400Y-83810D03*
X131602Y-77500D03*
X131402Y-77340D03*
X37400Y-84210D03*
X131992Y-77500D03*
X131802Y-77340D03*
X37400Y-84600D03*
X132387Y-77500D03*
X132182Y-77340D03*
X37400Y-85000D03*
X132783Y-77499D03*
X132582Y-77340D03*
X37400Y-85390D03*
X133177Y-77500D03*
X132982Y-77340D03*
X37400Y-85790D03*
X133572Y-77500D03*
X133362Y-77340D03*
X37400Y-86180D03*
X134752Y-77500D03*
X134542Y-77340D03*
X37400Y-87760D03*
X135147Y-77500D03*
X37400Y-88150D03*
X134942Y-77340D03*
X137250Y-75830D03*
X135942Y-74880D03*
X37400Y-92860D03*
X135742Y-74680D03*
X136522Y-75800D03*
X136917Y-75800D03*
X136322Y-75960D03*
X37400Y-91500D03*
X136722Y-75960D03*
X37400Y-91890D03*
X37730Y-83210D03*
X38147Y-83092D03*
G54D14*
X139552Y-74810D03*
G54D13*
X38205Y-86555D03*
X37900Y-86765D03*
X37965Y-87535D03*
X37735Y-87345D03*
X37690Y-90890D03*
X37795Y-91460D03*
X37400Y-92265D03*
X68800Y-90165D03*
X66800Y-90168D03*
X73262Y-90166D03*
X77262Y-90166D03*
X81262Y-90166D03*
X85262Y-90166D03*
X89262Y-90166D03*
X93262Y-90166D03*
X91262Y-90166D03*
X87262Y-90166D03*
X83262Y-90166D03*
X79262Y-90166D03*
X75262Y-90166D03*
X71262Y-90166D03*
X99262Y-90166D03*
X103262Y-90166D03*
X107262Y-90166D03*
X105262Y-90166D03*
X101262Y-90166D03*
X97262Y-90166D03*
X95262Y-90166D03*
G54D14*
X132582Y-74740D03*
X131402Y-74740D03*
G54D13*
X64930Y-88225D03*
X63480Y-86885D03*
X55610Y-86890D03*
X59610Y-86890D03*
X61610Y-86890D03*
X57610Y-86890D03*
X53610Y-86890D03*
X37610Y-86890D03*
X66955Y-90635D03*
X68955Y-90635D03*
X64885Y-90705D03*
X70955Y-90635D03*
X55880Y-91705D03*
X59880Y-91705D03*
X61880Y-91705D03*
X57880Y-91705D03*
X53880Y-91700D03*
X63860Y-91715D03*
X74955Y-90635D03*
X78955Y-90635D03*
X82955Y-90635D03*
X86955Y-90635D03*
X90955Y-90635D03*
X94955Y-90635D03*
X98955Y-90635D03*
X102955Y-90635D03*
X100955Y-90635D03*
X96955Y-90635D03*
X92955Y-90635D03*
X88955Y-90635D03*
X84955Y-90635D03*
X80955Y-90635D03*
X76955Y-90635D03*
X72955Y-90635D03*
X104955Y-90635D03*
X106955Y-90635D03*
X109512Y-90625D03*
X125512Y-90625D03*
X127512Y-90625D03*
X130962Y-89180D03*
X129512Y-90625D03*
X136232Y-79785D03*
X135237Y-80780D03*
X133832Y-82210D03*
X133802Y-84210D03*
X137647Y-78370D03*
X133792Y-86350D03*
X132377Y-87765D03*
X66080Y-84830D03*
X56300Y-83050D03*
X60300Y-83050D03*
X62300Y-83050D03*
X58300Y-83050D03*
X54300Y-83050D03*
X38550Y-83050D03*
X64300Y-83050D03*
X37400Y-82860D03*
X37400Y-82450D03*
X67850Y-86595D03*
X95362Y-86595D03*
X54060Y-92580D03*
X56060Y-92990D03*
X58060Y-92580D03*
X60060Y-92990D03*
X62060Y-92580D03*
X65210Y-91900D03*
X65680Y-92320D03*
X37800Y-92990D03*
X37790Y-92580D03*
X70800Y-90165D03*
X53480Y-91060D03*
X57480Y-91060D03*
X61480Y-91060D03*
X59480Y-91060D03*
X55480Y-91060D03*
X63485Y-91055D03*
X64400Y-90165D03*
X37400Y-91060D03*
X63480Y-87230D03*
X55480Y-87230D03*
X59480Y-87230D03*
X61480Y-87230D03*
X57480Y-87230D03*
X53480Y-87230D03*
X37480Y-87230D03*
X96242Y-88225D03*
X96402Y-88530D03*
X64800Y-88530D03*
X130687Y-88750D03*
X131907Y-87530D03*
X130042Y-86885D03*
X129822Y-86655D03*
X98402Y-88530D03*
X102402Y-88530D03*
X106402Y-88530D03*
X110402Y-88530D03*
X126402Y-88530D03*
X124402Y-88530D03*
X108402Y-88530D03*
X104402Y-88530D03*
X100402Y-88530D03*
X68402Y-88530D03*
X72402Y-88530D03*
X76402Y-88530D03*
X80402Y-88530D03*
X84402Y-88530D03*
X88402Y-88530D03*
X92402Y-88530D03*
X94402Y-88530D03*
X90402Y-88530D03*
X86402Y-88530D03*
X82402Y-88530D03*
X78402Y-88530D03*
X74402Y-88530D03*
X70402Y-88530D03*
X98242Y-88225D03*
X102242Y-88225D03*
X106242Y-88225D03*
X110242Y-88225D03*
X126242Y-88225D03*
X124242Y-88225D03*
X108242Y-88225D03*
X104242Y-88225D03*
X100242Y-88225D03*
X68242Y-88225D03*
X72242Y-88225D03*
X76242Y-88225D03*
X80242Y-88225D03*
X84242Y-88225D03*
X88242Y-88225D03*
X92242Y-88225D03*
X94242Y-88225D03*
X90242Y-88225D03*
X86242Y-88225D03*
X82242Y-88225D03*
X78242Y-88225D03*
X74242Y-88225D03*
X70242Y-88225D03*
X131382Y-85090D03*
X133532Y-78000D03*
X131387Y-80160D03*
X131392Y-82660D03*
X128242Y-88225D03*
X128402Y-88530D03*
X131692Y-82740D03*
X133992Y-78000D03*
X131712Y-80280D03*
X131692Y-85225D03*
X133332Y-84100D03*
X133317Y-86115D03*
X127262Y-90165D03*
X125262Y-90165D03*
X109262Y-90165D03*
X69362Y-86595D03*
X73362Y-86595D03*
X77362Y-86595D03*
X81362Y-86595D03*
X85362Y-86595D03*
X89362Y-86595D03*
X93362Y-86595D03*
X91362Y-86595D03*
X87362Y-86595D03*
X83362Y-86595D03*
X79362Y-86595D03*
X75362Y-86595D03*
X71362Y-86595D03*
X99362Y-86595D03*
X103362Y-86595D03*
X107362Y-86595D03*
X125362Y-86595D03*
X109362Y-86595D03*
X105362Y-86595D03*
X101362Y-86595D03*
X97362Y-86595D03*
X133332Y-81990D03*
X134712Y-80585D03*
X135857Y-79435D03*
X127337Y-86565D03*
X37400Y-81700D03*
X37400Y-81450D03*
G54D14*
X128562Y-74800D03*
G54D13*
X137277Y-78015D03*
G54D14*
X134962Y-76100D03*
G54D13*
X128517Y-85375D03*
X129752Y-82000D03*
X129762Y-78000D03*
X129752Y-80000D03*
X129752Y-84000D03*
G54D14*
X134362Y-76100D03*
X133762Y-76100D03*
G54D15*
X38065Y-82655D02*
X37735Y-82655D01*
X37735Y-82655D02*
X37730Y-82650D01*
X38070Y-82650D02*
X64500Y-82650D01*
X130962Y-76000D02*
X133062Y-76000D01*
X129362Y-77600D02*
X130962Y-76000D01*
X129362Y-83900D02*
X129362Y-77600D01*
X127062Y-86200D02*
X129362Y-83900D01*
X68050Y-86200D02*
X127062Y-86200D01*
X64500Y-82650D02*
X68050Y-86200D01*
G54D16*
X38070Y-82650D02*
X36650Y-82650D01*
X36424Y-82424D02*
X33730Y-82424D01*
X36650Y-82650D02*
X36424Y-82424D01*
X37250Y-82200D02*
X37400Y-82200D01*
X33730Y-81833D02*
X36883Y-81833D01*
X36883Y-81833D02*
X37250Y-82200D01*
X36986Y-81636D02*
X37300Y-81950D01*
X37300Y-81950D02*
X37400Y-81950D01*
X36936Y-81636D02*
X33730Y-81636D01*
X36936Y-81636D02*
X36986Y-81636D01*
X37900Y-81250D02*
X37600Y-81250D01*
X37396Y-81046D02*
X33730Y-81046D01*
X37600Y-81250D02*
X37396Y-81046D01*
X37900Y-81250D02*
X37900Y-81250D01*
G54D17*
X68350Y-85500D02*
X64100Y-81250D01*
X64100Y-81250D02*
X37900Y-81250D01*
X128662Y-75900D02*
X128662Y-83600D01*
G54D18*
X129822Y-74740D02*
X128662Y-75900D01*
X130812Y-74740D02*
X129822Y-74740D01*
G54D17*
X126762Y-85500D02*
X69000Y-85500D01*
X128662Y-83600D02*
X126762Y-85500D01*
X69000Y-85500D02*
X68350Y-85500D01*
G54D16*
X37499Y-80849D02*
X33730Y-80849D01*
X37900Y-81250D02*
X37499Y-80849D01*
X33730Y-93053D02*
X37473Y-93053D01*
X139662Y-77860D02*
X139662Y-75480D01*
X134822Y-82700D02*
X139662Y-77860D01*
X134822Y-86650D02*
X134822Y-82700D01*
X129962Y-91510D02*
X134822Y-86650D01*
X66900Y-91510D02*
X129962Y-91510D01*
X65210Y-93200D02*
X66900Y-91510D01*
X37620Y-93200D02*
X65210Y-93200D01*
X37473Y-93053D02*
X37620Y-93200D01*
X135342Y-74620D02*
X135482Y-74480D01*
X139662Y-75480D02*
X139662Y-77740D01*
X138662Y-74480D02*
X139662Y-75480D01*
X135482Y-74480D02*
X138662Y-74480D01*
X37060Y-93250D02*
X37400Y-93250D01*
X33730Y-93250D02*
X37060Y-93250D01*
X37400Y-93250D02*
X37400Y-93249D01*
G54D19*
X37560Y-83510D02*
X64380Y-83510D01*
X37464Y-83605D02*
X37560Y-83510D01*
X33730Y-83605D02*
X37464Y-83605D01*
X67650Y-86780D02*
X127462Y-86780D01*
X64380Y-83510D02*
X67650Y-86780D01*
X127462Y-86780D02*
X129942Y-84300D01*
X129942Y-84300D02*
X129942Y-78400D01*
X129942Y-78400D02*
X130802Y-77540D01*
X130802Y-77540D02*
X130802Y-77500D01*
X130802Y-77500D02*
X130842Y-77500D01*
X127462Y-86780D02*
X68900Y-86780D01*
X129942Y-84300D02*
X127462Y-86780D01*
X129942Y-78400D02*
X129942Y-84300D01*
X130842Y-77500D02*
X129942Y-78400D01*
X37388Y-83408D02*
X37400Y-83420D01*
X37388Y-83408D02*
X33730Y-83408D01*
X135537Y-77500D02*
X135537Y-77525D01*
X37464Y-88735D02*
X37560Y-88640D01*
X33730Y-88735D02*
X37464Y-88735D01*
X63510Y-88640D02*
X37560Y-88640D01*
X63950Y-89080D02*
X63510Y-88640D01*
X128682Y-89080D02*
X63950Y-89080D01*
X132242Y-85520D02*
X128682Y-89080D01*
X132242Y-80820D02*
X132242Y-85520D01*
X135537Y-77525D02*
X132242Y-80820D01*
X37388Y-88538D02*
X37400Y-88550D01*
X33730Y-88538D02*
X37388Y-88538D01*
X37560Y-89030D02*
X63340Y-89030D01*
X33730Y-89125D02*
X37464Y-89125D01*
X37464Y-89125D02*
X37560Y-89030D01*
X135932Y-77530D02*
X135932Y-77500D01*
X132422Y-81040D02*
X135932Y-77530D01*
X132422Y-85620D02*
X132422Y-81040D01*
X128782Y-89260D02*
X132422Y-85620D01*
X63570Y-89260D02*
X128782Y-89260D01*
X63340Y-89030D02*
X63570Y-89260D01*
X33730Y-88928D02*
X37388Y-88928D01*
X37388Y-88928D02*
X37400Y-88940D01*
X136327Y-77500D02*
X136327Y-77515D01*
X37464Y-89525D02*
X37560Y-89430D01*
X33730Y-89525D02*
X37464Y-89525D01*
X63180Y-89430D02*
X37560Y-89430D01*
X63190Y-89440D02*
X63180Y-89430D01*
X128882Y-89440D02*
X63190Y-89440D01*
X132602Y-85720D02*
X128882Y-89440D01*
X132602Y-81240D02*
X132602Y-85720D01*
X136327Y-77515D02*
X132602Y-81240D01*
X37388Y-89328D02*
X37400Y-89340D01*
X33730Y-89328D02*
X37388Y-89328D01*
X37560Y-89820D02*
X63370Y-89820D01*
X33730Y-89915D02*
X37464Y-89915D01*
X37464Y-89915D02*
X37560Y-89820D01*
X136717Y-77525D02*
X136717Y-77500D01*
X132782Y-81460D02*
X136717Y-77525D01*
X132782Y-85820D02*
X132782Y-81460D01*
X128982Y-89620D02*
X132782Y-85820D01*
X63570Y-89620D02*
X128982Y-89620D01*
X63370Y-89820D02*
X63570Y-89620D01*
X33730Y-89718D02*
X37388Y-89718D01*
X37388Y-89718D02*
X37400Y-89730D01*
X137112Y-77500D02*
X137112Y-77530D01*
X33730Y-90315D02*
X37464Y-90315D01*
X37464Y-90315D02*
X37560Y-90220D01*
X63530Y-90220D02*
X37560Y-90220D01*
X63950Y-89800D02*
X63530Y-90220D01*
X129082Y-89800D02*
X63950Y-89800D01*
X132962Y-85920D02*
X129082Y-89800D01*
X132962Y-81680D02*
X132962Y-85920D01*
X137112Y-77530D02*
X132962Y-81680D01*
X33730Y-90118D02*
X37388Y-90118D01*
X37388Y-90118D02*
X37400Y-90130D01*
X37560Y-90610D02*
X63700Y-90610D01*
X37464Y-90705D02*
X37560Y-90610D01*
X33730Y-90705D02*
X37464Y-90705D01*
X64330Y-89980D02*
X129182Y-89980D01*
X63700Y-90610D02*
X64330Y-89980D01*
X129182Y-89980D02*
X133142Y-86020D01*
X133142Y-86020D02*
X133142Y-81880D01*
X133142Y-81880D02*
X137502Y-77520D01*
X137502Y-77520D02*
X137502Y-77500D01*
X137502Y-77500D02*
X137502Y-77520D01*
X129182Y-89980D02*
X68940Y-89980D01*
X133142Y-86020D02*
X129182Y-89980D01*
X133142Y-81880D02*
X133142Y-86020D01*
X137502Y-77520D02*
X133142Y-81880D01*
X37388Y-90508D02*
X37400Y-90520D01*
X33730Y-90508D02*
X37388Y-90508D01*
X131207Y-77500D02*
X131207Y-77515D01*
X33730Y-83995D02*
X37464Y-83995D01*
X37464Y-83995D02*
X37560Y-83900D01*
X64210Y-83900D02*
X37560Y-83900D01*
X67270Y-86960D02*
X64210Y-83900D01*
X127562Y-86960D02*
X67270Y-86960D01*
X130122Y-84400D02*
X127562Y-86960D01*
X130122Y-78600D02*
X130122Y-84400D01*
X131207Y-77515D02*
X130122Y-78600D01*
X37388Y-83798D02*
X37400Y-83810D01*
X37388Y-83798D02*
X33730Y-83798D01*
X131602Y-77500D02*
X131602Y-77520D01*
X64050Y-84300D02*
X66890Y-87140D01*
X66890Y-87140D02*
X127662Y-87140D01*
X127662Y-87140D02*
X130302Y-84500D01*
X130302Y-84500D02*
X130302Y-78820D01*
X130302Y-78820D02*
X131402Y-77720D01*
X37464Y-84395D02*
X37560Y-84300D01*
X33730Y-84395D02*
X37464Y-84395D01*
X37560Y-84300D02*
X64050Y-84300D01*
X131602Y-77520D02*
X131402Y-77720D01*
X37388Y-84198D02*
X37400Y-84210D01*
X37388Y-84198D02*
X33730Y-84198D01*
X131992Y-77500D02*
X131992Y-77530D01*
X63890Y-84690D02*
X66520Y-87320D01*
X66520Y-87320D02*
X127762Y-87320D01*
X127762Y-87320D02*
X130482Y-84600D01*
X130482Y-84600D02*
X130482Y-79040D01*
X130482Y-79040D02*
X131802Y-77720D01*
X37464Y-84785D02*
X33730Y-84785D01*
X37464Y-84785D02*
X37560Y-84690D01*
X37560Y-84690D02*
X63890Y-84690D01*
X131992Y-77530D02*
X131802Y-77720D01*
X37388Y-84588D02*
X33730Y-84588D01*
X37388Y-84588D02*
X37400Y-84600D01*
X37560Y-85090D02*
X63730Y-85090D01*
X33730Y-85185D02*
X37464Y-85185D01*
X37464Y-85185D02*
X37560Y-85090D01*
X132387Y-77515D02*
X132387Y-77500D01*
X130662Y-79240D02*
X132387Y-77515D01*
X130662Y-84700D02*
X130662Y-79240D01*
X127862Y-87500D02*
X130662Y-84700D01*
X66140Y-87500D02*
X127862Y-87500D01*
X63730Y-85090D02*
X66140Y-87500D01*
X37388Y-84988D02*
X37400Y-85000D01*
X37388Y-84988D02*
X33730Y-84988D01*
X132783Y-77499D02*
X132783Y-77519D01*
X37464Y-85575D02*
X37560Y-85480D01*
X37464Y-85575D02*
X33730Y-85575D01*
X63560Y-85480D02*
X37560Y-85480D01*
X65760Y-87680D02*
X63560Y-85480D01*
X127962Y-87680D02*
X65760Y-87680D01*
X130842Y-84800D02*
X127962Y-87680D01*
X130842Y-79460D02*
X130842Y-84800D01*
X132783Y-77519D02*
X130842Y-79460D01*
X37388Y-85378D02*
X33730Y-85378D01*
X37388Y-85378D02*
X37400Y-85390D01*
X37560Y-85880D02*
X63400Y-85880D01*
X37464Y-85975D02*
X37560Y-85880D01*
X33730Y-85975D02*
X37464Y-85975D01*
X133177Y-77525D02*
X133177Y-77500D01*
X131022Y-79680D02*
X133177Y-77525D01*
X131022Y-84900D02*
X131022Y-79680D01*
X128062Y-87860D02*
X131022Y-84900D01*
X65380Y-87860D02*
X128062Y-87860D01*
X63400Y-85880D02*
X65380Y-87860D01*
X37388Y-85778D02*
X33730Y-85778D01*
X37388Y-85778D02*
X37400Y-85790D01*
X133572Y-77500D02*
X133572Y-77510D01*
X33730Y-86365D02*
X37464Y-86365D01*
X37464Y-86365D02*
X37560Y-86270D01*
X63240Y-86270D02*
X37560Y-86270D01*
X65010Y-88040D02*
X63240Y-86270D01*
X128162Y-88040D02*
X65010Y-88040D01*
X131202Y-85000D02*
X128162Y-88040D01*
X131202Y-79880D02*
X131202Y-85000D01*
X133572Y-77510D02*
X131202Y-79880D01*
X37388Y-86168D02*
X37400Y-86180D01*
X37388Y-86168D02*
X33730Y-86168D01*
X134752Y-77500D02*
X134752Y-77510D01*
X33730Y-87945D02*
X37464Y-87945D01*
X37464Y-87945D02*
X37560Y-87850D01*
X63840Y-87850D02*
X37560Y-87850D01*
X64710Y-88720D02*
X63840Y-87850D01*
X128482Y-88720D02*
X64710Y-88720D01*
X131882Y-85320D02*
X128482Y-88720D01*
X131882Y-80380D02*
X131882Y-85320D01*
X134752Y-77510D02*
X131882Y-80380D01*
X37388Y-87748D02*
X37400Y-87760D01*
X37388Y-87748D02*
X33730Y-87748D01*
X37560Y-88240D02*
X63670Y-88240D01*
X37464Y-88335D02*
X37560Y-88240D01*
X33730Y-88335D02*
X37464Y-88335D01*
X135147Y-77515D02*
X135147Y-77500D01*
X132062Y-80600D02*
X135147Y-77515D01*
X132062Y-85420D02*
X132062Y-80600D01*
X128582Y-88900D02*
X132062Y-85420D01*
X64330Y-88900D02*
X128582Y-88900D01*
X63670Y-88240D02*
X64330Y-88900D01*
X37388Y-88138D02*
X37400Y-88150D01*
X37388Y-88138D02*
X33730Y-88138D01*
G54D16*
X137250Y-75830D02*
X138512Y-75830D01*
X138512Y-75830D02*
X138882Y-76200D01*
X129772Y-91100D02*
X134302Y-86570D01*
X65600Y-91100D02*
X129772Y-91100D01*
X64320Y-92380D02*
X65600Y-91100D01*
X33730Y-92463D02*
X37556Y-92463D01*
X37640Y-92380D02*
X64320Y-92380D01*
X37556Y-92463D02*
X37640Y-92380D01*
X138882Y-77860D02*
X138882Y-76200D01*
X134302Y-82440D02*
X138882Y-77860D01*
X134302Y-86570D02*
X134302Y-82440D01*
X138882Y-76200D02*
X138882Y-77160D01*
X33730Y-92857D02*
X37397Y-92857D01*
X37397Y-92857D02*
X37400Y-92860D01*
X37393Y-92853D02*
X37400Y-92860D01*
X33730Y-92660D02*
X37515Y-92660D01*
X136022Y-74680D02*
X136142Y-74800D01*
X136142Y-74800D02*
X138542Y-74800D01*
X138542Y-74800D02*
X139202Y-75460D01*
X139202Y-75460D02*
X139202Y-77720D01*
X135742Y-74680D02*
X136022Y-74680D01*
X139202Y-77930D02*
X139202Y-77720D01*
X134562Y-82570D02*
X139202Y-77930D01*
X134562Y-86600D02*
X134562Y-82570D01*
X129862Y-91300D02*
X134562Y-86600D01*
X66260Y-91300D02*
X129862Y-91300D01*
X64780Y-92780D02*
X66260Y-91300D01*
X37635Y-92780D02*
X64780Y-92780D01*
X37515Y-92660D02*
X37635Y-92780D01*
G54D19*
X38305Y-91370D02*
X63735Y-91370D01*
X37989Y-91685D02*
X38305Y-91370D01*
X37989Y-91685D02*
X33730Y-91685D01*
X136522Y-76155D02*
X136522Y-75800D01*
X136687Y-76320D02*
X136522Y-76155D01*
X137542Y-76320D02*
X136687Y-76320D01*
X137702Y-76480D02*
X137542Y-76320D01*
X137702Y-77970D02*
X137702Y-76480D01*
X133597Y-82075D02*
X137702Y-77970D01*
X133597Y-86215D02*
X133597Y-82075D01*
X129367Y-90445D02*
X133597Y-86215D01*
X64660Y-90445D02*
X129367Y-90445D01*
X63735Y-91370D02*
X64660Y-90445D01*
X136917Y-75800D02*
X136917Y-76065D01*
X33730Y-92075D02*
X37464Y-92075D01*
X37464Y-92075D02*
X37505Y-92035D01*
X64040Y-92035D02*
X37505Y-92035D01*
X65250Y-90825D02*
X64040Y-92035D01*
X129657Y-90825D02*
X65250Y-90825D01*
X134027Y-86455D02*
X129657Y-90825D01*
X134027Y-82325D02*
X134027Y-86455D01*
X137902Y-78450D02*
X134027Y-82325D01*
X137902Y-76440D02*
X137902Y-78450D01*
X137602Y-76140D02*
X137902Y-76440D01*
X136992Y-76140D02*
X137602Y-76140D01*
X136917Y-76065D02*
X136992Y-76140D01*
X37388Y-91488D02*
X33730Y-91488D01*
X37388Y-91488D02*
X37400Y-91500D01*
X37388Y-91878D02*
X37400Y-91890D01*
X37388Y-91878D02*
X33730Y-91878D01*
G54D16*
X38442Y-83157D02*
X37927Y-83157D01*
X37927Y-83157D02*
X37890Y-83120D01*
X38550Y-83050D02*
X38425Y-83050D01*
X38035Y-83060D02*
X37995Y-83060D01*
X38095Y-83000D02*
X38035Y-83060D01*
X38375Y-83000D02*
X38095Y-83000D01*
X38425Y-83050D02*
X38375Y-83000D01*
X38320Y-83000D02*
X38320Y-83050D01*
X37835Y-83210D02*
X38390Y-83210D01*
X38390Y-83210D02*
X38442Y-83157D01*
X38442Y-83157D02*
X38550Y-83050D01*
G54D20*
X38550Y-83050D02*
X38320Y-83050D01*
X38320Y-83050D02*
X38190Y-83050D01*
X38190Y-83050D02*
X38147Y-83092D01*
G54D16*
X37730Y-83210D02*
X37835Y-83210D01*
X36382Y-83211D02*
X37728Y-83211D01*
X37728Y-83211D02*
X37730Y-83210D01*
X38147Y-83092D02*
X38027Y-83092D01*
X38027Y-83092D02*
X37995Y-83060D01*
X37995Y-83060D02*
X36535Y-83060D01*
X36535Y-83060D02*
X36517Y-83077D01*
G54D20*
X38137Y-83102D02*
X38147Y-83092D01*
X36492Y-83102D02*
X36455Y-83140D01*
G54D16*
X36382Y-82942D02*
X36382Y-83211D01*
X33730Y-83014D02*
X36454Y-83014D01*
X36454Y-83014D02*
X36480Y-83040D01*
X37115Y-86745D02*
X37115Y-86951D01*
X37115Y-86557D02*
X37115Y-86745D01*
X37115Y-86745D02*
X37115Y-86754D01*
X37110Y-87340D02*
X37110Y-87542D01*
X37110Y-87148D02*
X37110Y-87340D01*
X37110Y-87340D02*
X37110Y-87345D01*
X37130Y-90888D02*
X37130Y-91085D01*
X37050Y-86557D02*
X37115Y-86557D01*
X37115Y-86557D02*
X38202Y-86557D01*
X38202Y-86557D02*
X38205Y-86555D01*
X36885Y-86754D02*
X37115Y-86754D01*
X37115Y-86754D02*
X37889Y-86754D01*
X37889Y-86754D02*
X37900Y-86765D01*
X36970Y-87542D02*
X37110Y-87542D01*
X37110Y-87542D02*
X37957Y-87542D01*
X37957Y-87542D02*
X37965Y-87535D01*
X36835Y-87345D02*
X37110Y-87345D01*
X37110Y-87345D02*
X37734Y-87345D01*
X37734Y-87345D02*
X37735Y-87345D01*
X36805Y-90888D02*
X37130Y-90888D01*
X37130Y-90888D02*
X37688Y-90888D01*
X37688Y-90888D02*
X37690Y-90890D01*
X37055Y-91282D02*
X37617Y-91282D01*
X37617Y-91282D02*
X37795Y-91460D01*
X33730Y-92266D02*
X36905Y-92266D01*
X36905Y-92266D02*
X37398Y-92266D01*
X37398Y-92266D02*
X37400Y-92265D01*
X37548Y-86951D02*
X37610Y-86890D01*
X37115Y-86951D02*
X37548Y-86951D01*
X36480Y-83040D02*
X36487Y-83047D01*
X36487Y-83047D02*
X36560Y-83120D01*
X36560Y-83120D02*
X37900Y-83120D01*
X37900Y-83120D02*
X37890Y-83120D01*
X37890Y-83120D02*
X38550Y-83050D01*
X37400Y-82860D02*
X36580Y-82860D01*
X36340Y-82620D02*
X33730Y-82620D01*
X36580Y-82860D02*
X36340Y-82620D01*
X36240Y-82817D02*
X36257Y-82817D01*
X36257Y-82817D02*
X36382Y-82942D01*
X36382Y-82942D02*
X36480Y-83040D01*
X36110Y-83211D02*
X36382Y-83211D01*
X33730Y-91282D02*
X37055Y-91282D01*
X37055Y-91282D02*
X37177Y-91282D01*
X33730Y-91085D02*
X37130Y-91085D01*
X37130Y-91085D02*
X37374Y-91085D01*
X37374Y-91085D02*
X37400Y-91060D01*
X33730Y-90888D02*
X36805Y-90888D01*
X36805Y-90888D02*
X37228Y-90888D01*
X33730Y-87542D02*
X36970Y-87542D01*
X36970Y-87542D02*
X37167Y-87542D01*
X33730Y-87345D02*
X36835Y-87345D01*
X36835Y-87345D02*
X37364Y-87345D01*
X33730Y-87148D02*
X37110Y-87148D01*
X37110Y-87148D02*
X37398Y-87148D01*
X37398Y-87148D02*
X37480Y-87230D01*
X33730Y-86951D02*
X37115Y-86951D01*
X33730Y-86754D02*
X36885Y-86754D01*
X36885Y-86754D02*
X37474Y-86754D01*
X33730Y-86557D02*
X37050Y-86557D01*
X37050Y-86557D02*
X37277Y-86557D01*
X33730Y-83211D02*
X36110Y-83211D01*
X36110Y-83211D02*
X36438Y-83211D01*
X33730Y-82817D02*
X36240Y-82817D01*
X33730Y-82227D02*
X36727Y-82227D01*
X36830Y-82030D02*
X37250Y-82450D01*
X37250Y-82450D02*
X37400Y-82450D01*
X36830Y-82030D02*
X33730Y-82030D01*
X36950Y-82450D02*
X37400Y-82450D01*
X36727Y-82227D02*
X36950Y-82450D01*
X36650Y-81439D02*
X37139Y-81439D01*
X36650Y-81439D02*
X37089Y-81439D01*
X33730Y-81439D02*
X36650Y-81439D01*
X37139Y-81439D02*
X37400Y-81700D01*
X36400Y-81242D02*
X37192Y-81242D01*
X37142Y-81242D02*
X36550Y-81242D01*
X37192Y-81242D02*
X37400Y-81450D01*
X33730Y-81242D02*
X36400Y-81242D01*
X36550Y-81242D02*
X37092Y-81242D01*
M02*
