%FSLAX34Y34*%
G04 Gerber Fmt 3.4, Leading zero omitted, Abs format*
G04 (created by PCBNEW (2013-10-07 BZR 4378)-stable) date Fri 19 Dec 2014 03:56:25 PM EST*
%MOIN*%
G01*
G70*
G90*
G04 APERTURE LIST*
%ADD10C,0.005906*%
%ADD11C,0.003937*%
%ADD12C,0.016000*%
%ADD13C,0.050000*%
%ADD14C,0.020000*%
%ADD15C,0.030000*%
%ADD16C,0.010000*%
%ADD17C,0.075000*%
%ADD18C,0.050000*%
%ADD19C,0.003000*%
G04 APERTURE END LIST*
G54D10*
G54D11*
X187590Y-91750D02*
X67550Y-91750D01*
X192640Y-82860D02*
X192640Y-83000D01*
X193600Y-81900D02*
X192640Y-82860D01*
X192640Y-86700D02*
X192640Y-83000D01*
X187590Y-91750D02*
X192640Y-86700D01*
X33030Y-93450D02*
X33480Y-93450D01*
X33480Y-93450D02*
X33570Y-93540D01*
X33570Y-93540D02*
X33570Y-93640D01*
X33570Y-93640D02*
X33690Y-93760D01*
X33690Y-93760D02*
X34140Y-93760D01*
X34140Y-93760D02*
X34140Y-93450D01*
X33030Y-93450D02*
X33030Y-80650D01*
X33030Y-80650D02*
X33400Y-80650D01*
X33390Y-80650D02*
X33420Y-80650D01*
X33420Y-80650D02*
X33450Y-80650D01*
X33450Y-80650D02*
X33570Y-80530D01*
X33570Y-80530D02*
X33570Y-80440D01*
X33570Y-80440D02*
X33680Y-80330D01*
X33680Y-80330D02*
X34130Y-80330D01*
X34130Y-80330D02*
X34130Y-80640D01*
X197600Y-77900D02*
X193600Y-81900D01*
X65850Y-93450D02*
X67550Y-91750D01*
X33050Y-93450D02*
X65850Y-93450D01*
X33050Y-80650D02*
X33050Y-93450D01*
X64350Y-80650D02*
X33050Y-80650D01*
X68600Y-84900D02*
X64350Y-80650D01*
X184100Y-84900D02*
X68600Y-84900D01*
X185600Y-83400D02*
X184100Y-84900D01*
X185600Y-74300D02*
X185600Y-83400D01*
X197600Y-74300D02*
X197600Y-77900D01*
X197600Y-74300D02*
X185600Y-74300D01*
G54D12*
X37730Y-82655D03*
X38065Y-82650D03*
G54D13*
X190600Y-76000D03*
G54D12*
X37400Y-82200D03*
X37400Y-81950D03*
G54D13*
X189530Y-74740D03*
X188350Y-74740D03*
G54D12*
X192880Y-74620D03*
X193080Y-74900D03*
X37400Y-93250D03*
X188340Y-77500D03*
X188160Y-77340D03*
X37400Y-83420D03*
X193075Y-77500D03*
X37400Y-88530D03*
X192880Y-77340D03*
X193470Y-77500D03*
X37400Y-88940D03*
X193280Y-77340D03*
X193865Y-77500D03*
X193660Y-77340D03*
X37400Y-89340D03*
X194255Y-77500D03*
X37400Y-89730D03*
X194060Y-77340D03*
X194650Y-77500D03*
X194460Y-77340D03*
X37400Y-90130D03*
X195040Y-77500D03*
X194840Y-77340D03*
X37400Y-90520D03*
X188745Y-77500D03*
X188540Y-77340D03*
X37400Y-83810D03*
X189140Y-77500D03*
X188940Y-77340D03*
X37400Y-84210D03*
X189530Y-77500D03*
X189340Y-77340D03*
X37400Y-84600D03*
X189925Y-77500D03*
X189720Y-77340D03*
X37400Y-85000D03*
X190320Y-77499D03*
X190120Y-77340D03*
X37400Y-85390D03*
X190715Y-77500D03*
X190520Y-77340D03*
X37400Y-85790D03*
X191110Y-77500D03*
X190900Y-77340D03*
X37400Y-86180D03*
X192290Y-77500D03*
X192080Y-77340D03*
X37400Y-87760D03*
X192685Y-77500D03*
X37400Y-88150D03*
X192480Y-77340D03*
G54D14*
X194740Y-75840D03*
G54D12*
X193480Y-74880D03*
X37400Y-92860D03*
X193280Y-74680D03*
X194060Y-75800D03*
X194455Y-75800D03*
X193860Y-75960D03*
X37400Y-91500D03*
X194260Y-75960D03*
X37400Y-91890D03*
X37730Y-83210D03*
X38148Y-83093D03*
X106955Y-90635D03*
X110955Y-90635D03*
X108955Y-90635D03*
X104955Y-90635D03*
X72955Y-90635D03*
X76955Y-90635D03*
X80955Y-90635D03*
X84955Y-90635D03*
X88955Y-90635D03*
X92955Y-90635D03*
X96955Y-90635D03*
X100955Y-90635D03*
X102955Y-90635D03*
X98955Y-90635D03*
X94955Y-90635D03*
X90955Y-90635D03*
X86955Y-90635D03*
X82955Y-90635D03*
X78955Y-90635D03*
X74955Y-90635D03*
X124955Y-90635D03*
X128955Y-90635D03*
X132955Y-90635D03*
X136955Y-90635D03*
X140955Y-90635D03*
X144955Y-90635D03*
X148955Y-90635D03*
X152955Y-90635D03*
X150955Y-90635D03*
X146955Y-90635D03*
X142955Y-90635D03*
X138955Y-90635D03*
X134955Y-90635D03*
X130955Y-90635D03*
X126955Y-90635D03*
X155050Y-90625D03*
X70955Y-90635D03*
X68955Y-90635D03*
X66955Y-90635D03*
X37770Y-91460D03*
X37360Y-92250D03*
G54D13*
X197090Y-74810D03*
G54D12*
X37700Y-90900D03*
X38000Y-87540D03*
X37740Y-87350D03*
X38140Y-86560D03*
X37860Y-86750D03*
X64885Y-90705D03*
X55880Y-91705D03*
X59880Y-91705D03*
X61880Y-91705D03*
X57880Y-91705D03*
X53880Y-91700D03*
X63860Y-91715D03*
X159050Y-90625D03*
X163050Y-90625D03*
X167050Y-90625D03*
X171050Y-90625D03*
X175050Y-90625D03*
X179050Y-90625D03*
X183050Y-90625D03*
X185050Y-90625D03*
X181050Y-90625D03*
X177050Y-90625D03*
X173050Y-90625D03*
X169050Y-90625D03*
X165050Y-90625D03*
X161050Y-90625D03*
X157050Y-90625D03*
X188500Y-89180D03*
X187050Y-90625D03*
X193770Y-79785D03*
X192775Y-80780D03*
X191370Y-82210D03*
X191340Y-84210D03*
X195185Y-78370D03*
X191330Y-86350D03*
X189915Y-87765D03*
X37400Y-82860D03*
X37400Y-82450D03*
X64300Y-83050D03*
X38570Y-83050D03*
X54300Y-83050D03*
X58300Y-83050D03*
X62300Y-83050D03*
X60300Y-83050D03*
X56300Y-83050D03*
X66080Y-84830D03*
X67850Y-86595D03*
X152900Y-86595D03*
X54060Y-92580D03*
X56060Y-92990D03*
X58060Y-92580D03*
X60060Y-92990D03*
X62060Y-92580D03*
X65210Y-91900D03*
X65680Y-92320D03*
X37800Y-92990D03*
X37790Y-92580D03*
X66800Y-90165D03*
X68800Y-90165D03*
X70800Y-90165D03*
X154800Y-90165D03*
X53480Y-91060D03*
X57480Y-91060D03*
X61480Y-91060D03*
X59480Y-91060D03*
X55480Y-91060D03*
X63485Y-91055D03*
X64400Y-90165D03*
X37400Y-91060D03*
X63480Y-87230D03*
X55480Y-87230D03*
X59480Y-87230D03*
X61480Y-87230D03*
X57480Y-87230D03*
X53480Y-87230D03*
X37480Y-87230D03*
X63480Y-86885D03*
X37610Y-86890D03*
X53610Y-86890D03*
X57610Y-86890D03*
X61610Y-86890D03*
X59610Y-86890D03*
X55610Y-86890D03*
X64930Y-88225D03*
X67780Y-88225D03*
X69780Y-88225D03*
X153780Y-88225D03*
X67940Y-88530D03*
X69940Y-88530D03*
X153940Y-88530D03*
X64800Y-88530D03*
X188225Y-88750D03*
X189445Y-87530D03*
X187580Y-86885D03*
X187360Y-86655D03*
X155940Y-88530D03*
X159940Y-88530D03*
X163940Y-88530D03*
X167940Y-88530D03*
X171940Y-88530D03*
X175940Y-88530D03*
X179940Y-88530D03*
X183940Y-88530D03*
X181940Y-88530D03*
X177940Y-88530D03*
X173940Y-88530D03*
X169940Y-88530D03*
X165940Y-88530D03*
X161940Y-88530D03*
X157940Y-88530D03*
X125940Y-88530D03*
X129940Y-88530D03*
X133940Y-88530D03*
X137940Y-88530D03*
X141940Y-88530D03*
X145940Y-88530D03*
X149940Y-88530D03*
X151940Y-88530D03*
X147940Y-88530D03*
X143940Y-88530D03*
X139940Y-88530D03*
X135940Y-88530D03*
X131940Y-88530D03*
X127940Y-88530D03*
X73940Y-88530D03*
X77940Y-88530D03*
X81940Y-88530D03*
X85940Y-88530D03*
X89940Y-88530D03*
X93940Y-88530D03*
X97940Y-88530D03*
X101940Y-88530D03*
X99940Y-88530D03*
X95940Y-88530D03*
X91940Y-88530D03*
X87940Y-88530D03*
X83940Y-88530D03*
X79940Y-88530D03*
X75940Y-88530D03*
X71940Y-88530D03*
X103940Y-88530D03*
X107940Y-88530D03*
X109940Y-88530D03*
X105940Y-88530D03*
X155780Y-88225D03*
X159780Y-88225D03*
X163780Y-88225D03*
X167780Y-88225D03*
X171780Y-88225D03*
X175780Y-88225D03*
X179780Y-88225D03*
X183780Y-88225D03*
X181780Y-88225D03*
X177780Y-88225D03*
X173780Y-88225D03*
X169780Y-88225D03*
X165780Y-88225D03*
X161780Y-88225D03*
X157780Y-88225D03*
X125780Y-88225D03*
X129780Y-88225D03*
X133780Y-88225D03*
X137780Y-88225D03*
X141780Y-88225D03*
X145780Y-88225D03*
X149780Y-88225D03*
X151780Y-88225D03*
X147780Y-88225D03*
X143780Y-88225D03*
X139780Y-88225D03*
X135780Y-88225D03*
X131780Y-88225D03*
X127780Y-88225D03*
X73780Y-88225D03*
X77780Y-88225D03*
X81780Y-88225D03*
X85780Y-88225D03*
X89780Y-88225D03*
X93780Y-88225D03*
X97780Y-88225D03*
X101780Y-88225D03*
X99780Y-88225D03*
X95780Y-88225D03*
X91780Y-88225D03*
X87780Y-88225D03*
X83780Y-88225D03*
X79780Y-88225D03*
X75780Y-88225D03*
X71780Y-88225D03*
X103780Y-88225D03*
X107780Y-88225D03*
X109780Y-88225D03*
X105780Y-88225D03*
X188920Y-85090D03*
X191070Y-78000D03*
X188925Y-80160D03*
X188930Y-82660D03*
X185780Y-88225D03*
X185940Y-88530D03*
X189230Y-82740D03*
X191530Y-78000D03*
X189250Y-80280D03*
X189230Y-85225D03*
X190870Y-84100D03*
X190855Y-86115D03*
X156800Y-90165D03*
X160800Y-90165D03*
X164800Y-90165D03*
X168800Y-90165D03*
X172800Y-90165D03*
X176800Y-90165D03*
X180800Y-90165D03*
X184800Y-90165D03*
X182800Y-90165D03*
X178800Y-90165D03*
X174800Y-90165D03*
X170800Y-90165D03*
X166800Y-90165D03*
X162800Y-90165D03*
X158800Y-90165D03*
X126800Y-90165D03*
X130800Y-90165D03*
X134800Y-90165D03*
X138800Y-90165D03*
X142800Y-90165D03*
X146800Y-90165D03*
X150800Y-90165D03*
X152800Y-90165D03*
X148800Y-90165D03*
X144800Y-90165D03*
X140800Y-90165D03*
X136800Y-90165D03*
X132800Y-90165D03*
X128800Y-90165D03*
X124800Y-90165D03*
X74800Y-90165D03*
X78800Y-90165D03*
X82800Y-90165D03*
X86800Y-90165D03*
X90800Y-90165D03*
X94800Y-90165D03*
X98800Y-90165D03*
X102800Y-90165D03*
X100800Y-90165D03*
X96800Y-90165D03*
X92800Y-90165D03*
X88800Y-90165D03*
X84800Y-90165D03*
X80800Y-90165D03*
X76800Y-90165D03*
X72800Y-90165D03*
X104800Y-90165D03*
X108800Y-90165D03*
X110800Y-90165D03*
X106800Y-90165D03*
X186805Y-90170D03*
X104900Y-86595D03*
X108900Y-86595D03*
X110900Y-86595D03*
X106900Y-86595D03*
X102900Y-86595D03*
X70900Y-86595D03*
X74900Y-86595D03*
X78900Y-86595D03*
X82900Y-86595D03*
X86900Y-86595D03*
X90900Y-86595D03*
X94900Y-86595D03*
X98900Y-86595D03*
X100900Y-86595D03*
X96900Y-86595D03*
X92900Y-86595D03*
X88900Y-86595D03*
X84900Y-86595D03*
X80900Y-86595D03*
X76900Y-86595D03*
X72900Y-86595D03*
X126900Y-86595D03*
X130900Y-86595D03*
X134900Y-86595D03*
X138900Y-86595D03*
X142900Y-86595D03*
X146900Y-86595D03*
X150900Y-86595D03*
X148900Y-86595D03*
X144900Y-86595D03*
X140900Y-86595D03*
X136900Y-86595D03*
X132900Y-86595D03*
X128900Y-86595D03*
X124900Y-86595D03*
X156900Y-86595D03*
X160900Y-86595D03*
X164900Y-86595D03*
X168900Y-86595D03*
X172900Y-86595D03*
X176900Y-86595D03*
X180900Y-86595D03*
X182900Y-86595D03*
X178900Y-86595D03*
X174900Y-86595D03*
X170900Y-86595D03*
X166900Y-86595D03*
X162900Y-86595D03*
X158900Y-86595D03*
X154900Y-86595D03*
X190870Y-81990D03*
X192250Y-80585D03*
X193395Y-79435D03*
X184875Y-86565D03*
X37400Y-81700D03*
X37400Y-81450D03*
G54D13*
X186100Y-74800D03*
G54D12*
X194815Y-78015D03*
G54D13*
X192500Y-76100D03*
G54D12*
X186055Y-85375D03*
X187290Y-82000D03*
X187300Y-78000D03*
X187290Y-80000D03*
X187290Y-84000D03*
G54D13*
X191900Y-76100D03*
X191300Y-76100D03*
X190120Y-74740D03*
X188940Y-74740D03*
G54D15*
X190600Y-76000D02*
X188500Y-76000D01*
X37730Y-82655D02*
X64505Y-82655D01*
X68050Y-86200D02*
X64505Y-82655D01*
X184600Y-86200D02*
X68050Y-86200D01*
X186900Y-83900D02*
X184600Y-86200D01*
X186900Y-77600D02*
X186900Y-83900D01*
X188500Y-76000D02*
X186900Y-77600D01*
G54D16*
X37400Y-82200D02*
X37550Y-82200D01*
X37550Y-82200D02*
X37750Y-82000D01*
X37400Y-81950D02*
X37700Y-81950D01*
X38050Y-82000D02*
X37750Y-82000D01*
X37700Y-81950D02*
X37750Y-82000D01*
G54D17*
X68400Y-85500D02*
X68350Y-85500D01*
X184300Y-85500D02*
X185500Y-84300D01*
X186200Y-83600D02*
X185500Y-84300D01*
G54D18*
X189530Y-74740D02*
X189530Y-75170D01*
X186700Y-75400D02*
X186200Y-75900D01*
X189300Y-75400D02*
X186700Y-75400D01*
X189530Y-75170D02*
X189300Y-75400D01*
G54D17*
X186200Y-75900D02*
X186200Y-83600D01*
X69000Y-85500D02*
X184300Y-85500D01*
X69000Y-85500D02*
X68400Y-85500D01*
X64850Y-82000D02*
X38050Y-82000D01*
X38050Y-82000D02*
X37900Y-82000D01*
X68350Y-85500D02*
X64850Y-82000D01*
G54D16*
X66900Y-91510D02*
X187500Y-91510D01*
X37400Y-93250D02*
X37571Y-93250D01*
X197200Y-77860D02*
X192360Y-82700D01*
X197200Y-77740D02*
X197200Y-77860D01*
X197200Y-75480D02*
X197200Y-77740D01*
X193080Y-74900D02*
X193080Y-74520D01*
X193120Y-74480D02*
X196200Y-74480D01*
X193080Y-74520D02*
X193120Y-74480D01*
X196200Y-74480D02*
X197200Y-75480D01*
X192360Y-86650D02*
X187500Y-91510D01*
X192360Y-82700D02*
X192360Y-86650D01*
X65210Y-93200D02*
X66900Y-91510D01*
X37621Y-93200D02*
X65210Y-93200D01*
X37571Y-93250D02*
X37621Y-93200D01*
G54D19*
X64380Y-83510D02*
X37560Y-83510D01*
X67650Y-86780D02*
X64380Y-83510D01*
X187480Y-78420D02*
X187480Y-78400D01*
X188160Y-77720D02*
X188160Y-77340D01*
X187480Y-78400D02*
X188160Y-77720D01*
X184880Y-86780D02*
X68900Y-86780D01*
X187480Y-84300D02*
X185040Y-86740D01*
X187480Y-78420D02*
X187480Y-84300D01*
X68900Y-86780D02*
X67650Y-86780D01*
X185040Y-86740D02*
X184880Y-86780D01*
X37400Y-83420D02*
X37490Y-83510D01*
X37490Y-83510D02*
X37560Y-83510D01*
X37400Y-88530D02*
X37490Y-88640D01*
X68940Y-89080D02*
X63950Y-89080D01*
X37490Y-88640D02*
X37560Y-88640D01*
X192880Y-77720D02*
X189780Y-80820D01*
X189780Y-80820D02*
X189780Y-85520D01*
X189780Y-85520D02*
X186220Y-89080D01*
X186220Y-89080D02*
X68940Y-89080D01*
X192880Y-77340D02*
X192880Y-77720D01*
X63510Y-88640D02*
X37560Y-88640D01*
X63950Y-89080D02*
X63510Y-88640D01*
X37400Y-88550D02*
X37490Y-88640D01*
X37400Y-88940D02*
X37490Y-89030D01*
X68960Y-89260D02*
X63570Y-89260D01*
X37490Y-89030D02*
X37560Y-89030D01*
X193280Y-77720D02*
X189960Y-81040D01*
X189960Y-81040D02*
X189960Y-85620D01*
X189960Y-85620D02*
X186320Y-89260D01*
X186320Y-89260D02*
X68960Y-89260D01*
X193280Y-77340D02*
X193280Y-77720D01*
X63340Y-89030D02*
X37560Y-89030D01*
X63570Y-89260D02*
X63340Y-89030D01*
X37400Y-89340D02*
X37490Y-89430D01*
X37560Y-89430D02*
X63180Y-89430D01*
X37490Y-89430D02*
X37560Y-89430D01*
X193660Y-77720D02*
X190140Y-81240D01*
X190140Y-81240D02*
X190140Y-85720D01*
X190140Y-85720D02*
X186420Y-89440D01*
X186420Y-89440D02*
X68940Y-89440D01*
X193660Y-77340D02*
X193660Y-77720D01*
X63190Y-89440D02*
X68940Y-89440D01*
X63180Y-89430D02*
X63190Y-89440D01*
X37400Y-89340D02*
X37490Y-89430D01*
X37400Y-89730D02*
X37490Y-89820D01*
X68980Y-89620D02*
X63570Y-89620D01*
X37490Y-89820D02*
X37560Y-89820D01*
X194060Y-77720D02*
X190320Y-81460D01*
X190320Y-81460D02*
X190320Y-85820D01*
X190320Y-85820D02*
X186520Y-89620D01*
X186520Y-89620D02*
X68980Y-89620D01*
X194060Y-77340D02*
X194060Y-77720D01*
X63370Y-89820D02*
X37560Y-89820D01*
X63570Y-89620D02*
X63370Y-89820D01*
X194460Y-77720D02*
X190500Y-81680D01*
X37400Y-90130D02*
X37490Y-90220D01*
X69040Y-89800D02*
X63950Y-89800D01*
X190500Y-81680D02*
X190500Y-85920D01*
X190500Y-85920D02*
X186620Y-89800D01*
X186620Y-89800D02*
X69040Y-89800D01*
X194460Y-77340D02*
X194460Y-77720D01*
X63950Y-89800D02*
X63530Y-90220D01*
X37490Y-90220D02*
X37560Y-90220D01*
X63530Y-90220D02*
X37560Y-90220D01*
X194840Y-77720D02*
X190680Y-81880D01*
X194840Y-77340D02*
X194840Y-77720D01*
X37400Y-90520D02*
X37490Y-90610D01*
X68980Y-89980D02*
X64330Y-89980D01*
X190680Y-81880D02*
X190680Y-86020D01*
X190680Y-86020D02*
X186720Y-89980D01*
X186720Y-89980D02*
X68980Y-89980D01*
X64330Y-89980D02*
X63700Y-90610D01*
X37490Y-90610D02*
X37560Y-90610D01*
X63700Y-90610D02*
X37560Y-90610D01*
X37400Y-90520D02*
X37490Y-90610D01*
X64210Y-83900D02*
X37560Y-83900D01*
X37490Y-83900D02*
X37400Y-83810D01*
X68900Y-86960D02*
X67270Y-86960D01*
X188540Y-77720D02*
X187660Y-78600D01*
X187660Y-78600D02*
X187660Y-84400D01*
X187660Y-84400D02*
X185100Y-86960D01*
X185100Y-86960D02*
X68900Y-86960D01*
X188540Y-77340D02*
X188540Y-77720D01*
X37490Y-83900D02*
X37560Y-83900D01*
X67270Y-86960D02*
X64210Y-83900D01*
X37490Y-84300D02*
X37400Y-84210D01*
X68900Y-87140D02*
X66890Y-87140D01*
X188940Y-77720D02*
X187840Y-78820D01*
X187840Y-78820D02*
X187840Y-84500D01*
X187840Y-84500D02*
X185200Y-87140D01*
X185200Y-87140D02*
X68900Y-87140D01*
X188940Y-77340D02*
X188940Y-77720D01*
X37490Y-84300D02*
X37560Y-84300D01*
X64050Y-84300D02*
X37560Y-84300D01*
X66890Y-87140D02*
X64050Y-84300D01*
X37490Y-84690D02*
X37400Y-84600D01*
X68900Y-87320D02*
X66520Y-87320D01*
X189340Y-77720D02*
X188020Y-79040D01*
X188020Y-79040D02*
X188020Y-84600D01*
X188020Y-84600D02*
X185300Y-87320D01*
X185300Y-87320D02*
X68900Y-87320D01*
X189340Y-77340D02*
X189340Y-77720D01*
X37490Y-84690D02*
X37560Y-84690D01*
X63890Y-84690D02*
X37560Y-84690D01*
X66520Y-87320D02*
X63890Y-84690D01*
X37500Y-85090D02*
X37400Y-85000D01*
X68900Y-87500D02*
X66140Y-87500D01*
X189720Y-77720D02*
X188200Y-79240D01*
X188200Y-79240D02*
X188200Y-84700D01*
X188200Y-84700D02*
X185400Y-87500D01*
X185400Y-87500D02*
X68900Y-87500D01*
X189720Y-77340D02*
X189720Y-77720D01*
X37500Y-85090D02*
X37560Y-85090D01*
X63730Y-85090D02*
X37560Y-85090D01*
X66140Y-87500D02*
X63730Y-85090D01*
X190120Y-77720D02*
X188380Y-79460D01*
X37485Y-85475D02*
X37400Y-85390D01*
X68900Y-87680D02*
X65760Y-87680D01*
X188380Y-79460D02*
X188380Y-84800D01*
X188380Y-84800D02*
X185500Y-87680D01*
X185500Y-87680D02*
X68900Y-87680D01*
X190120Y-77340D02*
X190120Y-77720D01*
X37485Y-85475D02*
X37490Y-85480D01*
X37490Y-85480D02*
X37560Y-85480D01*
X63560Y-85480D02*
X37560Y-85480D01*
X65760Y-87680D02*
X63560Y-85480D01*
X190520Y-77720D02*
X188560Y-79680D01*
X37490Y-85880D02*
X37400Y-85790D01*
X68900Y-87860D02*
X65380Y-87860D01*
X188560Y-79680D02*
X188560Y-84900D01*
X188560Y-84900D02*
X185600Y-87860D01*
X185600Y-87860D02*
X68900Y-87860D01*
X190520Y-77340D02*
X190520Y-77720D01*
X37490Y-85880D02*
X37560Y-85880D01*
X63400Y-85880D02*
X37560Y-85880D01*
X65380Y-87860D02*
X63400Y-85880D01*
X190900Y-77720D02*
X188740Y-79880D01*
X37400Y-86180D02*
X37490Y-86270D01*
X68900Y-88040D02*
X65010Y-88040D01*
X188740Y-79880D02*
X188740Y-85000D01*
X188740Y-85000D02*
X185700Y-88040D01*
X185700Y-88040D02*
X68900Y-88040D01*
X190900Y-77340D02*
X190900Y-77720D01*
X37490Y-86270D02*
X37560Y-86270D01*
X63240Y-86270D02*
X37560Y-86270D01*
X65010Y-88040D02*
X63240Y-86270D01*
X37400Y-86180D02*
X37490Y-86270D01*
X37400Y-87760D02*
X37490Y-87850D01*
X68960Y-88720D02*
X64710Y-88720D01*
X192080Y-77720D02*
X189420Y-80380D01*
X189420Y-80380D02*
X189420Y-85320D01*
X189420Y-85320D02*
X186020Y-88720D01*
X186020Y-88720D02*
X68960Y-88720D01*
X192080Y-77340D02*
X192080Y-77720D01*
X37490Y-87850D02*
X37560Y-87850D01*
X63840Y-87850D02*
X37560Y-87850D01*
X64710Y-88720D02*
X63840Y-87850D01*
X37400Y-87760D02*
X37490Y-87850D01*
X37400Y-88150D02*
X37490Y-88240D01*
X69010Y-88900D02*
X64330Y-88900D01*
X64330Y-88900D02*
X63670Y-88240D01*
X63670Y-88240D02*
X37560Y-88240D01*
X37490Y-88240D02*
X37560Y-88240D01*
X192480Y-77340D02*
X192480Y-77720D01*
X186120Y-88900D02*
X69010Y-88900D01*
X69010Y-88900D02*
X69000Y-88900D01*
X189600Y-85420D02*
X186120Y-88900D01*
X189600Y-80600D02*
X189600Y-85420D01*
X192480Y-77720D02*
X189600Y-80600D01*
G54D16*
X37400Y-92860D02*
X37561Y-92860D01*
X37561Y-92860D02*
X37641Y-92780D01*
X66260Y-91300D02*
X187400Y-91300D01*
X66260Y-91300D02*
X64780Y-92780D01*
X64780Y-92780D02*
X37641Y-92780D01*
X196740Y-77720D02*
X196740Y-77930D01*
X193480Y-74880D02*
X193560Y-74800D01*
X196740Y-75460D02*
X196740Y-77080D01*
X196080Y-74800D02*
X196740Y-75460D01*
X193560Y-74800D02*
X196080Y-74800D01*
X196740Y-77720D02*
X196740Y-77080D01*
X192100Y-86600D02*
X187400Y-91300D01*
X192100Y-82570D02*
X192100Y-86600D01*
X196740Y-77930D02*
X192100Y-82570D01*
G54D19*
X37400Y-91500D02*
X37490Y-91590D01*
X38325Y-91450D02*
X38090Y-91685D01*
X37585Y-91685D02*
X37490Y-91590D01*
X38090Y-91685D02*
X37585Y-91685D01*
X38325Y-91450D02*
X38405Y-91370D01*
X38405Y-91370D02*
X63735Y-91370D01*
X64660Y-90445D02*
X186905Y-90445D01*
X194020Y-76320D02*
X195080Y-76320D01*
X195240Y-77970D02*
X195240Y-76480D01*
X191135Y-86215D02*
X186905Y-90445D01*
X191135Y-82075D02*
X191135Y-86215D01*
X195240Y-77970D02*
X191135Y-82075D01*
X193860Y-76160D02*
X194020Y-76320D01*
X193860Y-75960D02*
X193860Y-76160D01*
X195080Y-76320D02*
X195240Y-76480D01*
X64660Y-90445D02*
X63735Y-91370D01*
X37490Y-91590D02*
X37400Y-91500D01*
X37400Y-91890D02*
X37490Y-91980D01*
X37545Y-92035D02*
X64040Y-92035D01*
X65250Y-90825D02*
X187195Y-90825D01*
X195440Y-78450D02*
X191565Y-82325D01*
X195440Y-77860D02*
X195440Y-78450D01*
X194440Y-76140D02*
X195140Y-76140D01*
X195140Y-76140D02*
X195440Y-76440D01*
X195440Y-76440D02*
X195440Y-77860D01*
X194260Y-75960D02*
X194440Y-76140D01*
X191565Y-86455D02*
X187195Y-90825D01*
X191565Y-82325D02*
X191565Y-86455D01*
X37490Y-91980D02*
X37545Y-92035D01*
X65250Y-90825D02*
X64040Y-92035D01*
M02*
