%FSLAX34Y34*%
G04 Gerber Fmt 3.4, Leading zero omitted, Abs format*
G04 (created by PCBNEW (2013-10-07 BZR 4378)-stable) date Fri 19 Dec 2014 03:58:14 PM EST*
%MOIN*%
G01*
G70*
G90*
G04 APERTURE LIST*
%ADD10C,0.005906*%
%ADD11C,0.003937*%
%ADD12R,0.139764X0.013779*%
%ADD13C,0.016000*%
%ADD14C,0.050000*%
%ADD15C,0.020000*%
%ADD16C,0.030000*%
%ADD17C,0.010000*%
%ADD18C,0.075000*%
%ADD19C,0.050000*%
%ADD20C,0.003000*%
%ADD21C,0.020000*%
G04 APERTURE END LIST*
G54D10*
G54D11*
X167259Y-91750D02*
X67550Y-91750D01*
X172309Y-82860D02*
X172309Y-83000D01*
X173269Y-81900D02*
X172309Y-82860D01*
X172309Y-86700D02*
X172309Y-83000D01*
X167259Y-91750D02*
X172309Y-86700D01*
X33030Y-93450D02*
X33480Y-93450D01*
X33480Y-93450D02*
X33570Y-93540D01*
X33570Y-93540D02*
X33570Y-93640D01*
X33570Y-93640D02*
X33690Y-93760D01*
X33690Y-93760D02*
X34140Y-93760D01*
X34140Y-93760D02*
X34140Y-93450D01*
X33030Y-93450D02*
X33030Y-80650D01*
X33030Y-80650D02*
X33400Y-80650D01*
X33390Y-80650D02*
X33420Y-80650D01*
X33420Y-80650D02*
X33450Y-80650D01*
X33450Y-80650D02*
X33570Y-80530D01*
X33570Y-80530D02*
X33570Y-80440D01*
X33570Y-80440D02*
X33680Y-80330D01*
X33680Y-80330D02*
X34130Y-80330D01*
X34130Y-80330D02*
X34130Y-80640D01*
X177269Y-77900D02*
X173269Y-81900D01*
X65850Y-93450D02*
X67550Y-91750D01*
X33050Y-93450D02*
X65850Y-93450D01*
X33050Y-80650D02*
X33050Y-93450D01*
X64350Y-80650D02*
X33050Y-80650D01*
X68600Y-84900D02*
X64350Y-80650D01*
X163769Y-84900D02*
X68600Y-84900D01*
X165269Y-83400D02*
X163769Y-84900D01*
X165269Y-74300D02*
X165269Y-83400D01*
X177269Y-74300D02*
X177269Y-77900D01*
X177269Y-74300D02*
X165269Y-74300D01*
G54D12*
X33730Y-90101D03*
X33730Y-89904D03*
X33730Y-89510D03*
X33730Y-89707D03*
X33730Y-88920D03*
X33730Y-88723D03*
X33730Y-89116D03*
X33730Y-89313D03*
X33730Y-87738D03*
X33730Y-87542D03*
X33730Y-87148D03*
X33730Y-87345D03*
X33730Y-88132D03*
X33730Y-87935D03*
X33730Y-88329D03*
X33730Y-88526D03*
X33730Y-91675D03*
X33730Y-91479D03*
X33730Y-91085D03*
X33730Y-91282D03*
X33730Y-90494D03*
X33730Y-90298D03*
X33730Y-90691D03*
X33730Y-90888D03*
X33730Y-92463D03*
X33730Y-92266D03*
X33730Y-91872D03*
X33730Y-92069D03*
X33730Y-92857D03*
X33730Y-92660D03*
X33730Y-93053D03*
X33730Y-93250D03*
X33730Y-83998D03*
X33730Y-84195D03*
X33730Y-84589D03*
X33730Y-84392D03*
X33730Y-85179D03*
X33730Y-85376D03*
X33730Y-84983D03*
X33730Y-84786D03*
X33730Y-86361D03*
X33730Y-86557D03*
X33730Y-86951D03*
X33730Y-86754D03*
X33730Y-85967D03*
X33730Y-86164D03*
X33730Y-85770D03*
X33730Y-85573D03*
X33730Y-82424D03*
X33730Y-82620D03*
X33730Y-83014D03*
X33730Y-82817D03*
X33730Y-83605D03*
X33730Y-83801D03*
X33730Y-83408D03*
X33730Y-83211D03*
X33730Y-81636D03*
X33730Y-81833D03*
X33730Y-82227D03*
X33730Y-82030D03*
X33730Y-81242D03*
X33730Y-81439D03*
X33730Y-81046D03*
X33730Y-80849D03*
G54D13*
X38065Y-82650D03*
X37730Y-82655D03*
G54D14*
X170269Y-76000D03*
G54D13*
X37400Y-82200D03*
X37400Y-81950D03*
G54D14*
X169199Y-74740D03*
X168019Y-74740D03*
G54D13*
X172549Y-74620D03*
X172749Y-74900D03*
X37400Y-93250D03*
X168009Y-77500D03*
X167829Y-77340D03*
X37400Y-83420D03*
X172744Y-77500D03*
X37400Y-88530D03*
X172549Y-77340D03*
X173139Y-77500D03*
X37400Y-88940D03*
X172949Y-77340D03*
X173534Y-77500D03*
X37400Y-89340D03*
X173329Y-77340D03*
X173924Y-77500D03*
X37400Y-89730D03*
X173729Y-77340D03*
X174319Y-77500D03*
X174129Y-77340D03*
X37400Y-90130D03*
X174709Y-77500D03*
X174509Y-77340D03*
X37400Y-90520D03*
X168414Y-77500D03*
X168209Y-77340D03*
X37400Y-83810D03*
X168809Y-77500D03*
X168609Y-77340D03*
X37400Y-84210D03*
X169199Y-77500D03*
X169009Y-77340D03*
X37400Y-84600D03*
X169594Y-77500D03*
X169389Y-77340D03*
X37400Y-85000D03*
X169989Y-77499D03*
X169789Y-77340D03*
X37400Y-85390D03*
X170384Y-77500D03*
X170189Y-77340D03*
X37400Y-85790D03*
X170779Y-77500D03*
X170569Y-77340D03*
X37400Y-86180D03*
X171959Y-77500D03*
X171749Y-77340D03*
X37400Y-87760D03*
X172354Y-77500D03*
X37400Y-88150D03*
X172149Y-77340D03*
G54D15*
X174409Y-75840D03*
G54D13*
X173149Y-74880D03*
X37400Y-92860D03*
X172949Y-74680D03*
X173729Y-75800D03*
X174124Y-75800D03*
X173529Y-75960D03*
X37400Y-91500D03*
X173929Y-75960D03*
X37400Y-91890D03*
X37730Y-83210D03*
X38455Y-83050D03*
X64300Y-83050D03*
X38070Y-83095D03*
X54300Y-83050D03*
X58300Y-83050D03*
X62300Y-83050D03*
X60300Y-83050D03*
X56300Y-83050D03*
X66080Y-84830D03*
X37675Y-90895D03*
X38050Y-87520D03*
X37760Y-87355D03*
X37480Y-87230D03*
X38165Y-86565D03*
X37900Y-86740D03*
X37610Y-86890D03*
X37380Y-92255D03*
X37830Y-91485D03*
G54D14*
X176759Y-74810D03*
G54D13*
X166719Y-90625D03*
X168169Y-89180D03*
X106955Y-90635D03*
X110955Y-90635D03*
X108955Y-90635D03*
X104955Y-90635D03*
X72955Y-90635D03*
X76955Y-90635D03*
X80955Y-90635D03*
X84955Y-90635D03*
X88955Y-90635D03*
X92955Y-90635D03*
X96955Y-90635D03*
X100955Y-90635D03*
X102955Y-90635D03*
X98955Y-90635D03*
X94955Y-90635D03*
X90955Y-90635D03*
X86955Y-90635D03*
X82955Y-90635D03*
X78955Y-90635D03*
X74955Y-90635D03*
X124624Y-90635D03*
X128624Y-90635D03*
X132624Y-90635D03*
X130624Y-90635D03*
X126624Y-90635D03*
X134719Y-90625D03*
X70955Y-90635D03*
X68955Y-90635D03*
X66955Y-90635D03*
X54060Y-92580D03*
X56060Y-92990D03*
X58060Y-92580D03*
X60060Y-92990D03*
X62060Y-92580D03*
X65210Y-91900D03*
X65680Y-92320D03*
X37800Y-92990D03*
X37790Y-92580D03*
X64885Y-90705D03*
X55880Y-91705D03*
X59880Y-91705D03*
X61880Y-91705D03*
X57880Y-91705D03*
X53880Y-91700D03*
X63860Y-91715D03*
X138719Y-90625D03*
X142719Y-90625D03*
X146719Y-90625D03*
X150719Y-90625D03*
X154719Y-90625D03*
X158719Y-90625D03*
X162719Y-90625D03*
X164719Y-90625D03*
X160719Y-90625D03*
X156719Y-90625D03*
X152719Y-90625D03*
X148719Y-90625D03*
X144719Y-90625D03*
X140719Y-90625D03*
X136719Y-90625D03*
X173439Y-79785D03*
X172444Y-80780D03*
X171039Y-82210D03*
X171009Y-84210D03*
X174854Y-78370D03*
X64930Y-88225D03*
X67780Y-88225D03*
X69780Y-88225D03*
X133449Y-88225D03*
X167029Y-86655D03*
X135449Y-88225D03*
X139449Y-88225D03*
X143449Y-88225D03*
X147449Y-88225D03*
X151449Y-88225D03*
X155449Y-88225D03*
X159449Y-88225D03*
X163449Y-88225D03*
X161449Y-88225D03*
X157449Y-88225D03*
X153449Y-88225D03*
X149449Y-88225D03*
X145449Y-88225D03*
X141449Y-88225D03*
X137449Y-88225D03*
X125449Y-88225D03*
X129449Y-88225D03*
X131449Y-88225D03*
X127449Y-88225D03*
X73780Y-88225D03*
X77780Y-88225D03*
X81780Y-88225D03*
X85780Y-88225D03*
X89780Y-88225D03*
X93780Y-88225D03*
X97780Y-88225D03*
X101780Y-88225D03*
X99780Y-88225D03*
X95780Y-88225D03*
X91780Y-88225D03*
X87780Y-88225D03*
X83780Y-88225D03*
X79780Y-88225D03*
X75780Y-88225D03*
X71780Y-88225D03*
X103780Y-88225D03*
X107780Y-88225D03*
X109780Y-88225D03*
X105780Y-88225D03*
X168589Y-85090D03*
X165449Y-88225D03*
X168599Y-82660D03*
X168594Y-80160D03*
X170739Y-78000D03*
G54D14*
X170969Y-76100D03*
X169789Y-74740D03*
X168609Y-74740D03*
G54D13*
X37400Y-82860D03*
X37400Y-82450D03*
X67850Y-86595D03*
X132569Y-86595D03*
X66800Y-90165D03*
X68800Y-90165D03*
X70800Y-90165D03*
X134469Y-90165D03*
X53480Y-91060D03*
X57480Y-91060D03*
X61480Y-91060D03*
X59480Y-91060D03*
X55480Y-91060D03*
X63485Y-91055D03*
X64400Y-90165D03*
X37400Y-91060D03*
X63480Y-87230D03*
X55480Y-87230D03*
X59480Y-87230D03*
X61480Y-87230D03*
X57480Y-87230D03*
X53480Y-87230D03*
X63480Y-86885D03*
X53610Y-86890D03*
X57610Y-86890D03*
X61610Y-86890D03*
X59610Y-86890D03*
X55610Y-86890D03*
X67940Y-88530D03*
X69940Y-88530D03*
X133609Y-88530D03*
X64800Y-88530D03*
X167894Y-88750D03*
X169114Y-87530D03*
X167249Y-86885D03*
X135609Y-88530D03*
X139609Y-88530D03*
X143609Y-88530D03*
X147609Y-88530D03*
X151609Y-88530D03*
X155609Y-88530D03*
X159609Y-88530D03*
X163609Y-88530D03*
X161609Y-88530D03*
X157609Y-88530D03*
X153609Y-88530D03*
X149609Y-88530D03*
X145609Y-88530D03*
X141609Y-88530D03*
X137609Y-88530D03*
X125609Y-88530D03*
X129609Y-88530D03*
X131609Y-88530D03*
X127609Y-88530D03*
X73940Y-88530D03*
X77940Y-88530D03*
X81940Y-88530D03*
X85940Y-88530D03*
X89940Y-88530D03*
X93940Y-88530D03*
X97940Y-88530D03*
X101940Y-88530D03*
X99940Y-88530D03*
X95940Y-88530D03*
X91940Y-88530D03*
X87940Y-88530D03*
X83940Y-88530D03*
X79940Y-88530D03*
X75940Y-88530D03*
X71940Y-88530D03*
X103940Y-88530D03*
X107940Y-88530D03*
X109940Y-88530D03*
X105940Y-88530D03*
X165609Y-88530D03*
X168899Y-82740D03*
X168899Y-85225D03*
X170539Y-84100D03*
X170524Y-86115D03*
X168919Y-80280D03*
X171199Y-78000D03*
X136469Y-90165D03*
X140469Y-90165D03*
X144469Y-90165D03*
X148469Y-90165D03*
X152469Y-90165D03*
X156469Y-90165D03*
X160469Y-90165D03*
X164469Y-90165D03*
X162469Y-90165D03*
X158469Y-90165D03*
X154469Y-90165D03*
X150469Y-90165D03*
X146469Y-90165D03*
X142469Y-90165D03*
X138469Y-90165D03*
X126469Y-90165D03*
X130469Y-90165D03*
X132469Y-90165D03*
X128469Y-90165D03*
X124469Y-90165D03*
X74800Y-90165D03*
X78800Y-90165D03*
X82800Y-90165D03*
X86800Y-90165D03*
X90800Y-90165D03*
X94800Y-90165D03*
X98800Y-90165D03*
X102800Y-90165D03*
X100800Y-90165D03*
X96800Y-90165D03*
X92800Y-90165D03*
X88800Y-90165D03*
X84800Y-90165D03*
X80800Y-90165D03*
X76800Y-90165D03*
X72800Y-90165D03*
X104800Y-90165D03*
X108800Y-90165D03*
X110800Y-90165D03*
X106800Y-90165D03*
X166474Y-90170D03*
X104900Y-86595D03*
X108900Y-86595D03*
X110900Y-86595D03*
X106900Y-86595D03*
X102900Y-86595D03*
X70900Y-86595D03*
X74900Y-86595D03*
X78900Y-86595D03*
X82900Y-86595D03*
X86900Y-86595D03*
X90900Y-86595D03*
X94900Y-86595D03*
X98900Y-86595D03*
X100900Y-86595D03*
X96900Y-86595D03*
X92900Y-86595D03*
X88900Y-86595D03*
X84900Y-86595D03*
X80900Y-86595D03*
X76900Y-86595D03*
X72900Y-86595D03*
X126569Y-86595D03*
X130569Y-86595D03*
X128569Y-86595D03*
X124569Y-86595D03*
X136569Y-86595D03*
X140569Y-86595D03*
X144569Y-86595D03*
X148569Y-86595D03*
X152569Y-86595D03*
X156569Y-86595D03*
X160569Y-86595D03*
X162569Y-86595D03*
X158569Y-86595D03*
X154569Y-86595D03*
X150569Y-86595D03*
X146569Y-86595D03*
X142569Y-86595D03*
X138569Y-86595D03*
X134569Y-86595D03*
X170539Y-81990D03*
X171919Y-80585D03*
X173064Y-79435D03*
X164544Y-86565D03*
X37400Y-81700D03*
X37400Y-81450D03*
G54D14*
X165769Y-74800D03*
G54D13*
X174484Y-78015D03*
G54D14*
X172169Y-76100D03*
G54D13*
X165724Y-85375D03*
X166959Y-82000D03*
X166969Y-78000D03*
X166959Y-80000D03*
X166959Y-84000D03*
G54D14*
X171569Y-76100D03*
G54D16*
X37735Y-82650D02*
X38065Y-82650D01*
X38065Y-82650D02*
X64500Y-82650D01*
X168169Y-76000D02*
X170269Y-76000D01*
X166569Y-77600D02*
X168169Y-76000D01*
X166569Y-83900D02*
X166569Y-77600D01*
X164269Y-86200D02*
X166569Y-83900D01*
X68050Y-86200D02*
X164269Y-86200D01*
X64500Y-82650D02*
X68050Y-86200D01*
G54D17*
X37735Y-82650D02*
X36650Y-82650D01*
X36424Y-82424D02*
X33730Y-82424D01*
X36650Y-82650D02*
X36424Y-82424D01*
X37250Y-82200D02*
X37400Y-82200D01*
X33730Y-81833D02*
X36883Y-81833D01*
X36883Y-81833D02*
X37250Y-82200D01*
X36986Y-81636D02*
X37300Y-81950D01*
X37300Y-81950D02*
X37400Y-81950D01*
X36936Y-81636D02*
X33730Y-81636D01*
X36936Y-81636D02*
X36986Y-81636D01*
X37900Y-81250D02*
X37600Y-81250D01*
X37396Y-81046D02*
X33730Y-81046D01*
X37600Y-81250D02*
X37396Y-81046D01*
X37900Y-81250D02*
X37900Y-81250D01*
G54D18*
X68350Y-85500D02*
X64100Y-81250D01*
X64100Y-81250D02*
X37900Y-81250D01*
X165869Y-75900D02*
X165869Y-83600D01*
G54D19*
X167029Y-74740D02*
X165869Y-75900D01*
X168019Y-74740D02*
X167029Y-74740D01*
G54D18*
X163969Y-85500D02*
X69000Y-85500D01*
X165869Y-83600D02*
X163969Y-85500D01*
X69000Y-85500D02*
X68350Y-85500D01*
G54D17*
X37499Y-80849D02*
X33730Y-80849D01*
X37900Y-81250D02*
X37499Y-80849D01*
X33730Y-93053D02*
X37473Y-93053D01*
X176869Y-77860D02*
X176869Y-75480D01*
X172029Y-82700D02*
X176869Y-77860D01*
X172029Y-86650D02*
X172029Y-82700D01*
X167169Y-91510D02*
X172029Y-86650D01*
X66900Y-91510D02*
X167169Y-91510D01*
X65210Y-93200D02*
X66900Y-91510D01*
X37620Y-93200D02*
X65210Y-93200D01*
X37473Y-93053D02*
X37620Y-93200D01*
X172549Y-74620D02*
X172689Y-74480D01*
X176869Y-75480D02*
X176869Y-77740D01*
X175869Y-74480D02*
X176869Y-75480D01*
X172689Y-74480D02*
X175869Y-74480D01*
X37060Y-93250D02*
X37400Y-93250D01*
X33730Y-93250D02*
X37060Y-93250D01*
X37400Y-93250D02*
X37400Y-93249D01*
G54D20*
X37560Y-83510D02*
X64380Y-83510D01*
X37464Y-83605D02*
X37560Y-83510D01*
X33730Y-83605D02*
X37464Y-83605D01*
X67650Y-86780D02*
X164669Y-86780D01*
X64380Y-83510D02*
X67650Y-86780D01*
X164669Y-86780D02*
X167149Y-84300D01*
X167149Y-84300D02*
X167149Y-78400D01*
X167149Y-78400D02*
X168009Y-77540D01*
X168009Y-77540D02*
X168009Y-77500D01*
X168009Y-77500D02*
X168049Y-77500D01*
X164669Y-86780D02*
X68900Y-86780D01*
X167149Y-84300D02*
X164669Y-86780D01*
X167149Y-78400D02*
X167149Y-84300D01*
X168049Y-77500D02*
X167149Y-78400D01*
X37388Y-83408D02*
X37400Y-83420D01*
X37388Y-83408D02*
X33730Y-83408D01*
X172744Y-77500D02*
X172744Y-77525D01*
X37464Y-88735D02*
X37560Y-88640D01*
X33730Y-88735D02*
X37464Y-88735D01*
X63510Y-88640D02*
X37560Y-88640D01*
X63950Y-89080D02*
X63510Y-88640D01*
X165889Y-89080D02*
X63950Y-89080D01*
X169449Y-85520D02*
X165889Y-89080D01*
X169449Y-80820D02*
X169449Y-85520D01*
X172744Y-77525D02*
X169449Y-80820D01*
X37388Y-88538D02*
X37400Y-88550D01*
X33730Y-88538D02*
X37388Y-88538D01*
X37560Y-89030D02*
X63340Y-89030D01*
X33730Y-89125D02*
X37464Y-89125D01*
X37464Y-89125D02*
X37560Y-89030D01*
X173139Y-77530D02*
X173139Y-77500D01*
X169629Y-81040D02*
X173139Y-77530D01*
X169629Y-85620D02*
X169629Y-81040D01*
X165989Y-89260D02*
X169629Y-85620D01*
X63570Y-89260D02*
X165989Y-89260D01*
X63340Y-89030D02*
X63570Y-89260D01*
X33730Y-88928D02*
X37388Y-88928D01*
X37388Y-88928D02*
X37400Y-88940D01*
X173534Y-77500D02*
X173534Y-77515D01*
X37464Y-89525D02*
X37560Y-89430D01*
X33730Y-89525D02*
X37464Y-89525D01*
X63180Y-89430D02*
X37560Y-89430D01*
X63190Y-89440D02*
X63180Y-89430D01*
X166089Y-89440D02*
X63190Y-89440D01*
X169809Y-85720D02*
X166089Y-89440D01*
X169809Y-81240D02*
X169809Y-85720D01*
X173534Y-77515D02*
X169809Y-81240D01*
X37388Y-89328D02*
X37400Y-89340D01*
X33730Y-89328D02*
X37388Y-89328D01*
X37560Y-89820D02*
X63370Y-89820D01*
X33730Y-89915D02*
X37464Y-89915D01*
X37464Y-89915D02*
X37560Y-89820D01*
X173924Y-77525D02*
X173924Y-77500D01*
X169989Y-81460D02*
X173924Y-77525D01*
X169989Y-85820D02*
X169989Y-81460D01*
X166189Y-89620D02*
X169989Y-85820D01*
X63570Y-89620D02*
X166189Y-89620D01*
X63370Y-89820D02*
X63570Y-89620D01*
X33730Y-89718D02*
X37388Y-89718D01*
X37388Y-89718D02*
X37400Y-89730D01*
X174319Y-77500D02*
X174319Y-77530D01*
X33730Y-90315D02*
X37464Y-90315D01*
X37464Y-90315D02*
X37560Y-90220D01*
X63530Y-90220D02*
X37560Y-90220D01*
X63950Y-89800D02*
X63530Y-90220D01*
X166289Y-89800D02*
X63950Y-89800D01*
X170169Y-85920D02*
X166289Y-89800D01*
X170169Y-81680D02*
X170169Y-85920D01*
X174319Y-77530D02*
X170169Y-81680D01*
X33730Y-90118D02*
X37388Y-90118D01*
X37388Y-90118D02*
X37400Y-90130D01*
X37560Y-90610D02*
X63700Y-90610D01*
X37464Y-90705D02*
X37560Y-90610D01*
X33730Y-90705D02*
X37464Y-90705D01*
X64330Y-89980D02*
X166389Y-89980D01*
X63700Y-90610D02*
X64330Y-89980D01*
X166389Y-89980D02*
X170349Y-86020D01*
X170349Y-86020D02*
X170349Y-81880D01*
X170349Y-81880D02*
X174709Y-77520D01*
X174709Y-77520D02*
X174709Y-77500D01*
X174709Y-77500D02*
X174709Y-77520D01*
X166389Y-89980D02*
X68940Y-89980D01*
X170349Y-86020D02*
X166389Y-89980D01*
X170349Y-81880D02*
X170349Y-86020D01*
X174709Y-77520D02*
X170349Y-81880D01*
X37388Y-90508D02*
X37400Y-90520D01*
X33730Y-90508D02*
X37388Y-90508D01*
X168414Y-77500D02*
X168414Y-77515D01*
X33730Y-83995D02*
X37464Y-83995D01*
X37464Y-83995D02*
X37560Y-83900D01*
X64210Y-83900D02*
X37560Y-83900D01*
X67270Y-86960D02*
X64210Y-83900D01*
X164769Y-86960D02*
X67270Y-86960D01*
X167329Y-84400D02*
X164769Y-86960D01*
X167329Y-78600D02*
X167329Y-84400D01*
X168414Y-77515D02*
X167329Y-78600D01*
X37388Y-83798D02*
X37400Y-83810D01*
X37388Y-83798D02*
X33730Y-83798D01*
X168809Y-77500D02*
X168809Y-77520D01*
X64050Y-84300D02*
X66890Y-87140D01*
X66890Y-87140D02*
X164869Y-87140D01*
X164869Y-87140D02*
X167509Y-84500D01*
X167509Y-84500D02*
X167509Y-78820D01*
X167509Y-78820D02*
X168609Y-77720D01*
X37464Y-84395D02*
X37560Y-84300D01*
X33730Y-84395D02*
X37464Y-84395D01*
X37560Y-84300D02*
X64050Y-84300D01*
X168809Y-77520D02*
X168609Y-77720D01*
X37388Y-84198D02*
X37400Y-84210D01*
X37388Y-84198D02*
X33730Y-84198D01*
X169199Y-77500D02*
X169199Y-77530D01*
X63890Y-84690D02*
X66520Y-87320D01*
X66520Y-87320D02*
X164969Y-87320D01*
X164969Y-87320D02*
X167689Y-84600D01*
X167689Y-84600D02*
X167689Y-79040D01*
X167689Y-79040D02*
X169009Y-77720D01*
X37464Y-84785D02*
X33730Y-84785D01*
X37464Y-84785D02*
X37560Y-84690D01*
X37560Y-84690D02*
X63890Y-84690D01*
X169199Y-77530D02*
X169009Y-77720D01*
X37388Y-84588D02*
X33730Y-84588D01*
X37388Y-84588D02*
X37400Y-84600D01*
X37560Y-85090D02*
X63730Y-85090D01*
X33730Y-85185D02*
X37464Y-85185D01*
X37464Y-85185D02*
X37560Y-85090D01*
X169594Y-77515D02*
X169594Y-77500D01*
X167869Y-79240D02*
X169594Y-77515D01*
X167869Y-84700D02*
X167869Y-79240D01*
X165069Y-87500D02*
X167869Y-84700D01*
X66140Y-87500D02*
X165069Y-87500D01*
X63730Y-85090D02*
X66140Y-87500D01*
X37388Y-84988D02*
X37400Y-85000D01*
X37388Y-84988D02*
X33730Y-84988D01*
X169989Y-77499D02*
X169989Y-77519D01*
X37464Y-85575D02*
X37560Y-85480D01*
X37464Y-85575D02*
X33730Y-85575D01*
X63560Y-85480D02*
X37560Y-85480D01*
X65760Y-87680D02*
X63560Y-85480D01*
X165169Y-87680D02*
X65760Y-87680D01*
X168049Y-84800D02*
X165169Y-87680D01*
X168049Y-79460D02*
X168049Y-84800D01*
X169989Y-77519D02*
X168049Y-79460D01*
X37388Y-85378D02*
X33730Y-85378D01*
X37388Y-85378D02*
X37400Y-85390D01*
X37560Y-85880D02*
X63400Y-85880D01*
X37464Y-85975D02*
X37560Y-85880D01*
X33730Y-85975D02*
X37464Y-85975D01*
X170384Y-77525D02*
X170384Y-77500D01*
X168229Y-79680D02*
X170384Y-77525D01*
X168229Y-84900D02*
X168229Y-79680D01*
X165269Y-87860D02*
X168229Y-84900D01*
X65380Y-87860D02*
X165269Y-87860D01*
X63400Y-85880D02*
X65380Y-87860D01*
X37388Y-85778D02*
X33730Y-85778D01*
X37388Y-85778D02*
X37400Y-85790D01*
X170779Y-77500D02*
X170779Y-77510D01*
X33730Y-86365D02*
X37464Y-86365D01*
X37464Y-86365D02*
X37560Y-86270D01*
X63240Y-86270D02*
X37560Y-86270D01*
X65010Y-88040D02*
X63240Y-86270D01*
X165369Y-88040D02*
X65010Y-88040D01*
X168409Y-85000D02*
X165369Y-88040D01*
X168409Y-79880D02*
X168409Y-85000D01*
X170779Y-77510D02*
X168409Y-79880D01*
X37388Y-86168D02*
X37400Y-86180D01*
X37388Y-86168D02*
X33730Y-86168D01*
X171959Y-77500D02*
X171959Y-77510D01*
X33730Y-87945D02*
X37464Y-87945D01*
X37464Y-87945D02*
X37560Y-87850D01*
X63840Y-87850D02*
X37560Y-87850D01*
X64710Y-88720D02*
X63840Y-87850D01*
X165689Y-88720D02*
X64710Y-88720D01*
X169089Y-85320D02*
X165689Y-88720D01*
X169089Y-80380D02*
X169089Y-85320D01*
X171959Y-77510D02*
X169089Y-80380D01*
X37388Y-87748D02*
X37400Y-87760D01*
X37388Y-87748D02*
X33730Y-87748D01*
X37560Y-88240D02*
X63670Y-88240D01*
X37464Y-88335D02*
X37560Y-88240D01*
X33730Y-88335D02*
X37464Y-88335D01*
X172354Y-77515D02*
X172354Y-77500D01*
X169269Y-80600D02*
X172354Y-77515D01*
X169269Y-85420D02*
X169269Y-80600D01*
X165789Y-88900D02*
X169269Y-85420D01*
X64330Y-88900D02*
X165789Y-88900D01*
X63670Y-88240D02*
X64330Y-88900D01*
X37388Y-88138D02*
X37400Y-88150D01*
X37388Y-88138D02*
X33730Y-88138D01*
G54D17*
X33730Y-92463D02*
X37516Y-92463D01*
X175730Y-75840D02*
X176090Y-76200D01*
X176090Y-76200D02*
X176090Y-77860D01*
X176090Y-77860D02*
X171510Y-82440D01*
X171510Y-82440D02*
X171510Y-86570D01*
X171510Y-86570D02*
X166980Y-91100D01*
X166980Y-91100D02*
X65600Y-91100D01*
X65600Y-91100D02*
X64320Y-92380D01*
X64320Y-92380D02*
X37725Y-92380D01*
X175730Y-75840D02*
X174409Y-75840D01*
X37600Y-92380D02*
X37725Y-92380D01*
X37516Y-92463D02*
X37600Y-92380D01*
X33730Y-92857D02*
X37397Y-92857D01*
X37397Y-92857D02*
X37400Y-92860D01*
X37393Y-92853D02*
X37400Y-92860D01*
X33730Y-92660D02*
X37515Y-92660D01*
X173229Y-74680D02*
X173349Y-74800D01*
X173349Y-74800D02*
X175749Y-74800D01*
X175749Y-74800D02*
X176409Y-75460D01*
X176409Y-75460D02*
X176409Y-77720D01*
X172949Y-74680D02*
X173229Y-74680D01*
X176409Y-77930D02*
X176409Y-77720D01*
X171769Y-82570D02*
X176409Y-77930D01*
X171769Y-86600D02*
X171769Y-82570D01*
X167069Y-91300D02*
X171769Y-86600D01*
X66260Y-91300D02*
X167069Y-91300D01*
X64780Y-92780D02*
X66260Y-91300D01*
X37635Y-92780D02*
X64780Y-92780D01*
X37515Y-92660D02*
X37635Y-92780D01*
G54D20*
X38360Y-91370D02*
X63735Y-91370D01*
X38044Y-91685D02*
X38360Y-91370D01*
X38044Y-91685D02*
X33730Y-91685D01*
X173729Y-76155D02*
X173729Y-75800D01*
X173894Y-76320D02*
X173729Y-76155D01*
X174749Y-76320D02*
X173894Y-76320D01*
X174909Y-76480D02*
X174749Y-76320D01*
X174909Y-77970D02*
X174909Y-76480D01*
X170804Y-82075D02*
X174909Y-77970D01*
X170804Y-86215D02*
X170804Y-82075D01*
X166574Y-90445D02*
X170804Y-86215D01*
X64660Y-90445D02*
X166574Y-90445D01*
X63735Y-91370D02*
X64660Y-90445D01*
X174124Y-75800D02*
X174124Y-76065D01*
X33730Y-92075D02*
X37464Y-92075D01*
X37464Y-92075D02*
X37505Y-92035D01*
X64040Y-92035D02*
X37505Y-92035D01*
X65250Y-90825D02*
X64040Y-92035D01*
X166864Y-90825D02*
X65250Y-90825D01*
X171234Y-86455D02*
X166864Y-90825D01*
X171234Y-82325D02*
X171234Y-86455D01*
X175109Y-78450D02*
X171234Y-82325D01*
X175109Y-76440D02*
X175109Y-78450D01*
X174809Y-76140D02*
X175109Y-76440D01*
X174199Y-76140D02*
X174809Y-76140D01*
X174124Y-76065D02*
X174199Y-76140D01*
X37388Y-91488D02*
X33730Y-91488D01*
X37388Y-91488D02*
X37400Y-91500D01*
X37388Y-91878D02*
X37400Y-91890D01*
X37388Y-91878D02*
X33730Y-91878D01*
G54D21*
X36480Y-83110D02*
X38055Y-83110D01*
X38055Y-83110D02*
X38070Y-83095D01*
G54D17*
X38347Y-83157D02*
X38132Y-83157D01*
X38132Y-83157D02*
X38070Y-83095D01*
X37730Y-83210D02*
X38295Y-83210D01*
X37728Y-83211D02*
X37730Y-83210D01*
X36385Y-83211D02*
X37728Y-83211D01*
G54D21*
X38455Y-83050D02*
X38115Y-83050D01*
X38115Y-83050D02*
X38070Y-83095D01*
G54D17*
X36480Y-83040D02*
X36527Y-83087D01*
X36527Y-83087D02*
X38417Y-83087D01*
X38417Y-83087D02*
X38455Y-83050D01*
X38295Y-83210D02*
X38347Y-83157D01*
X38347Y-83157D02*
X38455Y-83050D01*
X36385Y-82945D02*
X36385Y-83211D01*
X37130Y-86750D02*
X37130Y-86951D01*
X37130Y-86557D02*
X37130Y-86750D01*
X37130Y-86750D02*
X37130Y-86754D01*
X37120Y-87345D02*
X37120Y-87148D01*
X37120Y-87542D02*
X37120Y-87345D01*
X37120Y-90888D02*
X37120Y-91085D01*
X36725Y-90888D02*
X37120Y-90888D01*
X37120Y-90888D02*
X37668Y-90888D01*
X37668Y-90888D02*
X37675Y-90895D01*
X36365Y-87542D02*
X37120Y-87542D01*
X37120Y-87542D02*
X38027Y-87542D01*
X38027Y-87542D02*
X38050Y-87520D01*
X36255Y-87345D02*
X37120Y-87345D01*
X37120Y-87345D02*
X37750Y-87345D01*
X37750Y-87345D02*
X37760Y-87355D01*
X36470Y-87148D02*
X37120Y-87148D01*
X33730Y-87148D02*
X36470Y-87148D01*
X37120Y-87148D02*
X37398Y-87148D01*
X37398Y-87148D02*
X37480Y-87230D01*
X36745Y-86557D02*
X37130Y-86557D01*
X37130Y-86557D02*
X38157Y-86557D01*
X38157Y-86557D02*
X38165Y-86565D01*
X36485Y-86754D02*
X37130Y-86754D01*
X37130Y-86754D02*
X37885Y-86754D01*
X37885Y-86754D02*
X37900Y-86740D01*
X35975Y-86951D02*
X37130Y-86951D01*
X33730Y-86951D02*
X35975Y-86951D01*
X37130Y-86951D02*
X37548Y-86951D01*
X37548Y-86951D02*
X37610Y-86890D01*
X33730Y-92266D02*
X37368Y-92266D01*
X37368Y-92266D02*
X37380Y-92255D01*
X36655Y-91282D02*
X37627Y-91282D01*
X37627Y-91282D02*
X37830Y-91485D01*
X33730Y-83014D02*
X36454Y-83014D01*
X36454Y-83014D02*
X36480Y-83040D01*
X37400Y-82860D02*
X36580Y-82860D01*
X36340Y-82620D02*
X33730Y-82620D01*
X36580Y-82860D02*
X36340Y-82620D01*
X36240Y-82817D02*
X36257Y-82817D01*
X36257Y-82817D02*
X36385Y-82945D01*
X36385Y-82945D02*
X36480Y-83040D01*
X36110Y-83211D02*
X36385Y-83211D01*
X33730Y-91282D02*
X36655Y-91282D01*
X36655Y-91282D02*
X37177Y-91282D01*
X33730Y-91085D02*
X37120Y-91085D01*
X37120Y-91085D02*
X37374Y-91085D01*
X37374Y-91085D02*
X37400Y-91060D01*
X33730Y-90888D02*
X36725Y-90888D01*
X36725Y-90888D02*
X37228Y-90888D01*
X33730Y-87542D02*
X36365Y-87542D01*
X36365Y-87542D02*
X37167Y-87542D01*
X33730Y-87345D02*
X36255Y-87345D01*
X36255Y-87345D02*
X37364Y-87345D01*
X37398Y-87148D02*
X37480Y-87230D01*
X37548Y-86951D02*
X37610Y-86890D01*
X33730Y-86754D02*
X36485Y-86754D01*
X36485Y-86754D02*
X37474Y-86754D01*
X33730Y-86557D02*
X36745Y-86557D01*
X36745Y-86557D02*
X37277Y-86557D01*
X33730Y-83211D02*
X36110Y-83211D01*
X36110Y-83211D02*
X36438Y-83211D01*
X33730Y-82817D02*
X36240Y-82817D01*
X33730Y-82227D02*
X36727Y-82227D01*
X36830Y-82030D02*
X37250Y-82450D01*
X37250Y-82450D02*
X37400Y-82450D01*
X36830Y-82030D02*
X33730Y-82030D01*
X36950Y-82450D02*
X37400Y-82450D01*
X36727Y-82227D02*
X36950Y-82450D01*
X36650Y-81439D02*
X37139Y-81439D01*
X36650Y-81439D02*
X37089Y-81439D01*
X33730Y-81439D02*
X36650Y-81439D01*
X37139Y-81439D02*
X37400Y-81700D01*
X36400Y-81242D02*
X37192Y-81242D01*
X37142Y-81242D02*
X36550Y-81242D01*
X37192Y-81242D02*
X37400Y-81450D01*
X33730Y-81242D02*
X36400Y-81242D01*
X36550Y-81242D02*
X37092Y-81242D01*
M02*
