  0
SECTION
  2
HEADER
  9
$ANGBASE
  50
0.0
  9
$ANGDIR
  70
  1
  9
$MEASUREMENT
  70
0
  0
ENDSEC
  0
SECTION
  2
TABLES
  0
TABLE
  2
LTYPE
  70
1
  0
LTYPE
  2
CONTINUOUS
  70
0
  3
Solid line
  72
65
  73
0
  40
0.0
  0
ENDTAB
  0
TABLE
  2
STYLE
  70
4
  0
STYLE
  2
KICAD
  70
0
  40
0
  41
1
  42
1
  50
0
  71
0
  3
isocp.shx
  0
STYLE
  2
KICADB
  70
0
  40
0
  41
1
  42
1
  50
0
  71
0
  3
isocp.shx
  0
STYLE
  2
KICADI
  70
0
  40
0
  41
1
  42
1
  50
15
  71
0
  3
isocp.shx
  0
STYLE
  2
KICADBI
  70
0
  40
0
  41
1
  42
1
  50
15
  71
0
  3
isocp.shx
  0
ENDTAB
  0
TABLE
  2
LAYER
  70
30
  0
LAYER
  2
BLACK
  70
0
  62
7
  6
CONTINUOUS
  0
LAYER
  2
GRAY1
  70
0
  62
251
  6
CONTINUOUS
  0
LAYER
  2
GRAY2
  70
0
  62
8
  6
CONTINUOUS
  0
LAYER
  2
GRAY3
  70
0
  62
9
  6
CONTINUOUS
  0
LAYER
  2
WHITE
  70
0
  62
7
  6
CONTINUOUS
  0
LAYER
  2
LYELLOW
  70
0
  62
51
  6
CONTINUOUS
  0
LAYER
  2
BLUE1
  70
0
  62
178
  6
CONTINUOUS
  0
LAYER
  2
GREEN1
  70
0
  62
98
  6
CONTINUOUS
  0
LAYER
  2
CYAN1
  70
0
  62
138
  6
CONTINUOUS
  0
LAYER
  2
RED1
  70
0
  62
18
  6
CONTINUOUS
  0
LAYER
  2
MAGENTA1
  70
0
  62
228
  6
CONTINUOUS
  0
LAYER
  2
BROWN1
  70
0
  62
58
  6
CONTINUOUS
  0
LAYER
  2
BLUE2
  70
0
  62
5
  6
CONTINUOUS
  0
LAYER
  2
GREEN2
  70
0
  62
3
  6
CONTINUOUS
  0
LAYER
  2
CYAN2
  70
0
  62
4
  6
CONTINUOUS
  0
LAYER
  2
RED2
  70
0
  62
1
  6
CONTINUOUS
  0
LAYER
  2
MAGENTA2
  70
0
  62
6
  6
CONTINUOUS
  0
LAYER
  2
BROWN2
  70
0
  62
54
  6
CONTINUOUS
  0
LAYER
  2
BLUE3
  70
0
  62
171
  6
CONTINUOUS
  0
LAYER
  2
GREEN3
  70
0
  62
91
  6
CONTINUOUS
  0
LAYER
  2
CYAN3
  70
0
  62
131
  6
CONTINUOUS
  0
LAYER
  2
RED3
  70
0
  62
11
  6
CONTINUOUS
  0
LAYER
  2
MAGENTA3
  70
0
  62
221
  6
CONTINUOUS
  0
LAYER
  2
YELLOW3
  70
0
  62
2
  6
CONTINUOUS
  0
LAYER
  2
BLUE4
  70
0
  62
5
  6
CONTINUOUS
  0
LAYER
  2
GREEN4
  70
0
  62
3
  6
CONTINUOUS
  0
LAYER
  2
CYAN4
  70
0
  62
4
  6
CONTINUOUS
  0
LAYER
  2
RED4
  70
0
  62
1
  6
CONTINUOUS
  0
LAYER
  2
MAGENTA4
  70
0
  62
6
  6
CONTINUOUS
  0
LAYER
  2
YELLOW4
  70
0
  62
2
  6
CONTINUOUS
  0
ENDTAB
  0
ENDSEC
  0
SECTION
  2
ENTITIES
0
LINE
8
Black
10
171.577
20
-233.095
11
476.479
21
-233.095
0
LINE
8
Black
10
171.577
20
-232.995
11
476.479
21
-232.995
0
ARC
8
Black
10
476.479
20
-233.045
40
0.05
50
270
51
450
0
ARC
8
Black
10
171.577
20
-233.045
40
0.05
50
90
51
270
0
LINE
8
Black
10
489.356
20
-210.82
11
489.356
21
-210.464
0
LINE
8
Black
10
489.256
20
-210.82
11
489.256
21
-210.464
0
ARC
8
Black
10
489.306
20
-210.464
40
0.05
50
360
51
540
0
ARC
8
Black
10
489.306
20
-210.82
40
0.05
50
180
51
360
0
LINE
8
Black
10
491.709
20
-207.991
11
489.27
21
-210.429
0
LINE
8
Black
10
491.779
20
-208.061
11
489.341
21
-210.5
0
ARC
8
Black
10
489.306
20
-210.464
40
0.05
50
495
51
675
0
ARC
8
Black
10
491.744
20
-208.026
40
0.05
50
315
51
495
0
LINE
8
Black
10
489.356
20
-220.218
11
489.356
21
-210.82
0
LINE
8
Black
10
489.256
20
-220.218
11
489.256
21
-210.82
0
ARC
8
Black
10
489.306
20
-210.82
40
0.05
50
360
51
540
0
ARC
8
Black
10
489.306
20
-220.218
40
0.05
50
180
51
360
0
LINE
8
Black
10
476.514
20
-233.08
11
489.341
21
-220.253
0
LINE
8
Black
10
476.443
20
-233.01
11
489.27
21
-220.183
0
ARC
8
Black
10
489.306
20
-220.218
40
0.05
50
315
51
495
0
ARC
8
Black
10
476.479
20
-233.045
40
0.05
50
135
51
315
0
LINE
8
Black
10
83.8962
20
-237.413
11
85.0392
21
-237.413
0
LINE
8
Black
10
83.8962
20
-237.313
11
85.0392
21
-237.313
0
ARC
8
Black
10
85.0392
20
-237.363
40
0.05
50
270
51
450
0
ARC
8
Black
10
83.8962
20
-237.363
40
0.05
50
90
51
270
0
LINE
8
Black
10
85.0038
20
-237.398
11
85.2324
21
-237.627
0
LINE
8
Black
10
85.0746
20
-237.328
11
85.3032
21
-237.556
0
ARC
8
Black
10
85.2678
20
-237.592
40
0.05
50
225
51
405
0
ARC
8
Black
10
85.0392
20
-237.363
40
0.05
50
45
51
225
0
LINE
8
Black
10
85.3178
20
-237.846
11
85.3178
21
-237.592
0
LINE
8
Black
10
85.2178
20
-237.846
11
85.2178
21
-237.592
0
ARC
8
Black
10
85.2678
20
-237.592
40
0.05
50
360
51
540
0
ARC
8
Black
10
85.2678
20
-237.846
40
0.05
50
180
51
360
0
LINE
8
Black
10
85.2324
20
-237.881
11
85.5372
21
-238.186
0
LINE
8
Black
10
85.3032
20
-237.81
11
85.608
21
-238.115
0
ARC
8
Black
10
85.5726
20
-238.15
40
0.05
50
225
51
405
0
ARC
8
Black
10
85.2678
20
-237.846
40
0.05
50
45
51
225
0
LINE
8
Black
10
85.5726
20
-238.2
11
86.7156
21
-238.2
0
LINE
8
Black
10
85.5726
20
-238.1
11
86.7156
21
-238.1
0
ARC
8
Black
10
86.7156
20
-238.15
40
0.05
50
270
51
450
0
ARC
8
Black
10
85.5726
20
-238.15
40
0.05
50
90
51
270
0
LINE
8
Black
10
86.7656
20
-238.15
11
86.7656
21
-237.363
0
LINE
8
Black
10
86.6656
20
-238.15
11
86.6656
21
-237.363
0
ARC
8
Black
10
86.7156
20
-237.363
40
0.05
50
360
51
540
0
ARC
8
Black
10
86.7156
20
-238.15
40
0.05
50
180
51
360
0
LINE
8
Black
10
83.9462
20
-237.363
11
83.9462
21
-204.851
0
LINE
8
Black
10
83.8462
20
-237.363
11
83.8462
21
-204.851
0
ARC
8
Black
10
83.8962
20
-204.851
40
0.05
50
360
51
540
0
ARC
8
Black
10
83.8962
20
-237.363
40
0.05
50
180
51
360
0
LINE
8
Black
10
83.8962
20
-204.901
11
84.836
21
-204.901
0
LINE
8
Black
10
83.8962
20
-204.801
11
84.836
21
-204.801
0
ARC
8
Black
10
84.836
20
-204.851
40
0.05
50
270
51
450
0
ARC
8
Black
10
83.8962
20
-204.851
40
0.05
50
90
51
270
0
LINE
8
Black
10
84.8106
20
-204.901
11
84.8868
21
-204.901
0
LINE
8
Black
10
84.8106
20
-204.801
11
84.8868
21
-204.801
0
ARC
8
Black
10
84.8868
20
-204.851
40
0.05
50
270
51
450
0
ARC
8
Black
10
84.8106
20
-204.851
40
0.05
50
90
51
270
0
LINE
8
Black
10
84.8868
20
-204.901
11
84.963
21
-204.901
0
LINE
8
Black
10
84.8868
20
-204.801
11
84.963
21
-204.801
0
ARC
8
Black
10
84.963
20
-204.851
40
0.05
50
270
51
450
0
ARC
8
Black
10
84.8868
20
-204.851
40
0.05
50
90
51
270
0
LINE
8
Black
10
84.9984
20
-204.886
11
85.3032
21
-204.582
0
LINE
8
Black
10
84.9276
20
-204.816
11
85.2324
21
-204.511
0
ARC
8
Black
10
85.2678
20
-204.546
40
0.05
50
315
51
495
0
ARC
8
Black
10
84.963
20
-204.851
40
0.05
50
135
51
315
0
LINE
8
Black
10
85.3178
20
-204.546
11
85.3178
21
-204.318
0
LINE
8
Black
10
85.2178
20
-204.546
11
85.2178
21
-204.318
0
ARC
8
Black
10
85.2678
20
-204.318
40
0.05
50
360
51
540
0
ARC
8
Black
10
85.2678
20
-204.546
40
0.05
50
180
51
360
0
LINE
8
Black
10
85.3032
20
-204.353
11
85.5826
21
-204.074
0
LINE
8
Black
10
85.2324
20
-204.282
11
85.5118
21
-204.003
0
ARC
8
Black
10
85.5472
20
-204.038
40
0.05
50
315
51
495
0
ARC
8
Black
10
85.2678
20
-204.318
40
0.05
50
135
51
315
0
LINE
8
Black
10
85.5472
20
-204.088
11
86.6902
21
-204.088
0
LINE
8
Black
10
85.5472
20
-203.988
11
86.6902
21
-203.988
0
ARC
8
Black
10
86.6902
20
-204.038
40
0.05
50
270
51
450
0
ARC
8
Black
10
85.5472
20
-204.038
40
0.05
50
90
51
270
0
LINE
8
Black
10
86.7402
20
-204.826
11
86.7402
21
-204.038
0
LINE
8
Black
10
86.6402
20
-204.826
11
86.6402
21
-204.038
0
ARC
8
Black
10
86.6902
20
-204.038
40
0.05
50
360
51
540
0
ARC
8
Black
10
86.6902
20
-204.826
40
0.05
50
180
51
360
0
LINE
8
Black
10
501.869
20
-197.831
11
491.709
21
-207.991
0
LINE
8
Black
10
501.939
20
-197.901
11
491.779
21
-208.061
0
ARC
8
Black
10
491.744
20
-208.026
40
0.05
50
495
51
675
0
ARC
8
Black
10
501.904
20
-197.866
40
0.05
50
315
51
495
0
LINE
8
Black
10
167.294
20
-237.398
11
171.612
21
-233.08
0
LINE
8
Black
10
167.224
20
-237.328
11
171.542
21
-233.01
0
ARC
8
Black
10
171.577
20
-233.045
40
0.05
50
315
51
495
0
ARC
8
Black
10
167.259
20
-237.363
40
0.05
50
135
51
315
0
LINE
8
Black
10
83.947
20
-237.413
11
167.259
21
-237.413
0
LINE
8
Black
10
83.947
20
-237.313
11
167.259
21
-237.313
0
ARC
8
Black
10
167.259
20
-237.363
40
0.05
50
270
51
450
0
ARC
8
Black
10
83.947
20
-237.363
40
0.05
50
90
51
270
0
LINE
8
Black
10
83.997
20
-237.363
11
83.997
21
-204.851
0
LINE
8
Black
10
83.897
20
-237.363
11
83.897
21
-204.851
0
ARC
8
Black
10
83.947
20
-204.851
40
0.05
50
360
51
540
0
ARC
8
Black
10
83.947
20
-237.363
40
0.05
50
180
51
360
0
LINE
8
Black
10
83.947
20
-204.901
11
163.449
21
-204.901
0
LINE
8
Black
10
83.947
20
-204.801
11
163.449
21
-204.801
0
ARC
8
Black
10
163.449
20
-204.851
40
0.05
50
270
51
450
0
ARC
8
Black
10
83.947
20
-204.851
40
0.05
50
90
51
270
0
LINE
8
Black
10
174.279
20
-215.611
11
163.484
21
-204.816
0
LINE
8
Black
10
174.209
20
-215.681
11
163.414
21
-204.886
0
ARC
8
Black
10
163.449
20
-204.851
40
0.05
50
405
51
585
0
ARC
8
Black
10
174.244
20
-215.646
40
0.05
50
225
51
405
0
LINE
8
Black
10
174.244
20
-215.696
11
467.614
21
-215.696
0
LINE
8
Black
10
174.244
20
-215.596
11
467.614
21
-215.596
0
ARC
8
Black
10
467.614
20
-215.646
40
0.05
50
270
51
450
0
ARC
8
Black
10
174.244
20
-215.646
40
0.05
50
90
51
270
0
LINE
8
Black
10
471.389
20
-211.801
11
467.579
21
-215.611
0
LINE
8
Black
10
471.459
20
-211.871
11
467.649
21
-215.681
0
ARC
8
Black
10
467.614
20
-215.646
40
0.05
50
495
51
675
0
ARC
8
Black
10
471.424
20
-211.836
40
0.05
50
315
51
495
0
LINE
8
Black
10
471.474
20
-211.836
11
471.474
21
-188.722
0
LINE
8
Black
10
471.374
20
-211.836
11
471.374
21
-188.722
0
ARC
8
Black
10
471.424
20
-188.722
40
0.05
50
360
51
540
0
ARC
8
Black
10
471.424
20
-211.836
40
0.05
50
180
51
360
0
LINE
8
Black
10
501.954
20
-197.866
11
501.954
21
-188.722
0
LINE
8
Black
10
501.854
20
-197.866
11
501.854
21
-188.722
0
ARC
8
Black
10
501.904
20
-188.722
40
0.05
50
360
51
540
0
ARC
8
Black
10
501.904
20
-197.866
40
0.05
50
180
51
360
0
LINE
8
Black
10
471.424
20
-188.772
11
501.904
21
-188.772
0
LINE
8
Black
10
471.424
20
-188.672
11
501.904
21
-188.672
0
ARC
8
Black
10
501.904
20
-188.722
40
0.05
50
270
51
450
0
ARC
8
Black
10
471.424
20
-188.722
40
0.05
50
90
51
270
0
CIRCLE
8
Black
10
497.664
20
-194.056
40
0.725
0
CIRCLE
8
Black
10
475.664
20
-194.056
40
0.725
  0
ENDSEC
  0
EOF
