%FSLAX34Y34*%
G04 Gerber Fmt 3.4, Leading zero omitted, Abs format*
G04 (created by PCBNEW (2013-10-07 BZR 4378)-stable) date Fri 19 Dec 2014 03:56:25 PM EST*
%MOIN*%
G01*
G70*
G90*
G04 APERTURE LIST*
%ADD10C,0.005906*%
%ADD11C,0.003937*%
%ADD12C,0.016000*%
%ADD13C,0.050000*%
%ADD14C,0.020000*%
%ADD15C,0.010000*%
%ADD16C,0.003000*%
%ADD17C,0.030000*%
%ADD18C,0.075000*%
%ADD19C,0.050000*%
%ADD20C,0.005000*%
G04 APERTURE END LIST*
G54D10*
G54D11*
X187590Y-91750D02*
X67550Y-91750D01*
X192640Y-82860D02*
X192640Y-83000D01*
X193600Y-81900D02*
X192640Y-82860D01*
X192640Y-86700D02*
X192640Y-83000D01*
X187590Y-91750D02*
X192640Y-86700D01*
X33030Y-93450D02*
X33480Y-93450D01*
X33480Y-93450D02*
X33570Y-93540D01*
X33570Y-93540D02*
X33570Y-93640D01*
X33570Y-93640D02*
X33690Y-93760D01*
X33690Y-93760D02*
X34140Y-93760D01*
X34140Y-93760D02*
X34140Y-93450D01*
X33030Y-93450D02*
X33030Y-80650D01*
X33030Y-80650D02*
X33400Y-80650D01*
X33390Y-80650D02*
X33420Y-80650D01*
X33420Y-80650D02*
X33450Y-80650D01*
X33450Y-80650D02*
X33570Y-80530D01*
X33570Y-80530D02*
X33570Y-80440D01*
X33570Y-80440D02*
X33680Y-80330D01*
X33680Y-80330D02*
X34130Y-80330D01*
X34130Y-80330D02*
X34130Y-80640D01*
X197600Y-77900D02*
X193600Y-81900D01*
X65850Y-93450D02*
X67550Y-91750D01*
X33050Y-93450D02*
X65850Y-93450D01*
X33050Y-80650D02*
X33050Y-93450D01*
X64350Y-80650D02*
X33050Y-80650D01*
X68600Y-84900D02*
X64350Y-80650D01*
X184100Y-84900D02*
X68600Y-84900D01*
X185600Y-83400D02*
X184100Y-84900D01*
X185600Y-74300D02*
X185600Y-83400D01*
X197600Y-74300D02*
X197600Y-77900D01*
X197600Y-74300D02*
X185600Y-74300D01*
G54D12*
X37730Y-82655D03*
X38065Y-82650D03*
G54D13*
X190600Y-76000D03*
G54D12*
X37400Y-82200D03*
X37400Y-81950D03*
G54D13*
X189530Y-74740D03*
X188350Y-74740D03*
G54D12*
X192880Y-74620D03*
X193080Y-74900D03*
X37400Y-93250D03*
X188340Y-77500D03*
X188160Y-77340D03*
X37400Y-83420D03*
X193075Y-77500D03*
X37400Y-88530D03*
X192880Y-77340D03*
X193470Y-77500D03*
X37400Y-88940D03*
X193280Y-77340D03*
X193865Y-77500D03*
X193660Y-77340D03*
X37400Y-89340D03*
X194255Y-77500D03*
X37400Y-89730D03*
X194060Y-77340D03*
X194650Y-77500D03*
X194460Y-77340D03*
X37400Y-90130D03*
X195040Y-77500D03*
X194840Y-77340D03*
X37400Y-90520D03*
X188745Y-77500D03*
X188540Y-77340D03*
X37400Y-83810D03*
X189140Y-77500D03*
X188940Y-77340D03*
X37400Y-84210D03*
X189530Y-77500D03*
X189340Y-77340D03*
X37400Y-84600D03*
X189925Y-77500D03*
X189720Y-77340D03*
X37400Y-85000D03*
X190320Y-77499D03*
X190120Y-77340D03*
X37400Y-85390D03*
X190715Y-77500D03*
X190520Y-77340D03*
X37400Y-85790D03*
X191110Y-77500D03*
X190900Y-77340D03*
X37400Y-86180D03*
X192290Y-77500D03*
X192080Y-77340D03*
X37400Y-87760D03*
X192685Y-77500D03*
X37400Y-88150D03*
X192480Y-77340D03*
G54D14*
X194740Y-75840D03*
G54D12*
X193480Y-74880D03*
X37400Y-92860D03*
X193280Y-74680D03*
X194060Y-75800D03*
X194455Y-75800D03*
X193860Y-75960D03*
X37400Y-91500D03*
X194260Y-75960D03*
X37400Y-91890D03*
X37730Y-83210D03*
X38148Y-83093D03*
X106955Y-90635D03*
X110955Y-90635D03*
X108955Y-90635D03*
X104955Y-90635D03*
X72955Y-90635D03*
X76955Y-90635D03*
X80955Y-90635D03*
X84955Y-90635D03*
X88955Y-90635D03*
X92955Y-90635D03*
X96955Y-90635D03*
X100955Y-90635D03*
X102955Y-90635D03*
X98955Y-90635D03*
X94955Y-90635D03*
X90955Y-90635D03*
X86955Y-90635D03*
X82955Y-90635D03*
X78955Y-90635D03*
X74955Y-90635D03*
X124955Y-90635D03*
X128955Y-90635D03*
X132955Y-90635D03*
X136955Y-90635D03*
X140955Y-90635D03*
X144955Y-90635D03*
X148955Y-90635D03*
X152955Y-90635D03*
X150955Y-90635D03*
X146955Y-90635D03*
X142955Y-90635D03*
X138955Y-90635D03*
X134955Y-90635D03*
X130955Y-90635D03*
X126955Y-90635D03*
X155050Y-90625D03*
X70955Y-90635D03*
X68955Y-90635D03*
X66955Y-90635D03*
X37770Y-91460D03*
X37360Y-92250D03*
G54D13*
X197090Y-74810D03*
G54D12*
X37700Y-90900D03*
X38000Y-87540D03*
X37740Y-87350D03*
X38140Y-86560D03*
X37860Y-86750D03*
X64885Y-90705D03*
X55880Y-91705D03*
X59880Y-91705D03*
X61880Y-91705D03*
X57880Y-91705D03*
X53880Y-91700D03*
X63860Y-91715D03*
X159050Y-90625D03*
X163050Y-90625D03*
X167050Y-90625D03*
X171050Y-90625D03*
X175050Y-90625D03*
X179050Y-90625D03*
X183050Y-90625D03*
X185050Y-90625D03*
X181050Y-90625D03*
X177050Y-90625D03*
X173050Y-90625D03*
X169050Y-90625D03*
X165050Y-90625D03*
X161050Y-90625D03*
X157050Y-90625D03*
X188500Y-89180D03*
X187050Y-90625D03*
X193770Y-79785D03*
X192775Y-80780D03*
X191370Y-82210D03*
X191340Y-84210D03*
X195185Y-78370D03*
X191330Y-86350D03*
X189915Y-87765D03*
X37400Y-82860D03*
X37400Y-82450D03*
X64300Y-83050D03*
X38570Y-83050D03*
X54300Y-83050D03*
X58300Y-83050D03*
X62300Y-83050D03*
X60300Y-83050D03*
X56300Y-83050D03*
X66080Y-84830D03*
X67850Y-86595D03*
X152900Y-86595D03*
X54060Y-92580D03*
X56060Y-92990D03*
X58060Y-92580D03*
X60060Y-92990D03*
X62060Y-92580D03*
X65210Y-91900D03*
X65680Y-92320D03*
X37800Y-92990D03*
X37790Y-92580D03*
X66800Y-90165D03*
X68800Y-90165D03*
X70800Y-90165D03*
X154800Y-90165D03*
X53480Y-91060D03*
X57480Y-91060D03*
X61480Y-91060D03*
X59480Y-91060D03*
X55480Y-91060D03*
X63485Y-91055D03*
X64400Y-90165D03*
X37400Y-91060D03*
X63480Y-87230D03*
X55480Y-87230D03*
X59480Y-87230D03*
X61480Y-87230D03*
X57480Y-87230D03*
X53480Y-87230D03*
X37480Y-87230D03*
X63480Y-86885D03*
X37610Y-86890D03*
X53610Y-86890D03*
X57610Y-86890D03*
X61610Y-86890D03*
X59610Y-86890D03*
X55610Y-86890D03*
X64930Y-88225D03*
X67780Y-88225D03*
X69780Y-88225D03*
X153780Y-88225D03*
X67940Y-88530D03*
X69940Y-88530D03*
X153940Y-88530D03*
X64800Y-88530D03*
X188225Y-88750D03*
X189445Y-87530D03*
X187580Y-86885D03*
X187360Y-86655D03*
X155940Y-88530D03*
X159940Y-88530D03*
X163940Y-88530D03*
X167940Y-88530D03*
X171940Y-88530D03*
X175940Y-88530D03*
X179940Y-88530D03*
X183940Y-88530D03*
X181940Y-88530D03*
X177940Y-88530D03*
X173940Y-88530D03*
X169940Y-88530D03*
X165940Y-88530D03*
X161940Y-88530D03*
X157940Y-88530D03*
X125940Y-88530D03*
X129940Y-88530D03*
X133940Y-88530D03*
X137940Y-88530D03*
X141940Y-88530D03*
X145940Y-88530D03*
X149940Y-88530D03*
X151940Y-88530D03*
X147940Y-88530D03*
X143940Y-88530D03*
X139940Y-88530D03*
X135940Y-88530D03*
X131940Y-88530D03*
X127940Y-88530D03*
X73940Y-88530D03*
X77940Y-88530D03*
X81940Y-88530D03*
X85940Y-88530D03*
X89940Y-88530D03*
X93940Y-88530D03*
X97940Y-88530D03*
X101940Y-88530D03*
X99940Y-88530D03*
X95940Y-88530D03*
X91940Y-88530D03*
X87940Y-88530D03*
X83940Y-88530D03*
X79940Y-88530D03*
X75940Y-88530D03*
X71940Y-88530D03*
X103940Y-88530D03*
X107940Y-88530D03*
X109940Y-88530D03*
X105940Y-88530D03*
X155780Y-88225D03*
X159780Y-88225D03*
X163780Y-88225D03*
X167780Y-88225D03*
X171780Y-88225D03*
X175780Y-88225D03*
X179780Y-88225D03*
X183780Y-88225D03*
X181780Y-88225D03*
X177780Y-88225D03*
X173780Y-88225D03*
X169780Y-88225D03*
X165780Y-88225D03*
X161780Y-88225D03*
X157780Y-88225D03*
X125780Y-88225D03*
X129780Y-88225D03*
X133780Y-88225D03*
X137780Y-88225D03*
X141780Y-88225D03*
X145780Y-88225D03*
X149780Y-88225D03*
X151780Y-88225D03*
X147780Y-88225D03*
X143780Y-88225D03*
X139780Y-88225D03*
X135780Y-88225D03*
X131780Y-88225D03*
X127780Y-88225D03*
X73780Y-88225D03*
X77780Y-88225D03*
X81780Y-88225D03*
X85780Y-88225D03*
X89780Y-88225D03*
X93780Y-88225D03*
X97780Y-88225D03*
X101780Y-88225D03*
X99780Y-88225D03*
X95780Y-88225D03*
X91780Y-88225D03*
X87780Y-88225D03*
X83780Y-88225D03*
X79780Y-88225D03*
X75780Y-88225D03*
X71780Y-88225D03*
X103780Y-88225D03*
X107780Y-88225D03*
X109780Y-88225D03*
X105780Y-88225D03*
X188920Y-85090D03*
X191070Y-78000D03*
X188925Y-80160D03*
X188930Y-82660D03*
X185780Y-88225D03*
X185940Y-88530D03*
X189230Y-82740D03*
X191530Y-78000D03*
X189250Y-80280D03*
X189230Y-85225D03*
X190870Y-84100D03*
X190855Y-86115D03*
X156800Y-90165D03*
X160800Y-90165D03*
X164800Y-90165D03*
X168800Y-90165D03*
X172800Y-90165D03*
X176800Y-90165D03*
X180800Y-90165D03*
X184800Y-90165D03*
X182800Y-90165D03*
X178800Y-90165D03*
X174800Y-90165D03*
X170800Y-90165D03*
X166800Y-90165D03*
X162800Y-90165D03*
X158800Y-90165D03*
X126800Y-90165D03*
X130800Y-90165D03*
X134800Y-90165D03*
X138800Y-90165D03*
X142800Y-90165D03*
X146800Y-90165D03*
X150800Y-90165D03*
X152800Y-90165D03*
X148800Y-90165D03*
X144800Y-90165D03*
X140800Y-90165D03*
X136800Y-90165D03*
X132800Y-90165D03*
X128800Y-90165D03*
X124800Y-90165D03*
X74800Y-90165D03*
X78800Y-90165D03*
X82800Y-90165D03*
X86800Y-90165D03*
X90800Y-90165D03*
X94800Y-90165D03*
X98800Y-90165D03*
X102800Y-90165D03*
X100800Y-90165D03*
X96800Y-90165D03*
X92800Y-90165D03*
X88800Y-90165D03*
X84800Y-90165D03*
X80800Y-90165D03*
X76800Y-90165D03*
X72800Y-90165D03*
X104800Y-90165D03*
X108800Y-90165D03*
X110800Y-90165D03*
X106800Y-90165D03*
X186805Y-90170D03*
X104900Y-86595D03*
X108900Y-86595D03*
X110900Y-86595D03*
X106900Y-86595D03*
X102900Y-86595D03*
X70900Y-86595D03*
X74900Y-86595D03*
X78900Y-86595D03*
X82900Y-86595D03*
X86900Y-86595D03*
X90900Y-86595D03*
X94900Y-86595D03*
X98900Y-86595D03*
X100900Y-86595D03*
X96900Y-86595D03*
X92900Y-86595D03*
X88900Y-86595D03*
X84900Y-86595D03*
X80900Y-86595D03*
X76900Y-86595D03*
X72900Y-86595D03*
X126900Y-86595D03*
X130900Y-86595D03*
X134900Y-86595D03*
X138900Y-86595D03*
X142900Y-86595D03*
X146900Y-86595D03*
X150900Y-86595D03*
X148900Y-86595D03*
X144900Y-86595D03*
X140900Y-86595D03*
X136900Y-86595D03*
X132900Y-86595D03*
X128900Y-86595D03*
X124900Y-86595D03*
X156900Y-86595D03*
X160900Y-86595D03*
X164900Y-86595D03*
X168900Y-86595D03*
X172900Y-86595D03*
X176900Y-86595D03*
X180900Y-86595D03*
X182900Y-86595D03*
X178900Y-86595D03*
X174900Y-86595D03*
X170900Y-86595D03*
X166900Y-86595D03*
X162900Y-86595D03*
X158900Y-86595D03*
X154900Y-86595D03*
X190870Y-81990D03*
X192250Y-80585D03*
X193395Y-79435D03*
X184875Y-86565D03*
X37400Y-81700D03*
X37400Y-81450D03*
G54D13*
X186100Y-74800D03*
G54D12*
X194815Y-78015D03*
G54D13*
X192500Y-76100D03*
G54D12*
X186055Y-85375D03*
X187290Y-82000D03*
X187300Y-78000D03*
X187290Y-80000D03*
X187290Y-84000D03*
G54D13*
X191900Y-76100D03*
X191300Y-76100D03*
X190120Y-74740D03*
X188940Y-74740D03*
G54D15*
X37400Y-93250D02*
X37400Y-93249D01*
G54D16*
X189525Y-77505D02*
X189525Y-77510D01*
X189530Y-77500D02*
X189525Y-77505D01*
X190320Y-77499D02*
X190320Y-77500D01*
G54D15*
X38148Y-83093D02*
X38150Y-83095D01*
X64885Y-90705D02*
X64890Y-90705D01*
X191330Y-86350D02*
X189915Y-87765D01*
G54D17*
X186100Y-74800D02*
X186100Y-76800D01*
X68050Y-86200D02*
X64500Y-82650D01*
X184600Y-86200D02*
X68050Y-86200D01*
X186900Y-83900D02*
X184600Y-86200D01*
X186900Y-77600D02*
X186900Y-83900D01*
X186100Y-76800D02*
X186900Y-77600D01*
G54D15*
X63485Y-91055D02*
X63490Y-91060D01*
X187580Y-86885D02*
X187585Y-86890D01*
X187360Y-86655D02*
X187365Y-86660D01*
X192250Y-80585D02*
X192240Y-80575D01*
G54D18*
X64850Y-82000D02*
X64450Y-81600D01*
X186200Y-83600D02*
X184300Y-85500D01*
X184300Y-85500D02*
X68350Y-85500D01*
X68350Y-85500D02*
X64850Y-82000D01*
G54D19*
X186100Y-74800D02*
X186100Y-75800D01*
X186100Y-75800D02*
X186200Y-75900D01*
G54D18*
X186200Y-75900D02*
X186200Y-83600D01*
X64450Y-81600D02*
X63600Y-81600D01*
G54D10*
G36*
X64675Y-82755D02*
X38243Y-82755D01*
X38269Y-82690D01*
X38270Y-82609D01*
X38238Y-82534D01*
X38181Y-82476D01*
X38105Y-82445D01*
X38024Y-82444D01*
X37949Y-82476D01*
X37894Y-82530D01*
X37846Y-82481D01*
X37770Y-82450D01*
X37689Y-82449D01*
X37614Y-82481D01*
X37605Y-82490D01*
X37605Y-82159D01*
X37573Y-82084D01*
X37564Y-82075D01*
X37573Y-82066D01*
X37604Y-81990D01*
X37605Y-81909D01*
X37573Y-81834D01*
X37516Y-81776D01*
X37440Y-81745D01*
X37359Y-81744D01*
X37284Y-81776D01*
X37226Y-81833D01*
X37195Y-81909D01*
X37194Y-81990D01*
X37226Y-82065D01*
X37235Y-82074D01*
X37226Y-82083D01*
X37195Y-82159D01*
X37194Y-82240D01*
X37226Y-82315D01*
X37283Y-82373D01*
X37359Y-82404D01*
X37440Y-82405D01*
X37515Y-82373D01*
X37573Y-82316D01*
X37604Y-82240D01*
X37605Y-82159D01*
X37605Y-82490D01*
X37556Y-82538D01*
X37525Y-82614D01*
X37524Y-82695D01*
X37556Y-82770D01*
X37582Y-82797D01*
X37474Y-82905D01*
X33265Y-82905D01*
X33265Y-80875D01*
X64289Y-80875D01*
X64675Y-81260D01*
X64675Y-82755D01*
X64675Y-82755D01*
G37*
G54D20*
X64675Y-82755D02*
X38243Y-82755D01*
X38269Y-82690D01*
X38270Y-82609D01*
X38238Y-82534D01*
X38181Y-82476D01*
X38105Y-82445D01*
X38024Y-82444D01*
X37949Y-82476D01*
X37894Y-82530D01*
X37846Y-82481D01*
X37770Y-82450D01*
X37689Y-82449D01*
X37614Y-82481D01*
X37605Y-82490D01*
X37605Y-82159D01*
X37573Y-82084D01*
X37564Y-82075D01*
X37573Y-82066D01*
X37604Y-81990D01*
X37605Y-81909D01*
X37573Y-81834D01*
X37516Y-81776D01*
X37440Y-81745D01*
X37359Y-81744D01*
X37284Y-81776D01*
X37226Y-81833D01*
X37195Y-81909D01*
X37194Y-81990D01*
X37226Y-82065D01*
X37235Y-82074D01*
X37226Y-82083D01*
X37195Y-82159D01*
X37194Y-82240D01*
X37226Y-82315D01*
X37283Y-82373D01*
X37359Y-82404D01*
X37440Y-82405D01*
X37515Y-82373D01*
X37573Y-82316D01*
X37604Y-82240D01*
X37605Y-82159D01*
X37605Y-82490D01*
X37556Y-82538D01*
X37525Y-82614D01*
X37524Y-82695D01*
X37556Y-82770D01*
X37582Y-82797D01*
X37474Y-82905D01*
X33265Y-82905D01*
X33265Y-80875D01*
X64289Y-80875D01*
X64675Y-81260D01*
X64675Y-82755D01*
G54D10*
G36*
X197350Y-77910D02*
X196366Y-78893D01*
X196366Y-76313D01*
X196300Y-76153D01*
X196177Y-76031D01*
X196017Y-75964D01*
X195844Y-75964D01*
X195684Y-76030D01*
X195561Y-76153D01*
X195495Y-76313D01*
X195495Y-76486D01*
X195561Y-76646D01*
X195683Y-76768D01*
X195843Y-76835D01*
X196016Y-76835D01*
X196177Y-76769D01*
X196299Y-76646D01*
X196366Y-76486D01*
X196366Y-76313D01*
X196366Y-78893D01*
X193480Y-81780D01*
X192520Y-82740D01*
X192483Y-82795D01*
X192482Y-82796D01*
X192470Y-82809D01*
X192470Y-86630D01*
X187520Y-91580D01*
X67499Y-91580D01*
X67486Y-91592D01*
X67485Y-91593D01*
X67430Y-91630D01*
X65780Y-93280D01*
X37629Y-93280D01*
X37630Y-93204D01*
X37595Y-93119D01*
X37530Y-93055D01*
X37530Y-93055D01*
X37594Y-92990D01*
X37629Y-92905D01*
X37630Y-92814D01*
X37595Y-92729D01*
X37530Y-92665D01*
X37445Y-92630D01*
X37354Y-92629D01*
X37269Y-92664D01*
X37205Y-92729D01*
X37170Y-92814D01*
X37169Y-92905D01*
X37204Y-92990D01*
X37269Y-93054D01*
X37269Y-93054D01*
X37205Y-93119D01*
X37170Y-93204D01*
X37169Y-93280D01*
X33290Y-93280D01*
X33290Y-91350D01*
X37224Y-91350D01*
X37205Y-91369D01*
X37170Y-91454D01*
X37169Y-91545D01*
X37204Y-91630D01*
X37269Y-91694D01*
X37269Y-91694D01*
X37205Y-91759D01*
X37170Y-91844D01*
X37169Y-91935D01*
X37204Y-92020D01*
X37269Y-92084D01*
X37354Y-92119D01*
X37445Y-92120D01*
X37530Y-92085D01*
X37594Y-92020D01*
X37629Y-91935D01*
X37630Y-91844D01*
X37595Y-91759D01*
X37530Y-91695D01*
X37530Y-91695D01*
X37594Y-91630D01*
X37629Y-91545D01*
X37630Y-91454D01*
X37595Y-91369D01*
X37575Y-91350D01*
X63720Y-91350D01*
X64640Y-90430D01*
X186900Y-90430D01*
X191130Y-86200D01*
X191110Y-82080D01*
X195540Y-77650D01*
X195270Y-77650D01*
X195270Y-77454D01*
X195235Y-77369D01*
X195170Y-77305D01*
X195085Y-77270D01*
X195059Y-77270D01*
X195035Y-77209D01*
X194990Y-77164D01*
X194990Y-75790D01*
X194952Y-75698D01*
X194881Y-75628D01*
X194789Y-75590D01*
X194690Y-75589D01*
X194605Y-75625D01*
X194585Y-75605D01*
X194500Y-75570D01*
X194409Y-75569D01*
X194324Y-75604D01*
X194260Y-75669D01*
X194257Y-75675D01*
X194255Y-75669D01*
X194190Y-75605D01*
X194105Y-75570D01*
X194014Y-75569D01*
X193929Y-75604D01*
X193865Y-75669D01*
X193840Y-75729D01*
X193814Y-75729D01*
X193729Y-75764D01*
X193665Y-75829D01*
X193630Y-75914D01*
X193629Y-76005D01*
X193664Y-76090D01*
X193729Y-76154D01*
X193814Y-76189D01*
X193905Y-76190D01*
X193990Y-76155D01*
X194054Y-76090D01*
X194059Y-76078D01*
X194064Y-76090D01*
X194129Y-76154D01*
X194214Y-76189D01*
X194305Y-76190D01*
X194390Y-76155D01*
X194454Y-76090D01*
X194479Y-76030D01*
X194500Y-76030D01*
X194554Y-76007D01*
X194598Y-76051D01*
X194690Y-76089D01*
X194789Y-76090D01*
X194881Y-76052D01*
X194951Y-75981D01*
X194989Y-75889D01*
X194990Y-75790D01*
X194990Y-77164D01*
X194970Y-77145D01*
X194885Y-77110D01*
X194794Y-77109D01*
X194709Y-77144D01*
X194649Y-77204D01*
X194590Y-77145D01*
X194505Y-77110D01*
X194414Y-77109D01*
X194329Y-77144D01*
X194265Y-77209D01*
X194260Y-77221D01*
X194255Y-77209D01*
X194190Y-77145D01*
X194105Y-77110D01*
X194014Y-77109D01*
X193929Y-77144D01*
X193865Y-77209D01*
X193860Y-77221D01*
X193855Y-77209D01*
X193790Y-77145D01*
X193705Y-77110D01*
X193614Y-77109D01*
X193529Y-77144D01*
X193469Y-77204D01*
X193410Y-77145D01*
X193325Y-77110D01*
X193234Y-77109D01*
X193149Y-77144D01*
X193085Y-77209D01*
X193080Y-77221D01*
X193075Y-77209D01*
X193010Y-77145D01*
X192925Y-77110D01*
X192834Y-77109D01*
X192749Y-77144D01*
X192685Y-77209D01*
X192680Y-77221D01*
X192675Y-77209D01*
X192610Y-77145D01*
X192525Y-77110D01*
X192434Y-77109D01*
X192349Y-77144D01*
X192285Y-77209D01*
X192280Y-77221D01*
X192275Y-77209D01*
X192210Y-77145D01*
X192125Y-77110D01*
X192034Y-77109D01*
X191949Y-77144D01*
X191885Y-77209D01*
X191850Y-77294D01*
X191849Y-77385D01*
X191884Y-77470D01*
X191949Y-77534D01*
X192034Y-77569D01*
X192070Y-77569D01*
X192094Y-77630D01*
X192159Y-77694D01*
X192244Y-77729D01*
X192335Y-77730D01*
X192420Y-77695D01*
X192484Y-77630D01*
X192487Y-77624D01*
X192489Y-77630D01*
X192554Y-77694D01*
X192639Y-77729D01*
X192730Y-77730D01*
X192815Y-77695D01*
X192879Y-77630D01*
X192879Y-77630D01*
X192944Y-77694D01*
X193029Y-77729D01*
X193120Y-77730D01*
X193205Y-77695D01*
X193269Y-77630D01*
X193272Y-77624D01*
X193274Y-77630D01*
X193339Y-77694D01*
X193424Y-77729D01*
X193515Y-77730D01*
X193600Y-77695D01*
X193664Y-77630D01*
X193667Y-77624D01*
X193669Y-77630D01*
X193734Y-77694D01*
X193819Y-77729D01*
X193910Y-77730D01*
X193995Y-77695D01*
X194059Y-77630D01*
X194059Y-77630D01*
X194124Y-77694D01*
X194209Y-77729D01*
X194300Y-77730D01*
X194385Y-77695D01*
X194449Y-77630D01*
X194452Y-77624D01*
X194454Y-77630D01*
X194519Y-77694D01*
X194604Y-77729D01*
X194695Y-77730D01*
X194780Y-77695D01*
X194844Y-77630D01*
X194844Y-77630D01*
X194909Y-77694D01*
X194994Y-77729D01*
X195085Y-77730D01*
X195170Y-77695D01*
X195234Y-77630D01*
X195269Y-77545D01*
X195270Y-77454D01*
X195270Y-77650D01*
X195239Y-77650D01*
X190910Y-81979D01*
X190910Y-86119D01*
X186819Y-90210D01*
X64539Y-90210D01*
X63619Y-91130D01*
X37630Y-91138D01*
X37630Y-90474D01*
X37595Y-90389D01*
X37530Y-90325D01*
X37530Y-90325D01*
X37594Y-90260D01*
X37629Y-90175D01*
X37630Y-90084D01*
X37595Y-89999D01*
X37530Y-89935D01*
X37518Y-89930D01*
X37530Y-89925D01*
X37594Y-89860D01*
X37629Y-89775D01*
X37630Y-89684D01*
X37595Y-89599D01*
X37530Y-89535D01*
X37530Y-89535D01*
X37594Y-89470D01*
X37629Y-89385D01*
X37630Y-89294D01*
X37595Y-89209D01*
X37530Y-89145D01*
X37518Y-89140D01*
X37530Y-89135D01*
X37594Y-89070D01*
X37629Y-88985D01*
X37630Y-88894D01*
X37595Y-88809D01*
X37530Y-88745D01*
X37506Y-88735D01*
X37530Y-88725D01*
X37594Y-88660D01*
X37629Y-88575D01*
X37630Y-88484D01*
X37595Y-88399D01*
X37535Y-88339D01*
X37594Y-88280D01*
X37629Y-88195D01*
X37630Y-88104D01*
X37595Y-88019D01*
X37530Y-87955D01*
X37530Y-87955D01*
X37594Y-87890D01*
X37629Y-87805D01*
X37630Y-87714D01*
X37595Y-87629D01*
X37530Y-87565D01*
X37445Y-87530D01*
X37354Y-87529D01*
X37269Y-87564D01*
X37205Y-87629D01*
X37170Y-87714D01*
X37169Y-87805D01*
X37204Y-87890D01*
X37269Y-87954D01*
X37269Y-87954D01*
X37205Y-88019D01*
X37170Y-88104D01*
X37169Y-88195D01*
X37204Y-88280D01*
X37264Y-88340D01*
X37205Y-88399D01*
X37170Y-88484D01*
X37169Y-88575D01*
X37204Y-88660D01*
X37269Y-88724D01*
X37293Y-88734D01*
X37269Y-88744D01*
X37205Y-88809D01*
X37170Y-88894D01*
X37169Y-88985D01*
X37204Y-89070D01*
X37269Y-89134D01*
X37281Y-89139D01*
X37269Y-89144D01*
X37205Y-89209D01*
X37170Y-89294D01*
X37169Y-89385D01*
X37204Y-89470D01*
X37269Y-89534D01*
X37269Y-89534D01*
X37205Y-89599D01*
X37170Y-89684D01*
X37169Y-89775D01*
X37204Y-89860D01*
X37269Y-89924D01*
X37281Y-89929D01*
X37269Y-89934D01*
X37205Y-89999D01*
X37170Y-90084D01*
X37169Y-90175D01*
X37204Y-90260D01*
X37269Y-90324D01*
X37269Y-90324D01*
X37205Y-90389D01*
X37170Y-90474D01*
X37169Y-90565D01*
X37204Y-90650D01*
X37269Y-90714D01*
X37354Y-90749D01*
X37445Y-90750D01*
X37530Y-90715D01*
X37594Y-90650D01*
X37629Y-90565D01*
X37630Y-90474D01*
X37630Y-91138D01*
X33290Y-91139D01*
X33290Y-87170D01*
X63499Y-87170D01*
X64819Y-88490D01*
X185920Y-88490D01*
X189190Y-85220D01*
X189190Y-80260D01*
X191800Y-77650D01*
X191499Y-77650D01*
X191340Y-77809D01*
X191340Y-77454D01*
X191305Y-77369D01*
X191240Y-77305D01*
X191155Y-77270D01*
X191119Y-77270D01*
X191095Y-77209D01*
X191030Y-77145D01*
X191000Y-77132D01*
X191000Y-75920D01*
X190939Y-75773D01*
X190826Y-75661D01*
X190679Y-75600D01*
X190520Y-75599D01*
X190373Y-75660D01*
X190261Y-75773D01*
X190200Y-75920D01*
X190199Y-76079D01*
X190260Y-76226D01*
X190373Y-76338D01*
X190520Y-76399D01*
X190679Y-76400D01*
X190826Y-76339D01*
X190938Y-76226D01*
X190999Y-76079D01*
X191000Y-75920D01*
X191000Y-77132D01*
X190945Y-77110D01*
X190854Y-77109D01*
X190769Y-77144D01*
X190709Y-77204D01*
X190650Y-77145D01*
X190565Y-77110D01*
X190474Y-77109D01*
X190389Y-77144D01*
X190325Y-77209D01*
X190320Y-77221D01*
X190315Y-77209D01*
X190250Y-77145D01*
X190165Y-77110D01*
X190074Y-77109D01*
X189989Y-77144D01*
X189925Y-77209D01*
X189920Y-77221D01*
X189915Y-77209D01*
X189850Y-77145D01*
X189765Y-77110D01*
X189674Y-77109D01*
X189589Y-77144D01*
X189529Y-77204D01*
X189470Y-77145D01*
X189385Y-77110D01*
X189294Y-77109D01*
X189209Y-77144D01*
X189145Y-77209D01*
X189140Y-77221D01*
X189135Y-77209D01*
X189070Y-77145D01*
X188985Y-77110D01*
X188894Y-77109D01*
X188809Y-77144D01*
X188745Y-77209D01*
X188740Y-77221D01*
X188735Y-77209D01*
X188670Y-77145D01*
X188585Y-77110D01*
X188494Y-77109D01*
X188409Y-77144D01*
X188349Y-77204D01*
X188290Y-77145D01*
X188205Y-77110D01*
X188114Y-77109D01*
X188029Y-77144D01*
X187965Y-77209D01*
X187930Y-77294D01*
X187929Y-77385D01*
X187964Y-77470D01*
X188029Y-77534D01*
X188114Y-77569D01*
X188120Y-77569D01*
X188144Y-77630D01*
X188209Y-77694D01*
X188294Y-77729D01*
X188385Y-77730D01*
X188470Y-77695D01*
X188534Y-77630D01*
X188542Y-77612D01*
X188549Y-77630D01*
X188614Y-77694D01*
X188699Y-77729D01*
X188790Y-77730D01*
X188875Y-77695D01*
X188939Y-77630D01*
X188942Y-77624D01*
X188944Y-77630D01*
X189009Y-77694D01*
X189094Y-77729D01*
X189185Y-77730D01*
X189270Y-77695D01*
X189334Y-77630D01*
X189334Y-77630D01*
X189399Y-77694D01*
X189484Y-77729D01*
X189575Y-77730D01*
X189660Y-77695D01*
X189724Y-77630D01*
X189727Y-77624D01*
X189729Y-77630D01*
X189794Y-77694D01*
X189879Y-77729D01*
X189970Y-77730D01*
X190055Y-77695D01*
X190119Y-77630D01*
X190122Y-77623D01*
X190125Y-77629D01*
X190190Y-77694D01*
X190274Y-77729D01*
X190366Y-77729D01*
X190450Y-77694D01*
X190515Y-77629D01*
X190517Y-77624D01*
X190519Y-77630D01*
X190584Y-77694D01*
X190669Y-77729D01*
X190760Y-77730D01*
X190845Y-77695D01*
X190909Y-77630D01*
X190912Y-77624D01*
X190914Y-77630D01*
X190979Y-77694D01*
X191064Y-77729D01*
X191155Y-77730D01*
X191240Y-77695D01*
X191304Y-77630D01*
X191339Y-77545D01*
X191340Y-77454D01*
X191340Y-77809D01*
X188970Y-80179D01*
X188970Y-85099D01*
X187704Y-86372D01*
X187704Y-76313D01*
X187638Y-76153D01*
X187516Y-76031D01*
X187356Y-75964D01*
X187183Y-75964D01*
X187022Y-76030D01*
X186900Y-76153D01*
X186833Y-76313D01*
X186833Y-76486D01*
X186899Y-76646D01*
X187022Y-76768D01*
X187182Y-76835D01*
X187355Y-76835D01*
X187515Y-76769D01*
X187638Y-76646D01*
X187704Y-76486D01*
X187704Y-76313D01*
X187704Y-86372D01*
X185819Y-88270D01*
X64900Y-88270D01*
X63590Y-86950D01*
X37630Y-86950D01*
X37630Y-86134D01*
X37595Y-86049D01*
X37530Y-85985D01*
X37530Y-85985D01*
X37594Y-85920D01*
X37629Y-85835D01*
X37630Y-85744D01*
X37595Y-85659D01*
X37530Y-85595D01*
X37518Y-85590D01*
X37530Y-85585D01*
X37594Y-85520D01*
X37629Y-85435D01*
X37630Y-85344D01*
X37595Y-85259D01*
X37530Y-85195D01*
X37530Y-85195D01*
X37594Y-85130D01*
X37629Y-85045D01*
X37630Y-84954D01*
X37595Y-84869D01*
X37530Y-84805D01*
X37518Y-84800D01*
X37530Y-84795D01*
X37594Y-84730D01*
X37629Y-84645D01*
X37630Y-84554D01*
X37595Y-84469D01*
X37530Y-84405D01*
X37530Y-84405D01*
X37594Y-84340D01*
X37629Y-84255D01*
X37630Y-84164D01*
X37595Y-84079D01*
X37530Y-84015D01*
X37518Y-84010D01*
X37530Y-84005D01*
X37594Y-83940D01*
X37629Y-83855D01*
X37630Y-83764D01*
X37595Y-83679D01*
X37530Y-83615D01*
X37530Y-83615D01*
X37594Y-83550D01*
X37629Y-83465D01*
X37630Y-83374D01*
X37595Y-83289D01*
X37530Y-83225D01*
X37445Y-83190D01*
X37354Y-83189D01*
X37269Y-83224D01*
X37205Y-83289D01*
X37170Y-83374D01*
X37169Y-83465D01*
X37204Y-83550D01*
X37269Y-83614D01*
X37269Y-83614D01*
X37205Y-83679D01*
X37170Y-83764D01*
X37169Y-83855D01*
X37204Y-83940D01*
X37269Y-84004D01*
X37281Y-84009D01*
X37269Y-84014D01*
X37205Y-84079D01*
X37170Y-84164D01*
X37169Y-84255D01*
X37204Y-84340D01*
X37269Y-84404D01*
X37269Y-84404D01*
X37205Y-84469D01*
X37170Y-84554D01*
X37169Y-84645D01*
X37204Y-84730D01*
X37269Y-84794D01*
X37281Y-84799D01*
X37269Y-84804D01*
X37205Y-84869D01*
X37170Y-84954D01*
X37169Y-85045D01*
X37204Y-85130D01*
X37269Y-85194D01*
X37269Y-85194D01*
X37205Y-85259D01*
X37170Y-85344D01*
X37169Y-85435D01*
X37204Y-85520D01*
X37269Y-85584D01*
X37281Y-85589D01*
X37269Y-85594D01*
X37205Y-85659D01*
X37170Y-85744D01*
X37169Y-85835D01*
X37204Y-85920D01*
X37269Y-85984D01*
X37269Y-85984D01*
X37205Y-86049D01*
X37170Y-86134D01*
X37169Y-86225D01*
X37204Y-86310D01*
X37269Y-86374D01*
X37354Y-86409D01*
X37445Y-86410D01*
X37530Y-86375D01*
X37594Y-86310D01*
X37629Y-86225D01*
X37630Y-86134D01*
X37630Y-86950D01*
X33290Y-86950D01*
X33290Y-83100D01*
X37560Y-83100D01*
X37710Y-82950D01*
X64264Y-82950D01*
X67864Y-86550D01*
X68900Y-86550D01*
X184820Y-86550D01*
X187250Y-84120D01*
X187250Y-77650D01*
X185850Y-77650D01*
X185850Y-74550D01*
X187995Y-74550D01*
X187950Y-74660D01*
X187949Y-74819D01*
X188010Y-74966D01*
X188123Y-75078D01*
X188270Y-75139D01*
X188429Y-75140D01*
X188576Y-75079D01*
X188688Y-74966D01*
X188749Y-74819D01*
X188750Y-74660D01*
X188704Y-74550D01*
X189175Y-74550D01*
X189130Y-74660D01*
X189129Y-74819D01*
X189190Y-74966D01*
X189303Y-75078D01*
X189450Y-75139D01*
X189609Y-75140D01*
X189756Y-75079D01*
X189868Y-74966D01*
X189929Y-74819D01*
X189930Y-74660D01*
X189884Y-74550D01*
X192660Y-74550D01*
X192650Y-74574D01*
X192649Y-74665D01*
X192684Y-74750D01*
X192749Y-74814D01*
X192834Y-74849D01*
X192851Y-74849D01*
X192850Y-74854D01*
X192849Y-74945D01*
X192884Y-75030D01*
X192949Y-75094D01*
X193034Y-75129D01*
X193125Y-75130D01*
X193210Y-75095D01*
X193274Y-75030D01*
X193284Y-75008D01*
X193284Y-75010D01*
X193349Y-75074D01*
X193434Y-75109D01*
X193525Y-75110D01*
X193610Y-75075D01*
X193674Y-75010D01*
X193709Y-74925D01*
X193710Y-74834D01*
X193675Y-74749D01*
X193610Y-74685D01*
X193525Y-74650D01*
X193510Y-74650D01*
X193510Y-74634D01*
X193475Y-74550D01*
X197350Y-74550D01*
X197350Y-77910D01*
X197350Y-77910D01*
G37*
G54D15*
X197350Y-77910D02*
X196366Y-78893D01*
X196366Y-76313D01*
X196300Y-76153D01*
X196177Y-76031D01*
X196017Y-75964D01*
X195844Y-75964D01*
X195684Y-76030D01*
X195561Y-76153D01*
X195495Y-76313D01*
X195495Y-76486D01*
X195561Y-76646D01*
X195683Y-76768D01*
X195843Y-76835D01*
X196016Y-76835D01*
X196177Y-76769D01*
X196299Y-76646D01*
X196366Y-76486D01*
X196366Y-76313D01*
X196366Y-78893D01*
X193480Y-81780D01*
X192520Y-82740D01*
X192483Y-82795D01*
X192482Y-82796D01*
X192470Y-82809D01*
X192470Y-86630D01*
X187520Y-91580D01*
X67499Y-91580D01*
X67486Y-91592D01*
X67485Y-91593D01*
X67430Y-91630D01*
X65780Y-93280D01*
X37629Y-93280D01*
X37630Y-93204D01*
X37595Y-93119D01*
X37530Y-93055D01*
X37530Y-93055D01*
X37594Y-92990D01*
X37629Y-92905D01*
X37630Y-92814D01*
X37595Y-92729D01*
X37530Y-92665D01*
X37445Y-92630D01*
X37354Y-92629D01*
X37269Y-92664D01*
X37205Y-92729D01*
X37170Y-92814D01*
X37169Y-92905D01*
X37204Y-92990D01*
X37269Y-93054D01*
X37269Y-93054D01*
X37205Y-93119D01*
X37170Y-93204D01*
X37169Y-93280D01*
X33290Y-93280D01*
X33290Y-91350D01*
X37224Y-91350D01*
X37205Y-91369D01*
X37170Y-91454D01*
X37169Y-91545D01*
X37204Y-91630D01*
X37269Y-91694D01*
X37269Y-91694D01*
X37205Y-91759D01*
X37170Y-91844D01*
X37169Y-91935D01*
X37204Y-92020D01*
X37269Y-92084D01*
X37354Y-92119D01*
X37445Y-92120D01*
X37530Y-92085D01*
X37594Y-92020D01*
X37629Y-91935D01*
X37630Y-91844D01*
X37595Y-91759D01*
X37530Y-91695D01*
X37530Y-91695D01*
X37594Y-91630D01*
X37629Y-91545D01*
X37630Y-91454D01*
X37595Y-91369D01*
X37575Y-91350D01*
X63720Y-91350D01*
X64640Y-90430D01*
X186900Y-90430D01*
X191130Y-86200D01*
X191110Y-82080D01*
X195540Y-77650D01*
X195270Y-77650D01*
X195270Y-77454D01*
X195235Y-77369D01*
X195170Y-77305D01*
X195085Y-77270D01*
X195059Y-77270D01*
X195035Y-77209D01*
X194990Y-77164D01*
X194990Y-75790D01*
X194952Y-75698D01*
X194881Y-75628D01*
X194789Y-75590D01*
X194690Y-75589D01*
X194605Y-75625D01*
X194585Y-75605D01*
X194500Y-75570D01*
X194409Y-75569D01*
X194324Y-75604D01*
X194260Y-75669D01*
X194257Y-75675D01*
X194255Y-75669D01*
X194190Y-75605D01*
X194105Y-75570D01*
X194014Y-75569D01*
X193929Y-75604D01*
X193865Y-75669D01*
X193840Y-75729D01*
X193814Y-75729D01*
X193729Y-75764D01*
X193665Y-75829D01*
X193630Y-75914D01*
X193629Y-76005D01*
X193664Y-76090D01*
X193729Y-76154D01*
X193814Y-76189D01*
X193905Y-76190D01*
X193990Y-76155D01*
X194054Y-76090D01*
X194059Y-76078D01*
X194064Y-76090D01*
X194129Y-76154D01*
X194214Y-76189D01*
X194305Y-76190D01*
X194390Y-76155D01*
X194454Y-76090D01*
X194479Y-76030D01*
X194500Y-76030D01*
X194554Y-76007D01*
X194598Y-76051D01*
X194690Y-76089D01*
X194789Y-76090D01*
X194881Y-76052D01*
X194951Y-75981D01*
X194989Y-75889D01*
X194990Y-75790D01*
X194990Y-77164D01*
X194970Y-77145D01*
X194885Y-77110D01*
X194794Y-77109D01*
X194709Y-77144D01*
X194649Y-77204D01*
X194590Y-77145D01*
X194505Y-77110D01*
X194414Y-77109D01*
X194329Y-77144D01*
X194265Y-77209D01*
X194260Y-77221D01*
X194255Y-77209D01*
X194190Y-77145D01*
X194105Y-77110D01*
X194014Y-77109D01*
X193929Y-77144D01*
X193865Y-77209D01*
X193860Y-77221D01*
X193855Y-77209D01*
X193790Y-77145D01*
X193705Y-77110D01*
X193614Y-77109D01*
X193529Y-77144D01*
X193469Y-77204D01*
X193410Y-77145D01*
X193325Y-77110D01*
X193234Y-77109D01*
X193149Y-77144D01*
X193085Y-77209D01*
X193080Y-77221D01*
X193075Y-77209D01*
X193010Y-77145D01*
X192925Y-77110D01*
X192834Y-77109D01*
X192749Y-77144D01*
X192685Y-77209D01*
X192680Y-77221D01*
X192675Y-77209D01*
X192610Y-77145D01*
X192525Y-77110D01*
X192434Y-77109D01*
X192349Y-77144D01*
X192285Y-77209D01*
X192280Y-77221D01*
X192275Y-77209D01*
X192210Y-77145D01*
X192125Y-77110D01*
X192034Y-77109D01*
X191949Y-77144D01*
X191885Y-77209D01*
X191850Y-77294D01*
X191849Y-77385D01*
X191884Y-77470D01*
X191949Y-77534D01*
X192034Y-77569D01*
X192070Y-77569D01*
X192094Y-77630D01*
X192159Y-77694D01*
X192244Y-77729D01*
X192335Y-77730D01*
X192420Y-77695D01*
X192484Y-77630D01*
X192487Y-77624D01*
X192489Y-77630D01*
X192554Y-77694D01*
X192639Y-77729D01*
X192730Y-77730D01*
X192815Y-77695D01*
X192879Y-77630D01*
X192879Y-77630D01*
X192944Y-77694D01*
X193029Y-77729D01*
X193120Y-77730D01*
X193205Y-77695D01*
X193269Y-77630D01*
X193272Y-77624D01*
X193274Y-77630D01*
X193339Y-77694D01*
X193424Y-77729D01*
X193515Y-77730D01*
X193600Y-77695D01*
X193664Y-77630D01*
X193667Y-77624D01*
X193669Y-77630D01*
X193734Y-77694D01*
X193819Y-77729D01*
X193910Y-77730D01*
X193995Y-77695D01*
X194059Y-77630D01*
X194059Y-77630D01*
X194124Y-77694D01*
X194209Y-77729D01*
X194300Y-77730D01*
X194385Y-77695D01*
X194449Y-77630D01*
X194452Y-77624D01*
X194454Y-77630D01*
X194519Y-77694D01*
X194604Y-77729D01*
X194695Y-77730D01*
X194780Y-77695D01*
X194844Y-77630D01*
X194844Y-77630D01*
X194909Y-77694D01*
X194994Y-77729D01*
X195085Y-77730D01*
X195170Y-77695D01*
X195234Y-77630D01*
X195269Y-77545D01*
X195270Y-77454D01*
X195270Y-77650D01*
X195239Y-77650D01*
X190910Y-81979D01*
X190910Y-86119D01*
X186819Y-90210D01*
X64539Y-90210D01*
X63619Y-91130D01*
X37630Y-91138D01*
X37630Y-90474D01*
X37595Y-90389D01*
X37530Y-90325D01*
X37530Y-90325D01*
X37594Y-90260D01*
X37629Y-90175D01*
X37630Y-90084D01*
X37595Y-89999D01*
X37530Y-89935D01*
X37518Y-89930D01*
X37530Y-89925D01*
X37594Y-89860D01*
X37629Y-89775D01*
X37630Y-89684D01*
X37595Y-89599D01*
X37530Y-89535D01*
X37530Y-89535D01*
X37594Y-89470D01*
X37629Y-89385D01*
X37630Y-89294D01*
X37595Y-89209D01*
X37530Y-89145D01*
X37518Y-89140D01*
X37530Y-89135D01*
X37594Y-89070D01*
X37629Y-88985D01*
X37630Y-88894D01*
X37595Y-88809D01*
X37530Y-88745D01*
X37506Y-88735D01*
X37530Y-88725D01*
X37594Y-88660D01*
X37629Y-88575D01*
X37630Y-88484D01*
X37595Y-88399D01*
X37535Y-88339D01*
X37594Y-88280D01*
X37629Y-88195D01*
X37630Y-88104D01*
X37595Y-88019D01*
X37530Y-87955D01*
X37530Y-87955D01*
X37594Y-87890D01*
X37629Y-87805D01*
X37630Y-87714D01*
X37595Y-87629D01*
X37530Y-87565D01*
X37445Y-87530D01*
X37354Y-87529D01*
X37269Y-87564D01*
X37205Y-87629D01*
X37170Y-87714D01*
X37169Y-87805D01*
X37204Y-87890D01*
X37269Y-87954D01*
X37269Y-87954D01*
X37205Y-88019D01*
X37170Y-88104D01*
X37169Y-88195D01*
X37204Y-88280D01*
X37264Y-88340D01*
X37205Y-88399D01*
X37170Y-88484D01*
X37169Y-88575D01*
X37204Y-88660D01*
X37269Y-88724D01*
X37293Y-88734D01*
X37269Y-88744D01*
X37205Y-88809D01*
X37170Y-88894D01*
X37169Y-88985D01*
X37204Y-89070D01*
X37269Y-89134D01*
X37281Y-89139D01*
X37269Y-89144D01*
X37205Y-89209D01*
X37170Y-89294D01*
X37169Y-89385D01*
X37204Y-89470D01*
X37269Y-89534D01*
X37269Y-89534D01*
X37205Y-89599D01*
X37170Y-89684D01*
X37169Y-89775D01*
X37204Y-89860D01*
X37269Y-89924D01*
X37281Y-89929D01*
X37269Y-89934D01*
X37205Y-89999D01*
X37170Y-90084D01*
X37169Y-90175D01*
X37204Y-90260D01*
X37269Y-90324D01*
X37269Y-90324D01*
X37205Y-90389D01*
X37170Y-90474D01*
X37169Y-90565D01*
X37204Y-90650D01*
X37269Y-90714D01*
X37354Y-90749D01*
X37445Y-90750D01*
X37530Y-90715D01*
X37594Y-90650D01*
X37629Y-90565D01*
X37630Y-90474D01*
X37630Y-91138D01*
X33290Y-91139D01*
X33290Y-87170D01*
X63499Y-87170D01*
X64819Y-88490D01*
X185920Y-88490D01*
X189190Y-85220D01*
X189190Y-80260D01*
X191800Y-77650D01*
X191499Y-77650D01*
X191340Y-77809D01*
X191340Y-77454D01*
X191305Y-77369D01*
X191240Y-77305D01*
X191155Y-77270D01*
X191119Y-77270D01*
X191095Y-77209D01*
X191030Y-77145D01*
X191000Y-77132D01*
X191000Y-75920D01*
X190939Y-75773D01*
X190826Y-75661D01*
X190679Y-75600D01*
X190520Y-75599D01*
X190373Y-75660D01*
X190261Y-75773D01*
X190200Y-75920D01*
X190199Y-76079D01*
X190260Y-76226D01*
X190373Y-76338D01*
X190520Y-76399D01*
X190679Y-76400D01*
X190826Y-76339D01*
X190938Y-76226D01*
X190999Y-76079D01*
X191000Y-75920D01*
X191000Y-77132D01*
X190945Y-77110D01*
X190854Y-77109D01*
X190769Y-77144D01*
X190709Y-77204D01*
X190650Y-77145D01*
X190565Y-77110D01*
X190474Y-77109D01*
X190389Y-77144D01*
X190325Y-77209D01*
X190320Y-77221D01*
X190315Y-77209D01*
X190250Y-77145D01*
X190165Y-77110D01*
X190074Y-77109D01*
X189989Y-77144D01*
X189925Y-77209D01*
X189920Y-77221D01*
X189915Y-77209D01*
X189850Y-77145D01*
X189765Y-77110D01*
X189674Y-77109D01*
X189589Y-77144D01*
X189529Y-77204D01*
X189470Y-77145D01*
X189385Y-77110D01*
X189294Y-77109D01*
X189209Y-77144D01*
X189145Y-77209D01*
X189140Y-77221D01*
X189135Y-77209D01*
X189070Y-77145D01*
X188985Y-77110D01*
X188894Y-77109D01*
X188809Y-77144D01*
X188745Y-77209D01*
X188740Y-77221D01*
X188735Y-77209D01*
X188670Y-77145D01*
X188585Y-77110D01*
X188494Y-77109D01*
X188409Y-77144D01*
X188349Y-77204D01*
X188290Y-77145D01*
X188205Y-77110D01*
X188114Y-77109D01*
X188029Y-77144D01*
X187965Y-77209D01*
X187930Y-77294D01*
X187929Y-77385D01*
X187964Y-77470D01*
X188029Y-77534D01*
X188114Y-77569D01*
X188120Y-77569D01*
X188144Y-77630D01*
X188209Y-77694D01*
X188294Y-77729D01*
X188385Y-77730D01*
X188470Y-77695D01*
X188534Y-77630D01*
X188542Y-77612D01*
X188549Y-77630D01*
X188614Y-77694D01*
X188699Y-77729D01*
X188790Y-77730D01*
X188875Y-77695D01*
X188939Y-77630D01*
X188942Y-77624D01*
X188944Y-77630D01*
X189009Y-77694D01*
X189094Y-77729D01*
X189185Y-77730D01*
X189270Y-77695D01*
X189334Y-77630D01*
X189334Y-77630D01*
X189399Y-77694D01*
X189484Y-77729D01*
X189575Y-77730D01*
X189660Y-77695D01*
X189724Y-77630D01*
X189727Y-77624D01*
X189729Y-77630D01*
X189794Y-77694D01*
X189879Y-77729D01*
X189970Y-77730D01*
X190055Y-77695D01*
X190119Y-77630D01*
X190122Y-77623D01*
X190125Y-77629D01*
X190190Y-77694D01*
X190274Y-77729D01*
X190366Y-77729D01*
X190450Y-77694D01*
X190515Y-77629D01*
X190517Y-77624D01*
X190519Y-77630D01*
X190584Y-77694D01*
X190669Y-77729D01*
X190760Y-77730D01*
X190845Y-77695D01*
X190909Y-77630D01*
X190912Y-77624D01*
X190914Y-77630D01*
X190979Y-77694D01*
X191064Y-77729D01*
X191155Y-77730D01*
X191240Y-77695D01*
X191304Y-77630D01*
X191339Y-77545D01*
X191340Y-77454D01*
X191340Y-77809D01*
X188970Y-80179D01*
X188970Y-85099D01*
X187704Y-86372D01*
X187704Y-76313D01*
X187638Y-76153D01*
X187516Y-76031D01*
X187356Y-75964D01*
X187183Y-75964D01*
X187022Y-76030D01*
X186900Y-76153D01*
X186833Y-76313D01*
X186833Y-76486D01*
X186899Y-76646D01*
X187022Y-76768D01*
X187182Y-76835D01*
X187355Y-76835D01*
X187515Y-76769D01*
X187638Y-76646D01*
X187704Y-76486D01*
X187704Y-76313D01*
X187704Y-86372D01*
X185819Y-88270D01*
X64900Y-88270D01*
X63590Y-86950D01*
X37630Y-86950D01*
X37630Y-86134D01*
X37595Y-86049D01*
X37530Y-85985D01*
X37530Y-85985D01*
X37594Y-85920D01*
X37629Y-85835D01*
X37630Y-85744D01*
X37595Y-85659D01*
X37530Y-85595D01*
X37518Y-85590D01*
X37530Y-85585D01*
X37594Y-85520D01*
X37629Y-85435D01*
X37630Y-85344D01*
X37595Y-85259D01*
X37530Y-85195D01*
X37530Y-85195D01*
X37594Y-85130D01*
X37629Y-85045D01*
X37630Y-84954D01*
X37595Y-84869D01*
X37530Y-84805D01*
X37518Y-84800D01*
X37530Y-84795D01*
X37594Y-84730D01*
X37629Y-84645D01*
X37630Y-84554D01*
X37595Y-84469D01*
X37530Y-84405D01*
X37530Y-84405D01*
X37594Y-84340D01*
X37629Y-84255D01*
X37630Y-84164D01*
X37595Y-84079D01*
X37530Y-84015D01*
X37518Y-84010D01*
X37530Y-84005D01*
X37594Y-83940D01*
X37629Y-83855D01*
X37630Y-83764D01*
X37595Y-83679D01*
X37530Y-83615D01*
X37530Y-83615D01*
X37594Y-83550D01*
X37629Y-83465D01*
X37630Y-83374D01*
X37595Y-83289D01*
X37530Y-83225D01*
X37445Y-83190D01*
X37354Y-83189D01*
X37269Y-83224D01*
X37205Y-83289D01*
X37170Y-83374D01*
X37169Y-83465D01*
X37204Y-83550D01*
X37269Y-83614D01*
X37269Y-83614D01*
X37205Y-83679D01*
X37170Y-83764D01*
X37169Y-83855D01*
X37204Y-83940D01*
X37269Y-84004D01*
X37281Y-84009D01*
X37269Y-84014D01*
X37205Y-84079D01*
X37170Y-84164D01*
X37169Y-84255D01*
X37204Y-84340D01*
X37269Y-84404D01*
X37269Y-84404D01*
X37205Y-84469D01*
X37170Y-84554D01*
X37169Y-84645D01*
X37204Y-84730D01*
X37269Y-84794D01*
X37281Y-84799D01*
X37269Y-84804D01*
X37205Y-84869D01*
X37170Y-84954D01*
X37169Y-85045D01*
X37204Y-85130D01*
X37269Y-85194D01*
X37269Y-85194D01*
X37205Y-85259D01*
X37170Y-85344D01*
X37169Y-85435D01*
X37204Y-85520D01*
X37269Y-85584D01*
X37281Y-85589D01*
X37269Y-85594D01*
X37205Y-85659D01*
X37170Y-85744D01*
X37169Y-85835D01*
X37204Y-85920D01*
X37269Y-85984D01*
X37269Y-85984D01*
X37205Y-86049D01*
X37170Y-86134D01*
X37169Y-86225D01*
X37204Y-86310D01*
X37269Y-86374D01*
X37354Y-86409D01*
X37445Y-86410D01*
X37530Y-86375D01*
X37594Y-86310D01*
X37629Y-86225D01*
X37630Y-86134D01*
X37630Y-86950D01*
X33290Y-86950D01*
X33290Y-83100D01*
X37560Y-83100D01*
X37710Y-82950D01*
X64264Y-82950D01*
X67864Y-86550D01*
X68900Y-86550D01*
X184820Y-86550D01*
X187250Y-84120D01*
X187250Y-77650D01*
X185850Y-77650D01*
X185850Y-74550D01*
X187995Y-74550D01*
X187950Y-74660D01*
X187949Y-74819D01*
X188010Y-74966D01*
X188123Y-75078D01*
X188270Y-75139D01*
X188429Y-75140D01*
X188576Y-75079D01*
X188688Y-74966D01*
X188749Y-74819D01*
X188750Y-74660D01*
X188704Y-74550D01*
X189175Y-74550D01*
X189130Y-74660D01*
X189129Y-74819D01*
X189190Y-74966D01*
X189303Y-75078D01*
X189450Y-75139D01*
X189609Y-75140D01*
X189756Y-75079D01*
X189868Y-74966D01*
X189929Y-74819D01*
X189930Y-74660D01*
X189884Y-74550D01*
X192660Y-74550D01*
X192650Y-74574D01*
X192649Y-74665D01*
X192684Y-74750D01*
X192749Y-74814D01*
X192834Y-74849D01*
X192851Y-74849D01*
X192850Y-74854D01*
X192849Y-74945D01*
X192884Y-75030D01*
X192949Y-75094D01*
X193034Y-75129D01*
X193125Y-75130D01*
X193210Y-75095D01*
X193274Y-75030D01*
X193284Y-75008D01*
X193284Y-75010D01*
X193349Y-75074D01*
X193434Y-75109D01*
X193525Y-75110D01*
X193610Y-75075D01*
X193674Y-75010D01*
X193709Y-74925D01*
X193710Y-74834D01*
X193675Y-74749D01*
X193610Y-74685D01*
X193525Y-74650D01*
X193510Y-74650D01*
X193510Y-74634D01*
X193475Y-74550D01*
X197350Y-74550D01*
X197350Y-77910D01*
M02*
