%FSLAX34Y34*%
G04 Gerber Fmt 3.4, Leading zero omitted, Abs format*
G04 (created by PCBNEW (2013-10-07 BZR 4378)-stable) date Fri 19 Dec 2014 03:58:14 PM EST*
%MOIN*%
G01*
G70*
G90*
G04 APERTURE LIST*
%ADD10C,0.005906*%
%ADD11C,0.003937*%
%ADD12C,0.016000*%
%ADD13C,0.050000*%
%ADD14C,0.020000*%
%ADD15C,0.010000*%
%ADD16C,0.003000*%
%ADD17C,0.030000*%
%ADD18C,0.075000*%
%ADD19C,0.050000*%
%ADD20C,0.005000*%
G04 APERTURE END LIST*
G54D10*
G54D11*
X167259Y-91750D02*
X67550Y-91750D01*
X172309Y-82860D02*
X172309Y-83000D01*
X173269Y-81900D02*
X172309Y-82860D01*
X172309Y-86700D02*
X172309Y-83000D01*
X167259Y-91750D02*
X172309Y-86700D01*
X33030Y-93450D02*
X33480Y-93450D01*
X33480Y-93450D02*
X33570Y-93540D01*
X33570Y-93540D02*
X33570Y-93640D01*
X33570Y-93640D02*
X33690Y-93760D01*
X33690Y-93760D02*
X34140Y-93760D01*
X34140Y-93760D02*
X34140Y-93450D01*
X33030Y-93450D02*
X33030Y-80650D01*
X33030Y-80650D02*
X33400Y-80650D01*
X33390Y-80650D02*
X33420Y-80650D01*
X33420Y-80650D02*
X33450Y-80650D01*
X33450Y-80650D02*
X33570Y-80530D01*
X33570Y-80530D02*
X33570Y-80440D01*
X33570Y-80440D02*
X33680Y-80330D01*
X33680Y-80330D02*
X34130Y-80330D01*
X34130Y-80330D02*
X34130Y-80640D01*
X177269Y-77900D02*
X173269Y-81900D01*
X65850Y-93450D02*
X67550Y-91750D01*
X33050Y-93450D02*
X65850Y-93450D01*
X33050Y-80650D02*
X33050Y-93450D01*
X64350Y-80650D02*
X33050Y-80650D01*
X68600Y-84900D02*
X64350Y-80650D01*
X163769Y-84900D02*
X68600Y-84900D01*
X165269Y-83400D02*
X163769Y-84900D01*
X165269Y-74300D02*
X165269Y-83400D01*
X177269Y-74300D02*
X177269Y-77900D01*
X177269Y-74300D02*
X165269Y-74300D01*
G54D12*
X38065Y-82650D03*
X37730Y-82655D03*
G54D13*
X170269Y-76000D03*
G54D12*
X37400Y-82200D03*
X37400Y-81950D03*
G54D13*
X169199Y-74740D03*
X168019Y-74740D03*
G54D12*
X172549Y-74620D03*
X172749Y-74900D03*
X37400Y-93250D03*
X168009Y-77500D03*
X167829Y-77340D03*
X37400Y-83420D03*
X172744Y-77500D03*
X37400Y-88530D03*
X172549Y-77340D03*
X173139Y-77500D03*
X37400Y-88940D03*
X172949Y-77340D03*
X173534Y-77500D03*
X37400Y-89340D03*
X173329Y-77340D03*
X173924Y-77500D03*
X37400Y-89730D03*
X173729Y-77340D03*
X174319Y-77500D03*
X174129Y-77340D03*
X37400Y-90130D03*
X174709Y-77500D03*
X174509Y-77340D03*
X37400Y-90520D03*
X168414Y-77500D03*
X168209Y-77340D03*
X37400Y-83810D03*
X168809Y-77500D03*
X168609Y-77340D03*
X37400Y-84210D03*
X169199Y-77500D03*
X169009Y-77340D03*
X37400Y-84600D03*
X169594Y-77500D03*
X169389Y-77340D03*
X37400Y-85000D03*
X169989Y-77499D03*
X169789Y-77340D03*
X37400Y-85390D03*
X170384Y-77500D03*
X170189Y-77340D03*
X37400Y-85790D03*
X170779Y-77500D03*
X170569Y-77340D03*
X37400Y-86180D03*
X171959Y-77500D03*
X171749Y-77340D03*
X37400Y-87760D03*
X172354Y-77500D03*
X37400Y-88150D03*
X172149Y-77340D03*
G54D14*
X174409Y-75840D03*
G54D12*
X173149Y-74880D03*
X37400Y-92860D03*
X172949Y-74680D03*
X173729Y-75800D03*
X174124Y-75800D03*
X173529Y-75960D03*
X37400Y-91500D03*
X173929Y-75960D03*
X37400Y-91890D03*
X37730Y-83210D03*
X38455Y-83050D03*
X64300Y-83050D03*
X38070Y-83095D03*
X54300Y-83050D03*
X58300Y-83050D03*
X62300Y-83050D03*
X60300Y-83050D03*
X56300Y-83050D03*
X66080Y-84830D03*
X37675Y-90895D03*
X38050Y-87520D03*
X37760Y-87355D03*
X37480Y-87230D03*
X38165Y-86565D03*
X37900Y-86740D03*
X37610Y-86890D03*
X37380Y-92255D03*
X37830Y-91485D03*
G54D13*
X176759Y-74810D03*
G54D12*
X166719Y-90625D03*
X168169Y-89180D03*
X106955Y-90635D03*
X110955Y-90635D03*
X108955Y-90635D03*
X104955Y-90635D03*
X72955Y-90635D03*
X76955Y-90635D03*
X80955Y-90635D03*
X84955Y-90635D03*
X88955Y-90635D03*
X92955Y-90635D03*
X96955Y-90635D03*
X100955Y-90635D03*
X102955Y-90635D03*
X98955Y-90635D03*
X94955Y-90635D03*
X90955Y-90635D03*
X86955Y-90635D03*
X82955Y-90635D03*
X78955Y-90635D03*
X74955Y-90635D03*
X124624Y-90635D03*
X128624Y-90635D03*
X132624Y-90635D03*
X130624Y-90635D03*
X126624Y-90635D03*
X134719Y-90625D03*
X70955Y-90635D03*
X68955Y-90635D03*
X66955Y-90635D03*
X54060Y-92580D03*
X56060Y-92990D03*
X58060Y-92580D03*
X60060Y-92990D03*
X62060Y-92580D03*
X65210Y-91900D03*
X65680Y-92320D03*
X37800Y-92990D03*
X37790Y-92580D03*
X64885Y-90705D03*
X55880Y-91705D03*
X59880Y-91705D03*
X61880Y-91705D03*
X57880Y-91705D03*
X53880Y-91700D03*
X63860Y-91715D03*
X138719Y-90625D03*
X142719Y-90625D03*
X146719Y-90625D03*
X150719Y-90625D03*
X154719Y-90625D03*
X158719Y-90625D03*
X162719Y-90625D03*
X164719Y-90625D03*
X160719Y-90625D03*
X156719Y-90625D03*
X152719Y-90625D03*
X148719Y-90625D03*
X144719Y-90625D03*
X140719Y-90625D03*
X136719Y-90625D03*
X173439Y-79785D03*
X172444Y-80780D03*
X171039Y-82210D03*
X171009Y-84210D03*
X174854Y-78370D03*
X64930Y-88225D03*
X67780Y-88225D03*
X69780Y-88225D03*
X133449Y-88225D03*
X167029Y-86655D03*
X135449Y-88225D03*
X139449Y-88225D03*
X143449Y-88225D03*
X147449Y-88225D03*
X151449Y-88225D03*
X155449Y-88225D03*
X159449Y-88225D03*
X163449Y-88225D03*
X161449Y-88225D03*
X157449Y-88225D03*
X153449Y-88225D03*
X149449Y-88225D03*
X145449Y-88225D03*
X141449Y-88225D03*
X137449Y-88225D03*
X125449Y-88225D03*
X129449Y-88225D03*
X131449Y-88225D03*
X127449Y-88225D03*
X73780Y-88225D03*
X77780Y-88225D03*
X81780Y-88225D03*
X85780Y-88225D03*
X89780Y-88225D03*
X93780Y-88225D03*
X97780Y-88225D03*
X101780Y-88225D03*
X99780Y-88225D03*
X95780Y-88225D03*
X91780Y-88225D03*
X87780Y-88225D03*
X83780Y-88225D03*
X79780Y-88225D03*
X75780Y-88225D03*
X71780Y-88225D03*
X103780Y-88225D03*
X107780Y-88225D03*
X109780Y-88225D03*
X105780Y-88225D03*
X168589Y-85090D03*
X165449Y-88225D03*
X168599Y-82660D03*
X168594Y-80160D03*
X170739Y-78000D03*
G54D13*
X170969Y-76100D03*
X169789Y-74740D03*
X168609Y-74740D03*
G54D12*
X37400Y-82860D03*
X37400Y-82450D03*
X67850Y-86595D03*
X132569Y-86595D03*
X66800Y-90165D03*
X68800Y-90165D03*
X70800Y-90165D03*
X134469Y-90165D03*
X53480Y-91060D03*
X57480Y-91060D03*
X61480Y-91060D03*
X59480Y-91060D03*
X55480Y-91060D03*
X63485Y-91055D03*
X64400Y-90165D03*
X37400Y-91060D03*
X63480Y-87230D03*
X55480Y-87230D03*
X59480Y-87230D03*
X61480Y-87230D03*
X57480Y-87230D03*
X53480Y-87230D03*
X63480Y-86885D03*
X53610Y-86890D03*
X57610Y-86890D03*
X61610Y-86890D03*
X59610Y-86890D03*
X55610Y-86890D03*
X67940Y-88530D03*
X69940Y-88530D03*
X133609Y-88530D03*
X64800Y-88530D03*
X167894Y-88750D03*
X169114Y-87530D03*
X167249Y-86885D03*
X135609Y-88530D03*
X139609Y-88530D03*
X143609Y-88530D03*
X147609Y-88530D03*
X151609Y-88530D03*
X155609Y-88530D03*
X159609Y-88530D03*
X163609Y-88530D03*
X161609Y-88530D03*
X157609Y-88530D03*
X153609Y-88530D03*
X149609Y-88530D03*
X145609Y-88530D03*
X141609Y-88530D03*
X137609Y-88530D03*
X125609Y-88530D03*
X129609Y-88530D03*
X131609Y-88530D03*
X127609Y-88530D03*
X73940Y-88530D03*
X77940Y-88530D03*
X81940Y-88530D03*
X85940Y-88530D03*
X89940Y-88530D03*
X93940Y-88530D03*
X97940Y-88530D03*
X101940Y-88530D03*
X99940Y-88530D03*
X95940Y-88530D03*
X91940Y-88530D03*
X87940Y-88530D03*
X83940Y-88530D03*
X79940Y-88530D03*
X75940Y-88530D03*
X71940Y-88530D03*
X103940Y-88530D03*
X107940Y-88530D03*
X109940Y-88530D03*
X105940Y-88530D03*
X165609Y-88530D03*
X168899Y-82740D03*
X168899Y-85225D03*
X170539Y-84100D03*
X170524Y-86115D03*
X168919Y-80280D03*
X171199Y-78000D03*
X136469Y-90165D03*
X140469Y-90165D03*
X144469Y-90165D03*
X148469Y-90165D03*
X152469Y-90165D03*
X156469Y-90165D03*
X160469Y-90165D03*
X164469Y-90165D03*
X162469Y-90165D03*
X158469Y-90165D03*
X154469Y-90165D03*
X150469Y-90165D03*
X146469Y-90165D03*
X142469Y-90165D03*
X138469Y-90165D03*
X126469Y-90165D03*
X130469Y-90165D03*
X132469Y-90165D03*
X128469Y-90165D03*
X124469Y-90165D03*
X74800Y-90165D03*
X78800Y-90165D03*
X82800Y-90165D03*
X86800Y-90165D03*
X90800Y-90165D03*
X94800Y-90165D03*
X98800Y-90165D03*
X102800Y-90165D03*
X100800Y-90165D03*
X96800Y-90165D03*
X92800Y-90165D03*
X88800Y-90165D03*
X84800Y-90165D03*
X80800Y-90165D03*
X76800Y-90165D03*
X72800Y-90165D03*
X104800Y-90165D03*
X108800Y-90165D03*
X110800Y-90165D03*
X106800Y-90165D03*
X166474Y-90170D03*
X104900Y-86595D03*
X108900Y-86595D03*
X110900Y-86595D03*
X106900Y-86595D03*
X102900Y-86595D03*
X70900Y-86595D03*
X74900Y-86595D03*
X78900Y-86595D03*
X82900Y-86595D03*
X86900Y-86595D03*
X90900Y-86595D03*
X94900Y-86595D03*
X98900Y-86595D03*
X100900Y-86595D03*
X96900Y-86595D03*
X92900Y-86595D03*
X88900Y-86595D03*
X84900Y-86595D03*
X80900Y-86595D03*
X76900Y-86595D03*
X72900Y-86595D03*
X126569Y-86595D03*
X130569Y-86595D03*
X128569Y-86595D03*
X124569Y-86595D03*
X136569Y-86595D03*
X140569Y-86595D03*
X144569Y-86595D03*
X148569Y-86595D03*
X152569Y-86595D03*
X156569Y-86595D03*
X160569Y-86595D03*
X162569Y-86595D03*
X158569Y-86595D03*
X154569Y-86595D03*
X150569Y-86595D03*
X146569Y-86595D03*
X142569Y-86595D03*
X138569Y-86595D03*
X134569Y-86595D03*
X170539Y-81990D03*
X171919Y-80585D03*
X173064Y-79435D03*
X164544Y-86565D03*
X37400Y-81700D03*
X37400Y-81450D03*
G54D13*
X165769Y-74800D03*
G54D12*
X174484Y-78015D03*
G54D13*
X172169Y-76100D03*
G54D12*
X165724Y-85375D03*
X166959Y-82000D03*
X166969Y-78000D03*
X166959Y-80000D03*
X166959Y-84000D03*
G54D13*
X171569Y-76100D03*
G54D15*
X37400Y-93250D02*
X37400Y-93249D01*
G54D16*
X169194Y-77505D02*
X169194Y-77510D01*
X169199Y-77500D02*
X169194Y-77505D01*
X169989Y-77499D02*
X169989Y-77500D01*
G54D15*
X64885Y-90705D02*
X64890Y-90705D01*
X167029Y-86655D02*
X167034Y-86660D01*
G54D17*
X165769Y-74800D02*
X165769Y-76800D01*
X68050Y-86200D02*
X64500Y-82650D01*
X164269Y-86200D02*
X68050Y-86200D01*
X166569Y-83900D02*
X164269Y-86200D01*
X166569Y-77600D02*
X166569Y-83900D01*
X165769Y-76800D02*
X166569Y-77600D01*
G54D15*
X63485Y-91055D02*
X63490Y-91060D01*
X167249Y-86885D02*
X167254Y-86890D01*
X171919Y-80585D02*
X171909Y-80575D01*
G54D18*
X64850Y-82000D02*
X64450Y-81600D01*
X165869Y-83600D02*
X163969Y-85500D01*
X163969Y-85500D02*
X68350Y-85500D01*
X68350Y-85500D02*
X64850Y-82000D01*
G54D19*
X165769Y-74800D02*
X165769Y-75800D01*
X165769Y-75800D02*
X165869Y-75900D01*
G54D18*
X165869Y-75900D02*
X165869Y-83600D01*
X64450Y-81600D02*
X63600Y-81600D01*
G54D10*
G36*
X64675Y-82755D02*
X38243Y-82755D01*
X38269Y-82690D01*
X38270Y-82609D01*
X38238Y-82534D01*
X38181Y-82476D01*
X38105Y-82445D01*
X38024Y-82444D01*
X37949Y-82476D01*
X37894Y-82530D01*
X37846Y-82481D01*
X37770Y-82450D01*
X37689Y-82449D01*
X37614Y-82481D01*
X37605Y-82490D01*
X37605Y-82159D01*
X37573Y-82084D01*
X37564Y-82075D01*
X37573Y-82066D01*
X37604Y-81990D01*
X37605Y-81909D01*
X37573Y-81834D01*
X37516Y-81776D01*
X37440Y-81745D01*
X37359Y-81744D01*
X37284Y-81776D01*
X37226Y-81833D01*
X37195Y-81909D01*
X37194Y-81990D01*
X37226Y-82065D01*
X37235Y-82074D01*
X37226Y-82083D01*
X37195Y-82159D01*
X37194Y-82240D01*
X37226Y-82315D01*
X37283Y-82373D01*
X37359Y-82404D01*
X37440Y-82405D01*
X37515Y-82373D01*
X37573Y-82316D01*
X37604Y-82240D01*
X37605Y-82159D01*
X37605Y-82490D01*
X37556Y-82538D01*
X37525Y-82614D01*
X37524Y-82695D01*
X37556Y-82770D01*
X37581Y-82796D01*
X37469Y-82905D01*
X33265Y-82905D01*
X33265Y-80875D01*
X64289Y-80875D01*
X64675Y-81260D01*
X64675Y-82755D01*
X64675Y-82755D01*
G37*
G54D20*
X64675Y-82755D02*
X38243Y-82755D01*
X38269Y-82690D01*
X38270Y-82609D01*
X38238Y-82534D01*
X38181Y-82476D01*
X38105Y-82445D01*
X38024Y-82444D01*
X37949Y-82476D01*
X37894Y-82530D01*
X37846Y-82481D01*
X37770Y-82450D01*
X37689Y-82449D01*
X37614Y-82481D01*
X37605Y-82490D01*
X37605Y-82159D01*
X37573Y-82084D01*
X37564Y-82075D01*
X37573Y-82066D01*
X37604Y-81990D01*
X37605Y-81909D01*
X37573Y-81834D01*
X37516Y-81776D01*
X37440Y-81745D01*
X37359Y-81744D01*
X37284Y-81776D01*
X37226Y-81833D01*
X37195Y-81909D01*
X37194Y-81990D01*
X37226Y-82065D01*
X37235Y-82074D01*
X37226Y-82083D01*
X37195Y-82159D01*
X37194Y-82240D01*
X37226Y-82315D01*
X37283Y-82373D01*
X37359Y-82404D01*
X37440Y-82405D01*
X37515Y-82373D01*
X37573Y-82316D01*
X37604Y-82240D01*
X37605Y-82159D01*
X37605Y-82490D01*
X37556Y-82538D01*
X37525Y-82614D01*
X37524Y-82695D01*
X37556Y-82770D01*
X37581Y-82796D01*
X37469Y-82905D01*
X33265Y-82905D01*
X33265Y-80875D01*
X64289Y-80875D01*
X64675Y-81260D01*
X64675Y-82755D01*
G54D10*
G36*
X177044Y-77920D02*
X176009Y-78955D01*
X176009Y-76318D01*
X175947Y-76167D01*
X175831Y-76052D01*
X175680Y-75989D01*
X175517Y-75989D01*
X175366Y-76051D01*
X175251Y-76167D01*
X175188Y-76318D01*
X175188Y-76481D01*
X175250Y-76632D01*
X175366Y-76747D01*
X175516Y-76810D01*
X175680Y-76810D01*
X175831Y-76748D01*
X175946Y-76632D01*
X176009Y-76481D01*
X176009Y-76318D01*
X176009Y-78955D01*
X173166Y-81797D01*
X173166Y-81797D01*
X172206Y-82757D01*
X172175Y-82804D01*
X172174Y-82809D01*
X172164Y-82819D01*
X172164Y-86640D01*
X167199Y-91605D01*
X67509Y-91605D01*
X67499Y-91615D01*
X67499Y-91615D01*
X67494Y-91616D01*
X67447Y-91647D01*
X65790Y-93305D01*
X37599Y-93305D01*
X37604Y-93290D01*
X37605Y-93209D01*
X37573Y-93134D01*
X37516Y-93076D01*
X37464Y-93054D01*
X37515Y-93033D01*
X37573Y-92976D01*
X37604Y-92900D01*
X37605Y-92819D01*
X37573Y-92744D01*
X37516Y-92686D01*
X37440Y-92655D01*
X37359Y-92654D01*
X37284Y-92686D01*
X37226Y-92743D01*
X37195Y-92819D01*
X37194Y-92900D01*
X37226Y-92975D01*
X37283Y-93033D01*
X37335Y-93055D01*
X37284Y-93076D01*
X37226Y-93133D01*
X37195Y-93209D01*
X37194Y-93290D01*
X37200Y-93305D01*
X33265Y-93305D01*
X33265Y-91325D01*
X37286Y-91325D01*
X37284Y-91326D01*
X37226Y-91383D01*
X37195Y-91459D01*
X37194Y-91540D01*
X37226Y-91615D01*
X37283Y-91673D01*
X37335Y-91695D01*
X37284Y-91716D01*
X37226Y-91773D01*
X37195Y-91849D01*
X37194Y-91930D01*
X37226Y-92005D01*
X37283Y-92063D01*
X37359Y-92094D01*
X37440Y-92095D01*
X37515Y-92063D01*
X37573Y-92006D01*
X37604Y-91930D01*
X37605Y-91849D01*
X37573Y-91774D01*
X37516Y-91716D01*
X37464Y-91694D01*
X37515Y-91673D01*
X37573Y-91616D01*
X37604Y-91540D01*
X37605Y-91459D01*
X37573Y-91384D01*
X37516Y-91326D01*
X37513Y-91325D01*
X63710Y-91325D01*
X64630Y-90405D01*
X166559Y-90405D01*
X170774Y-86190D01*
X170754Y-82070D01*
X175149Y-77675D01*
X174918Y-77675D01*
X174914Y-77679D01*
X174914Y-77459D01*
X174883Y-77384D01*
X174825Y-77326D01*
X174750Y-77295D01*
X174712Y-77295D01*
X174683Y-77224D01*
X174634Y-77175D01*
X174634Y-75795D01*
X174600Y-75712D01*
X174536Y-75649D01*
X174454Y-75615D01*
X174364Y-75614D01*
X174282Y-75649D01*
X174272Y-75658D01*
X174240Y-75626D01*
X174165Y-75595D01*
X174083Y-75594D01*
X174008Y-75626D01*
X173950Y-75683D01*
X173926Y-75741D01*
X173903Y-75684D01*
X173845Y-75626D01*
X173770Y-75595D01*
X173688Y-75594D01*
X173613Y-75626D01*
X173555Y-75683D01*
X173526Y-75754D01*
X173488Y-75754D01*
X173413Y-75786D01*
X173355Y-75843D01*
X173324Y-75919D01*
X173324Y-76000D01*
X173355Y-76075D01*
X173413Y-76133D01*
X173488Y-76164D01*
X173569Y-76165D01*
X173645Y-76133D01*
X173702Y-76076D01*
X173729Y-76012D01*
X173755Y-76075D01*
X173813Y-76133D01*
X173888Y-76164D01*
X173969Y-76165D01*
X174045Y-76133D01*
X174102Y-76076D01*
X174132Y-76005D01*
X174164Y-76005D01*
X174229Y-75978D01*
X174281Y-76030D01*
X174364Y-76064D01*
X174453Y-76065D01*
X174536Y-76030D01*
X174599Y-75967D01*
X174634Y-75884D01*
X174634Y-75795D01*
X174634Y-77175D01*
X174625Y-77166D01*
X174550Y-77135D01*
X174468Y-77134D01*
X174393Y-77166D01*
X174335Y-77223D01*
X174319Y-77263D01*
X174303Y-77224D01*
X174245Y-77166D01*
X174170Y-77135D01*
X174088Y-77134D01*
X174013Y-77166D01*
X173955Y-77223D01*
X173929Y-77287D01*
X173903Y-77224D01*
X173845Y-77166D01*
X173770Y-77135D01*
X173688Y-77134D01*
X173613Y-77166D01*
X173555Y-77223D01*
X173529Y-77287D01*
X173503Y-77224D01*
X173445Y-77166D01*
X173370Y-77135D01*
X173288Y-77134D01*
X173213Y-77166D01*
X173155Y-77223D01*
X173139Y-77263D01*
X173123Y-77224D01*
X173065Y-77166D01*
X172990Y-77135D01*
X172908Y-77134D01*
X172833Y-77166D01*
X172775Y-77223D01*
X172749Y-77287D01*
X172723Y-77224D01*
X172665Y-77166D01*
X172590Y-77135D01*
X172508Y-77134D01*
X172433Y-77166D01*
X172375Y-77223D01*
X172349Y-77287D01*
X172323Y-77224D01*
X172265Y-77166D01*
X172190Y-77135D01*
X172108Y-77134D01*
X172033Y-77166D01*
X171975Y-77223D01*
X171949Y-77287D01*
X171923Y-77224D01*
X171865Y-77166D01*
X171790Y-77135D01*
X171708Y-77134D01*
X171633Y-77166D01*
X171575Y-77223D01*
X171544Y-77299D01*
X171544Y-77380D01*
X171575Y-77455D01*
X171633Y-77513D01*
X171708Y-77544D01*
X171756Y-77545D01*
X171785Y-77615D01*
X171843Y-77673D01*
X171918Y-77704D01*
X171999Y-77705D01*
X172075Y-77673D01*
X172132Y-77616D01*
X172156Y-77558D01*
X172180Y-77615D01*
X172238Y-77673D01*
X172313Y-77704D01*
X172394Y-77705D01*
X172470Y-77673D01*
X172527Y-77616D01*
X172549Y-77564D01*
X172570Y-77615D01*
X172628Y-77673D01*
X172703Y-77704D01*
X172784Y-77705D01*
X172860Y-77673D01*
X172917Y-77616D01*
X172941Y-77558D01*
X172965Y-77615D01*
X173023Y-77673D01*
X173098Y-77704D01*
X173179Y-77705D01*
X173255Y-77673D01*
X173312Y-77616D01*
X173336Y-77558D01*
X173360Y-77615D01*
X173418Y-77673D01*
X173493Y-77704D01*
X173574Y-77705D01*
X173650Y-77673D01*
X173707Y-77616D01*
X173729Y-77564D01*
X173750Y-77615D01*
X173808Y-77673D01*
X173883Y-77704D01*
X173964Y-77705D01*
X174040Y-77673D01*
X174097Y-77616D01*
X174121Y-77558D01*
X174145Y-77615D01*
X174203Y-77673D01*
X174278Y-77704D01*
X174359Y-77705D01*
X174435Y-77673D01*
X174492Y-77616D01*
X174514Y-77564D01*
X174535Y-77615D01*
X174593Y-77673D01*
X174668Y-77704D01*
X174749Y-77705D01*
X174825Y-77673D01*
X174882Y-77616D01*
X174914Y-77540D01*
X174914Y-77459D01*
X174914Y-77679D01*
X170604Y-81989D01*
X170604Y-86129D01*
X166498Y-90235D01*
X64549Y-90235D01*
X63629Y-91155D01*
X37605Y-91155D01*
X37605Y-90479D01*
X37573Y-90404D01*
X37516Y-90346D01*
X37464Y-90324D01*
X37515Y-90303D01*
X37573Y-90246D01*
X37604Y-90170D01*
X37605Y-90089D01*
X37573Y-90014D01*
X37516Y-89956D01*
X37452Y-89929D01*
X37515Y-89903D01*
X37573Y-89846D01*
X37604Y-89770D01*
X37605Y-89689D01*
X37573Y-89614D01*
X37516Y-89556D01*
X37464Y-89534D01*
X37515Y-89513D01*
X37573Y-89456D01*
X37604Y-89380D01*
X37605Y-89299D01*
X37573Y-89224D01*
X37516Y-89166D01*
X37452Y-89139D01*
X37515Y-89113D01*
X37573Y-89056D01*
X37604Y-88980D01*
X37605Y-88899D01*
X37573Y-88824D01*
X37516Y-88766D01*
X37440Y-88735D01*
X37440Y-88735D01*
X37515Y-88703D01*
X37573Y-88646D01*
X37604Y-88570D01*
X37605Y-88489D01*
X37573Y-88414D01*
X37516Y-88356D01*
X37476Y-88339D01*
X37515Y-88323D01*
X37573Y-88266D01*
X37604Y-88190D01*
X37605Y-88109D01*
X37573Y-88034D01*
X37516Y-87976D01*
X37464Y-87954D01*
X37515Y-87933D01*
X37573Y-87876D01*
X37604Y-87800D01*
X37605Y-87719D01*
X37573Y-87644D01*
X37516Y-87586D01*
X37440Y-87555D01*
X37359Y-87554D01*
X37284Y-87586D01*
X37226Y-87643D01*
X37195Y-87719D01*
X37194Y-87800D01*
X37226Y-87875D01*
X37283Y-87933D01*
X37335Y-87955D01*
X37284Y-87976D01*
X37226Y-88033D01*
X37195Y-88109D01*
X37194Y-88190D01*
X37226Y-88265D01*
X37283Y-88323D01*
X37323Y-88340D01*
X37284Y-88356D01*
X37226Y-88413D01*
X37195Y-88489D01*
X37194Y-88570D01*
X37226Y-88645D01*
X37283Y-88703D01*
X37359Y-88734D01*
X37440Y-88735D01*
X37359Y-88734D01*
X37284Y-88766D01*
X37226Y-88823D01*
X37195Y-88899D01*
X37194Y-88980D01*
X37226Y-89055D01*
X37283Y-89113D01*
X37347Y-89140D01*
X37284Y-89166D01*
X37226Y-89223D01*
X37195Y-89299D01*
X37194Y-89380D01*
X37226Y-89455D01*
X37283Y-89513D01*
X37335Y-89535D01*
X37284Y-89556D01*
X37226Y-89613D01*
X37195Y-89689D01*
X37194Y-89770D01*
X37226Y-89845D01*
X37283Y-89903D01*
X37347Y-89930D01*
X37284Y-89956D01*
X37226Y-90013D01*
X37195Y-90089D01*
X37194Y-90170D01*
X37226Y-90245D01*
X37283Y-90303D01*
X37335Y-90325D01*
X37284Y-90346D01*
X37226Y-90403D01*
X37195Y-90479D01*
X37194Y-90560D01*
X37226Y-90635D01*
X37283Y-90693D01*
X37359Y-90724D01*
X37440Y-90725D01*
X37515Y-90693D01*
X37573Y-90636D01*
X37604Y-90560D01*
X37605Y-90479D01*
X37605Y-91155D01*
X33265Y-91155D01*
X33265Y-87145D01*
X63509Y-87145D01*
X64829Y-88465D01*
X165579Y-88465D01*
X168834Y-85210D01*
X168834Y-80250D01*
X171409Y-77675D01*
X171178Y-77675D01*
X170984Y-77869D01*
X170984Y-77459D01*
X170953Y-77384D01*
X170895Y-77326D01*
X170820Y-77295D01*
X170772Y-77294D01*
X170743Y-77224D01*
X170685Y-77166D01*
X170644Y-77149D01*
X170644Y-75925D01*
X170587Y-75787D01*
X170481Y-75682D01*
X170344Y-75625D01*
X170195Y-75624D01*
X170057Y-75681D01*
X169951Y-75787D01*
X169894Y-75925D01*
X169894Y-76074D01*
X169951Y-76212D01*
X170056Y-76317D01*
X170194Y-76374D01*
X170343Y-76375D01*
X170481Y-76318D01*
X170587Y-76212D01*
X170644Y-76074D01*
X170644Y-75925D01*
X170644Y-77149D01*
X170610Y-77135D01*
X170528Y-77134D01*
X170453Y-77166D01*
X170395Y-77223D01*
X170379Y-77263D01*
X170363Y-77224D01*
X170305Y-77166D01*
X170230Y-77135D01*
X170148Y-77134D01*
X170073Y-77166D01*
X170015Y-77223D01*
X169989Y-77287D01*
X169963Y-77224D01*
X169905Y-77166D01*
X169830Y-77135D01*
X169748Y-77134D01*
X169673Y-77166D01*
X169615Y-77223D01*
X169589Y-77287D01*
X169563Y-77224D01*
X169505Y-77166D01*
X169430Y-77135D01*
X169348Y-77134D01*
X169273Y-77166D01*
X169215Y-77223D01*
X169199Y-77263D01*
X169183Y-77224D01*
X169125Y-77166D01*
X169050Y-77135D01*
X168968Y-77134D01*
X168893Y-77166D01*
X168835Y-77223D01*
X168809Y-77287D01*
X168783Y-77224D01*
X168725Y-77166D01*
X168650Y-77135D01*
X168568Y-77134D01*
X168493Y-77166D01*
X168435Y-77223D01*
X168409Y-77287D01*
X168383Y-77224D01*
X168325Y-77166D01*
X168250Y-77135D01*
X168168Y-77134D01*
X168093Y-77166D01*
X168035Y-77223D01*
X168019Y-77263D01*
X168003Y-77224D01*
X167945Y-77166D01*
X167870Y-77135D01*
X167788Y-77134D01*
X167713Y-77166D01*
X167655Y-77223D01*
X167624Y-77299D01*
X167624Y-77380D01*
X167655Y-77455D01*
X167713Y-77513D01*
X167788Y-77544D01*
X167806Y-77544D01*
X167835Y-77615D01*
X167893Y-77673D01*
X167968Y-77704D01*
X168049Y-77705D01*
X168125Y-77673D01*
X168182Y-77616D01*
X168211Y-77546D01*
X168240Y-77615D01*
X168298Y-77673D01*
X168373Y-77704D01*
X168454Y-77705D01*
X168530Y-77673D01*
X168587Y-77616D01*
X168611Y-77558D01*
X168635Y-77615D01*
X168693Y-77673D01*
X168768Y-77704D01*
X168849Y-77705D01*
X168925Y-77673D01*
X168982Y-77616D01*
X169004Y-77564D01*
X169025Y-77615D01*
X169083Y-77673D01*
X169158Y-77704D01*
X169239Y-77705D01*
X169315Y-77673D01*
X169372Y-77616D01*
X169396Y-77558D01*
X169420Y-77615D01*
X169478Y-77673D01*
X169553Y-77704D01*
X169634Y-77705D01*
X169710Y-77673D01*
X169767Y-77616D01*
X169792Y-77558D01*
X169815Y-77615D01*
X169873Y-77673D01*
X169948Y-77704D01*
X170030Y-77704D01*
X170105Y-77673D01*
X170163Y-77615D01*
X170186Y-77559D01*
X170210Y-77615D01*
X170268Y-77673D01*
X170343Y-77704D01*
X170424Y-77705D01*
X170500Y-77673D01*
X170557Y-77616D01*
X170581Y-77558D01*
X170605Y-77615D01*
X170663Y-77673D01*
X170738Y-77704D01*
X170819Y-77705D01*
X170895Y-77673D01*
X170952Y-77616D01*
X170984Y-77540D01*
X170984Y-77459D01*
X170984Y-77869D01*
X168664Y-80189D01*
X168664Y-85109D01*
X167347Y-86434D01*
X167347Y-76318D01*
X167285Y-76167D01*
X167170Y-76052D01*
X167019Y-75989D01*
X166856Y-75989D01*
X166705Y-76051D01*
X166589Y-76167D01*
X166527Y-76318D01*
X166526Y-76481D01*
X166589Y-76632D01*
X166704Y-76747D01*
X166855Y-76810D01*
X167018Y-76810D01*
X167169Y-76748D01*
X167285Y-76632D01*
X167347Y-76481D01*
X167347Y-76318D01*
X167347Y-86434D01*
X165498Y-88295D01*
X64890Y-88295D01*
X63580Y-86975D01*
X37605Y-86975D01*
X37605Y-86139D01*
X37573Y-86064D01*
X37516Y-86006D01*
X37464Y-85984D01*
X37515Y-85963D01*
X37573Y-85906D01*
X37604Y-85830D01*
X37605Y-85749D01*
X37573Y-85674D01*
X37516Y-85616D01*
X37452Y-85589D01*
X37515Y-85563D01*
X37573Y-85506D01*
X37604Y-85430D01*
X37605Y-85349D01*
X37573Y-85274D01*
X37516Y-85216D01*
X37464Y-85194D01*
X37515Y-85173D01*
X37573Y-85116D01*
X37604Y-85040D01*
X37605Y-84959D01*
X37573Y-84884D01*
X37516Y-84826D01*
X37452Y-84799D01*
X37515Y-84773D01*
X37573Y-84716D01*
X37604Y-84640D01*
X37605Y-84559D01*
X37573Y-84484D01*
X37516Y-84426D01*
X37464Y-84404D01*
X37515Y-84383D01*
X37573Y-84326D01*
X37604Y-84250D01*
X37605Y-84169D01*
X37573Y-84094D01*
X37516Y-84036D01*
X37452Y-84009D01*
X37515Y-83983D01*
X37573Y-83926D01*
X37604Y-83850D01*
X37605Y-83769D01*
X37573Y-83694D01*
X37516Y-83636D01*
X37464Y-83614D01*
X37515Y-83593D01*
X37573Y-83536D01*
X37604Y-83460D01*
X37605Y-83379D01*
X37573Y-83304D01*
X37516Y-83246D01*
X37440Y-83215D01*
X37359Y-83214D01*
X37284Y-83246D01*
X37226Y-83303D01*
X37195Y-83379D01*
X37194Y-83460D01*
X37226Y-83535D01*
X37283Y-83593D01*
X37335Y-83615D01*
X37284Y-83636D01*
X37226Y-83693D01*
X37195Y-83769D01*
X37194Y-83850D01*
X37226Y-83925D01*
X37283Y-83983D01*
X37347Y-84010D01*
X37284Y-84036D01*
X37226Y-84093D01*
X37195Y-84169D01*
X37194Y-84250D01*
X37226Y-84325D01*
X37283Y-84383D01*
X37335Y-84405D01*
X37284Y-84426D01*
X37226Y-84483D01*
X37195Y-84559D01*
X37194Y-84640D01*
X37226Y-84715D01*
X37283Y-84773D01*
X37347Y-84800D01*
X37284Y-84826D01*
X37226Y-84883D01*
X37195Y-84959D01*
X37194Y-85040D01*
X37226Y-85115D01*
X37283Y-85173D01*
X37335Y-85195D01*
X37284Y-85216D01*
X37226Y-85273D01*
X37195Y-85349D01*
X37194Y-85430D01*
X37226Y-85505D01*
X37283Y-85563D01*
X37347Y-85590D01*
X37284Y-85616D01*
X37226Y-85673D01*
X37195Y-85749D01*
X37194Y-85830D01*
X37226Y-85905D01*
X37283Y-85963D01*
X37335Y-85985D01*
X37284Y-86006D01*
X37226Y-86063D01*
X37195Y-86139D01*
X37194Y-86220D01*
X37226Y-86295D01*
X37283Y-86353D01*
X37359Y-86384D01*
X37440Y-86385D01*
X37515Y-86353D01*
X37573Y-86296D01*
X37604Y-86220D01*
X37605Y-86139D01*
X37605Y-86975D01*
X33265Y-86975D01*
X33265Y-83075D01*
X37550Y-83075D01*
X37700Y-82925D01*
X64274Y-82925D01*
X67874Y-86525D01*
X68900Y-86525D01*
X164479Y-86525D01*
X166894Y-84110D01*
X166894Y-77675D01*
X165494Y-77675D01*
X165494Y-74525D01*
X167703Y-74525D01*
X167701Y-74527D01*
X167644Y-74665D01*
X167644Y-74814D01*
X167701Y-74952D01*
X167806Y-75057D01*
X167944Y-75114D01*
X168093Y-75115D01*
X168231Y-75058D01*
X168337Y-74952D01*
X168394Y-74814D01*
X168394Y-74665D01*
X168337Y-74527D01*
X168334Y-74525D01*
X168883Y-74525D01*
X168881Y-74527D01*
X168824Y-74665D01*
X168824Y-74814D01*
X168881Y-74952D01*
X168986Y-75057D01*
X169124Y-75114D01*
X169273Y-75115D01*
X169411Y-75058D01*
X169517Y-74952D01*
X169574Y-74814D01*
X169574Y-74665D01*
X169517Y-74527D01*
X169514Y-74525D01*
X172366Y-74525D01*
X172344Y-74579D01*
X172344Y-74660D01*
X172375Y-74735D01*
X172433Y-74793D01*
X172508Y-74824D01*
X172558Y-74825D01*
X172544Y-74859D01*
X172544Y-74940D01*
X172575Y-75015D01*
X172633Y-75073D01*
X172708Y-75104D01*
X172789Y-75105D01*
X172865Y-75073D01*
X172922Y-75016D01*
X172953Y-74942D01*
X172975Y-74995D01*
X173033Y-75053D01*
X173108Y-75084D01*
X173189Y-75085D01*
X173265Y-75053D01*
X173322Y-74996D01*
X173354Y-74920D01*
X173354Y-74839D01*
X173323Y-74764D01*
X173265Y-74706D01*
X173190Y-74675D01*
X173154Y-74675D01*
X173154Y-74639D01*
X173123Y-74564D01*
X173084Y-74525D01*
X177044Y-74525D01*
X177044Y-77920D01*
X177044Y-77920D01*
G37*
G54D20*
X177044Y-77920D02*
X176009Y-78955D01*
X176009Y-76318D01*
X175947Y-76167D01*
X175831Y-76052D01*
X175680Y-75989D01*
X175517Y-75989D01*
X175366Y-76051D01*
X175251Y-76167D01*
X175188Y-76318D01*
X175188Y-76481D01*
X175250Y-76632D01*
X175366Y-76747D01*
X175516Y-76810D01*
X175680Y-76810D01*
X175831Y-76748D01*
X175946Y-76632D01*
X176009Y-76481D01*
X176009Y-76318D01*
X176009Y-78955D01*
X173166Y-81797D01*
X173166Y-81797D01*
X172206Y-82757D01*
X172175Y-82804D01*
X172174Y-82809D01*
X172164Y-82819D01*
X172164Y-86640D01*
X167199Y-91605D01*
X67509Y-91605D01*
X67499Y-91615D01*
X67499Y-91615D01*
X67494Y-91616D01*
X67447Y-91647D01*
X65790Y-93305D01*
X37599Y-93305D01*
X37604Y-93290D01*
X37605Y-93209D01*
X37573Y-93134D01*
X37516Y-93076D01*
X37464Y-93054D01*
X37515Y-93033D01*
X37573Y-92976D01*
X37604Y-92900D01*
X37605Y-92819D01*
X37573Y-92744D01*
X37516Y-92686D01*
X37440Y-92655D01*
X37359Y-92654D01*
X37284Y-92686D01*
X37226Y-92743D01*
X37195Y-92819D01*
X37194Y-92900D01*
X37226Y-92975D01*
X37283Y-93033D01*
X37335Y-93055D01*
X37284Y-93076D01*
X37226Y-93133D01*
X37195Y-93209D01*
X37194Y-93290D01*
X37200Y-93305D01*
X33265Y-93305D01*
X33265Y-91325D01*
X37286Y-91325D01*
X37284Y-91326D01*
X37226Y-91383D01*
X37195Y-91459D01*
X37194Y-91540D01*
X37226Y-91615D01*
X37283Y-91673D01*
X37335Y-91695D01*
X37284Y-91716D01*
X37226Y-91773D01*
X37195Y-91849D01*
X37194Y-91930D01*
X37226Y-92005D01*
X37283Y-92063D01*
X37359Y-92094D01*
X37440Y-92095D01*
X37515Y-92063D01*
X37573Y-92006D01*
X37604Y-91930D01*
X37605Y-91849D01*
X37573Y-91774D01*
X37516Y-91716D01*
X37464Y-91694D01*
X37515Y-91673D01*
X37573Y-91616D01*
X37604Y-91540D01*
X37605Y-91459D01*
X37573Y-91384D01*
X37516Y-91326D01*
X37513Y-91325D01*
X63710Y-91325D01*
X64630Y-90405D01*
X166559Y-90405D01*
X170774Y-86190D01*
X170754Y-82070D01*
X175149Y-77675D01*
X174918Y-77675D01*
X174914Y-77679D01*
X174914Y-77459D01*
X174883Y-77384D01*
X174825Y-77326D01*
X174750Y-77295D01*
X174712Y-77295D01*
X174683Y-77224D01*
X174634Y-77175D01*
X174634Y-75795D01*
X174600Y-75712D01*
X174536Y-75649D01*
X174454Y-75615D01*
X174364Y-75614D01*
X174282Y-75649D01*
X174272Y-75658D01*
X174240Y-75626D01*
X174165Y-75595D01*
X174083Y-75594D01*
X174008Y-75626D01*
X173950Y-75683D01*
X173926Y-75741D01*
X173903Y-75684D01*
X173845Y-75626D01*
X173770Y-75595D01*
X173688Y-75594D01*
X173613Y-75626D01*
X173555Y-75683D01*
X173526Y-75754D01*
X173488Y-75754D01*
X173413Y-75786D01*
X173355Y-75843D01*
X173324Y-75919D01*
X173324Y-76000D01*
X173355Y-76075D01*
X173413Y-76133D01*
X173488Y-76164D01*
X173569Y-76165D01*
X173645Y-76133D01*
X173702Y-76076D01*
X173729Y-76012D01*
X173755Y-76075D01*
X173813Y-76133D01*
X173888Y-76164D01*
X173969Y-76165D01*
X174045Y-76133D01*
X174102Y-76076D01*
X174132Y-76005D01*
X174164Y-76005D01*
X174229Y-75978D01*
X174281Y-76030D01*
X174364Y-76064D01*
X174453Y-76065D01*
X174536Y-76030D01*
X174599Y-75967D01*
X174634Y-75884D01*
X174634Y-75795D01*
X174634Y-77175D01*
X174625Y-77166D01*
X174550Y-77135D01*
X174468Y-77134D01*
X174393Y-77166D01*
X174335Y-77223D01*
X174319Y-77263D01*
X174303Y-77224D01*
X174245Y-77166D01*
X174170Y-77135D01*
X174088Y-77134D01*
X174013Y-77166D01*
X173955Y-77223D01*
X173929Y-77287D01*
X173903Y-77224D01*
X173845Y-77166D01*
X173770Y-77135D01*
X173688Y-77134D01*
X173613Y-77166D01*
X173555Y-77223D01*
X173529Y-77287D01*
X173503Y-77224D01*
X173445Y-77166D01*
X173370Y-77135D01*
X173288Y-77134D01*
X173213Y-77166D01*
X173155Y-77223D01*
X173139Y-77263D01*
X173123Y-77224D01*
X173065Y-77166D01*
X172990Y-77135D01*
X172908Y-77134D01*
X172833Y-77166D01*
X172775Y-77223D01*
X172749Y-77287D01*
X172723Y-77224D01*
X172665Y-77166D01*
X172590Y-77135D01*
X172508Y-77134D01*
X172433Y-77166D01*
X172375Y-77223D01*
X172349Y-77287D01*
X172323Y-77224D01*
X172265Y-77166D01*
X172190Y-77135D01*
X172108Y-77134D01*
X172033Y-77166D01*
X171975Y-77223D01*
X171949Y-77287D01*
X171923Y-77224D01*
X171865Y-77166D01*
X171790Y-77135D01*
X171708Y-77134D01*
X171633Y-77166D01*
X171575Y-77223D01*
X171544Y-77299D01*
X171544Y-77380D01*
X171575Y-77455D01*
X171633Y-77513D01*
X171708Y-77544D01*
X171756Y-77545D01*
X171785Y-77615D01*
X171843Y-77673D01*
X171918Y-77704D01*
X171999Y-77705D01*
X172075Y-77673D01*
X172132Y-77616D01*
X172156Y-77558D01*
X172180Y-77615D01*
X172238Y-77673D01*
X172313Y-77704D01*
X172394Y-77705D01*
X172470Y-77673D01*
X172527Y-77616D01*
X172549Y-77564D01*
X172570Y-77615D01*
X172628Y-77673D01*
X172703Y-77704D01*
X172784Y-77705D01*
X172860Y-77673D01*
X172917Y-77616D01*
X172941Y-77558D01*
X172965Y-77615D01*
X173023Y-77673D01*
X173098Y-77704D01*
X173179Y-77705D01*
X173255Y-77673D01*
X173312Y-77616D01*
X173336Y-77558D01*
X173360Y-77615D01*
X173418Y-77673D01*
X173493Y-77704D01*
X173574Y-77705D01*
X173650Y-77673D01*
X173707Y-77616D01*
X173729Y-77564D01*
X173750Y-77615D01*
X173808Y-77673D01*
X173883Y-77704D01*
X173964Y-77705D01*
X174040Y-77673D01*
X174097Y-77616D01*
X174121Y-77558D01*
X174145Y-77615D01*
X174203Y-77673D01*
X174278Y-77704D01*
X174359Y-77705D01*
X174435Y-77673D01*
X174492Y-77616D01*
X174514Y-77564D01*
X174535Y-77615D01*
X174593Y-77673D01*
X174668Y-77704D01*
X174749Y-77705D01*
X174825Y-77673D01*
X174882Y-77616D01*
X174914Y-77540D01*
X174914Y-77459D01*
X174914Y-77679D01*
X170604Y-81989D01*
X170604Y-86129D01*
X166498Y-90235D01*
X64549Y-90235D01*
X63629Y-91155D01*
X37605Y-91155D01*
X37605Y-90479D01*
X37573Y-90404D01*
X37516Y-90346D01*
X37464Y-90324D01*
X37515Y-90303D01*
X37573Y-90246D01*
X37604Y-90170D01*
X37605Y-90089D01*
X37573Y-90014D01*
X37516Y-89956D01*
X37452Y-89929D01*
X37515Y-89903D01*
X37573Y-89846D01*
X37604Y-89770D01*
X37605Y-89689D01*
X37573Y-89614D01*
X37516Y-89556D01*
X37464Y-89534D01*
X37515Y-89513D01*
X37573Y-89456D01*
X37604Y-89380D01*
X37605Y-89299D01*
X37573Y-89224D01*
X37516Y-89166D01*
X37452Y-89139D01*
X37515Y-89113D01*
X37573Y-89056D01*
X37604Y-88980D01*
X37605Y-88899D01*
X37573Y-88824D01*
X37516Y-88766D01*
X37440Y-88735D01*
X37440Y-88735D01*
X37515Y-88703D01*
X37573Y-88646D01*
X37604Y-88570D01*
X37605Y-88489D01*
X37573Y-88414D01*
X37516Y-88356D01*
X37476Y-88339D01*
X37515Y-88323D01*
X37573Y-88266D01*
X37604Y-88190D01*
X37605Y-88109D01*
X37573Y-88034D01*
X37516Y-87976D01*
X37464Y-87954D01*
X37515Y-87933D01*
X37573Y-87876D01*
X37604Y-87800D01*
X37605Y-87719D01*
X37573Y-87644D01*
X37516Y-87586D01*
X37440Y-87555D01*
X37359Y-87554D01*
X37284Y-87586D01*
X37226Y-87643D01*
X37195Y-87719D01*
X37194Y-87800D01*
X37226Y-87875D01*
X37283Y-87933D01*
X37335Y-87955D01*
X37284Y-87976D01*
X37226Y-88033D01*
X37195Y-88109D01*
X37194Y-88190D01*
X37226Y-88265D01*
X37283Y-88323D01*
X37323Y-88340D01*
X37284Y-88356D01*
X37226Y-88413D01*
X37195Y-88489D01*
X37194Y-88570D01*
X37226Y-88645D01*
X37283Y-88703D01*
X37359Y-88734D01*
X37440Y-88735D01*
X37359Y-88734D01*
X37284Y-88766D01*
X37226Y-88823D01*
X37195Y-88899D01*
X37194Y-88980D01*
X37226Y-89055D01*
X37283Y-89113D01*
X37347Y-89140D01*
X37284Y-89166D01*
X37226Y-89223D01*
X37195Y-89299D01*
X37194Y-89380D01*
X37226Y-89455D01*
X37283Y-89513D01*
X37335Y-89535D01*
X37284Y-89556D01*
X37226Y-89613D01*
X37195Y-89689D01*
X37194Y-89770D01*
X37226Y-89845D01*
X37283Y-89903D01*
X37347Y-89930D01*
X37284Y-89956D01*
X37226Y-90013D01*
X37195Y-90089D01*
X37194Y-90170D01*
X37226Y-90245D01*
X37283Y-90303D01*
X37335Y-90325D01*
X37284Y-90346D01*
X37226Y-90403D01*
X37195Y-90479D01*
X37194Y-90560D01*
X37226Y-90635D01*
X37283Y-90693D01*
X37359Y-90724D01*
X37440Y-90725D01*
X37515Y-90693D01*
X37573Y-90636D01*
X37604Y-90560D01*
X37605Y-90479D01*
X37605Y-91155D01*
X33265Y-91155D01*
X33265Y-87145D01*
X63509Y-87145D01*
X64829Y-88465D01*
X165579Y-88465D01*
X168834Y-85210D01*
X168834Y-80250D01*
X171409Y-77675D01*
X171178Y-77675D01*
X170984Y-77869D01*
X170984Y-77459D01*
X170953Y-77384D01*
X170895Y-77326D01*
X170820Y-77295D01*
X170772Y-77294D01*
X170743Y-77224D01*
X170685Y-77166D01*
X170644Y-77149D01*
X170644Y-75925D01*
X170587Y-75787D01*
X170481Y-75682D01*
X170344Y-75625D01*
X170195Y-75624D01*
X170057Y-75681D01*
X169951Y-75787D01*
X169894Y-75925D01*
X169894Y-76074D01*
X169951Y-76212D01*
X170056Y-76317D01*
X170194Y-76374D01*
X170343Y-76375D01*
X170481Y-76318D01*
X170587Y-76212D01*
X170644Y-76074D01*
X170644Y-75925D01*
X170644Y-77149D01*
X170610Y-77135D01*
X170528Y-77134D01*
X170453Y-77166D01*
X170395Y-77223D01*
X170379Y-77263D01*
X170363Y-77224D01*
X170305Y-77166D01*
X170230Y-77135D01*
X170148Y-77134D01*
X170073Y-77166D01*
X170015Y-77223D01*
X169989Y-77287D01*
X169963Y-77224D01*
X169905Y-77166D01*
X169830Y-77135D01*
X169748Y-77134D01*
X169673Y-77166D01*
X169615Y-77223D01*
X169589Y-77287D01*
X169563Y-77224D01*
X169505Y-77166D01*
X169430Y-77135D01*
X169348Y-77134D01*
X169273Y-77166D01*
X169215Y-77223D01*
X169199Y-77263D01*
X169183Y-77224D01*
X169125Y-77166D01*
X169050Y-77135D01*
X168968Y-77134D01*
X168893Y-77166D01*
X168835Y-77223D01*
X168809Y-77287D01*
X168783Y-77224D01*
X168725Y-77166D01*
X168650Y-77135D01*
X168568Y-77134D01*
X168493Y-77166D01*
X168435Y-77223D01*
X168409Y-77287D01*
X168383Y-77224D01*
X168325Y-77166D01*
X168250Y-77135D01*
X168168Y-77134D01*
X168093Y-77166D01*
X168035Y-77223D01*
X168019Y-77263D01*
X168003Y-77224D01*
X167945Y-77166D01*
X167870Y-77135D01*
X167788Y-77134D01*
X167713Y-77166D01*
X167655Y-77223D01*
X167624Y-77299D01*
X167624Y-77380D01*
X167655Y-77455D01*
X167713Y-77513D01*
X167788Y-77544D01*
X167806Y-77544D01*
X167835Y-77615D01*
X167893Y-77673D01*
X167968Y-77704D01*
X168049Y-77705D01*
X168125Y-77673D01*
X168182Y-77616D01*
X168211Y-77546D01*
X168240Y-77615D01*
X168298Y-77673D01*
X168373Y-77704D01*
X168454Y-77705D01*
X168530Y-77673D01*
X168587Y-77616D01*
X168611Y-77558D01*
X168635Y-77615D01*
X168693Y-77673D01*
X168768Y-77704D01*
X168849Y-77705D01*
X168925Y-77673D01*
X168982Y-77616D01*
X169004Y-77564D01*
X169025Y-77615D01*
X169083Y-77673D01*
X169158Y-77704D01*
X169239Y-77705D01*
X169315Y-77673D01*
X169372Y-77616D01*
X169396Y-77558D01*
X169420Y-77615D01*
X169478Y-77673D01*
X169553Y-77704D01*
X169634Y-77705D01*
X169710Y-77673D01*
X169767Y-77616D01*
X169792Y-77558D01*
X169815Y-77615D01*
X169873Y-77673D01*
X169948Y-77704D01*
X170030Y-77704D01*
X170105Y-77673D01*
X170163Y-77615D01*
X170186Y-77559D01*
X170210Y-77615D01*
X170268Y-77673D01*
X170343Y-77704D01*
X170424Y-77705D01*
X170500Y-77673D01*
X170557Y-77616D01*
X170581Y-77558D01*
X170605Y-77615D01*
X170663Y-77673D01*
X170738Y-77704D01*
X170819Y-77705D01*
X170895Y-77673D01*
X170952Y-77616D01*
X170984Y-77540D01*
X170984Y-77459D01*
X170984Y-77869D01*
X168664Y-80189D01*
X168664Y-85109D01*
X167347Y-86434D01*
X167347Y-76318D01*
X167285Y-76167D01*
X167170Y-76052D01*
X167019Y-75989D01*
X166856Y-75989D01*
X166705Y-76051D01*
X166589Y-76167D01*
X166527Y-76318D01*
X166526Y-76481D01*
X166589Y-76632D01*
X166704Y-76747D01*
X166855Y-76810D01*
X167018Y-76810D01*
X167169Y-76748D01*
X167285Y-76632D01*
X167347Y-76481D01*
X167347Y-76318D01*
X167347Y-86434D01*
X165498Y-88295D01*
X64890Y-88295D01*
X63580Y-86975D01*
X37605Y-86975D01*
X37605Y-86139D01*
X37573Y-86064D01*
X37516Y-86006D01*
X37464Y-85984D01*
X37515Y-85963D01*
X37573Y-85906D01*
X37604Y-85830D01*
X37605Y-85749D01*
X37573Y-85674D01*
X37516Y-85616D01*
X37452Y-85589D01*
X37515Y-85563D01*
X37573Y-85506D01*
X37604Y-85430D01*
X37605Y-85349D01*
X37573Y-85274D01*
X37516Y-85216D01*
X37464Y-85194D01*
X37515Y-85173D01*
X37573Y-85116D01*
X37604Y-85040D01*
X37605Y-84959D01*
X37573Y-84884D01*
X37516Y-84826D01*
X37452Y-84799D01*
X37515Y-84773D01*
X37573Y-84716D01*
X37604Y-84640D01*
X37605Y-84559D01*
X37573Y-84484D01*
X37516Y-84426D01*
X37464Y-84404D01*
X37515Y-84383D01*
X37573Y-84326D01*
X37604Y-84250D01*
X37605Y-84169D01*
X37573Y-84094D01*
X37516Y-84036D01*
X37452Y-84009D01*
X37515Y-83983D01*
X37573Y-83926D01*
X37604Y-83850D01*
X37605Y-83769D01*
X37573Y-83694D01*
X37516Y-83636D01*
X37464Y-83614D01*
X37515Y-83593D01*
X37573Y-83536D01*
X37604Y-83460D01*
X37605Y-83379D01*
X37573Y-83304D01*
X37516Y-83246D01*
X37440Y-83215D01*
X37359Y-83214D01*
X37284Y-83246D01*
X37226Y-83303D01*
X37195Y-83379D01*
X37194Y-83460D01*
X37226Y-83535D01*
X37283Y-83593D01*
X37335Y-83615D01*
X37284Y-83636D01*
X37226Y-83693D01*
X37195Y-83769D01*
X37194Y-83850D01*
X37226Y-83925D01*
X37283Y-83983D01*
X37347Y-84010D01*
X37284Y-84036D01*
X37226Y-84093D01*
X37195Y-84169D01*
X37194Y-84250D01*
X37226Y-84325D01*
X37283Y-84383D01*
X37335Y-84405D01*
X37284Y-84426D01*
X37226Y-84483D01*
X37195Y-84559D01*
X37194Y-84640D01*
X37226Y-84715D01*
X37283Y-84773D01*
X37347Y-84800D01*
X37284Y-84826D01*
X37226Y-84883D01*
X37195Y-84959D01*
X37194Y-85040D01*
X37226Y-85115D01*
X37283Y-85173D01*
X37335Y-85195D01*
X37284Y-85216D01*
X37226Y-85273D01*
X37195Y-85349D01*
X37194Y-85430D01*
X37226Y-85505D01*
X37283Y-85563D01*
X37347Y-85590D01*
X37284Y-85616D01*
X37226Y-85673D01*
X37195Y-85749D01*
X37194Y-85830D01*
X37226Y-85905D01*
X37283Y-85963D01*
X37335Y-85985D01*
X37284Y-86006D01*
X37226Y-86063D01*
X37195Y-86139D01*
X37194Y-86220D01*
X37226Y-86295D01*
X37283Y-86353D01*
X37359Y-86384D01*
X37440Y-86385D01*
X37515Y-86353D01*
X37573Y-86296D01*
X37604Y-86220D01*
X37605Y-86139D01*
X37605Y-86975D01*
X33265Y-86975D01*
X33265Y-83075D01*
X37550Y-83075D01*
X37700Y-82925D01*
X64274Y-82925D01*
X67874Y-86525D01*
X68900Y-86525D01*
X164479Y-86525D01*
X166894Y-84110D01*
X166894Y-77675D01*
X165494Y-77675D01*
X165494Y-74525D01*
X167703Y-74525D01*
X167701Y-74527D01*
X167644Y-74665D01*
X167644Y-74814D01*
X167701Y-74952D01*
X167806Y-75057D01*
X167944Y-75114D01*
X168093Y-75115D01*
X168231Y-75058D01*
X168337Y-74952D01*
X168394Y-74814D01*
X168394Y-74665D01*
X168337Y-74527D01*
X168334Y-74525D01*
X168883Y-74525D01*
X168881Y-74527D01*
X168824Y-74665D01*
X168824Y-74814D01*
X168881Y-74952D01*
X168986Y-75057D01*
X169124Y-75114D01*
X169273Y-75115D01*
X169411Y-75058D01*
X169517Y-74952D01*
X169574Y-74814D01*
X169574Y-74665D01*
X169517Y-74527D01*
X169514Y-74525D01*
X172366Y-74525D01*
X172344Y-74579D01*
X172344Y-74660D01*
X172375Y-74735D01*
X172433Y-74793D01*
X172508Y-74824D01*
X172558Y-74825D01*
X172544Y-74859D01*
X172544Y-74940D01*
X172575Y-75015D01*
X172633Y-75073D01*
X172708Y-75104D01*
X172789Y-75105D01*
X172865Y-75073D01*
X172922Y-75016D01*
X172953Y-74942D01*
X172975Y-74995D01*
X173033Y-75053D01*
X173108Y-75084D01*
X173189Y-75085D01*
X173265Y-75053D01*
X173322Y-74996D01*
X173354Y-74920D01*
X173354Y-74839D01*
X173323Y-74764D01*
X173265Y-74706D01*
X173190Y-74675D01*
X173154Y-74675D01*
X173154Y-74639D01*
X173123Y-74564D01*
X173084Y-74525D01*
X177044Y-74525D01*
X177044Y-77920D01*
M02*
