M48
;DRILL file {Pcbnew (2013-10-07 BZR 4378)-stable} date Fri 19 Dec 2014 04:01:07 PM EST
;FORMAT={-:-/ absolute / inch / decimal}
FMAT,2
INCH,TZ
T1C0.057
%
G90
G05
M72
T1
X12.9732Y-7.64
X13.8394Y-7.64
T0
M30
