%FSLAX34Y34*%
G04 Gerber Fmt 3.4, Leading zero omitted, Abs format*
G04 (created by PCBNEW (2013-10-07 BZR 4378)-stable) date Mon 03 Nov 2014 10:34:20 AM EST*
%MOIN*%
G01*
G70*
G90*
G04 APERTURE LIST*
%ADD10C,0.005906*%
%ADD11C,0.003937*%
%ADD12C,0.025000*%
%ADD13C,0.018000*%
%ADD14C,0.050000*%
%ADD15C,0.005000*%
%ADD16C,0.075000*%
%ADD17C,0.030000*%
%ADD18C,0.010000*%
G04 APERTURE END LIST*
G54D10*
G54D11*
X82170Y-23220D02*
X82170Y-28280D01*
X86000Y-19190D02*
X86000Y-19390D01*
X72590Y-26510D02*
X74000Y-25100D01*
X71750Y-26510D02*
X72590Y-26510D01*
X44530Y-21040D02*
X44480Y-21040D01*
X50000Y-26510D02*
X44530Y-21040D01*
X38150Y-33850D02*
X46180Y-33850D01*
X38140Y-21040D02*
X44480Y-21040D01*
G54D12*
X47950Y-22822D02*
X47950Y-21822D01*
X48331Y-21822D01*
X48426Y-21870D01*
X48474Y-21917D01*
X48521Y-22012D01*
X48521Y-22155D01*
X48474Y-22250D01*
X48426Y-22298D01*
X48331Y-22346D01*
X47950Y-22346D01*
X48950Y-22822D02*
X48950Y-22155D01*
X48950Y-22346D02*
X48998Y-22250D01*
X49045Y-22203D01*
X49140Y-22155D01*
X49236Y-22155D01*
X49950Y-22774D02*
X49855Y-22822D01*
X49664Y-22822D01*
X49569Y-22774D01*
X49521Y-22679D01*
X49521Y-22298D01*
X49569Y-22203D01*
X49664Y-22155D01*
X49855Y-22155D01*
X49950Y-22203D01*
X49998Y-22298D01*
X49998Y-22393D01*
X49521Y-22489D01*
X50569Y-22822D02*
X50474Y-22774D01*
X50426Y-22679D01*
X50426Y-21822D01*
X50950Y-22822D02*
X50950Y-22155D01*
X50950Y-21822D02*
X50902Y-21870D01*
X50950Y-21917D01*
X50998Y-21870D01*
X50950Y-21822D01*
X50950Y-21917D01*
X51426Y-22822D02*
X51426Y-22155D01*
X51426Y-22250D02*
X51474Y-22203D01*
X51569Y-22155D01*
X51712Y-22155D01*
X51807Y-22203D01*
X51855Y-22298D01*
X51855Y-22822D01*
X51855Y-22298D02*
X51902Y-22203D01*
X51998Y-22155D01*
X52140Y-22155D01*
X52236Y-22203D01*
X52283Y-22298D01*
X52283Y-22822D01*
X52760Y-22822D02*
X52760Y-22155D01*
X52760Y-21822D02*
X52712Y-21870D01*
X52760Y-21917D01*
X52807Y-21870D01*
X52760Y-21822D01*
X52760Y-21917D01*
X53236Y-22155D02*
X53236Y-22822D01*
X53236Y-22250D02*
X53283Y-22203D01*
X53379Y-22155D01*
X53521Y-22155D01*
X53617Y-22203D01*
X53664Y-22298D01*
X53664Y-22822D01*
X54569Y-22822D02*
X54569Y-22298D01*
X54521Y-22203D01*
X54426Y-22155D01*
X54236Y-22155D01*
X54140Y-22203D01*
X54569Y-22774D02*
X54474Y-22822D01*
X54236Y-22822D01*
X54140Y-22774D01*
X54093Y-22679D01*
X54093Y-22584D01*
X54140Y-22489D01*
X54236Y-22441D01*
X54474Y-22441D01*
X54569Y-22393D01*
X55045Y-22822D02*
X55045Y-22155D01*
X55045Y-22346D02*
X55093Y-22250D01*
X55140Y-22203D01*
X55236Y-22155D01*
X55331Y-22155D01*
X55569Y-22155D02*
X55807Y-22822D01*
X56045Y-22155D02*
X55807Y-22822D01*
X55712Y-23060D01*
X55664Y-23108D01*
X55569Y-23155D01*
X57617Y-22822D02*
X57617Y-21822D01*
X57617Y-22774D02*
X57521Y-22822D01*
X57331Y-22822D01*
X57236Y-22774D01*
X57188Y-22727D01*
X57140Y-22631D01*
X57140Y-22346D01*
X57188Y-22250D01*
X57236Y-22203D01*
X57331Y-22155D01*
X57521Y-22155D01*
X57617Y-22203D01*
X58474Y-22774D02*
X58379Y-22822D01*
X58188Y-22822D01*
X58093Y-22774D01*
X58045Y-22679D01*
X58045Y-22298D01*
X58093Y-22203D01*
X58188Y-22155D01*
X58379Y-22155D01*
X58474Y-22203D01*
X58521Y-22298D01*
X58521Y-22393D01*
X58045Y-22489D01*
X58902Y-22774D02*
X58998Y-22822D01*
X59188Y-22822D01*
X59283Y-22774D01*
X59331Y-22679D01*
X59331Y-22631D01*
X59283Y-22536D01*
X59188Y-22489D01*
X59045Y-22489D01*
X58950Y-22441D01*
X58902Y-22346D01*
X58902Y-22298D01*
X58950Y-22203D01*
X59045Y-22155D01*
X59188Y-22155D01*
X59283Y-22203D01*
X59760Y-22822D02*
X59760Y-22155D01*
X59760Y-21822D02*
X59712Y-21870D01*
X59760Y-21917D01*
X59807Y-21870D01*
X59760Y-21822D01*
X59760Y-21917D01*
X60664Y-22155D02*
X60664Y-22965D01*
X60617Y-23060D01*
X60569Y-23108D01*
X60474Y-23155D01*
X60331Y-23155D01*
X60236Y-23108D01*
X60664Y-22774D02*
X60569Y-22822D01*
X60379Y-22822D01*
X60283Y-22774D01*
X60236Y-22727D01*
X60188Y-22631D01*
X60188Y-22346D01*
X60236Y-22250D01*
X60283Y-22203D01*
X60379Y-22155D01*
X60569Y-22155D01*
X60664Y-22203D01*
X61140Y-22155D02*
X61140Y-22822D01*
X61140Y-22250D02*
X61188Y-22203D01*
X61283Y-22155D01*
X61426Y-22155D01*
X61521Y-22203D01*
X61569Y-22298D01*
X61569Y-22822D01*
X62045Y-22727D02*
X62093Y-22774D01*
X62045Y-22822D01*
X61998Y-22774D01*
X62045Y-22727D01*
X62045Y-22822D01*
X64045Y-22822D02*
X64045Y-21822D01*
X64283Y-21822D01*
X64426Y-21870D01*
X64521Y-21965D01*
X64569Y-22060D01*
X64617Y-22250D01*
X64617Y-22393D01*
X64569Y-22584D01*
X64521Y-22679D01*
X64426Y-22774D01*
X64283Y-22822D01*
X64045Y-22822D01*
X65188Y-22822D02*
X65093Y-22774D01*
X65045Y-22727D01*
X64998Y-22631D01*
X64998Y-22346D01*
X65045Y-22250D01*
X65093Y-22203D01*
X65188Y-22155D01*
X65331Y-22155D01*
X65426Y-22203D01*
X65474Y-22250D01*
X65521Y-22346D01*
X65521Y-22631D01*
X65474Y-22727D01*
X65426Y-22774D01*
X65331Y-22822D01*
X65188Y-22822D01*
X66712Y-22155D02*
X66712Y-22822D01*
X66712Y-22250D02*
X66760Y-22203D01*
X66855Y-22155D01*
X66998Y-22155D01*
X67093Y-22203D01*
X67140Y-22298D01*
X67140Y-22822D01*
X67760Y-22822D02*
X67664Y-22774D01*
X67617Y-22727D01*
X67569Y-22631D01*
X67569Y-22346D01*
X67617Y-22250D01*
X67664Y-22203D01*
X67760Y-22155D01*
X67902Y-22155D01*
X67998Y-22203D01*
X68045Y-22250D01*
X68093Y-22346D01*
X68093Y-22631D01*
X68045Y-22727D01*
X67998Y-22774D01*
X67902Y-22822D01*
X67760Y-22822D01*
X68379Y-22155D02*
X68760Y-22155D01*
X68521Y-21822D02*
X68521Y-22679D01*
X68569Y-22774D01*
X68664Y-22822D01*
X68760Y-22822D01*
X69855Y-22822D02*
X69855Y-21822D01*
X69855Y-22203D02*
X69950Y-22155D01*
X70140Y-22155D01*
X70236Y-22203D01*
X70283Y-22250D01*
X70331Y-22346D01*
X70331Y-22631D01*
X70283Y-22727D01*
X70236Y-22774D01*
X70140Y-22822D01*
X69950Y-22822D01*
X69855Y-22774D01*
X71188Y-22155D02*
X71188Y-22822D01*
X70760Y-22155D02*
X70760Y-22679D01*
X70807Y-22774D01*
X70902Y-22822D01*
X71045Y-22822D01*
X71140Y-22774D01*
X71188Y-22727D01*
X71664Y-22822D02*
X71664Y-22155D01*
X71664Y-21822D02*
X71617Y-21870D01*
X71664Y-21917D01*
X71712Y-21870D01*
X71664Y-21822D01*
X71664Y-21917D01*
X72283Y-22822D02*
X72188Y-22774D01*
X72140Y-22679D01*
X72140Y-21822D01*
X73093Y-22822D02*
X73093Y-21822D01*
X73093Y-22774D02*
X72998Y-22822D01*
X72807Y-22822D01*
X72712Y-22774D01*
X72664Y-22727D01*
X72617Y-22631D01*
X72617Y-22346D01*
X72664Y-22250D01*
X72712Y-22203D01*
X72807Y-22155D01*
X72998Y-22155D01*
X73093Y-22203D01*
X73569Y-22727D02*
X73617Y-22774D01*
X73569Y-22822D01*
X73521Y-22774D01*
X73569Y-22727D01*
X73569Y-22822D01*
X73569Y-22441D02*
X73521Y-21870D01*
X73569Y-21822D01*
X73617Y-21870D01*
X73569Y-22441D01*
X73569Y-21822D01*
G54D11*
X86000Y-19190D02*
X86000Y-16030D01*
X82170Y-23220D02*
X86000Y-19390D01*
X76080Y-34370D02*
X82170Y-28280D01*
X46700Y-34370D02*
X76080Y-34370D01*
X46610Y-34280D02*
X46700Y-34370D01*
X46180Y-33850D02*
X46610Y-34280D01*
X38140Y-20730D02*
X38140Y-21040D01*
X37690Y-20730D02*
X38140Y-20730D01*
X37580Y-20840D02*
X37690Y-20730D01*
X37580Y-20930D02*
X37580Y-20840D01*
X37460Y-21050D02*
X37580Y-20930D01*
X37430Y-21050D02*
X37460Y-21050D01*
X37400Y-21050D02*
X37430Y-21050D01*
X37040Y-21050D02*
X37410Y-21050D01*
X37040Y-33850D02*
X37040Y-21050D01*
X38150Y-34160D02*
X38150Y-33850D01*
X37700Y-34160D02*
X38150Y-34160D01*
X37580Y-34040D02*
X37700Y-34160D01*
X37580Y-33940D02*
X37580Y-34040D01*
X37490Y-33850D02*
X37580Y-33940D01*
X37040Y-33850D02*
X37490Y-33850D01*
X74000Y-24300D02*
X74000Y-25100D01*
X74000Y-22820D02*
X74000Y-24301D01*
X50000Y-26507D02*
X71750Y-26507D01*
X74000Y-16031D02*
X86000Y-16031D01*
X74000Y-22820D02*
X74000Y-16031D01*
G54D13*
X41270Y-22840D03*
G54D14*
X79020Y-17530D03*
G54D13*
X41190Y-22130D03*
G54D14*
X77930Y-16390D03*
G54D13*
X41190Y-21340D03*
G54D14*
X76750Y-16390D03*
G54D13*
X81280Y-16350D03*
X42300Y-33650D03*
X81480Y-16540D03*
X76750Y-19020D03*
X76560Y-18880D03*
X41210Y-23810D03*
X81470Y-19020D03*
X81280Y-18880D03*
X41210Y-28930D03*
X81860Y-19020D03*
X41210Y-29330D03*
X81670Y-18880D03*
X82260Y-19020D03*
X82070Y-18880D03*
X41210Y-29710D03*
X82650Y-19020D03*
X41210Y-30110D03*
X82460Y-18880D03*
X83050Y-19020D03*
X82860Y-18880D03*
X41210Y-30500D03*
X83440Y-19020D03*
X41210Y-30900D03*
X83250Y-18880D03*
X77140Y-19020D03*
X41210Y-24210D03*
X76950Y-18880D03*
X77540Y-19020D03*
X77350Y-18880D03*
X41210Y-24600D03*
X77930Y-19030D03*
X41210Y-25000D03*
X77740Y-18880D03*
X78330Y-19020D03*
X78140Y-18880D03*
X41210Y-25380D03*
X78720Y-19020D03*
X41210Y-25780D03*
X78530Y-18880D03*
X79120Y-19020D03*
X78930Y-18880D03*
X41210Y-26170D03*
X79510Y-19020D03*
X41210Y-26570D03*
X79320Y-18880D03*
X80680Y-19020D03*
X80490Y-18880D03*
X41210Y-28140D03*
X81070Y-19020D03*
X41210Y-28540D03*
X80880Y-18880D03*
X84490Y-16900D03*
X83220Y-17480D03*
X41500Y-32660D03*
X42290Y-33260D03*
X81870Y-16550D03*
X81700Y-16370D03*
X82460Y-17370D03*
X82860Y-17370D03*
X41210Y-31880D03*
X82260Y-17490D03*
X41210Y-32270D03*
X82660Y-17490D03*
X41190Y-21730D03*
X41210Y-31480D03*
X51030Y-32760D03*
X52530Y-32760D03*
X49330Y-32760D03*
X44220Y-27870D03*
X42860Y-27870D03*
X41690Y-27870D03*
X46490Y-28560D03*
X43170Y-31340D03*
X44680Y-31350D03*
X48750Y-30550D03*
X47600Y-32760D03*
X46180Y-31340D03*
G54D14*
X80290Y-17660D03*
G54D13*
X54040Y-32760D03*
X53280Y-32910D03*
X67530Y-32760D03*
X68280Y-32910D03*
X60850Y-32910D03*
X60030Y-32760D03*
G54D14*
X74520Y-16430D03*
G54D13*
X44680Y-33260D03*
X46090Y-33260D03*
X42830Y-33260D03*
X43170Y-32170D03*
X46100Y-32170D03*
X44680Y-32170D03*
X41640Y-32170D03*
X75440Y-32880D03*
X77930Y-30390D03*
X80690Y-26780D03*
X84420Y-18620D03*
X84420Y-19050D03*
X80680Y-23200D03*
X82420Y-20390D03*
X81355Y-21455D03*
X44220Y-27020D03*
X42860Y-27020D03*
X41690Y-27020D03*
X45520Y-27410D03*
X47630Y-29540D03*
X79220Y-28570D03*
X77050Y-27670D03*
X77150Y-30640D03*
X75100Y-29600D03*
X51450Y-30600D03*
X55530Y-32760D03*
X54370Y-30590D03*
X57030Y-32760D03*
X58530Y-32760D03*
X59000Y-30450D03*
X57440Y-30590D03*
X61530Y-32760D03*
X60420Y-30570D03*
X63030Y-32760D03*
X64530Y-32760D03*
X63360Y-30610D03*
X66030Y-32760D03*
X66410Y-30580D03*
X65790Y-28120D03*
X68000Y-30450D03*
X69030Y-32760D03*
X70530Y-32760D03*
X69510Y-30580D03*
X72030Y-32760D03*
X73520Y-32760D03*
X75030Y-32760D03*
X72550Y-30580D03*
X50000Y-30450D03*
X53000Y-30450D03*
X50790Y-28120D03*
X56000Y-30450D03*
X53790Y-28120D03*
X56790Y-28120D03*
X62000Y-30450D03*
X59790Y-28120D03*
X64820Y-30410D03*
X62790Y-28120D03*
X71000Y-30450D03*
X68790Y-28120D03*
X73990Y-30450D03*
X71780Y-28120D03*
X75890Y-28620D03*
X80290Y-26010D03*
X78190Y-24970D03*
X80290Y-22520D03*
X78190Y-21970D03*
X75900Y-22510D03*
X78030Y-23470D03*
X78020Y-26470D03*
X70290Y-28120D03*
X67290Y-28120D03*
X64290Y-28120D03*
X61290Y-28120D03*
X58290Y-28120D03*
X55290Y-28120D03*
X52300Y-28120D03*
X78160Y-29630D03*
X76090Y-31700D03*
X80290Y-24020D03*
X80290Y-27510D03*
X75900Y-19060D03*
X75900Y-21020D03*
X75900Y-24010D03*
X75900Y-25510D03*
X74595Y-26815D03*
X73290Y-28120D03*
X48205Y-27035D03*
X47105Y-25935D03*
X45955Y-24785D03*
X41630Y-23620D03*
X44840Y-23670D03*
X43230Y-23670D03*
X49290Y-28120D03*
G54D14*
X78520Y-16390D03*
X80890Y-17660D03*
X80000Y-19040D03*
X85460Y-16430D03*
G54D13*
X41180Y-23170D03*
X41190Y-22520D03*
G54D14*
X79700Y-17660D03*
X77340Y-16390D03*
G54D15*
X41690Y-27870D02*
X42860Y-27870D01*
X42860Y-27870D02*
X44220Y-27870D01*
X44220Y-27870D02*
X45400Y-27870D01*
X45400Y-27870D02*
X46290Y-28760D01*
X46180Y-31340D02*
X46180Y-28870D01*
X46180Y-28870D02*
X46290Y-28760D01*
X46290Y-28760D02*
X46490Y-28560D01*
X47600Y-32760D02*
X46180Y-31340D01*
X53280Y-33220D02*
X53280Y-32910D01*
X68310Y-33220D02*
X68310Y-32940D01*
X68310Y-32940D02*
X68280Y-32910D01*
X61020Y-33220D02*
X61020Y-33060D01*
X61020Y-33060D02*
X60850Y-32910D01*
G54D16*
X74780Y-16650D02*
X74760Y-16510D01*
X74780Y-16650D02*
X74780Y-18400D01*
G54D17*
X74600Y-16510D02*
X74640Y-16510D01*
X74520Y-16430D02*
X74600Y-16510D01*
G54D15*
X42830Y-33260D02*
X44680Y-33260D01*
X84780Y-19000D02*
X84420Y-18620D01*
X46660Y-33830D02*
X46090Y-33260D01*
X75820Y-33830D02*
X46660Y-33830D01*
X81620Y-28030D02*
X75820Y-33830D01*
X81620Y-22760D02*
X81620Y-28030D01*
X84820Y-19560D02*
X81620Y-22760D01*
X84820Y-19040D02*
X84820Y-19560D01*
X84780Y-19000D02*
X84820Y-19040D01*
X44680Y-33260D02*
X46090Y-33260D01*
X41640Y-32170D02*
X43170Y-32170D01*
X44680Y-32170D02*
X46100Y-32170D01*
X75530Y-33220D02*
X68310Y-33220D01*
X68310Y-33220D02*
X61020Y-33220D01*
X61020Y-33220D02*
X53280Y-33220D01*
X53280Y-33220D02*
X47310Y-33220D01*
X47310Y-33220D02*
X46260Y-32170D01*
X46260Y-32170D02*
X46100Y-32170D01*
X75530Y-33220D02*
X75870Y-32880D01*
X43170Y-32170D02*
X44680Y-32170D01*
X78330Y-30410D02*
X78330Y-30420D01*
X75870Y-32880D02*
X75440Y-32880D01*
X78330Y-30420D02*
X75870Y-32880D01*
X78330Y-30410D02*
X77950Y-30410D01*
X80990Y-27760D02*
X80560Y-28190D01*
X80560Y-28190D02*
X79510Y-29240D01*
X79510Y-29240D02*
X79500Y-29240D01*
X79500Y-29240D02*
X78330Y-30410D01*
X80990Y-26600D02*
X80990Y-27760D01*
X77950Y-30410D02*
X77930Y-30390D01*
X80990Y-26600D02*
X80870Y-26600D01*
X80990Y-23049D02*
X80990Y-26600D01*
X80870Y-26600D02*
X80690Y-26780D01*
X80990Y-23049D02*
X80830Y-23049D01*
X84050Y-19420D02*
X80990Y-22480D01*
X80990Y-22480D02*
X80990Y-23049D01*
X84420Y-18620D02*
X84420Y-19160D01*
X84420Y-19160D02*
X84420Y-19050D01*
X84420Y-19050D02*
X84050Y-19420D01*
X80830Y-23049D02*
X80680Y-23200D01*
X81355Y-21455D02*
X81350Y-21460D01*
X41690Y-27020D02*
X42860Y-27020D01*
X42860Y-27020D02*
X44220Y-27020D01*
X44220Y-27020D02*
X45130Y-27020D01*
X45130Y-27020D02*
X45520Y-27410D01*
X79220Y-28570D02*
X77950Y-28570D01*
X77950Y-28570D02*
X77050Y-27670D01*
X71780Y-28240D02*
X73990Y-30450D01*
X71780Y-28120D02*
X71780Y-28240D01*
X80290Y-22520D02*
X78740Y-22520D01*
X78740Y-22520D02*
X78190Y-21970D01*
X75900Y-25510D02*
X77060Y-25510D01*
X77060Y-25510D02*
X78020Y-26470D01*
X74595Y-26815D02*
X75900Y-25510D01*
X74595Y-26815D02*
X73290Y-28120D01*
X43180Y-23620D02*
X41630Y-23620D01*
X45955Y-24785D02*
X44840Y-23670D01*
X43230Y-23670D02*
X43180Y-23620D01*
X49290Y-28120D02*
X48205Y-27035D01*
X48205Y-27035D02*
X47105Y-25935D01*
X47105Y-25935D02*
X45955Y-24785D01*
G54D18*
X75460Y-19100D02*
X75460Y-19080D01*
X75460Y-19080D02*
X74780Y-18400D01*
G54D17*
X41180Y-23170D02*
X41570Y-23170D01*
X75460Y-25360D02*
X75460Y-19100D01*
X73140Y-27680D02*
X75460Y-25360D01*
X49480Y-27680D02*
X73140Y-27680D01*
X44940Y-23140D02*
X49480Y-27680D01*
X41600Y-23140D02*
X44940Y-23140D01*
X41570Y-23170D02*
X41600Y-23140D01*
X41720Y-22510D02*
X41200Y-22510D01*
X41200Y-22510D02*
X41190Y-22520D01*
G54D16*
X74780Y-18400D02*
X74780Y-25020D01*
X45300Y-22510D02*
X41720Y-22510D01*
X49800Y-27010D02*
X45300Y-22510D01*
X72790Y-27010D02*
X49800Y-27010D01*
X74780Y-25020D02*
X72790Y-27010D01*
G54D10*
G36*
X85845Y-19109D02*
X84741Y-20213D01*
X84741Y-17918D01*
X84678Y-17767D01*
X84655Y-17743D01*
X84655Y-16867D01*
X84629Y-16806D01*
X84583Y-16760D01*
X84522Y-16735D01*
X84457Y-16734D01*
X84396Y-16760D01*
X84350Y-16806D01*
X84325Y-16867D01*
X84324Y-16932D01*
X84350Y-16993D01*
X84396Y-17039D01*
X84457Y-17064D01*
X84522Y-17065D01*
X84583Y-17039D01*
X84629Y-16993D01*
X84654Y-16932D01*
X84655Y-16867D01*
X84655Y-17743D01*
X84563Y-17652D01*
X84412Y-17589D01*
X84249Y-17589D01*
X84098Y-17651D01*
X83982Y-17767D01*
X83920Y-17918D01*
X83920Y-18081D01*
X83982Y-18232D01*
X84097Y-18347D01*
X84248Y-18410D01*
X84411Y-18410D01*
X84562Y-18348D01*
X84678Y-18232D01*
X84741Y-18081D01*
X84741Y-17918D01*
X84741Y-20213D01*
X82015Y-22939D01*
X82015Y-28209D01*
X76009Y-34254D01*
X46780Y-34225D01*
X46270Y-33715D01*
X42451Y-33715D01*
X42464Y-33682D01*
X42465Y-33617D01*
X42455Y-33593D01*
X42455Y-33227D01*
X42429Y-33166D01*
X42383Y-33120D01*
X42322Y-33095D01*
X42257Y-33094D01*
X42196Y-33120D01*
X42150Y-33166D01*
X42125Y-33227D01*
X42124Y-33292D01*
X42150Y-33353D01*
X42196Y-33399D01*
X42257Y-33424D01*
X42322Y-33425D01*
X42383Y-33399D01*
X42429Y-33353D01*
X42454Y-33292D01*
X42455Y-33227D01*
X42455Y-33593D01*
X42439Y-33556D01*
X42393Y-33510D01*
X42332Y-33485D01*
X42267Y-33484D01*
X42206Y-33510D01*
X42160Y-33556D01*
X42135Y-33617D01*
X42134Y-33682D01*
X42148Y-33715D01*
X41135Y-33715D01*
X41135Y-32685D01*
X41334Y-32685D01*
X41334Y-32692D01*
X41360Y-32753D01*
X41406Y-32799D01*
X41467Y-32824D01*
X41532Y-32825D01*
X41593Y-32799D01*
X41639Y-32753D01*
X41664Y-32692D01*
X41665Y-32627D01*
X41647Y-32585D01*
X46159Y-32585D01*
X47089Y-33515D01*
X75690Y-33515D01*
X81295Y-27910D01*
X81295Y-22610D01*
X84200Y-19705D01*
X84049Y-19705D01*
X83605Y-20149D01*
X83605Y-19087D01*
X83579Y-19026D01*
X83533Y-18980D01*
X83472Y-18955D01*
X83415Y-18954D01*
X83415Y-18947D01*
X83389Y-18886D01*
X83385Y-18881D01*
X83385Y-17447D01*
X83359Y-17386D01*
X83313Y-17340D01*
X83252Y-17315D01*
X83187Y-17314D01*
X83126Y-17340D01*
X83080Y-17386D01*
X83055Y-17447D01*
X83054Y-17512D01*
X83080Y-17573D01*
X83126Y-17619D01*
X83187Y-17644D01*
X83252Y-17645D01*
X83313Y-17619D01*
X83359Y-17573D01*
X83384Y-17512D01*
X83385Y-17447D01*
X83385Y-18881D01*
X83343Y-18840D01*
X83282Y-18815D01*
X83217Y-18814D01*
X83156Y-18840D01*
X83110Y-18886D01*
X83085Y-18947D01*
X83085Y-18955D01*
X83082Y-18955D01*
X83025Y-18954D01*
X83025Y-18947D01*
X83025Y-17337D01*
X82999Y-17276D01*
X82953Y-17230D01*
X82892Y-17205D01*
X82827Y-17204D01*
X82766Y-17230D01*
X82720Y-17276D01*
X82698Y-17327D01*
X82692Y-17325D01*
X82627Y-17324D01*
X82621Y-17327D01*
X82599Y-17276D01*
X82553Y-17230D01*
X82492Y-17205D01*
X82427Y-17204D01*
X82366Y-17230D01*
X82320Y-17276D01*
X82298Y-17327D01*
X82292Y-17325D01*
X82227Y-17324D01*
X82166Y-17350D01*
X82120Y-17396D01*
X82095Y-17457D01*
X82094Y-17522D01*
X82120Y-17583D01*
X82166Y-17629D01*
X82227Y-17654D01*
X82292Y-17655D01*
X82353Y-17629D01*
X82399Y-17583D01*
X82421Y-17532D01*
X82427Y-17534D01*
X82492Y-17535D01*
X82498Y-17532D01*
X82520Y-17583D01*
X82566Y-17629D01*
X82627Y-17654D01*
X82692Y-17655D01*
X82753Y-17629D01*
X82799Y-17583D01*
X82821Y-17532D01*
X82827Y-17534D01*
X82892Y-17535D01*
X82953Y-17509D01*
X82999Y-17463D01*
X83024Y-17402D01*
X83025Y-17337D01*
X83025Y-18947D01*
X82999Y-18886D01*
X82953Y-18840D01*
X82892Y-18815D01*
X82827Y-18814D01*
X82766Y-18840D01*
X82720Y-18886D01*
X82695Y-18947D01*
X82695Y-18960D01*
X82682Y-18955D01*
X82625Y-18954D01*
X82625Y-18947D01*
X82599Y-18886D01*
X82553Y-18840D01*
X82492Y-18815D01*
X82427Y-18814D01*
X82366Y-18840D01*
X82320Y-18886D01*
X82295Y-18947D01*
X82295Y-18955D01*
X82292Y-18955D01*
X82235Y-18954D01*
X82235Y-18947D01*
X82209Y-18886D01*
X82163Y-18840D01*
X82102Y-18815D01*
X82037Y-18814D01*
X82035Y-18815D01*
X82035Y-16517D01*
X82009Y-16456D01*
X81963Y-16410D01*
X81902Y-16385D01*
X81864Y-16384D01*
X81865Y-16337D01*
X81839Y-16276D01*
X81793Y-16230D01*
X81732Y-16205D01*
X81667Y-16204D01*
X81606Y-16230D01*
X81560Y-16276D01*
X81535Y-16337D01*
X81534Y-16384D01*
X81512Y-16375D01*
X81447Y-16374D01*
X81444Y-16375D01*
X81445Y-16317D01*
X81419Y-16256D01*
X81373Y-16210D01*
X81312Y-16185D01*
X81247Y-16184D01*
X81186Y-16210D01*
X81140Y-16256D01*
X81115Y-16317D01*
X81114Y-16382D01*
X81140Y-16443D01*
X81186Y-16489D01*
X81247Y-16514D01*
X81312Y-16515D01*
X81315Y-16514D01*
X81314Y-16572D01*
X81340Y-16633D01*
X81386Y-16679D01*
X81447Y-16704D01*
X81512Y-16705D01*
X81573Y-16679D01*
X81619Y-16633D01*
X81644Y-16572D01*
X81645Y-16525D01*
X81667Y-16534D01*
X81705Y-16535D01*
X81704Y-16582D01*
X81730Y-16643D01*
X81776Y-16689D01*
X81837Y-16714D01*
X81902Y-16715D01*
X81963Y-16689D01*
X82009Y-16643D01*
X82034Y-16582D01*
X82035Y-16517D01*
X82035Y-18815D01*
X81976Y-18840D01*
X81930Y-18886D01*
X81905Y-18947D01*
X81905Y-18960D01*
X81892Y-18955D01*
X81835Y-18954D01*
X81835Y-18947D01*
X81809Y-18886D01*
X81763Y-18840D01*
X81702Y-18815D01*
X81637Y-18814D01*
X81576Y-18840D01*
X81530Y-18886D01*
X81505Y-18947D01*
X81505Y-18955D01*
X81502Y-18955D01*
X81445Y-18954D01*
X81445Y-18947D01*
X81419Y-18886D01*
X81373Y-18840D01*
X81312Y-18815D01*
X81247Y-18814D01*
X81186Y-18840D01*
X81140Y-18886D01*
X81115Y-18947D01*
X81115Y-18960D01*
X81102Y-18955D01*
X81045Y-18954D01*
X81045Y-18947D01*
X81019Y-18886D01*
X80973Y-18840D01*
X80912Y-18815D01*
X80847Y-18814D01*
X80786Y-18840D01*
X80740Y-18886D01*
X80715Y-18947D01*
X80715Y-18955D01*
X80712Y-18955D01*
X80655Y-18954D01*
X80655Y-18947D01*
X80629Y-18886D01*
X80583Y-18840D01*
X80522Y-18815D01*
X80457Y-18814D01*
X80396Y-18840D01*
X80350Y-18886D01*
X80325Y-18947D01*
X80324Y-19012D01*
X80350Y-19073D01*
X80396Y-19119D01*
X80457Y-19144D01*
X80514Y-19145D01*
X80514Y-19152D01*
X80540Y-19213D01*
X80586Y-19259D01*
X80647Y-19284D01*
X80712Y-19285D01*
X80773Y-19259D01*
X80819Y-19213D01*
X80844Y-19152D01*
X80844Y-19144D01*
X80847Y-19144D01*
X80904Y-19145D01*
X80904Y-19152D01*
X80930Y-19213D01*
X80976Y-19259D01*
X81037Y-19284D01*
X81102Y-19285D01*
X81163Y-19259D01*
X81209Y-19213D01*
X81234Y-19152D01*
X81234Y-19139D01*
X81247Y-19144D01*
X81304Y-19145D01*
X81304Y-19152D01*
X81330Y-19213D01*
X81376Y-19259D01*
X81437Y-19284D01*
X81502Y-19285D01*
X81563Y-19259D01*
X81609Y-19213D01*
X81634Y-19152D01*
X81634Y-19144D01*
X81637Y-19144D01*
X81694Y-19145D01*
X81694Y-19152D01*
X81720Y-19213D01*
X81766Y-19259D01*
X81827Y-19284D01*
X81892Y-19285D01*
X81953Y-19259D01*
X81999Y-19213D01*
X82024Y-19152D01*
X82024Y-19139D01*
X82037Y-19144D01*
X82094Y-19145D01*
X82094Y-19152D01*
X82120Y-19213D01*
X82166Y-19259D01*
X82227Y-19284D01*
X82292Y-19285D01*
X82353Y-19259D01*
X82399Y-19213D01*
X82424Y-19152D01*
X82424Y-19144D01*
X82427Y-19144D01*
X82484Y-19145D01*
X82484Y-19152D01*
X82510Y-19213D01*
X82556Y-19259D01*
X82617Y-19284D01*
X82682Y-19285D01*
X82743Y-19259D01*
X82789Y-19213D01*
X82814Y-19152D01*
X82814Y-19139D01*
X82827Y-19144D01*
X82884Y-19145D01*
X82884Y-19152D01*
X82910Y-19213D01*
X82956Y-19259D01*
X83017Y-19284D01*
X83082Y-19285D01*
X83143Y-19259D01*
X83189Y-19213D01*
X83214Y-19152D01*
X83214Y-19144D01*
X83217Y-19144D01*
X83274Y-19145D01*
X83274Y-19152D01*
X83300Y-19213D01*
X83346Y-19259D01*
X83407Y-19284D01*
X83472Y-19285D01*
X83533Y-19259D01*
X83579Y-19213D01*
X83604Y-19152D01*
X83605Y-19087D01*
X83605Y-20149D01*
X81195Y-22559D01*
X81195Y-27869D01*
X75659Y-33355D01*
X47130Y-33364D01*
X46210Y-32455D01*
X41439Y-32455D01*
X41359Y-32535D01*
X41135Y-32535D01*
X41135Y-32417D01*
X41177Y-32434D01*
X41242Y-32435D01*
X41303Y-32409D01*
X41349Y-32363D01*
X41374Y-32302D01*
X41375Y-32237D01*
X41349Y-32176D01*
X41303Y-32130D01*
X41242Y-32105D01*
X41177Y-32104D01*
X41135Y-32122D01*
X41135Y-32027D01*
X41177Y-32044D01*
X41242Y-32045D01*
X41303Y-32019D01*
X41349Y-31973D01*
X41374Y-31912D01*
X41374Y-31904D01*
X46329Y-31895D01*
X47429Y-32995D01*
X53040Y-32995D01*
X53210Y-32825D01*
X53349Y-32825D01*
X53519Y-32995D01*
X60620Y-32995D01*
X60790Y-32825D01*
X60899Y-32825D01*
X61069Y-32995D01*
X68010Y-32995D01*
X68180Y-32825D01*
X68379Y-32825D01*
X68549Y-32995D01*
X75180Y-32995D01*
X75480Y-32695D01*
X75760Y-32695D01*
X77685Y-30780D01*
X77685Y-30530D01*
X78040Y-30175D01*
X78290Y-30175D01*
X80775Y-27710D01*
X80775Y-27159D01*
X80565Y-26949D01*
X80565Y-26620D01*
X80774Y-26410D01*
X80785Y-23579D01*
X80555Y-23349D01*
X80555Y-23040D01*
X80785Y-22810D01*
X80785Y-22390D01*
X83470Y-19705D01*
X83289Y-19705D01*
X80465Y-22509D01*
X80465Y-22869D01*
X80365Y-22969D01*
X80365Y-23440D01*
X80465Y-23540D01*
X80474Y-26489D01*
X80365Y-26599D01*
X80365Y-26990D01*
X80475Y-27100D01*
X80475Y-27569D01*
X79675Y-28383D01*
X79675Y-19087D01*
X79649Y-19026D01*
X79603Y-18980D01*
X79542Y-18955D01*
X79485Y-18954D01*
X79485Y-18947D01*
X79459Y-18886D01*
X79413Y-18840D01*
X79352Y-18815D01*
X79345Y-18815D01*
X79345Y-17465D01*
X79295Y-17346D01*
X79204Y-17254D01*
X79084Y-17205D01*
X78955Y-17204D01*
X78836Y-17254D01*
X78744Y-17345D01*
X78695Y-17465D01*
X78694Y-17594D01*
X78744Y-17713D01*
X78835Y-17805D01*
X78955Y-17854D01*
X79084Y-17855D01*
X79203Y-17805D01*
X79295Y-17714D01*
X79344Y-17594D01*
X79345Y-17465D01*
X79345Y-18815D01*
X79287Y-18814D01*
X79226Y-18840D01*
X79180Y-18886D01*
X79155Y-18947D01*
X79155Y-18955D01*
X79152Y-18955D01*
X79095Y-18954D01*
X79095Y-18947D01*
X79069Y-18886D01*
X79023Y-18840D01*
X78962Y-18815D01*
X78897Y-18814D01*
X78836Y-18840D01*
X78790Y-18886D01*
X78765Y-18947D01*
X78765Y-18960D01*
X78752Y-18955D01*
X78695Y-18954D01*
X78695Y-18947D01*
X78669Y-18886D01*
X78623Y-18840D01*
X78562Y-18815D01*
X78497Y-18814D01*
X78436Y-18840D01*
X78390Y-18886D01*
X78365Y-18947D01*
X78365Y-18955D01*
X78362Y-18955D01*
X78305Y-18954D01*
X78305Y-18947D01*
X78279Y-18886D01*
X78233Y-18840D01*
X78172Y-18815D01*
X78107Y-18814D01*
X78046Y-18840D01*
X78000Y-18886D01*
X77975Y-18947D01*
X77975Y-18960D01*
X77962Y-18955D01*
X77905Y-18954D01*
X77905Y-18947D01*
X77879Y-18886D01*
X77833Y-18840D01*
X77772Y-18815D01*
X77707Y-18814D01*
X77646Y-18840D01*
X77600Y-18886D01*
X77575Y-18947D01*
X77575Y-18955D01*
X77572Y-18955D01*
X77515Y-18954D01*
X77515Y-18947D01*
X77489Y-18886D01*
X77443Y-18840D01*
X77382Y-18815D01*
X77317Y-18814D01*
X77256Y-18840D01*
X77210Y-18886D01*
X77185Y-18947D01*
X77185Y-18960D01*
X77172Y-18955D01*
X77115Y-18954D01*
X77115Y-18947D01*
X77089Y-18886D01*
X77043Y-18840D01*
X76982Y-18815D01*
X76917Y-18814D01*
X76856Y-18840D01*
X76810Y-18886D01*
X76785Y-18947D01*
X76785Y-18955D01*
X76782Y-18955D01*
X76725Y-18954D01*
X76725Y-18947D01*
X76699Y-18886D01*
X76653Y-18840D01*
X76592Y-18815D01*
X76527Y-18814D01*
X76466Y-18840D01*
X76420Y-18886D01*
X76395Y-18947D01*
X76394Y-19012D01*
X76420Y-19073D01*
X76466Y-19119D01*
X76527Y-19144D01*
X76584Y-19145D01*
X76584Y-19152D01*
X76610Y-19213D01*
X76656Y-19259D01*
X76717Y-19284D01*
X76782Y-19285D01*
X76843Y-19259D01*
X76889Y-19213D01*
X76914Y-19152D01*
X76914Y-19144D01*
X76917Y-19144D01*
X76974Y-19145D01*
X76974Y-19152D01*
X77000Y-19213D01*
X77046Y-19259D01*
X77107Y-19284D01*
X77172Y-19285D01*
X77233Y-19259D01*
X77279Y-19213D01*
X77304Y-19152D01*
X77304Y-19139D01*
X77317Y-19144D01*
X77374Y-19145D01*
X77374Y-19152D01*
X77400Y-19213D01*
X77446Y-19259D01*
X77507Y-19284D01*
X77572Y-19285D01*
X77633Y-19259D01*
X77679Y-19213D01*
X77704Y-19152D01*
X77704Y-19144D01*
X77707Y-19144D01*
X77764Y-19145D01*
X77764Y-19152D01*
X77790Y-19213D01*
X77836Y-19259D01*
X77897Y-19284D01*
X77962Y-19285D01*
X78023Y-19259D01*
X78069Y-19213D01*
X78094Y-19152D01*
X78094Y-19139D01*
X78107Y-19144D01*
X78164Y-19145D01*
X78164Y-19152D01*
X78190Y-19213D01*
X78236Y-19259D01*
X78297Y-19284D01*
X78362Y-19285D01*
X78423Y-19259D01*
X78469Y-19213D01*
X78494Y-19152D01*
X78494Y-19144D01*
X78497Y-19144D01*
X78554Y-19145D01*
X78554Y-19152D01*
X78580Y-19213D01*
X78626Y-19259D01*
X78687Y-19284D01*
X78752Y-19285D01*
X78813Y-19259D01*
X78859Y-19213D01*
X78884Y-19152D01*
X78884Y-19139D01*
X78897Y-19144D01*
X78954Y-19145D01*
X78954Y-19152D01*
X78980Y-19213D01*
X79026Y-19259D01*
X79087Y-19284D01*
X79152Y-19285D01*
X79213Y-19259D01*
X79259Y-19213D01*
X79284Y-19152D01*
X79284Y-19144D01*
X79287Y-19144D01*
X79344Y-19145D01*
X79344Y-19152D01*
X79370Y-19213D01*
X79416Y-19259D01*
X79477Y-19284D01*
X79542Y-19285D01*
X79603Y-19259D01*
X79649Y-19213D01*
X79674Y-19152D01*
X79675Y-19087D01*
X79675Y-28383D01*
X78089Y-29995D01*
X77959Y-29995D01*
X77525Y-30429D01*
X77525Y-30569D01*
X75579Y-32545D01*
X75419Y-32545D01*
X75079Y-32885D01*
X68610Y-32885D01*
X68420Y-32695D01*
X68139Y-32695D01*
X67949Y-32885D01*
X61140Y-32885D01*
X60950Y-32695D01*
X60729Y-32695D01*
X60539Y-32885D01*
X53570Y-32885D01*
X53380Y-32695D01*
X53179Y-32695D01*
X52989Y-32885D01*
X47500Y-32885D01*
X46270Y-31665D01*
X41420Y-31665D01*
X41135Y-31665D01*
X41135Y-31047D01*
X41177Y-31064D01*
X41242Y-31065D01*
X41303Y-31039D01*
X41349Y-30993D01*
X41374Y-30932D01*
X41375Y-30867D01*
X41349Y-30806D01*
X41303Y-30760D01*
X41242Y-30735D01*
X41177Y-30734D01*
X41135Y-30752D01*
X41135Y-30647D01*
X41177Y-30664D01*
X41242Y-30665D01*
X41303Y-30639D01*
X41349Y-30593D01*
X41374Y-30532D01*
X41375Y-30467D01*
X41349Y-30406D01*
X41303Y-30360D01*
X41242Y-30335D01*
X41177Y-30334D01*
X41135Y-30352D01*
X41135Y-30257D01*
X41177Y-30274D01*
X41242Y-30275D01*
X41303Y-30249D01*
X41349Y-30203D01*
X41374Y-30142D01*
X41375Y-30077D01*
X41349Y-30016D01*
X41303Y-29970D01*
X41242Y-29945D01*
X41177Y-29944D01*
X41135Y-29962D01*
X41135Y-29857D01*
X41177Y-29874D01*
X41242Y-29875D01*
X41303Y-29849D01*
X41349Y-29803D01*
X41374Y-29742D01*
X41375Y-29677D01*
X41349Y-29616D01*
X41303Y-29570D01*
X41242Y-29545D01*
X41177Y-29544D01*
X41135Y-29562D01*
X41135Y-29477D01*
X41177Y-29494D01*
X41242Y-29495D01*
X41303Y-29469D01*
X41349Y-29423D01*
X41374Y-29362D01*
X41375Y-29297D01*
X41349Y-29236D01*
X41303Y-29190D01*
X41242Y-29165D01*
X41177Y-29164D01*
X41135Y-29182D01*
X41135Y-29077D01*
X41177Y-29094D01*
X41242Y-29095D01*
X41303Y-29069D01*
X41349Y-29023D01*
X41374Y-28962D01*
X41375Y-28897D01*
X41349Y-28836D01*
X41303Y-28790D01*
X41242Y-28765D01*
X41177Y-28764D01*
X41135Y-28782D01*
X41135Y-28687D01*
X41177Y-28704D01*
X41242Y-28705D01*
X41303Y-28679D01*
X41349Y-28633D01*
X41374Y-28572D01*
X41375Y-28507D01*
X41349Y-28446D01*
X41303Y-28400D01*
X41242Y-28375D01*
X41177Y-28374D01*
X41135Y-28392D01*
X41135Y-28287D01*
X41177Y-28304D01*
X41242Y-28305D01*
X41303Y-28279D01*
X41349Y-28233D01*
X41374Y-28172D01*
X41375Y-28107D01*
X41349Y-28046D01*
X41303Y-28000D01*
X41242Y-27975D01*
X41177Y-27974D01*
X41135Y-27992D01*
X41135Y-27525D01*
X45309Y-27525D01*
X45899Y-28115D01*
X46169Y-28115D01*
X46975Y-28920D01*
X46975Y-29190D01*
X48089Y-30305D01*
X48949Y-30305D01*
X49369Y-30725D01*
X50600Y-30725D01*
X50910Y-30415D01*
X52059Y-30415D01*
X52379Y-30735D01*
X53550Y-30735D01*
X53850Y-30425D01*
X54929Y-30425D01*
X55239Y-30735D01*
X56490Y-30735D01*
X56800Y-30425D01*
X58159Y-30425D01*
X58459Y-30724D01*
X59640Y-30735D01*
X59940Y-30425D01*
X60999Y-30425D01*
X61339Y-30765D01*
X62640Y-30754D01*
X62960Y-30435D01*
X63839Y-30435D01*
X64159Y-30755D01*
X65510Y-30755D01*
X65850Y-30415D01*
X67049Y-30415D01*
X67399Y-30765D01*
X68660Y-30765D01*
X68990Y-30425D01*
X70049Y-30425D01*
X70389Y-30765D01*
X71760Y-30765D01*
X72140Y-30395D01*
X72969Y-30395D01*
X73339Y-30765D01*
X74120Y-30765D01*
X74725Y-30160D01*
X74725Y-29860D01*
X75350Y-29235D01*
X75650Y-29235D01*
X76615Y-28270D01*
X76615Y-27960D01*
X77420Y-27155D01*
X77730Y-27155D01*
X78295Y-26580D01*
X78295Y-25749D01*
X78085Y-25539D01*
X78085Y-24370D01*
X78295Y-24160D01*
X78295Y-22789D01*
X78085Y-22579D01*
X78085Y-21395D01*
X77925Y-21395D01*
X77925Y-22670D01*
X78135Y-22880D01*
X78135Y-24059D01*
X77925Y-24269D01*
X77925Y-25670D01*
X78135Y-25880D01*
X78135Y-26509D01*
X77659Y-26985D01*
X77409Y-26985D01*
X76435Y-27949D01*
X76435Y-28199D01*
X76079Y-28554D01*
X76079Y-17918D01*
X76017Y-17767D01*
X75902Y-17652D01*
X75751Y-17589D01*
X75588Y-17589D01*
X75437Y-17651D01*
X75321Y-17767D01*
X75258Y-17918D01*
X75258Y-18081D01*
X75321Y-18232D01*
X75436Y-18347D01*
X75587Y-18410D01*
X75750Y-18410D01*
X75901Y-18348D01*
X76017Y-18232D01*
X76079Y-18081D01*
X76079Y-17918D01*
X76079Y-28554D01*
X75599Y-29035D01*
X75339Y-29035D01*
X74515Y-29859D01*
X74515Y-30119D01*
X74049Y-30595D01*
X73450Y-30595D01*
X73090Y-30235D01*
X72029Y-30235D01*
X71659Y-30605D01*
X70480Y-30605D01*
X70140Y-30265D01*
X68909Y-30265D01*
X68569Y-30605D01*
X67530Y-30605D01*
X67180Y-30265D01*
X65719Y-30265D01*
X65379Y-30605D01*
X64290Y-30605D01*
X63950Y-30265D01*
X62849Y-30265D01*
X62519Y-30595D01*
X61430Y-30595D01*
X61100Y-30265D01*
X59839Y-30265D01*
X59509Y-30595D01*
X58550Y-30595D01*
X58220Y-30265D01*
X56739Y-30265D01*
X56409Y-30595D01*
X55360Y-30595D01*
X55030Y-30265D01*
X53739Y-30265D01*
X53419Y-30585D01*
X52470Y-30585D01*
X52150Y-30265D01*
X50839Y-30265D01*
X50519Y-30585D01*
X49510Y-30585D01*
X49090Y-30165D01*
X48160Y-30165D01*
X47175Y-29179D01*
X47175Y-28919D01*
X46170Y-27915D01*
X45910Y-27915D01*
X45370Y-27375D01*
X41135Y-27375D01*
X41135Y-26717D01*
X41177Y-26734D01*
X41242Y-26735D01*
X41303Y-26709D01*
X41349Y-26663D01*
X41374Y-26602D01*
X41375Y-26537D01*
X41349Y-26476D01*
X41303Y-26430D01*
X41242Y-26405D01*
X41177Y-26404D01*
X41135Y-26422D01*
X41135Y-26317D01*
X41177Y-26334D01*
X41242Y-26335D01*
X41303Y-26309D01*
X41349Y-26263D01*
X41374Y-26202D01*
X41375Y-26137D01*
X41349Y-26076D01*
X41303Y-26030D01*
X41242Y-26005D01*
X41177Y-26004D01*
X41135Y-26022D01*
X41135Y-25927D01*
X41177Y-25944D01*
X41242Y-25945D01*
X41303Y-25919D01*
X41349Y-25873D01*
X41374Y-25812D01*
X41375Y-25747D01*
X41349Y-25686D01*
X41303Y-25640D01*
X41242Y-25615D01*
X41177Y-25614D01*
X41135Y-25632D01*
X41135Y-25527D01*
X41177Y-25544D01*
X41242Y-25545D01*
X41303Y-25519D01*
X41349Y-25473D01*
X41374Y-25412D01*
X41375Y-25347D01*
X41349Y-25286D01*
X41303Y-25240D01*
X41242Y-25215D01*
X41177Y-25214D01*
X41135Y-25232D01*
X41135Y-25147D01*
X41177Y-25164D01*
X41242Y-25165D01*
X41303Y-25139D01*
X41349Y-25093D01*
X41374Y-25032D01*
X41375Y-24967D01*
X41349Y-24906D01*
X41303Y-24860D01*
X41242Y-24835D01*
X41177Y-24834D01*
X41135Y-24852D01*
X41135Y-24747D01*
X41177Y-24764D01*
X41242Y-24765D01*
X41303Y-24739D01*
X41349Y-24693D01*
X41374Y-24632D01*
X41375Y-24567D01*
X41349Y-24506D01*
X41303Y-24460D01*
X41242Y-24435D01*
X41177Y-24434D01*
X41135Y-24452D01*
X41135Y-24357D01*
X41177Y-24374D01*
X41242Y-24375D01*
X41303Y-24349D01*
X41349Y-24303D01*
X41374Y-24242D01*
X41375Y-24177D01*
X41349Y-24116D01*
X41303Y-24070D01*
X41242Y-24045D01*
X41177Y-24044D01*
X41135Y-24062D01*
X41135Y-23957D01*
X41177Y-23974D01*
X41242Y-23975D01*
X41303Y-23949D01*
X41349Y-23903D01*
X41374Y-23842D01*
X41375Y-23777D01*
X41349Y-23716D01*
X41303Y-23670D01*
X41242Y-23645D01*
X41177Y-23644D01*
X41135Y-23662D01*
X41135Y-23485D01*
X41670Y-23485D01*
X44869Y-23485D01*
X49359Y-27955D01*
X73270Y-27955D01*
X75755Y-25480D01*
X75755Y-19095D01*
X74155Y-19095D01*
X74155Y-16175D01*
X76505Y-16175D01*
X76474Y-16205D01*
X76425Y-16325D01*
X76424Y-16454D01*
X76474Y-16573D01*
X76565Y-16665D01*
X76685Y-16714D01*
X76814Y-16715D01*
X76933Y-16665D01*
X77025Y-16574D01*
X77074Y-16454D01*
X77075Y-16325D01*
X77025Y-16206D01*
X76994Y-16175D01*
X77685Y-16175D01*
X77654Y-16205D01*
X77605Y-16325D01*
X77604Y-16454D01*
X77654Y-16573D01*
X77745Y-16665D01*
X77865Y-16714D01*
X77994Y-16715D01*
X78113Y-16665D01*
X78205Y-16574D01*
X78254Y-16454D01*
X78255Y-16325D01*
X78205Y-16206D01*
X78174Y-16175D01*
X85845Y-16175D01*
X85845Y-19109D01*
X85845Y-19109D01*
G37*
G54D15*
X85845Y-19109D02*
X84741Y-20213D01*
X84741Y-17918D01*
X84678Y-17767D01*
X84655Y-17743D01*
X84655Y-16867D01*
X84629Y-16806D01*
X84583Y-16760D01*
X84522Y-16735D01*
X84457Y-16734D01*
X84396Y-16760D01*
X84350Y-16806D01*
X84325Y-16867D01*
X84324Y-16932D01*
X84350Y-16993D01*
X84396Y-17039D01*
X84457Y-17064D01*
X84522Y-17065D01*
X84583Y-17039D01*
X84629Y-16993D01*
X84654Y-16932D01*
X84655Y-16867D01*
X84655Y-17743D01*
X84563Y-17652D01*
X84412Y-17589D01*
X84249Y-17589D01*
X84098Y-17651D01*
X83982Y-17767D01*
X83920Y-17918D01*
X83920Y-18081D01*
X83982Y-18232D01*
X84097Y-18347D01*
X84248Y-18410D01*
X84411Y-18410D01*
X84562Y-18348D01*
X84678Y-18232D01*
X84741Y-18081D01*
X84741Y-17918D01*
X84741Y-20213D01*
X82015Y-22939D01*
X82015Y-28209D01*
X76009Y-34254D01*
X46780Y-34225D01*
X46270Y-33715D01*
X42451Y-33715D01*
X42464Y-33682D01*
X42465Y-33617D01*
X42455Y-33593D01*
X42455Y-33227D01*
X42429Y-33166D01*
X42383Y-33120D01*
X42322Y-33095D01*
X42257Y-33094D01*
X42196Y-33120D01*
X42150Y-33166D01*
X42125Y-33227D01*
X42124Y-33292D01*
X42150Y-33353D01*
X42196Y-33399D01*
X42257Y-33424D01*
X42322Y-33425D01*
X42383Y-33399D01*
X42429Y-33353D01*
X42454Y-33292D01*
X42455Y-33227D01*
X42455Y-33593D01*
X42439Y-33556D01*
X42393Y-33510D01*
X42332Y-33485D01*
X42267Y-33484D01*
X42206Y-33510D01*
X42160Y-33556D01*
X42135Y-33617D01*
X42134Y-33682D01*
X42148Y-33715D01*
X41135Y-33715D01*
X41135Y-32685D01*
X41334Y-32685D01*
X41334Y-32692D01*
X41360Y-32753D01*
X41406Y-32799D01*
X41467Y-32824D01*
X41532Y-32825D01*
X41593Y-32799D01*
X41639Y-32753D01*
X41664Y-32692D01*
X41665Y-32627D01*
X41647Y-32585D01*
X46159Y-32585D01*
X47089Y-33515D01*
X75690Y-33515D01*
X81295Y-27910D01*
X81295Y-22610D01*
X84200Y-19705D01*
X84049Y-19705D01*
X83605Y-20149D01*
X83605Y-19087D01*
X83579Y-19026D01*
X83533Y-18980D01*
X83472Y-18955D01*
X83415Y-18954D01*
X83415Y-18947D01*
X83389Y-18886D01*
X83385Y-18881D01*
X83385Y-17447D01*
X83359Y-17386D01*
X83313Y-17340D01*
X83252Y-17315D01*
X83187Y-17314D01*
X83126Y-17340D01*
X83080Y-17386D01*
X83055Y-17447D01*
X83054Y-17512D01*
X83080Y-17573D01*
X83126Y-17619D01*
X83187Y-17644D01*
X83252Y-17645D01*
X83313Y-17619D01*
X83359Y-17573D01*
X83384Y-17512D01*
X83385Y-17447D01*
X83385Y-18881D01*
X83343Y-18840D01*
X83282Y-18815D01*
X83217Y-18814D01*
X83156Y-18840D01*
X83110Y-18886D01*
X83085Y-18947D01*
X83085Y-18955D01*
X83082Y-18955D01*
X83025Y-18954D01*
X83025Y-18947D01*
X83025Y-17337D01*
X82999Y-17276D01*
X82953Y-17230D01*
X82892Y-17205D01*
X82827Y-17204D01*
X82766Y-17230D01*
X82720Y-17276D01*
X82698Y-17327D01*
X82692Y-17325D01*
X82627Y-17324D01*
X82621Y-17327D01*
X82599Y-17276D01*
X82553Y-17230D01*
X82492Y-17205D01*
X82427Y-17204D01*
X82366Y-17230D01*
X82320Y-17276D01*
X82298Y-17327D01*
X82292Y-17325D01*
X82227Y-17324D01*
X82166Y-17350D01*
X82120Y-17396D01*
X82095Y-17457D01*
X82094Y-17522D01*
X82120Y-17583D01*
X82166Y-17629D01*
X82227Y-17654D01*
X82292Y-17655D01*
X82353Y-17629D01*
X82399Y-17583D01*
X82421Y-17532D01*
X82427Y-17534D01*
X82492Y-17535D01*
X82498Y-17532D01*
X82520Y-17583D01*
X82566Y-17629D01*
X82627Y-17654D01*
X82692Y-17655D01*
X82753Y-17629D01*
X82799Y-17583D01*
X82821Y-17532D01*
X82827Y-17534D01*
X82892Y-17535D01*
X82953Y-17509D01*
X82999Y-17463D01*
X83024Y-17402D01*
X83025Y-17337D01*
X83025Y-18947D01*
X82999Y-18886D01*
X82953Y-18840D01*
X82892Y-18815D01*
X82827Y-18814D01*
X82766Y-18840D01*
X82720Y-18886D01*
X82695Y-18947D01*
X82695Y-18960D01*
X82682Y-18955D01*
X82625Y-18954D01*
X82625Y-18947D01*
X82599Y-18886D01*
X82553Y-18840D01*
X82492Y-18815D01*
X82427Y-18814D01*
X82366Y-18840D01*
X82320Y-18886D01*
X82295Y-18947D01*
X82295Y-18955D01*
X82292Y-18955D01*
X82235Y-18954D01*
X82235Y-18947D01*
X82209Y-18886D01*
X82163Y-18840D01*
X82102Y-18815D01*
X82037Y-18814D01*
X82035Y-18815D01*
X82035Y-16517D01*
X82009Y-16456D01*
X81963Y-16410D01*
X81902Y-16385D01*
X81864Y-16384D01*
X81865Y-16337D01*
X81839Y-16276D01*
X81793Y-16230D01*
X81732Y-16205D01*
X81667Y-16204D01*
X81606Y-16230D01*
X81560Y-16276D01*
X81535Y-16337D01*
X81534Y-16384D01*
X81512Y-16375D01*
X81447Y-16374D01*
X81444Y-16375D01*
X81445Y-16317D01*
X81419Y-16256D01*
X81373Y-16210D01*
X81312Y-16185D01*
X81247Y-16184D01*
X81186Y-16210D01*
X81140Y-16256D01*
X81115Y-16317D01*
X81114Y-16382D01*
X81140Y-16443D01*
X81186Y-16489D01*
X81247Y-16514D01*
X81312Y-16515D01*
X81315Y-16514D01*
X81314Y-16572D01*
X81340Y-16633D01*
X81386Y-16679D01*
X81447Y-16704D01*
X81512Y-16705D01*
X81573Y-16679D01*
X81619Y-16633D01*
X81644Y-16572D01*
X81645Y-16525D01*
X81667Y-16534D01*
X81705Y-16535D01*
X81704Y-16582D01*
X81730Y-16643D01*
X81776Y-16689D01*
X81837Y-16714D01*
X81902Y-16715D01*
X81963Y-16689D01*
X82009Y-16643D01*
X82034Y-16582D01*
X82035Y-16517D01*
X82035Y-18815D01*
X81976Y-18840D01*
X81930Y-18886D01*
X81905Y-18947D01*
X81905Y-18960D01*
X81892Y-18955D01*
X81835Y-18954D01*
X81835Y-18947D01*
X81809Y-18886D01*
X81763Y-18840D01*
X81702Y-18815D01*
X81637Y-18814D01*
X81576Y-18840D01*
X81530Y-18886D01*
X81505Y-18947D01*
X81505Y-18955D01*
X81502Y-18955D01*
X81445Y-18954D01*
X81445Y-18947D01*
X81419Y-18886D01*
X81373Y-18840D01*
X81312Y-18815D01*
X81247Y-18814D01*
X81186Y-18840D01*
X81140Y-18886D01*
X81115Y-18947D01*
X81115Y-18960D01*
X81102Y-18955D01*
X81045Y-18954D01*
X81045Y-18947D01*
X81019Y-18886D01*
X80973Y-18840D01*
X80912Y-18815D01*
X80847Y-18814D01*
X80786Y-18840D01*
X80740Y-18886D01*
X80715Y-18947D01*
X80715Y-18955D01*
X80712Y-18955D01*
X80655Y-18954D01*
X80655Y-18947D01*
X80629Y-18886D01*
X80583Y-18840D01*
X80522Y-18815D01*
X80457Y-18814D01*
X80396Y-18840D01*
X80350Y-18886D01*
X80325Y-18947D01*
X80324Y-19012D01*
X80350Y-19073D01*
X80396Y-19119D01*
X80457Y-19144D01*
X80514Y-19145D01*
X80514Y-19152D01*
X80540Y-19213D01*
X80586Y-19259D01*
X80647Y-19284D01*
X80712Y-19285D01*
X80773Y-19259D01*
X80819Y-19213D01*
X80844Y-19152D01*
X80844Y-19144D01*
X80847Y-19144D01*
X80904Y-19145D01*
X80904Y-19152D01*
X80930Y-19213D01*
X80976Y-19259D01*
X81037Y-19284D01*
X81102Y-19285D01*
X81163Y-19259D01*
X81209Y-19213D01*
X81234Y-19152D01*
X81234Y-19139D01*
X81247Y-19144D01*
X81304Y-19145D01*
X81304Y-19152D01*
X81330Y-19213D01*
X81376Y-19259D01*
X81437Y-19284D01*
X81502Y-19285D01*
X81563Y-19259D01*
X81609Y-19213D01*
X81634Y-19152D01*
X81634Y-19144D01*
X81637Y-19144D01*
X81694Y-19145D01*
X81694Y-19152D01*
X81720Y-19213D01*
X81766Y-19259D01*
X81827Y-19284D01*
X81892Y-19285D01*
X81953Y-19259D01*
X81999Y-19213D01*
X82024Y-19152D01*
X82024Y-19139D01*
X82037Y-19144D01*
X82094Y-19145D01*
X82094Y-19152D01*
X82120Y-19213D01*
X82166Y-19259D01*
X82227Y-19284D01*
X82292Y-19285D01*
X82353Y-19259D01*
X82399Y-19213D01*
X82424Y-19152D01*
X82424Y-19144D01*
X82427Y-19144D01*
X82484Y-19145D01*
X82484Y-19152D01*
X82510Y-19213D01*
X82556Y-19259D01*
X82617Y-19284D01*
X82682Y-19285D01*
X82743Y-19259D01*
X82789Y-19213D01*
X82814Y-19152D01*
X82814Y-19139D01*
X82827Y-19144D01*
X82884Y-19145D01*
X82884Y-19152D01*
X82910Y-19213D01*
X82956Y-19259D01*
X83017Y-19284D01*
X83082Y-19285D01*
X83143Y-19259D01*
X83189Y-19213D01*
X83214Y-19152D01*
X83214Y-19144D01*
X83217Y-19144D01*
X83274Y-19145D01*
X83274Y-19152D01*
X83300Y-19213D01*
X83346Y-19259D01*
X83407Y-19284D01*
X83472Y-19285D01*
X83533Y-19259D01*
X83579Y-19213D01*
X83604Y-19152D01*
X83605Y-19087D01*
X83605Y-20149D01*
X81195Y-22559D01*
X81195Y-27869D01*
X75659Y-33355D01*
X47130Y-33364D01*
X46210Y-32455D01*
X41439Y-32455D01*
X41359Y-32535D01*
X41135Y-32535D01*
X41135Y-32417D01*
X41177Y-32434D01*
X41242Y-32435D01*
X41303Y-32409D01*
X41349Y-32363D01*
X41374Y-32302D01*
X41375Y-32237D01*
X41349Y-32176D01*
X41303Y-32130D01*
X41242Y-32105D01*
X41177Y-32104D01*
X41135Y-32122D01*
X41135Y-32027D01*
X41177Y-32044D01*
X41242Y-32045D01*
X41303Y-32019D01*
X41349Y-31973D01*
X41374Y-31912D01*
X41374Y-31904D01*
X46329Y-31895D01*
X47429Y-32995D01*
X53040Y-32995D01*
X53210Y-32825D01*
X53349Y-32825D01*
X53519Y-32995D01*
X60620Y-32995D01*
X60790Y-32825D01*
X60899Y-32825D01*
X61069Y-32995D01*
X68010Y-32995D01*
X68180Y-32825D01*
X68379Y-32825D01*
X68549Y-32995D01*
X75180Y-32995D01*
X75480Y-32695D01*
X75760Y-32695D01*
X77685Y-30780D01*
X77685Y-30530D01*
X78040Y-30175D01*
X78290Y-30175D01*
X80775Y-27710D01*
X80775Y-27159D01*
X80565Y-26949D01*
X80565Y-26620D01*
X80774Y-26410D01*
X80785Y-23579D01*
X80555Y-23349D01*
X80555Y-23040D01*
X80785Y-22810D01*
X80785Y-22390D01*
X83470Y-19705D01*
X83289Y-19705D01*
X80465Y-22509D01*
X80465Y-22869D01*
X80365Y-22969D01*
X80365Y-23440D01*
X80465Y-23540D01*
X80474Y-26489D01*
X80365Y-26599D01*
X80365Y-26990D01*
X80475Y-27100D01*
X80475Y-27569D01*
X79675Y-28383D01*
X79675Y-19087D01*
X79649Y-19026D01*
X79603Y-18980D01*
X79542Y-18955D01*
X79485Y-18954D01*
X79485Y-18947D01*
X79459Y-18886D01*
X79413Y-18840D01*
X79352Y-18815D01*
X79345Y-18815D01*
X79345Y-17465D01*
X79295Y-17346D01*
X79204Y-17254D01*
X79084Y-17205D01*
X78955Y-17204D01*
X78836Y-17254D01*
X78744Y-17345D01*
X78695Y-17465D01*
X78694Y-17594D01*
X78744Y-17713D01*
X78835Y-17805D01*
X78955Y-17854D01*
X79084Y-17855D01*
X79203Y-17805D01*
X79295Y-17714D01*
X79344Y-17594D01*
X79345Y-17465D01*
X79345Y-18815D01*
X79287Y-18814D01*
X79226Y-18840D01*
X79180Y-18886D01*
X79155Y-18947D01*
X79155Y-18955D01*
X79152Y-18955D01*
X79095Y-18954D01*
X79095Y-18947D01*
X79069Y-18886D01*
X79023Y-18840D01*
X78962Y-18815D01*
X78897Y-18814D01*
X78836Y-18840D01*
X78790Y-18886D01*
X78765Y-18947D01*
X78765Y-18960D01*
X78752Y-18955D01*
X78695Y-18954D01*
X78695Y-18947D01*
X78669Y-18886D01*
X78623Y-18840D01*
X78562Y-18815D01*
X78497Y-18814D01*
X78436Y-18840D01*
X78390Y-18886D01*
X78365Y-18947D01*
X78365Y-18955D01*
X78362Y-18955D01*
X78305Y-18954D01*
X78305Y-18947D01*
X78279Y-18886D01*
X78233Y-18840D01*
X78172Y-18815D01*
X78107Y-18814D01*
X78046Y-18840D01*
X78000Y-18886D01*
X77975Y-18947D01*
X77975Y-18960D01*
X77962Y-18955D01*
X77905Y-18954D01*
X77905Y-18947D01*
X77879Y-18886D01*
X77833Y-18840D01*
X77772Y-18815D01*
X77707Y-18814D01*
X77646Y-18840D01*
X77600Y-18886D01*
X77575Y-18947D01*
X77575Y-18955D01*
X77572Y-18955D01*
X77515Y-18954D01*
X77515Y-18947D01*
X77489Y-18886D01*
X77443Y-18840D01*
X77382Y-18815D01*
X77317Y-18814D01*
X77256Y-18840D01*
X77210Y-18886D01*
X77185Y-18947D01*
X77185Y-18960D01*
X77172Y-18955D01*
X77115Y-18954D01*
X77115Y-18947D01*
X77089Y-18886D01*
X77043Y-18840D01*
X76982Y-18815D01*
X76917Y-18814D01*
X76856Y-18840D01*
X76810Y-18886D01*
X76785Y-18947D01*
X76785Y-18955D01*
X76782Y-18955D01*
X76725Y-18954D01*
X76725Y-18947D01*
X76699Y-18886D01*
X76653Y-18840D01*
X76592Y-18815D01*
X76527Y-18814D01*
X76466Y-18840D01*
X76420Y-18886D01*
X76395Y-18947D01*
X76394Y-19012D01*
X76420Y-19073D01*
X76466Y-19119D01*
X76527Y-19144D01*
X76584Y-19145D01*
X76584Y-19152D01*
X76610Y-19213D01*
X76656Y-19259D01*
X76717Y-19284D01*
X76782Y-19285D01*
X76843Y-19259D01*
X76889Y-19213D01*
X76914Y-19152D01*
X76914Y-19144D01*
X76917Y-19144D01*
X76974Y-19145D01*
X76974Y-19152D01*
X77000Y-19213D01*
X77046Y-19259D01*
X77107Y-19284D01*
X77172Y-19285D01*
X77233Y-19259D01*
X77279Y-19213D01*
X77304Y-19152D01*
X77304Y-19139D01*
X77317Y-19144D01*
X77374Y-19145D01*
X77374Y-19152D01*
X77400Y-19213D01*
X77446Y-19259D01*
X77507Y-19284D01*
X77572Y-19285D01*
X77633Y-19259D01*
X77679Y-19213D01*
X77704Y-19152D01*
X77704Y-19144D01*
X77707Y-19144D01*
X77764Y-19145D01*
X77764Y-19152D01*
X77790Y-19213D01*
X77836Y-19259D01*
X77897Y-19284D01*
X77962Y-19285D01*
X78023Y-19259D01*
X78069Y-19213D01*
X78094Y-19152D01*
X78094Y-19139D01*
X78107Y-19144D01*
X78164Y-19145D01*
X78164Y-19152D01*
X78190Y-19213D01*
X78236Y-19259D01*
X78297Y-19284D01*
X78362Y-19285D01*
X78423Y-19259D01*
X78469Y-19213D01*
X78494Y-19152D01*
X78494Y-19144D01*
X78497Y-19144D01*
X78554Y-19145D01*
X78554Y-19152D01*
X78580Y-19213D01*
X78626Y-19259D01*
X78687Y-19284D01*
X78752Y-19285D01*
X78813Y-19259D01*
X78859Y-19213D01*
X78884Y-19152D01*
X78884Y-19139D01*
X78897Y-19144D01*
X78954Y-19145D01*
X78954Y-19152D01*
X78980Y-19213D01*
X79026Y-19259D01*
X79087Y-19284D01*
X79152Y-19285D01*
X79213Y-19259D01*
X79259Y-19213D01*
X79284Y-19152D01*
X79284Y-19144D01*
X79287Y-19144D01*
X79344Y-19145D01*
X79344Y-19152D01*
X79370Y-19213D01*
X79416Y-19259D01*
X79477Y-19284D01*
X79542Y-19285D01*
X79603Y-19259D01*
X79649Y-19213D01*
X79674Y-19152D01*
X79675Y-19087D01*
X79675Y-28383D01*
X78089Y-29995D01*
X77959Y-29995D01*
X77525Y-30429D01*
X77525Y-30569D01*
X75579Y-32545D01*
X75419Y-32545D01*
X75079Y-32885D01*
X68610Y-32885D01*
X68420Y-32695D01*
X68139Y-32695D01*
X67949Y-32885D01*
X61140Y-32885D01*
X60950Y-32695D01*
X60729Y-32695D01*
X60539Y-32885D01*
X53570Y-32885D01*
X53380Y-32695D01*
X53179Y-32695D01*
X52989Y-32885D01*
X47500Y-32885D01*
X46270Y-31665D01*
X41420Y-31665D01*
X41135Y-31665D01*
X41135Y-31047D01*
X41177Y-31064D01*
X41242Y-31065D01*
X41303Y-31039D01*
X41349Y-30993D01*
X41374Y-30932D01*
X41375Y-30867D01*
X41349Y-30806D01*
X41303Y-30760D01*
X41242Y-30735D01*
X41177Y-30734D01*
X41135Y-30752D01*
X41135Y-30647D01*
X41177Y-30664D01*
X41242Y-30665D01*
X41303Y-30639D01*
X41349Y-30593D01*
X41374Y-30532D01*
X41375Y-30467D01*
X41349Y-30406D01*
X41303Y-30360D01*
X41242Y-30335D01*
X41177Y-30334D01*
X41135Y-30352D01*
X41135Y-30257D01*
X41177Y-30274D01*
X41242Y-30275D01*
X41303Y-30249D01*
X41349Y-30203D01*
X41374Y-30142D01*
X41375Y-30077D01*
X41349Y-30016D01*
X41303Y-29970D01*
X41242Y-29945D01*
X41177Y-29944D01*
X41135Y-29962D01*
X41135Y-29857D01*
X41177Y-29874D01*
X41242Y-29875D01*
X41303Y-29849D01*
X41349Y-29803D01*
X41374Y-29742D01*
X41375Y-29677D01*
X41349Y-29616D01*
X41303Y-29570D01*
X41242Y-29545D01*
X41177Y-29544D01*
X41135Y-29562D01*
X41135Y-29477D01*
X41177Y-29494D01*
X41242Y-29495D01*
X41303Y-29469D01*
X41349Y-29423D01*
X41374Y-29362D01*
X41375Y-29297D01*
X41349Y-29236D01*
X41303Y-29190D01*
X41242Y-29165D01*
X41177Y-29164D01*
X41135Y-29182D01*
X41135Y-29077D01*
X41177Y-29094D01*
X41242Y-29095D01*
X41303Y-29069D01*
X41349Y-29023D01*
X41374Y-28962D01*
X41375Y-28897D01*
X41349Y-28836D01*
X41303Y-28790D01*
X41242Y-28765D01*
X41177Y-28764D01*
X41135Y-28782D01*
X41135Y-28687D01*
X41177Y-28704D01*
X41242Y-28705D01*
X41303Y-28679D01*
X41349Y-28633D01*
X41374Y-28572D01*
X41375Y-28507D01*
X41349Y-28446D01*
X41303Y-28400D01*
X41242Y-28375D01*
X41177Y-28374D01*
X41135Y-28392D01*
X41135Y-28287D01*
X41177Y-28304D01*
X41242Y-28305D01*
X41303Y-28279D01*
X41349Y-28233D01*
X41374Y-28172D01*
X41375Y-28107D01*
X41349Y-28046D01*
X41303Y-28000D01*
X41242Y-27975D01*
X41177Y-27974D01*
X41135Y-27992D01*
X41135Y-27525D01*
X45309Y-27525D01*
X45899Y-28115D01*
X46169Y-28115D01*
X46975Y-28920D01*
X46975Y-29190D01*
X48089Y-30305D01*
X48949Y-30305D01*
X49369Y-30725D01*
X50600Y-30725D01*
X50910Y-30415D01*
X52059Y-30415D01*
X52379Y-30735D01*
X53550Y-30735D01*
X53850Y-30425D01*
X54929Y-30425D01*
X55239Y-30735D01*
X56490Y-30735D01*
X56800Y-30425D01*
X58159Y-30425D01*
X58459Y-30724D01*
X59640Y-30735D01*
X59940Y-30425D01*
X60999Y-30425D01*
X61339Y-30765D01*
X62640Y-30754D01*
X62960Y-30435D01*
X63839Y-30435D01*
X64159Y-30755D01*
X65510Y-30755D01*
X65850Y-30415D01*
X67049Y-30415D01*
X67399Y-30765D01*
X68660Y-30765D01*
X68990Y-30425D01*
X70049Y-30425D01*
X70389Y-30765D01*
X71760Y-30765D01*
X72140Y-30395D01*
X72969Y-30395D01*
X73339Y-30765D01*
X74120Y-30765D01*
X74725Y-30160D01*
X74725Y-29860D01*
X75350Y-29235D01*
X75650Y-29235D01*
X76615Y-28270D01*
X76615Y-27960D01*
X77420Y-27155D01*
X77730Y-27155D01*
X78295Y-26580D01*
X78295Y-25749D01*
X78085Y-25539D01*
X78085Y-24370D01*
X78295Y-24160D01*
X78295Y-22789D01*
X78085Y-22579D01*
X78085Y-21395D01*
X77925Y-21395D01*
X77925Y-22670D01*
X78135Y-22880D01*
X78135Y-24059D01*
X77925Y-24269D01*
X77925Y-25670D01*
X78135Y-25880D01*
X78135Y-26509D01*
X77659Y-26985D01*
X77409Y-26985D01*
X76435Y-27949D01*
X76435Y-28199D01*
X76079Y-28554D01*
X76079Y-17918D01*
X76017Y-17767D01*
X75902Y-17652D01*
X75751Y-17589D01*
X75588Y-17589D01*
X75437Y-17651D01*
X75321Y-17767D01*
X75258Y-17918D01*
X75258Y-18081D01*
X75321Y-18232D01*
X75436Y-18347D01*
X75587Y-18410D01*
X75750Y-18410D01*
X75901Y-18348D01*
X76017Y-18232D01*
X76079Y-18081D01*
X76079Y-17918D01*
X76079Y-28554D01*
X75599Y-29035D01*
X75339Y-29035D01*
X74515Y-29859D01*
X74515Y-30119D01*
X74049Y-30595D01*
X73450Y-30595D01*
X73090Y-30235D01*
X72029Y-30235D01*
X71659Y-30605D01*
X70480Y-30605D01*
X70140Y-30265D01*
X68909Y-30265D01*
X68569Y-30605D01*
X67530Y-30605D01*
X67180Y-30265D01*
X65719Y-30265D01*
X65379Y-30605D01*
X64290Y-30605D01*
X63950Y-30265D01*
X62849Y-30265D01*
X62519Y-30595D01*
X61430Y-30595D01*
X61100Y-30265D01*
X59839Y-30265D01*
X59509Y-30595D01*
X58550Y-30595D01*
X58220Y-30265D01*
X56739Y-30265D01*
X56409Y-30595D01*
X55360Y-30595D01*
X55030Y-30265D01*
X53739Y-30265D01*
X53419Y-30585D01*
X52470Y-30585D01*
X52150Y-30265D01*
X50839Y-30265D01*
X50519Y-30585D01*
X49510Y-30585D01*
X49090Y-30165D01*
X48160Y-30165D01*
X47175Y-29179D01*
X47175Y-28919D01*
X46170Y-27915D01*
X45910Y-27915D01*
X45370Y-27375D01*
X41135Y-27375D01*
X41135Y-26717D01*
X41177Y-26734D01*
X41242Y-26735D01*
X41303Y-26709D01*
X41349Y-26663D01*
X41374Y-26602D01*
X41375Y-26537D01*
X41349Y-26476D01*
X41303Y-26430D01*
X41242Y-26405D01*
X41177Y-26404D01*
X41135Y-26422D01*
X41135Y-26317D01*
X41177Y-26334D01*
X41242Y-26335D01*
X41303Y-26309D01*
X41349Y-26263D01*
X41374Y-26202D01*
X41375Y-26137D01*
X41349Y-26076D01*
X41303Y-26030D01*
X41242Y-26005D01*
X41177Y-26004D01*
X41135Y-26022D01*
X41135Y-25927D01*
X41177Y-25944D01*
X41242Y-25945D01*
X41303Y-25919D01*
X41349Y-25873D01*
X41374Y-25812D01*
X41375Y-25747D01*
X41349Y-25686D01*
X41303Y-25640D01*
X41242Y-25615D01*
X41177Y-25614D01*
X41135Y-25632D01*
X41135Y-25527D01*
X41177Y-25544D01*
X41242Y-25545D01*
X41303Y-25519D01*
X41349Y-25473D01*
X41374Y-25412D01*
X41375Y-25347D01*
X41349Y-25286D01*
X41303Y-25240D01*
X41242Y-25215D01*
X41177Y-25214D01*
X41135Y-25232D01*
X41135Y-25147D01*
X41177Y-25164D01*
X41242Y-25165D01*
X41303Y-25139D01*
X41349Y-25093D01*
X41374Y-25032D01*
X41375Y-24967D01*
X41349Y-24906D01*
X41303Y-24860D01*
X41242Y-24835D01*
X41177Y-24834D01*
X41135Y-24852D01*
X41135Y-24747D01*
X41177Y-24764D01*
X41242Y-24765D01*
X41303Y-24739D01*
X41349Y-24693D01*
X41374Y-24632D01*
X41375Y-24567D01*
X41349Y-24506D01*
X41303Y-24460D01*
X41242Y-24435D01*
X41177Y-24434D01*
X41135Y-24452D01*
X41135Y-24357D01*
X41177Y-24374D01*
X41242Y-24375D01*
X41303Y-24349D01*
X41349Y-24303D01*
X41374Y-24242D01*
X41375Y-24177D01*
X41349Y-24116D01*
X41303Y-24070D01*
X41242Y-24045D01*
X41177Y-24044D01*
X41135Y-24062D01*
X41135Y-23957D01*
X41177Y-23974D01*
X41242Y-23975D01*
X41303Y-23949D01*
X41349Y-23903D01*
X41374Y-23842D01*
X41375Y-23777D01*
X41349Y-23716D01*
X41303Y-23670D01*
X41242Y-23645D01*
X41177Y-23644D01*
X41135Y-23662D01*
X41135Y-23485D01*
X41670Y-23485D01*
X44869Y-23485D01*
X49359Y-27955D01*
X73270Y-27955D01*
X75755Y-25480D01*
X75755Y-19095D01*
X74155Y-19095D01*
X74155Y-16175D01*
X76505Y-16175D01*
X76474Y-16205D01*
X76425Y-16325D01*
X76424Y-16454D01*
X76474Y-16573D01*
X76565Y-16665D01*
X76685Y-16714D01*
X76814Y-16715D01*
X76933Y-16665D01*
X77025Y-16574D01*
X77074Y-16454D01*
X77075Y-16325D01*
X77025Y-16206D01*
X76994Y-16175D01*
X77685Y-16175D01*
X77654Y-16205D01*
X77605Y-16325D01*
X77604Y-16454D01*
X77654Y-16573D01*
X77745Y-16665D01*
X77865Y-16714D01*
X77994Y-16715D01*
X78113Y-16665D01*
X78205Y-16574D01*
X78254Y-16454D01*
X78255Y-16325D01*
X78205Y-16206D01*
X78174Y-16175D01*
X85845Y-16175D01*
X85845Y-19109D01*
G54D10*
G36*
X45829Y-22614D02*
X41135Y-22605D01*
X41135Y-22285D01*
X41157Y-22294D01*
X41222Y-22295D01*
X41283Y-22269D01*
X41329Y-22223D01*
X41354Y-22162D01*
X41355Y-22097D01*
X41329Y-22036D01*
X41283Y-21990D01*
X41222Y-21965D01*
X41157Y-21964D01*
X41135Y-21974D01*
X41135Y-21495D01*
X41157Y-21504D01*
X41222Y-21505D01*
X41283Y-21479D01*
X41329Y-21433D01*
X41354Y-21372D01*
X41355Y-21307D01*
X41329Y-21246D01*
X41288Y-21205D01*
X44419Y-21205D01*
X45829Y-22614D01*
X45829Y-22614D01*
G37*
G54D15*
X45829Y-22614D02*
X41135Y-22605D01*
X41135Y-22285D01*
X41157Y-22294D01*
X41222Y-22295D01*
X41283Y-22269D01*
X41329Y-22223D01*
X41354Y-22162D01*
X41355Y-22097D01*
X41329Y-22036D01*
X41283Y-21990D01*
X41222Y-21965D01*
X41157Y-21964D01*
X41135Y-21974D01*
X41135Y-21495D01*
X41157Y-21504D01*
X41222Y-21505D01*
X41283Y-21479D01*
X41329Y-21433D01*
X41354Y-21372D01*
X41355Y-21307D01*
X41329Y-21246D01*
X41288Y-21205D01*
X44419Y-21205D01*
X45829Y-22614D01*
M02*
