M48
;DRILL file {Pcbnew (2013-10-07 BZR 4378)-stable} date Fri 19 Dec 2014 03:58:15 PM EST
;FORMAT={-:-/ absolute / inch / decimal}
FMAT,2
INCH,TZ
T1C0.006
T2C0.020
%
G90
G05
M72
T1
X3.738Y-9.2255
X3.74Y-8.145
X3.74Y-8.17
X3.74Y-8.195
X3.74Y-8.22
X3.74Y-8.245
X3.74Y-8.286
X3.74Y-8.342
X3.74Y-8.381
X3.74Y-8.421
X3.74Y-8.46
X3.74Y-8.5
X3.74Y-8.539
X3.74Y-8.579
X3.74Y-8.618
X3.74Y-8.776
X3.74Y-8.815
X3.74Y-8.853
X3.74Y-8.894
X3.74Y-8.934
X3.74Y-8.973
X3.74Y-9.013
X3.74Y-9.052
X3.74Y-9.106
X3.74Y-9.15
X3.74Y-9.189
X3.74Y-9.286
X3.74Y-9.325
X3.748Y-8.723
X3.761Y-8.689
X3.7675Y-9.0895
X3.773Y-8.2655
X3.773Y-8.321
X3.776Y-8.7355
X3.779Y-9.258
X3.78Y-9.299
X3.783Y-9.1485
X3.79Y-8.674
X3.805Y-8.752
X3.8065Y-8.265
X3.807Y-8.3095
X3.8165Y-8.6565
X3.8455Y-8.305
X5.348Y-8.723
X5.348Y-9.106
X5.361Y-8.689
X5.388Y-9.17
X5.406Y-9.258
X5.43Y-8.305
X5.548Y-8.723
X5.548Y-9.106
X5.561Y-8.689
X5.588Y-9.1705
X5.606Y-9.299
X5.63Y-8.305
X5.748Y-8.723
X5.748Y-9.106
X5.761Y-8.689
X5.788Y-9.1705
X5.806Y-9.258
X5.83Y-8.305
X5.948Y-8.723
X5.948Y-9.106
X5.961Y-8.689
X5.988Y-9.1705
X6.006Y-9.299
X6.03Y-8.305
X6.148Y-8.723
X6.148Y-9.106
X6.161Y-8.689
X6.188Y-9.1705
X6.206Y-9.258
X6.23Y-8.305
X6.348Y-8.6885
X6.348Y-8.723
X6.3485Y-9.1055
X6.386Y-9.1715
X6.43Y-8.305
X6.44Y-9.0165
X6.48Y-8.853
X6.4885Y-9.0705
X6.493Y-8.8225
X6.521Y-9.19
X6.568Y-9.232
X6.608Y-8.483
X6.68Y-9.0165
X6.6955Y-9.0635
X6.778Y-8.8225
X6.785Y-8.6595
X6.794Y-8.853
X6.88Y-9.0165
X6.8955Y-9.0635
X6.978Y-8.8225
X6.994Y-8.853
X7.08Y-9.0165
X7.09Y-8.6595
X7.0955Y-9.0635
X7.178Y-8.8225
X7.194Y-8.853
X7.28Y-9.0165
X7.29Y-8.6595
X7.2955Y-9.0635
X7.378Y-8.8225
X7.394Y-8.853
X7.48Y-9.0165
X7.49Y-8.6595
X7.4955Y-9.0635
X7.578Y-8.8225
X7.594Y-8.853
X7.68Y-9.0165
X7.69Y-8.6595
X7.6955Y-9.0635
X7.778Y-8.8225
X7.794Y-8.853
X7.88Y-9.0165
X7.89Y-8.6595
X7.8955Y-9.0635
X7.978Y-8.8225
X7.994Y-8.853
X8.08Y-9.0165
X8.09Y-8.6595
X8.0955Y-9.0635
X8.178Y-8.8225
X8.194Y-8.853
X8.28Y-9.0165
X8.29Y-8.6595
X8.2955Y-9.0635
X8.378Y-8.8225
X8.394Y-8.853
X8.48Y-9.0165
X8.49Y-8.6595
X8.4955Y-9.0635
X8.578Y-8.8225
X8.594Y-8.853
X8.68Y-9.0165
X8.69Y-8.6595
X8.6955Y-9.0635
X8.778Y-8.8225
X8.794Y-8.853
X8.88Y-9.0165
X8.89Y-8.6595
X8.8955Y-9.0635
X8.978Y-8.8225
X8.994Y-8.853
X9.08Y-9.0165
X9.09Y-8.6595
X9.0955Y-9.0635
X9.178Y-8.8225
X9.194Y-8.853
X9.28Y-9.0165
X9.29Y-8.6595
X9.2955Y-9.0635
X9.378Y-8.8225
X9.394Y-8.853
X9.48Y-9.0165
X9.49Y-8.6595
X9.4955Y-9.0635
X9.578Y-8.8225
X9.594Y-8.853
X9.68Y-9.0165
X9.69Y-8.6595
X9.6955Y-9.0635
X9.778Y-8.8225
X9.794Y-8.853
X9.88Y-9.0165
X9.89Y-8.6595
X9.8955Y-9.0635
X9.978Y-8.8225
X9.994Y-8.853
X10.08Y-9.0165
X10.09Y-8.6595
X10.0955Y-9.0635
X10.178Y-8.8225
X10.194Y-8.853
X10.28Y-9.0165
X10.29Y-8.6595
X10.2955Y-9.0635
X10.378Y-8.8225
X10.394Y-8.853
X10.48Y-9.0165
X10.49Y-8.6595
X10.4955Y-9.0635
X10.578Y-8.8225
X10.594Y-8.853
X10.68Y-9.0165
X10.69Y-8.6595
X10.6955Y-9.0635
X10.778Y-8.8225
X10.794Y-8.853
X10.88Y-9.0165
X10.89Y-8.6595
X10.8955Y-9.0635
X10.978Y-8.8225
X10.994Y-8.853
X11.08Y-9.0165
X11.09Y-8.6595
X11.0955Y-9.0635
X12.4469Y-9.0165
X12.4569Y-8.6595
X12.4624Y-9.0635
X12.5449Y-8.8225
X12.5609Y-8.853
X12.6469Y-9.0165
X12.6569Y-8.6595
X12.6624Y-9.0635
X12.7449Y-8.8225
X12.7609Y-8.853
X12.8469Y-9.0165
X12.8569Y-8.6595
X12.8624Y-9.0635
X12.9449Y-8.8225
X12.9609Y-8.853
X13.0469Y-9.0165
X13.0569Y-8.6595
X13.0624Y-9.0635
X13.1449Y-8.8225
X13.1609Y-8.853
X13.2469Y-9.0165
X13.2569Y-8.6595
X13.2624Y-9.0635
X13.3449Y-8.8225
X13.3609Y-8.853
X13.4469Y-9.0165
X13.4569Y-8.6595
X13.4719Y-9.0625
X13.5449Y-8.8225
X13.5609Y-8.853
X13.6469Y-9.0165
X13.6569Y-8.6595
X13.6719Y-9.0625
X13.7449Y-8.8225
X13.7609Y-8.853
X13.8469Y-9.0165
X13.8569Y-8.6595
X13.8719Y-9.0625
X13.9449Y-8.8225
X13.9609Y-8.853
X14.0469Y-9.0165
X14.0569Y-8.6595
X14.0719Y-9.0625
X14.1449Y-8.8225
X14.1609Y-8.853
X14.2469Y-9.0165
X14.2569Y-8.6595
X14.2719Y-9.0625
X14.3449Y-8.8225
X14.3609Y-8.853
X14.4469Y-9.0165
X14.4569Y-8.6595
X14.4719Y-9.0625
X14.5449Y-8.8225
X14.5609Y-8.853
X14.6469Y-9.0165
X14.6569Y-8.6595
X14.6719Y-9.0625
X14.7449Y-8.8225
X14.7609Y-8.853
X14.8469Y-9.0165
X14.8569Y-8.6595
X14.8719Y-9.0625
X14.9449Y-8.8225
X14.9609Y-8.853
X15.0469Y-9.0165
X15.0569Y-8.6595
X15.0719Y-9.0625
X15.1449Y-8.8225
X15.1609Y-8.853
X15.2469Y-9.0165
X15.2569Y-8.6595
X15.2719Y-9.0625
X15.3449Y-8.8225
X15.3609Y-8.853
X15.4469Y-9.0165
X15.4569Y-8.6595
X15.4719Y-9.0625
X15.5449Y-8.8225
X15.5609Y-8.853
X15.6469Y-9.0165
X15.6569Y-8.6595
X15.6719Y-9.0625
X15.7449Y-8.8225
X15.7609Y-8.853
X15.8469Y-9.0165
X15.8569Y-8.6595
X15.8719Y-9.0625
X15.9449Y-8.8225
X15.9609Y-8.853
X16.0469Y-9.0165
X16.0569Y-8.6595
X16.0719Y-9.0625
X16.1449Y-8.8225
X16.1609Y-8.853
X16.2469Y-9.0165
X16.2569Y-8.6595
X16.2719Y-9.0625
X16.3449Y-8.8225
X16.3609Y-8.853
X16.4469Y-9.0165
X16.4544Y-8.6565
X16.4719Y-9.0625
X16.5449Y-8.8225
X16.5609Y-8.853
X16.5724Y-8.5375
X16.6474Y-9.017
X16.6719Y-9.0625
X16.6959Y-8.
X16.6959Y-8.2
X16.6959Y-8.4
X16.6969Y-7.8
X16.7029Y-8.6655
X16.7249Y-8.6885
X16.7829Y-7.734
X16.7894Y-8.875
X16.8009Y-7.75
X16.8169Y-8.918
X16.8209Y-7.734
X16.8414Y-7.75
X16.8589Y-8.509
X16.8594Y-8.016
X16.8599Y-8.266
X16.8609Y-7.734
X16.8809Y-7.75
X16.8899Y-8.274
X16.8899Y-8.5225
X16.8919Y-8.028
X16.9009Y-7.734
X16.9114Y-8.753
X16.9199Y-7.75
X16.9389Y-7.734
X16.9594Y-7.75
X16.9789Y-7.734
X16.999Y-7.75
X17.0189Y-7.734
X17.0384Y-7.75
X17.0524Y-8.6115
X17.0539Y-8.199
X17.0539Y-8.41
X17.0569Y-7.734
X17.0739Y-7.8
X17.0779Y-7.75
X17.1009Y-8.421
X17.1039Y-8.221
X17.1199Y-7.8
X17.1749Y-7.734
X17.1919Y-8.0585
X17.1959Y-7.75
X17.2149Y-7.734
X17.2354Y-7.75
X17.2444Y-8.078
X17.2549Y-7.462
X17.2549Y-7.734
X17.2744Y-7.75
X17.2749Y-7.49
X17.2949Y-7.468
X17.2949Y-7.734
X17.3064Y-7.9435
X17.3139Y-7.75
X17.3149Y-7.488
X17.3329Y-7.734
X17.3439Y-7.9785
X17.3529Y-7.596
X17.3534Y-7.75
X17.3729Y-7.58
X17.3729Y-7.734
X17.3924Y-7.75
X17.3929Y-7.596
X17.4124Y-7.58
X17.4129Y-7.734
X17.4319Y-7.75
X17.4409Y-7.584
X17.4484Y-7.8015
X17.4509Y-7.734
X17.4709Y-7.75
X17.4854Y-7.837
T2
X16.5769Y-7.48
X16.8019Y-7.474
X16.8609Y-7.474
X16.9199Y-7.474
X16.9789Y-7.474
X17.0269Y-7.6
X17.0969Y-7.61
X17.1569Y-7.61
X17.2169Y-7.61
X17.6759Y-7.481
T0
M30
