M48
;DRILL file {Pcbnew (2013-10-07 BZR 4378)-stable} date Fri 19 Dec 2014 04:01:07 PM EST
;FORMAT={-:-/ absolute / inch / decimal}
FMAT,2
INCH,TZ
T1C0.006
T2C0.020
%
G90
G05
M72
T1
X3.74Y-8.145
X3.74Y-8.17
X3.74Y-8.195
X3.74Y-8.22
X3.74Y-8.245
X3.74Y-8.286
X3.74Y-8.342
X3.74Y-8.381
X3.74Y-8.421
X3.74Y-8.46
X3.74Y-8.5
X3.74Y-8.539
X3.74Y-8.579
X3.74Y-8.618
X3.74Y-8.776
X3.74Y-8.815
X3.74Y-8.853
X3.74Y-8.894
X3.74Y-8.934
X3.74Y-8.973
X3.74Y-9.013
X3.74Y-9.052
X3.74Y-9.106
X3.74Y-9.15
X3.74Y-9.189
X3.74Y-9.2265
X3.74Y-9.286
X3.74Y-9.325
X3.748Y-8.723
X3.761Y-8.689
X3.769Y-9.089
X3.773Y-8.265
X3.773Y-8.321
X3.7735Y-8.7345
X3.779Y-9.258
X3.7795Y-9.146
X3.78Y-9.299
X3.79Y-8.6765
X3.7965Y-8.7535
X3.8065Y-8.2655
X3.8148Y-8.3093
X3.8205Y-8.6555
X3.855Y-8.305
X5.348Y-8.723
X5.348Y-9.106
X5.361Y-8.689
X5.388Y-9.17
X5.406Y-9.258
X5.43Y-8.305
X5.548Y-8.723
X5.548Y-9.106
X5.561Y-8.689
X5.588Y-9.1705
X5.606Y-9.299
X5.63Y-8.305
X5.748Y-8.723
X5.748Y-9.106
X5.761Y-8.689
X5.788Y-9.1705
X5.806Y-9.258
X5.83Y-8.305
X5.948Y-8.723
X5.948Y-9.106
X5.961Y-8.689
X5.988Y-9.1705
X6.006Y-9.299
X6.03Y-8.305
X6.148Y-8.723
X6.148Y-9.106
X6.161Y-8.689
X6.188Y-9.1705
X6.206Y-9.258
X6.23Y-8.305
X6.348Y-8.6885
X6.348Y-8.723
X6.3485Y-9.1055
X6.386Y-9.1715
X6.43Y-8.305
X6.44Y-9.0165
X6.48Y-8.853
X6.4885Y-9.0705
X6.493Y-8.8225
X6.521Y-9.19
X6.568Y-9.232
X6.608Y-8.483
X6.68Y-9.0168
X6.6955Y-9.0635
X6.785Y-8.6595
X6.8243Y-8.8225
X6.8403Y-8.853
X6.88Y-9.0165
X6.8955Y-9.0635
X6.9363Y-8.6595
X7.0243Y-8.8225
X7.0403Y-8.853
X7.08Y-9.0165
X7.0955Y-9.0635
X7.1263Y-9.0166
X7.1363Y-8.6595
X7.2243Y-8.8225
X7.2403Y-8.853
X7.2955Y-9.0635
X7.3263Y-9.0166
X7.3363Y-8.6595
X7.4243Y-8.8225
X7.4403Y-8.853
X7.4955Y-9.0635
X7.5263Y-9.0166
X7.5363Y-8.6595
X7.6243Y-8.8225
X7.6403Y-8.853
X7.6955Y-9.0635
X7.7263Y-9.0166
X7.7363Y-8.6595
X7.8243Y-8.8225
X7.8403Y-8.853
X7.8955Y-9.0635
X7.9263Y-9.0166
X7.9363Y-8.6595
X8.0243Y-8.8225
X8.0403Y-8.853
X8.0955Y-9.0635
X8.1263Y-9.0166
X8.1363Y-8.6595
X8.2243Y-8.8225
X8.2403Y-8.853
X8.2955Y-9.0635
X8.3263Y-9.0166
X8.3363Y-8.6595
X8.4243Y-8.8225
X8.4403Y-8.853
X8.4955Y-9.0635
X8.5263Y-9.0166
X8.5363Y-8.6595
X8.6243Y-8.8225
X8.6403Y-8.853
X8.6955Y-9.0635
X8.7263Y-9.0166
X8.7363Y-8.6595
X8.8243Y-8.8225
X8.8403Y-8.853
X8.8955Y-9.0635
X8.9263Y-9.0166
X8.9363Y-8.6595
X9.0243Y-8.8225
X9.0403Y-8.853
X9.0955Y-9.0635
X9.1263Y-9.0166
X9.1363Y-8.6595
X9.2243Y-8.8225
X9.2403Y-8.853
X9.2955Y-9.0635
X9.3263Y-9.0166
X9.3363Y-8.6595
X9.4243Y-8.8225
X9.4403Y-8.853
X9.4955Y-9.0635
X9.5263Y-9.0166
X9.5363Y-8.6595
X9.6243Y-8.8225
X9.6403Y-8.853
X9.6955Y-9.0635
X9.7263Y-9.0166
X9.7363Y-8.6595
X9.8243Y-8.8225
X9.8403Y-8.853
X9.8955Y-9.0635
X9.9263Y-9.0166
X9.9363Y-8.6595
X10.0243Y-8.8225
X10.0403Y-8.853
X10.0955Y-9.0635
X10.1263Y-9.0166
X10.1363Y-8.6595
X10.2243Y-8.8225
X10.2403Y-8.853
X10.2955Y-9.0635
X10.3263Y-9.0166
X10.3363Y-8.6595
X10.4243Y-8.8225
X10.4403Y-8.853
X10.4955Y-9.0635
X10.5263Y-9.0166
X10.5363Y-8.6595
X10.6243Y-8.8225
X10.6403Y-8.853
X10.6955Y-9.0635
X10.7263Y-9.0166
X10.7363Y-8.6595
X10.8243Y-8.8225
X10.8403Y-8.853
X10.9263Y-9.0165
X10.9363Y-8.6595
X10.9513Y-9.0625
X11.0243Y-8.8225
X11.0403Y-8.853
X12.4243Y-8.8225
X12.4403Y-8.853
X12.5263Y-9.0165
X12.5363Y-8.6595
X12.5513Y-9.0625
X12.6243Y-8.8225
X12.6403Y-8.853
X12.7263Y-9.0165
X12.7338Y-8.6565
X12.7513Y-9.0625
X12.8243Y-8.8225
X12.8403Y-8.853
X12.8518Y-8.5375
X12.9513Y-9.0625
X12.9753Y-8.
X12.9753Y-8.2
X12.9753Y-8.4
X12.9763Y-7.8
X12.9823Y-8.6655
X13.0043Y-8.6885
X13.0623Y-7.734
X13.0688Y-8.875
X13.0803Y-7.75
X13.0963Y-8.918
X13.1003Y-7.734
X13.1208Y-7.75
X13.1383Y-8.509
X13.1388Y-8.016
X13.1393Y-8.266
X13.1403Y-7.734
X13.1603Y-7.75
X13.1693Y-8.274
X13.1693Y-8.5225
X13.1713Y-8.028
X13.1803Y-7.734
X13.1908Y-8.753
X13.1993Y-7.75
X13.2183Y-7.734
X13.2378Y-8.7765
X13.2388Y-7.75
X13.2583Y-7.734
X13.2783Y-7.75
X13.2983Y-7.734
X13.3178Y-7.75
X13.3318Y-8.6115
X13.3333Y-8.199
X13.3333Y-8.41
X13.3363Y-7.734
X13.3533Y-7.8
X13.3573Y-7.75
X13.3793Y-8.635
X13.3803Y-8.421
X13.3833Y-8.221
X13.3993Y-7.8
X13.4543Y-7.734
X13.4713Y-8.0585
X13.4753Y-7.75
X13.4943Y-7.734
X13.5148Y-7.75
X13.5238Y-8.078
X13.5343Y-7.462
X13.5343Y-7.734
X13.5538Y-7.75
X13.5543Y-7.49
X13.5743Y-7.468
X13.5743Y-7.734
X13.5858Y-7.9435
X13.5933Y-7.75
X13.5943Y-7.488
X13.6123Y-7.734
X13.6233Y-7.9785
X13.6323Y-7.596
X13.6328Y-7.75
X13.6523Y-7.58
X13.6523Y-7.734
X13.6718Y-7.75
X13.6723Y-7.596
X13.6918Y-7.58
X13.6923Y-7.734
X13.7113Y-7.75
X13.725Y-7.583
X13.7278Y-7.8015
X13.7303Y-7.734
X13.7503Y-7.75
X13.7648Y-7.837
T2
X12.8563Y-7.48
X13.0813Y-7.474
X13.1403Y-7.474
X13.1993Y-7.474
X13.2583Y-7.474
X13.3063Y-7.6
X13.3763Y-7.61
X13.4363Y-7.61
X13.4963Y-7.61
X13.9553Y-7.481
T0
M30
