  0
SECTION
  2
HEADER
  9
$ANGBASE
  50
0.0
  9
$ANGDIR
  70
  1
  9
$MEASUREMENT
  70
0
  0
ENDSEC
  0
SECTION
  2
TABLES
  0
TABLE
  2
LTYPE
  70
1
  0
LTYPE
  2
CONTINUOUS
  70
0
  3
Solid line
  72
65
  73
0
  40
0.0
  0
ENDTAB
  0
TABLE
  2
STYLE
  70
4
  0
STYLE
  2
KICAD
  70
0
  40
0
  41
1
  42
1
  50
0
  71
0
  3
isocp.shx
  0
STYLE
  2
KICADB
  70
0
  40
0
  41
1
  42
1
  50
0
  71
0
  3
isocp.shx
  0
STYLE
  2
KICADI
  70
0
  40
0
  41
1
  42
1
  50
15
  71
0
  3
isocp.shx
  0
STYLE
  2
KICADBI
  70
0
  40
0
  41
1
  42
1
  50
15
  71
0
  3
isocp.shx
  0
ENDTAB
  0
TABLE
  2
LAYER
  70
30
  0
LAYER
  2
BLACK
  70
0
  62
7
  6
CONTINUOUS
  0
LAYER
  2
GRAY1
  70
0
  62
251
  6
CONTINUOUS
  0
LAYER
  2
GRAY2
  70
0
  62
8
  6
CONTINUOUS
  0
LAYER
  2
GRAY3
  70
0
  62
9
  6
CONTINUOUS
  0
LAYER
  2
WHITE
  70
0
  62
7
  6
CONTINUOUS
  0
LAYER
  2
LYELLOW
  70
0
  62
51
  6
CONTINUOUS
  0
LAYER
  2
BLUE1
  70
0
  62
178
  6
CONTINUOUS
  0
LAYER
  2
GREEN1
  70
0
  62
98
  6
CONTINUOUS
  0
LAYER
  2
CYAN1
  70
0
  62
138
  6
CONTINUOUS
  0
LAYER
  2
RED1
  70
0
  62
18
  6
CONTINUOUS
  0
LAYER
  2
MAGENTA1
  70
0
  62
228
  6
CONTINUOUS
  0
LAYER
  2
BROWN1
  70
0
  62
58
  6
CONTINUOUS
  0
LAYER
  2
BLUE2
  70
0
  62
5
  6
CONTINUOUS
  0
LAYER
  2
GREEN2
  70
0
  62
3
  6
CONTINUOUS
  0
LAYER
  2
CYAN2
  70
0
  62
4
  6
CONTINUOUS
  0
LAYER
  2
RED2
  70
0
  62
1
  6
CONTINUOUS
  0
LAYER
  2
MAGENTA2
  70
0
  62
6
  6
CONTINUOUS
  0
LAYER
  2
BROWN2
  70
0
  62
54
  6
CONTINUOUS
  0
LAYER
  2
BLUE3
  70
0
  62
171
  6
CONTINUOUS
  0
LAYER
  2
GREEN3
  70
0
  62
91
  6
CONTINUOUS
  0
LAYER
  2
CYAN3
  70
0
  62
131
  6
CONTINUOUS
  0
LAYER
  2
RED3
  70
0
  62
11
  6
CONTINUOUS
  0
LAYER
  2
MAGENTA3
  70
0
  62
221
  6
CONTINUOUS
  0
LAYER
  2
YELLOW3
  70
0
  62
2
  6
CONTINUOUS
  0
LAYER
  2
BLUE4
  70
0
  62
5
  6
CONTINUOUS
  0
LAYER
  2
GREEN4
  70
0
  62
3
  6
CONTINUOUS
  0
LAYER
  2
CYAN4
  70
0
  62
4
  6
CONTINUOUS
  0
LAYER
  2
RED4
  70
0
  62
1
  6
CONTINUOUS
  0
LAYER
  2
MAGENTA4
  70
0
  62
6
  6
CONTINUOUS
  0
LAYER
  2
YELLOW4
  70
0
  62
2
  6
CONTINUOUS
  0
ENDTAB
  0
ENDSEC
  0
SECTION
  2
ENTITIES
0
LINE
8
Black
10
171.577
20
-233.095
11
424.839
21
-233.095
0
LINE
8
Black
10
171.577
20
-232.995
11
424.839
21
-232.995
0
ARC
8
Black
10
424.839
20
-233.045
40
0.05
50
270
51
450
0
ARC
8
Black
10
171.577
20
-233.045
40
0.05
50
90
51
270
0
LINE
8
Black
10
437.716
20
-210.82
11
437.716
21
-210.464
0
LINE
8
Black
10
437.616
20
-210.82
11
437.616
21
-210.464
0
ARC
8
Black
10
437.666
20
-210.464
40
0.05
50
360
51
540
0
ARC
8
Black
10
437.666
20
-210.82
40
0.05
50
180
51
360
0
LINE
8
Black
10
440.069
20
-207.991
11
437.63
21
-210.429
0
LINE
8
Black
10
440.139
20
-208.061
11
437.701
21
-210.5
0
ARC
8
Black
10
437.666
20
-210.464
40
0.05
50
495
51
675
0
ARC
8
Black
10
440.104
20
-208.026
40
0.05
50
315
51
495
0
LINE
8
Black
10
437.716
20
-220.218
11
437.716
21
-210.82
0
LINE
8
Black
10
437.616
20
-220.218
11
437.616
21
-210.82
0
ARC
8
Black
10
437.666
20
-210.82
40
0.05
50
360
51
540
0
ARC
8
Black
10
437.666
20
-220.218
40
0.05
50
180
51
360
0
LINE
8
Black
10
424.874
20
-233.08
11
437.701
21
-220.253
0
LINE
8
Black
10
424.803
20
-233.01
11
437.63
21
-220.183
0
ARC
8
Black
10
437.666
20
-220.218
40
0.05
50
315
51
495
0
ARC
8
Black
10
424.839
20
-233.045
40
0.05
50
135
51
315
0
LINE
8
Black
10
83.8962
20
-237.413
11
85.0392
21
-237.413
0
LINE
8
Black
10
83.8962
20
-237.313
11
85.0392
21
-237.313
0
ARC
8
Black
10
85.0392
20
-237.363
40
0.05
50
270
51
450
0
ARC
8
Black
10
83.8962
20
-237.363
40
0.05
50
90
51
270
0
LINE
8
Black
10
85.0038
20
-237.398
11
85.2324
21
-237.627
0
LINE
8
Black
10
85.0746
20
-237.328
11
85.3032
21
-237.556
0
ARC
8
Black
10
85.2678
20
-237.592
40
0.05
50
225
51
405
0
ARC
8
Black
10
85.0392
20
-237.363
40
0.05
50
45
51
225
0
LINE
8
Black
10
85.3178
20
-237.846
11
85.3178
21
-237.592
0
LINE
8
Black
10
85.2178
20
-237.846
11
85.2178
21
-237.592
0
ARC
8
Black
10
85.2678
20
-237.592
40
0.05
50
360
51
540
0
ARC
8
Black
10
85.2678
20
-237.846
40
0.05
50
180
51
360
0
LINE
8
Black
10
85.2324
20
-237.881
11
85.5372
21
-238.186
0
LINE
8
Black
10
85.3032
20
-237.81
11
85.608
21
-238.115
0
ARC
8
Black
10
85.5726
20
-238.15
40
0.05
50
225
51
405
0
ARC
8
Black
10
85.2678
20
-237.846
40
0.05
50
45
51
225
0
LINE
8
Black
10
85.5726
20
-238.2
11
86.7156
21
-238.2
0
LINE
8
Black
10
85.5726
20
-238.1
11
86.7156
21
-238.1
0
ARC
8
Black
10
86.7156
20
-238.15
40
0.05
50
270
51
450
0
ARC
8
Black
10
85.5726
20
-238.15
40
0.05
50
90
51
270
0
LINE
8
Black
10
86.7656
20
-238.15
11
86.7656
21
-237.363
0
LINE
8
Black
10
86.6656
20
-238.15
11
86.6656
21
-237.363
0
ARC
8
Black
10
86.7156
20
-237.363
40
0.05
50
360
51
540
0
ARC
8
Black
10
86.7156
20
-238.15
40
0.05
50
180
51
360
0
LINE
8
Black
10
83.9462
20
-237.363
11
83.9462
21
-204.851
0
LINE
8
Black
10
83.8462
20
-237.363
11
83.8462
21
-204.851
0
ARC
8
Black
10
83.8962
20
-204.851
40
0.05
50
360
51
540
0
ARC
8
Black
10
83.8962
20
-237.363
40
0.05
50
180
51
360
0
LINE
8
Black
10
83.8962
20
-204.901
11
84.836
21
-204.901
0
LINE
8
Black
10
83.8962
20
-204.801
11
84.836
21
-204.801
0
ARC
8
Black
10
84.836
20
-204.851
40
0.05
50
270
51
450
0
ARC
8
Black
10
83.8962
20
-204.851
40
0.05
50
90
51
270
0
LINE
8
Black
10
84.8106
20
-204.901
11
84.8868
21
-204.901
0
LINE
8
Black
10
84.8106
20
-204.801
11
84.8868
21
-204.801
0
ARC
8
Black
10
84.8868
20
-204.851
40
0.05
50
270
51
450
0
ARC
8
Black
10
84.8106
20
-204.851
40
0.05
50
90
51
270
0
LINE
8
Black
10
84.8868
20
-204.901
11
84.963
21
-204.901
0
LINE
8
Black
10
84.8868
20
-204.801
11
84.963
21
-204.801
0
ARC
8
Black
10
84.963
20
-204.851
40
0.05
50
270
51
450
0
ARC
8
Black
10
84.8868
20
-204.851
40
0.05
50
90
51
270
0
LINE
8
Black
10
84.9984
20
-204.886
11
85.3032
21
-204.582
0
LINE
8
Black
10
84.9276
20
-204.816
11
85.2324
21
-204.511
0
ARC
8
Black
10
85.2678
20
-204.546
40
0.05
50
315
51
495
0
ARC
8
Black
10
84.963
20
-204.851
40
0.05
50
135
51
315
0
LINE
8
Black
10
85.3178
20
-204.546
11
85.3178
21
-204.318
0
LINE
8
Black
10
85.2178
20
-204.546
11
85.2178
21
-204.318
0
ARC
8
Black
10
85.2678
20
-204.318
40
0.05
50
360
51
540
0
ARC
8
Black
10
85.2678
20
-204.546
40
0.05
50
180
51
360
0
LINE
8
Black
10
85.3032
20
-204.353
11
85.5826
21
-204.074
0
LINE
8
Black
10
85.2324
20
-204.282
11
85.5118
21
-204.003
0
ARC
8
Black
10
85.5472
20
-204.038
40
0.05
50
315
51
495
0
ARC
8
Black
10
85.2678
20
-204.318
40
0.05
50
135
51
315
0
LINE
8
Black
10
85.5472
20
-204.088
11
86.6902
21
-204.088
0
LINE
8
Black
10
85.5472
20
-203.988
11
86.6902
21
-203.988
0
ARC
8
Black
10
86.6902
20
-204.038
40
0.05
50
270
51
450
0
ARC
8
Black
10
85.5472
20
-204.038
40
0.05
50
90
51
270
0
LINE
8
Black
10
86.7402
20
-204.826
11
86.7402
21
-204.038
0
LINE
8
Black
10
86.6402
20
-204.826
11
86.6402
21
-204.038
0
ARC
8
Black
10
86.6902
20
-204.038
40
0.05
50
360
51
540
0
ARC
8
Black
10
86.6902
20
-204.826
40
0.05
50
180
51
360
0
LINE
8
Black
10
450.229
20
-197.831
11
440.069
21
-207.991
0
LINE
8
Black
10
450.299
20
-197.901
11
440.139
21
-208.061
0
ARC
8
Black
10
440.104
20
-208.026
40
0.05
50
495
51
675
0
ARC
8
Black
10
450.264
20
-197.866
40
0.05
50
315
51
495
0
LINE
8
Black
10
167.294
20
-237.398
11
171.612
21
-233.08
0
LINE
8
Black
10
167.224
20
-237.328
11
171.542
21
-233.01
0
ARC
8
Black
10
171.577
20
-233.045
40
0.05
50
315
51
495
0
ARC
8
Black
10
167.259
20
-237.363
40
0.05
50
135
51
315
0
LINE
8
Black
10
83.947
20
-237.413
11
167.259
21
-237.413
0
LINE
8
Black
10
83.947
20
-237.313
11
167.259
21
-237.313
0
ARC
8
Black
10
167.259
20
-237.363
40
0.05
50
270
51
450
0
ARC
8
Black
10
83.947
20
-237.363
40
0.05
50
90
51
270
0
LINE
8
Black
10
83.997
20
-237.363
11
83.997
21
-204.851
0
LINE
8
Black
10
83.897
20
-237.363
11
83.897
21
-204.851
0
ARC
8
Black
10
83.947
20
-204.851
40
0.05
50
360
51
540
0
ARC
8
Black
10
83.947
20
-237.363
40
0.05
50
180
51
360
0
LINE
8
Black
10
83.947
20
-204.901
11
163.449
21
-204.901
0
LINE
8
Black
10
83.947
20
-204.801
11
163.449
21
-204.801
0
ARC
8
Black
10
163.449
20
-204.851
40
0.05
50
270
51
450
0
ARC
8
Black
10
83.947
20
-204.851
40
0.05
50
90
51
270
0
LINE
8
Black
10
174.279
20
-215.611
11
163.484
21
-204.816
0
LINE
8
Black
10
174.209
20
-215.681
11
163.414
21
-204.886
0
ARC
8
Black
10
163.449
20
-204.851
40
0.05
50
405
51
585
0
ARC
8
Black
10
174.244
20
-215.646
40
0.05
50
225
51
405
0
LINE
8
Black
10
174.244
20
-215.696
11
415.974
21
-215.696
0
LINE
8
Black
10
174.244
20
-215.596
11
415.974
21
-215.596
0
ARC
8
Black
10
415.974
20
-215.646
40
0.05
50
270
51
450
0
ARC
8
Black
10
174.244
20
-215.646
40
0.05
50
90
51
270
0
LINE
8
Black
10
419.749
20
-211.801
11
415.939
21
-215.611
0
LINE
8
Black
10
419.819
20
-211.871
11
416.009
21
-215.681
0
ARC
8
Black
10
415.974
20
-215.646
40
0.05
50
495
51
675
0
ARC
8
Black
10
419.784
20
-211.836
40
0.05
50
315
51
495
0
LINE
8
Black
10
419.834
20
-211.836
11
419.834
21
-188.722
0
LINE
8
Black
10
419.734
20
-211.836
11
419.734
21
-188.722
0
ARC
8
Black
10
419.784
20
-188.722
40
0.05
50
360
51
540
0
ARC
8
Black
10
419.784
20
-211.836
40
0.05
50
180
51
360
0
LINE
8
Black
10
450.314
20
-197.866
11
450.314
21
-188.722
0
LINE
8
Black
10
450.214
20
-197.866
11
450.214
21
-188.722
0
ARC
8
Black
10
450.264
20
-188.722
40
0.05
50
360
51
540
0
ARC
8
Black
10
450.264
20
-197.866
40
0.05
50
180
51
360
0
LINE
8
Black
10
419.784
20
-188.772
11
450.264
21
-188.772
0
LINE
8
Black
10
419.784
20
-188.672
11
450.264
21
-188.672
0
ARC
8
Black
10
450.264
20
-188.722
40
0.05
50
270
51
450
0
ARC
8
Black
10
419.784
20
-188.722
40
0.05
50
90
51
270
0
LINE
8
Black
10
441.421
20
-195.806
11
441.421
21
-194.306
0
LINE
8
Black
10
441.421
20
-194.306
11
441.121
21
-194.306
0
LINE
8
Black
10
441.121
20
-194.306
11
441.121
21
-195.806
0
LINE
8
Black
10
441.121
20
-195.806
11
441.421
21
-195.806
0
LINE
8
Black
10
441.921
20
-195.806
11
441.921
21
-194.306
0
LINE
8
Black
10
441.921
20
-194.306
11
441.621
21
-194.306
0
LINE
8
Black
10
441.621
20
-194.306
11
441.621
21
-195.806
0
LINE
8
Black
10
441.621
20
-195.806
11
441.921
21
-195.806
0
LINE
8
Black
10
442.921
20
-195.806
11
442.921
21
-194.306
0
LINE
8
Black
10
442.921
20
-194.306
11
442.621
21
-194.306
0
LINE
8
Black
10
442.621
20
-194.306
11
442.621
21
-195.806
0
LINE
8
Black
10
442.621
20
-195.806
11
442.921
21
-195.806
0
LINE
8
Black
10
442.421
20
-195.806
11
442.421
21
-194.306
0
LINE
8
Black
10
442.421
20
-194.306
11
442.121
21
-194.306
0
LINE
8
Black
10
442.121
20
-194.306
11
442.121
21
-195.806
0
LINE
8
Black
10
442.121
20
-195.806
11
442.421
21
-195.806
0
LINE
8
Black
10
444.421
20
-195.806
11
444.421
21
-194.306
0
LINE
8
Black
10
444.421
20
-194.306
11
444.121
21
-194.306
0
LINE
8
Black
10
444.121
20
-194.306
11
444.121
21
-195.806
0
LINE
8
Black
10
444.121
20
-195.806
11
444.421
21
-195.806
0
LINE
8
Black
10
444.921
20
-195.806
11
444.921
21
-194.306
0
LINE
8
Black
10
444.921
20
-194.306
11
444.621
21
-194.306
0
LINE
8
Black
10
444.621
20
-194.306
11
444.621
21
-195.806
0
LINE
8
Black
10
444.621
20
-195.806
11
444.921
21
-195.806
0
LINE
8
Black
10
443.921
20
-195.806
11
443.921
21
-194.306
0
LINE
8
Black
10
443.921
20
-194.306
11
443.621
21
-194.306
0
LINE
8
Black
10
443.621
20
-194.306
11
443.621
21
-195.806
0
LINE
8
Black
10
443.621
20
-195.806
11
443.921
21
-195.806
0
LINE
8
Black
10
443.421
20
-195.806
11
443.421
21
-194.306
0
LINE
8
Black
10
443.421
20
-194.306
11
443.121
21
-194.306
0
LINE
8
Black
10
443.121
20
-194.306
11
443.121
21
-195.806
0
LINE
8
Black
10
443.121
20
-195.806
11
443.421
21
-195.806
0
LINE
8
Black
10
433.421
20
-195.806
11
433.421
21
-194.306
0
LINE
8
Black
10
433.421
20
-194.306
11
433.121
21
-194.306
0
LINE
8
Black
10
433.121
20
-194.306
11
433.121
21
-195.806
0
LINE
8
Black
10
433.121
20
-195.806
11
433.421
21
-195.806
0
LINE
8
Black
10
433.921
20
-195.806
11
433.921
21
-194.306
0
LINE
8
Black
10
433.921
20
-194.306
11
433.621
21
-194.306
0
LINE
8
Black
10
433.621
20
-194.306
11
433.621
21
-195.806
0
LINE
8
Black
10
433.621
20
-195.806
11
433.921
21
-195.806
0
LINE
8
Black
10
434.921
20
-195.806
11
434.921
21
-194.306
0
LINE
8
Black
10
434.921
20
-194.306
11
434.621
21
-194.306
0
LINE
8
Black
10
434.621
20
-194.306
11
434.621
21
-195.806
0
LINE
8
Black
10
434.621
20
-195.806
11
434.921
21
-195.806
0
LINE
8
Black
10
434.421
20
-195.806
11
434.421
21
-194.306
0
LINE
8
Black
10
434.421
20
-194.306
11
434.121
21
-194.306
0
LINE
8
Black
10
434.121
20
-194.306
11
434.121
21
-195.806
0
LINE
8
Black
10
434.121
20
-195.806
11
434.421
21
-195.806
0
LINE
8
Black
10
436.421
20
-195.806
11
436.421
21
-194.306
0
LINE
8
Black
10
436.421
20
-194.306
11
436.121
21
-194.306
0
LINE
8
Black
10
436.121
20
-194.306
11
436.121
21
-195.806
0
LINE
8
Black
10
436.121
20
-195.806
11
436.421
21
-195.806
0
LINE
8
Black
10
436.921
20
-195.806
11
436.921
21
-194.306
0
LINE
8
Black
10
436.921
20
-194.306
11
436.621
21
-194.306
0
LINE
8
Black
10
436.621
20
-194.306
11
436.621
21
-195.806
0
LINE
8
Black
10
436.621
20
-195.806
11
436.921
21
-195.806
0
LINE
8
Black
10
435.921
20
-195.806
11
435.921
21
-194.306
0
LINE
8
Black
10
435.921
20
-194.306
11
435.621
21
-194.306
0
LINE
8
Black
10
435.621
20
-194.306
11
435.621
21
-195.806
0
LINE
8
Black
10
435.621
20
-195.806
11
435.921
21
-195.806
0
LINE
8
Black
10
435.421
20
-195.806
11
435.421
21
-194.306
0
LINE
8
Black
10
435.421
20
-194.306
11
435.121
21
-194.306
0
LINE
8
Black
10
435.121
20
-194.306
11
435.121
21
-195.806
0
LINE
8
Black
10
435.121
20
-195.806
11
435.421
21
-195.806
0
LINE
8
Black
10
439.421
20
-195.806
11
439.421
21
-194.306
0
LINE
8
Black
10
439.421
20
-194.306
11
439.121
21
-194.306
0
LINE
8
Black
10
439.121
20
-194.306
11
439.121
21
-195.806
0
LINE
8
Black
10
439.121
20
-195.806
11
439.421
21
-195.806
0
LINE
8
Black
10
439.921
20
-195.806
11
439.921
21
-194.306
0
LINE
8
Black
10
439.921
20
-194.306
11
439.621
21
-194.306
0
LINE
8
Black
10
439.621
20
-194.306
11
439.621
21
-195.806
0
LINE
8
Black
10
439.621
20
-195.806
11
439.921
21
-195.806
0
LINE
8
Black
10
440.921
20
-195.806
11
440.921
21
-194.306
0
LINE
8
Black
10
440.921
20
-194.306
11
440.621
21
-194.306
0
LINE
8
Black
10
440.621
20
-194.306
11
440.621
21
-195.806
0
LINE
8
Black
10
440.621
20
-195.806
11
440.921
21
-195.806
0
LINE
8
Black
10
440.421
20
-195.806
11
440.421
21
-194.306
0
LINE
8
Black
10
440.421
20
-194.306
11
440.121
21
-194.306
0
LINE
8
Black
10
440.121
20
-194.306
11
440.121
21
-195.806
0
LINE
8
Black
10
440.121
20
-195.806
11
440.421
21
-195.806
0
LINE
8
Black
10
438.421
20
-195.806
11
438.421
21
-194.306
0
LINE
8
Black
10
438.421
20
-194.306
11
438.121
21
-194.306
0
LINE
8
Black
10
438.121
20
-194.306
11
438.121
21
-195.806
0
LINE
8
Black
10
438.121
20
-195.806
11
438.421
21
-195.806
0
LINE
8
Black
10
438.921
20
-195.806
11
438.921
21
-194.306
0
LINE
8
Black
10
438.921
20
-194.306
11
438.621
21
-194.306
0
LINE
8
Black
10
438.621
20
-194.306
11
438.621
21
-195.806
0
LINE
8
Black
10
438.621
20
-195.806
11
438.921
21
-195.806
0
LINE
8
Black
10
437.921
20
-195.806
11
437.921
21
-194.306
0
LINE
8
Black
10
437.921
20
-194.306
11
437.621
21
-194.306
0
LINE
8
Black
10
437.621
20
-194.306
11
437.621
21
-195.806
0
LINE
8
Black
10
437.621
20
-195.806
11
437.921
21
-195.806
0
LINE
8
Black
10
437.421
20
-195.806
11
437.421
21
-194.306
0
LINE
8
Black
10
437.421
20
-194.306
11
437.121
21
-194.306
0
LINE
8
Black
10
437.121
20
-194.306
11
437.121
21
-195.806
0
LINE
8
Black
10
437.121
20
-195.806
11
437.421
21
-195.806
0
LINE
8
Black
10
429.421
20
-195.806
11
429.421
21
-194.306
0
LINE
8
Black
10
429.421
20
-194.306
11
429.121
21
-194.306
0
LINE
8
Black
10
429.121
20
-194.306
11
429.121
21
-195.806
0
LINE
8
Black
10
429.121
20
-195.806
11
429.421
21
-195.806
0
LINE
8
Black
10
429.921
20
-195.806
11
429.921
21
-194.306
0
LINE
8
Black
10
429.921
20
-194.306
11
429.621
21
-194.306
0
LINE
8
Black
10
429.621
20
-194.306
11
429.621
21
-195.806
0
LINE
8
Black
10
429.621
20
-195.806
11
429.921
21
-195.806
0
LINE
8
Black
10
430.921
20
-195.806
11
430.921
21
-194.306
0
LINE
8
Black
10
430.921
20
-194.306
11
430.621
21
-194.306
0
LINE
8
Black
10
430.621
20
-194.306
11
430.621
21
-195.806
0
LINE
8
Black
10
430.621
20
-195.806
11
430.921
21
-195.806
0
LINE
8
Black
10
430.421
20
-195.806
11
430.421
21
-194.306
0
LINE
8
Black
10
430.421
20
-194.306
11
430.121
21
-194.306
0
LINE
8
Black
10
430.121
20
-194.306
11
430.121
21
-195.806
0
LINE
8
Black
10
430.121
20
-195.806
11
430.421
21
-195.806
0
LINE
8
Black
10
432.421
20
-195.806
11
432.421
21
-194.306
0
LINE
8
Black
10
432.421
20
-194.306
11
432.121
21
-194.306
0
LINE
8
Black
10
432.121
20
-194.306
11
432.121
21
-195.806
0
LINE
8
Black
10
432.121
20
-195.806
11
432.421
21
-195.806
0
LINE
8
Black
10
432.921
20
-195.806
11
432.921
21
-194.306
0
LINE
8
Black
10
432.921
20
-194.306
11
432.621
21
-194.306
0
LINE
8
Black
10
432.621
20
-194.306
11
432.621
21
-195.806
0
LINE
8
Black
10
432.621
20
-195.806
11
432.921
21
-195.806
0
LINE
8
Black
10
431.921
20
-195.806
11
431.921
21
-194.306
0
LINE
8
Black
10
431.921
20
-194.306
11
431.621
21
-194.306
0
LINE
8
Black
10
431.621
20
-194.306
11
431.621
21
-195.806
0
LINE
8
Black
10
431.621
20
-195.806
11
431.921
21
-195.806
0
LINE
8
Black
10
431.421
20
-195.806
11
431.421
21
-194.306
0
LINE
8
Black
10
431.421
20
-194.306
11
431.121
21
-194.306
0
LINE
8
Black
10
431.121
20
-194.306
11
431.121
21
-195.806
0
LINE
8
Black
10
431.121
20
-195.806
11
431.421
21
-195.806
0
LINE
8
Black
10
427.421
20
-195.806
11
427.421
21
-194.306
0
LINE
8
Black
10
427.421
20
-194.306
11
427.121
21
-194.306
0
LINE
8
Black
10
427.121
20
-194.306
11
427.121
21
-195.806
0
LINE
8
Black
10
427.121
20
-195.806
11
427.421
21
-195.806
0
LINE
8
Black
10
427.921
20
-195.806
11
427.921
21
-194.306
0
LINE
8
Black
10
427.921
20
-194.306
11
427.621
21
-194.306
0
LINE
8
Black
10
427.621
20
-194.306
11
427.621
21
-195.806
0
LINE
8
Black
10
427.621
20
-195.806
11
427.921
21
-195.806
0
LINE
8
Black
10
428.921
20
-195.806
11
428.921
21
-194.306
0
LINE
8
Black
10
428.921
20
-194.306
11
428.621
21
-194.306
0
LINE
8
Black
10
428.621
20
-194.306
11
428.621
21
-195.806
0
LINE
8
Black
10
428.621
20
-195.806
11
428.921
21
-195.806
0
LINE
8
Black
10
428.421
20
-195.806
11
428.421
21
-194.306
0
LINE
8
Black
10
428.421
20
-194.306
11
428.121
21
-194.306
0
LINE
8
Black
10
428.121
20
-194.306
11
428.121
21
-195.806
0
LINE
8
Black
10
428.121
20
-195.806
11
428.421
21
-195.806
0
LINE
8
Black
10
426.421
20
-195.806
11
426.421
21
-194.306
0
LINE
8
Black
10
426.421
20
-194.306
11
426.121
21
-194.306
0
LINE
8
Black
10
426.121
20
-194.306
11
426.121
21
-195.806
0
LINE
8
Black
10
426.121
20
-195.806
11
426.421
21
-195.806
0
LINE
8
Black
10
426.921
20
-195.806
11
426.921
21
-194.306
0
LINE
8
Black
10
426.921
20
-194.306
11
426.621
21
-194.306
0
LINE
8
Black
10
426.621
20
-194.306
11
426.621
21
-195.806
0
LINE
8
Black
10
426.621
20
-195.806
11
426.921
21
-195.806
0
LINE
8
Black
10
425.921
20
-195.806
11
425.921
21
-194.306
0
LINE
8
Black
10
425.921
20
-194.306
11
425.621
21
-194.306
0
LINE
8
Black
10
425.621
20
-194.306
11
425.621
21
-195.806
0
LINE
8
Black
10
425.621
20
-195.806
11
425.921
21
-195.806
0
LINE
8
Black
10
441.421
20
-192.106
11
441.421
21
-190.606
0
LINE
8
Black
10
441.421
20
-190.606
11
441.121
21
-190.606
0
LINE
8
Black
10
441.121
20
-190.606
11
441.121
21
-192.106
0
LINE
8
Black
10
441.121
20
-192.106
11
441.421
21
-192.106
0
LINE
8
Black
10
441.921
20
-192.106
11
441.921
21
-190.606
0
LINE
8
Black
10
441.921
20
-190.606
11
441.621
21
-190.606
0
LINE
8
Black
10
441.621
20
-190.606
11
441.621
21
-192.106
0
LINE
8
Black
10
441.621
20
-192.106
11
441.921
21
-192.106
0
LINE
8
Black
10
442.921
20
-192.106
11
442.921
21
-190.606
0
LINE
8
Black
10
442.921
20
-190.606
11
442.621
21
-190.606
0
LINE
8
Black
10
442.621
20
-190.606
11
442.621
21
-192.106
0
LINE
8
Black
10
442.621
20
-192.106
11
442.921
21
-192.106
0
LINE
8
Black
10
442.421
20
-192.106
11
442.421
21
-190.606
0
LINE
8
Black
10
442.421
20
-190.606
11
442.121
21
-190.606
0
LINE
8
Black
10
442.121
20
-190.606
11
442.121
21
-192.106
0
LINE
8
Black
10
442.121
20
-192.106
11
442.421
21
-192.106
0
LINE
8
Black
10
444.421
20
-192.106
11
444.421
21
-190.606
0
LINE
8
Black
10
444.421
20
-190.606
11
444.121
21
-190.606
0
LINE
8
Black
10
444.121
20
-190.606
11
444.121
21
-192.106
0
LINE
8
Black
10
444.121
20
-192.106
11
444.421
21
-192.106
0
LINE
8
Black
10
444.921
20
-192.106
11
444.921
21
-190.606
0
LINE
8
Black
10
444.921
20
-190.606
11
444.621
21
-190.606
0
LINE
8
Black
10
444.621
20
-190.606
11
444.621
21
-192.106
0
LINE
8
Black
10
444.621
20
-192.106
11
444.921
21
-192.106
0
LINE
8
Black
10
443.921
20
-192.106
11
443.921
21
-190.606
0
LINE
8
Black
10
443.921
20
-190.606
11
443.621
21
-190.606
0
LINE
8
Black
10
443.621
20
-190.606
11
443.621
21
-192.106
0
LINE
8
Black
10
443.621
20
-192.106
11
443.921
21
-192.106
0
LINE
8
Black
10
443.421
20
-192.106
11
443.421
21
-190.606
0
LINE
8
Black
10
443.421
20
-190.606
11
443.121
21
-190.606
0
LINE
8
Black
10
443.121
20
-190.606
11
443.121
21
-192.106
0
LINE
8
Black
10
443.121
20
-192.106
11
443.421
21
-192.106
0
LINE
8
Black
10
433.421
20
-192.106
11
433.421
21
-190.606
0
LINE
8
Black
10
433.421
20
-190.606
11
433.121
21
-190.606
0
LINE
8
Black
10
433.121
20
-190.606
11
433.121
21
-192.106
0
LINE
8
Black
10
433.121
20
-192.106
11
433.421
21
-192.106
0
LINE
8
Black
10
433.921
20
-192.106
11
433.921
21
-190.606
0
LINE
8
Black
10
433.921
20
-190.606
11
433.621
21
-190.606
0
LINE
8
Black
10
433.621
20
-190.606
11
433.621
21
-192.106
0
LINE
8
Black
10
433.621
20
-192.106
11
433.921
21
-192.106
0
LINE
8
Black
10
434.921
20
-192.106
11
434.921
21
-190.606
0
LINE
8
Black
10
434.921
20
-190.606
11
434.621
21
-190.606
0
LINE
8
Black
10
434.621
20
-190.606
11
434.621
21
-192.106
0
LINE
8
Black
10
434.621
20
-192.106
11
434.921
21
-192.106
0
LINE
8
Black
10
434.421
20
-192.106
11
434.421
21
-190.606
0
LINE
8
Black
10
434.421
20
-190.606
11
434.121
21
-190.606
0
LINE
8
Black
10
434.121
20
-190.606
11
434.121
21
-192.106
0
LINE
8
Black
10
434.121
20
-192.106
11
434.421
21
-192.106
0
LINE
8
Black
10
436.421
20
-192.106
11
436.421
21
-190.606
0
LINE
8
Black
10
436.421
20
-190.606
11
436.121
21
-190.606
0
LINE
8
Black
10
436.121
20
-190.606
11
436.121
21
-192.106
0
LINE
8
Black
10
436.121
20
-192.106
11
436.421
21
-192.106
0
LINE
8
Black
10
436.921
20
-192.106
11
436.921
21
-190.606
0
LINE
8
Black
10
436.921
20
-190.606
11
436.621
21
-190.606
0
LINE
8
Black
10
436.621
20
-190.606
11
436.621
21
-192.106
0
LINE
8
Black
10
436.621
20
-192.106
11
436.921
21
-192.106
0
LINE
8
Black
10
435.921
20
-192.106
11
435.921
21
-190.606
0
LINE
8
Black
10
435.921
20
-190.606
11
435.621
21
-190.606
0
LINE
8
Black
10
435.621
20
-190.606
11
435.621
21
-192.106
0
LINE
8
Black
10
435.621
20
-192.106
11
435.921
21
-192.106
0
LINE
8
Black
10
435.421
20
-192.106
11
435.421
21
-190.606
0
LINE
8
Black
10
435.421
20
-190.606
11
435.121
21
-190.606
0
LINE
8
Black
10
435.121
20
-190.606
11
435.121
21
-192.106
0
LINE
8
Black
10
435.121
20
-192.106
11
435.421
21
-192.106
0
LINE
8
Black
10
439.421
20
-192.106
11
439.421
21
-190.606
0
LINE
8
Black
10
439.421
20
-190.606
11
439.121
21
-190.606
0
LINE
8
Black
10
439.121
20
-190.606
11
439.121
21
-192.106
0
LINE
8
Black
10
439.121
20
-192.106
11
439.421
21
-192.106
0
LINE
8
Black
10
439.921
20
-192.106
11
439.921
21
-190.606
0
LINE
8
Black
10
439.921
20
-190.606
11
439.621
21
-190.606
0
LINE
8
Black
10
439.621
20
-190.606
11
439.621
21
-192.106
0
LINE
8
Black
10
439.621
20
-192.106
11
439.921
21
-192.106
0
LINE
8
Black
10
440.921
20
-192.106
11
440.921
21
-190.606
0
LINE
8
Black
10
440.921
20
-190.606
11
440.621
21
-190.606
0
LINE
8
Black
10
440.621
20
-190.606
11
440.621
21
-192.106
0
LINE
8
Black
10
440.621
20
-192.106
11
440.921
21
-192.106
0
LINE
8
Black
10
440.421
20
-192.106
11
440.421
21
-190.606
0
LINE
8
Black
10
440.421
20
-190.606
11
440.121
21
-190.606
0
LINE
8
Black
10
440.121
20
-190.606
11
440.121
21
-192.106
0
LINE
8
Black
10
440.121
20
-192.106
11
440.421
21
-192.106
0
LINE
8
Black
10
438.421
20
-192.106
11
438.421
21
-190.606
0
LINE
8
Black
10
438.421
20
-190.606
11
438.121
21
-190.606
0
LINE
8
Black
10
438.121
20
-190.606
11
438.121
21
-192.106
0
LINE
8
Black
10
438.121
20
-192.106
11
438.421
21
-192.106
0
LINE
8
Black
10
438.921
20
-192.106
11
438.921
21
-190.606
0
LINE
8
Black
10
438.921
20
-190.606
11
438.621
21
-190.606
0
LINE
8
Black
10
438.621
20
-190.606
11
438.621
21
-192.106
0
LINE
8
Black
10
438.621
20
-192.106
11
438.921
21
-192.106
0
LINE
8
Black
10
437.921
20
-192.106
11
437.921
21
-190.606
0
LINE
8
Black
10
437.921
20
-190.606
11
437.621
21
-190.606
0
LINE
8
Black
10
437.621
20
-190.606
11
437.621
21
-192.106
0
LINE
8
Black
10
437.621
20
-192.106
11
437.921
21
-192.106
0
LINE
8
Black
10
437.421
20
-192.106
11
437.421
21
-190.606
0
LINE
8
Black
10
437.421
20
-190.606
11
437.121
21
-190.606
0
LINE
8
Black
10
437.121
20
-190.606
11
437.121
21
-192.106
0
LINE
8
Black
10
437.121
20
-192.106
11
437.421
21
-192.106
0
LINE
8
Black
10
429.421
20
-192.106
11
429.421
21
-190.606
0
LINE
8
Black
10
429.421
20
-190.606
11
429.121
21
-190.606
0
LINE
8
Black
10
429.121
20
-190.606
11
429.121
21
-192.106
0
LINE
8
Black
10
429.121
20
-192.106
11
429.421
21
-192.106
0
LINE
8
Black
10
429.921
20
-192.106
11
429.921
21
-190.606
0
LINE
8
Black
10
429.921
20
-190.606
11
429.621
21
-190.606
0
LINE
8
Black
10
429.621
20
-190.606
11
429.621
21
-192.106
0
LINE
8
Black
10
429.621
20
-192.106
11
429.921
21
-192.106
0
LINE
8
Black
10
430.921
20
-192.106
11
430.921
21
-190.606
0
LINE
8
Black
10
430.921
20
-190.606
11
430.621
21
-190.606
0
LINE
8
Black
10
430.621
20
-190.606
11
430.621
21
-192.106
0
LINE
8
Black
10
430.621
20
-192.106
11
430.921
21
-192.106
0
LINE
8
Black
10
430.421
20
-192.106
11
430.421
21
-190.606
0
LINE
8
Black
10
430.421
20
-190.606
11
430.121
21
-190.606
0
LINE
8
Black
10
430.121
20
-190.606
11
430.121
21
-192.106
0
LINE
8
Black
10
430.121
20
-192.106
11
430.421
21
-192.106
0
LINE
8
Black
10
432.421
20
-192.106
11
432.421
21
-190.606
0
LINE
8
Black
10
432.421
20
-190.606
11
432.121
21
-190.606
0
LINE
8
Black
10
432.121
20
-190.606
11
432.121
21
-192.106
0
LINE
8
Black
10
432.121
20
-192.106
11
432.421
21
-192.106
0
LINE
8
Black
10
432.921
20
-192.106
11
432.921
21
-190.606
0
LINE
8
Black
10
432.921
20
-190.606
11
432.621
21
-190.606
0
LINE
8
Black
10
432.621
20
-190.606
11
432.621
21
-192.106
0
LINE
8
Black
10
432.621
20
-192.106
11
432.921
21
-192.106
0
LINE
8
Black
10
431.921
20
-192.106
11
431.921
21
-190.606
0
LINE
8
Black
10
431.921
20
-190.606
11
431.621
21
-190.606
0
LINE
8
Black
10
431.621
20
-190.606
11
431.621
21
-192.106
0
LINE
8
Black
10
431.621
20
-192.106
11
431.921
21
-192.106
0
LINE
8
Black
10
431.421
20
-192.106
11
431.421
21
-190.606
0
LINE
8
Black
10
431.421
20
-190.606
11
431.121
21
-190.606
0
LINE
8
Black
10
431.121
20
-190.606
11
431.121
21
-192.106
0
LINE
8
Black
10
431.121
20
-192.106
11
431.421
21
-192.106
0
LINE
8
Black
10
427.421
20
-192.106
11
427.421
21
-190.606
0
LINE
8
Black
10
427.421
20
-190.606
11
427.121
21
-190.606
0
LINE
8
Black
10
427.121
20
-190.606
11
427.121
21
-192.106
0
LINE
8
Black
10
427.121
20
-192.106
11
427.421
21
-192.106
0
LINE
8
Black
10
427.921
20
-192.106
11
427.921
21
-190.606
0
LINE
8
Black
10
427.921
20
-190.606
11
427.621
21
-190.606
0
LINE
8
Black
10
427.621
20
-190.606
11
427.621
21
-192.106
0
LINE
8
Black
10
427.621
20
-192.106
11
427.921
21
-192.106
0
LINE
8
Black
10
428.921
20
-192.106
11
428.921
21
-190.606
0
LINE
8
Black
10
428.921
20
-190.606
11
428.621
21
-190.606
0
LINE
8
Black
10
428.621
20
-190.606
11
428.621
21
-192.106
0
LINE
8
Black
10
428.621
20
-192.106
11
428.921
21
-192.106
0
LINE
8
Black
10
428.421
20
-192.106
11
428.421
21
-190.606
0
LINE
8
Black
10
428.421
20
-190.606
11
428.121
21
-190.606
0
LINE
8
Black
10
428.121
20
-190.606
11
428.121
21
-192.106
0
LINE
8
Black
10
428.121
20
-192.106
11
428.421
21
-192.106
0
LINE
8
Black
10
426.421
20
-192.106
11
426.421
21
-190.606
0
LINE
8
Black
10
426.421
20
-190.606
11
426.121
21
-190.606
0
LINE
8
Black
10
426.121
20
-190.606
11
426.121
21
-192.106
0
LINE
8
Black
10
426.121
20
-192.106
11
426.421
21
-192.106
0
LINE
8
Black
10
426.921
20
-192.106
11
426.921
21
-190.606
0
LINE
8
Black
10
426.921
20
-190.606
11
426.621
21
-190.606
0
LINE
8
Black
10
426.621
20
-190.606
11
426.621
21
-192.106
0
LINE
8
Black
10
426.621
20
-192.106
11
426.921
21
-192.106
0
LINE
8
Black
10
425.921
20
-192.106
11
425.921
21
-190.606
0
LINE
8
Black
10
425.921
20
-190.606
11
425.621
21
-190.606
0
LINE
8
Black
10
425.621
20
-190.606
11
425.621
21
-192.106
0
LINE
8
Black
10
425.621
20
-192.106
11
425.921
21
-192.106
0
LINE
8
Black
10
425.421
20
-192.106
11
425.421
21
-190.606
0
LINE
8
Black
10
425.421
20
-190.606
11
425.121
21
-190.606
0
LINE
8
Black
10
425.121
20
-190.606
11
425.121
21
-192.106
0
LINE
8
Black
10
425.121
20
-192.106
11
425.421
21
-192.106
0
CIRCLE
8
Black
10
446.021
20
-194.056
40
0.725
0
LINE
8
Black
10
425.421
20
-195.806
11
425.421
21
-194.306
0
LINE
8
Black
10
425.421
20
-194.306
11
425.121
21
-194.306
0
LINE
8
Black
10
425.121
20
-194.306
11
425.121
21
-195.806
0
LINE
8
Black
10
425.121
20
-195.806
11
425.421
21
-195.806
0
CIRCLE
8
Black
10
424.021
20
-194.056
40
0.725
  0
ENDSEC
  0
EOF
