PCBNEW-LibModule-V1  Wed 08 Oct 2014 05:20:13 PM EDT
# encoding utf-8
Units mm
$INDEX
FLEX_EDGE_64
$EndINDEX
$MODULE FLEX_EDGE_64
Po 0 0 0 15 5435AA82 00000000 ~~
Li FLEX_EDGE_64
Sc 0
AR 
Op 0 0 0
T0 -0.2032 -6.0452 1 1 0 0.15 N V 21 N "FLEX_EDGE_64"
T1 -0.0254 7.0104 1 1 0 0.15 N V 21 N "VAL**"
DS -16.250006 2.724997 16.250006 2.724997 0.15 21
DS 16.250006 -1.775003 16.250006 -0.881 0.15 21
DS 17.050004 -0.127 17.050004 0.999591 0.15 21
DA 16.745204 -0.881 16.745204 -0.381 900 0.15 21
DS 16.764 -0.381 17.050004 -0.1016 0.15 21
DS 17.050004 1.024991 16.250006 1.024991 0.15 21
DS 16.250006 1.024991 16.250006 2.724997 0.15 21
DS -16.250006 1.024991 -16.250006 2.724997 0.15 21
DS -16.250006 -1.775003 16.250006 -1.775003 0.15 21
DS -17.050004 1.024991 -16.250006 1.024991 0.15 21
DS -16.764 -0.381 -17.050004 -0.1016 0.15 21
DA -16.745204 -0.881 -16.745204 -0.381 -900 0.15 21
DS -17.050004 -0.1016 -17.050004 1.024991 0.15 21
DS -16.250006 -1.775003 -16.250006 -0.881 0.15 21
$PAD
Sh "17" R 0.349999 3.550006 0 0 0
Dr 0 0 0
At SMD N 00000002
Ne 0 ""
Po 7.749997 0
.LocalClearance 0.07493
$EndPAD
$PAD
Sh "18" R 0.349999 3.550006 0 0 0
Dr 0 0 0
At SMD N 00000002
Ne 0 ""
Po 7.249998 0
.LocalClearance 0.07493
$EndPAD
$PAD
Sh "20" R 0.349999 3.550006 0 0 0
Dr 0 0 0
At SMD N 00000002
Ne 0 ""
Po 6.25 0
.LocalClearance 0.07493
$EndPAD
$PAD
Sh "19" R 0.349999 3.550006 0 0 0
Dr 0 0 0
At SMD N 00000002
Ne 0 ""
Po 6.749999 0
.LocalClearance 0.07493
$EndPAD
$PAD
Sh "23" R 0.349999 3.550006 0 0 0
Dr 0 0 0
At SMD N 00000002
Ne 0 ""
Po 4.750003 0
.LocalClearance 0.07493
$EndPAD
$PAD
Sh "24" R 0.349999 3.550006 0 0 0
Dr 0 0 0
At SMD N 00000002
Ne 0 ""
Po 4.250004 0
.LocalClearance 0.07493
$EndPAD
$PAD
Sh "22" R 0.349999 3.550006 0 0 0
Dr 0 0 0
At SMD N 00000002
Ne 0 ""
Po 5.250002 0
.LocalClearance 0.07493
$EndPAD
$PAD
Sh "21" R 0.349999 3.550006 0 0 0
Dr 0 0 0
At SMD N 00000002
Ne 0 ""
Po 5.750001 0
.LocalClearance 0.07493
$EndPAD
$PAD
Sh "29" R 0.349999 3.550006 0 0 0
Dr 0 0 0
At SMD N 00000002
Ne 0 ""
Po 1.749999 0
.LocalClearance 0.07493
$EndPAD
$PAD
Sh "30" R 0.349999 3.550006 0 0 0
Dr 0 0 0
At SMD N 00000002
Ne 0 ""
Po 1.25 0
.LocalClearance 0.07493
$EndPAD
$PAD
Sh "32" R 0.349999 3.550006 0 0 0
Dr 0 0 0
At SMD N 00000002
Ne 0 ""
Po 0.25 0
.LocalClearance 0.07493
$EndPAD
$PAD
Sh "31" R 0.349999 3.550006 0 0 0
Dr 0 0 0
At SMD N 00000002
Ne 0 ""
Po 0.750001 0
.LocalClearance 0.07493
$EndPAD
$PAD
Sh "27" R 0.349999 3.550006 0 0 0
Dr 0 0 0
At SMD N 00000002
Ne 0 ""
Po 2.750007 0
.LocalClearance 0.07493
$EndPAD
$PAD
Sh "28" R 0.349999 3.550006 0 0 0
Dr 0 0 0
At SMD N 00000002
Ne 0 ""
Po 2.250001 0
.LocalClearance 0.07493
$EndPAD
$PAD
Sh "26" R 0.349999 3.550006 0 0 0
Dr 0 0 0
At SMD N 00000002
Ne 0 ""
Po 3.250006 0
.LocalClearance 0.07493
$EndPAD
$PAD
Sh "25" R 0.349999 3.550006 0 0 0
Dr 0 0 0
At SMD N 00000002
Ne 0 ""
Po 3.750005 0
.LocalClearance 0.07493
$EndPAD
$PAD
Sh "9" R 0.349999 3.550006 0 0 0
Dr 0 0 0
At SMD N 00000002
Ne 0 ""
Po 11.749989 0
.LocalClearance 0.07493
$EndPAD
$PAD
Sh "10" R 0.349999 3.550006 0 0 0
Dr 0 0 0
At SMD N 00000002
Ne 0 ""
Po 11.24999 0
.LocalClearance 0.07493
$EndPAD
$PAD
Sh "12" R 0.349999 3.550006 0 0 0
Dr 0 0 0
At SMD N 00000002
Ne 0 ""
Po 10.249992 0
.LocalClearance 0.07493
$EndPAD
$PAD
Sh "11" R 0.349999 3.550006 0 0 0
Dr 0 0 0
At SMD N 00000002
Ne 0 ""
Po 10.749991 0
.LocalClearance 0.07493
$EndPAD
$PAD
Sh "15" R 0.349999 3.550006 0 0 0
Dr 0 0 0
At SMD N 00000002
Ne 0 ""
Po 8.749995 0
.LocalClearance 0.07493
$EndPAD
$PAD
Sh "16" R 0.349999 3.550006 0 0 0
Dr 0 0 0
At SMD N 00000002
Ne 0 ""
Po 8.249996 0
.LocalClearance 0.07493
$EndPAD
$PAD
Sh "14" R 0.349999 3.550006 0 0 0
Dr 0 0 0
At SMD N 00000002
Ne 0 ""
Po 9.249994 0
.LocalClearance 0.07493
$EndPAD
$PAD
Sh "13" R 0.349999 3.550006 0 0 0
Dr 0 0 0
At SMD N 00000002
Ne 0 ""
Po 9.749993 0
.LocalClearance 0.07493
$EndPAD
$PAD
Sh "5" R 0.349999 3.550006 0 0 0
Dr 0 0 0
At SMD N 00000002
Ne 0 ""
Po 13.750011 0
.LocalClearance 0.07493
$EndPAD
$PAD
Sh "6" R 0.349999 3.550006 0 0 0
Dr 0 0 0
At SMD N 00000002
Ne 0 ""
Po 13.250012 0
.LocalClearance 0.07493
$EndPAD
$PAD
Sh "8" R 0.349999 3.550006 0 0 0
Dr 0 0 0
At SMD N 00000002
Ne 0 ""
Po 12.249988 0
.LocalClearance 0.07493
$EndPAD
$PAD
Sh "7" R 0.349999 3.550006 0 0 0
Dr 0 0 0
At SMD N 00000002
Ne 0 ""
Po 12.750013 0
.LocalClearance 0.07493
$EndPAD
$PAD
Sh "3" R 0.349999 3.550006 0 0 0
Dr 0 0 0
At SMD N 00000002
Ne 0 ""
Po 14.750009 0
.LocalClearance 0.07493
$EndPAD
$PAD
Sh "4" R 0.349999 3.550006 0 0 0
Dr 0 0 0
At SMD N 00000002
Ne 0 ""
Po 14.25001 0
.LocalClearance 0.07493
$EndPAD
$PAD
Sh "2" R 0.349999 3.550006 0 0 0
Dr 0 0 0
At SMD N 00000002
Ne 0 ""
Po 15.250008 0
.LocalClearance 0.07493
$EndPAD
$PAD
Sh "1" R 0.349999 3.550006 0 0 0
Dr 0 0 0
At SMD N 00000002
Ne 0 ""
Po 15.750008 0
.LocalClearance 0.07493
$EndPAD
$PAD
Sh "48" R 0.349999 3.550006 0 0 0
Dr 0 0 0
At SMD N 00000002
Ne 0 ""
Po -7.749997 0
.LocalClearance 0.07493
$EndPAD
$PAD
Sh "47" R 0.349999 3.550006 0 0 0
Dr 0 0 0
At SMD N 00000002
Ne 0 ""
Po -7.249998 0
.LocalClearance 0.07493
$EndPAD
$PAD
Sh "45" R 0.349999 3.550006 0 0 0
Dr 0 0 0
At SMD N 00000002
Ne 0 ""
Po -6.25 0
.LocalClearance 0.07493
$EndPAD
$PAD
Sh "46" R 0.349999 3.550006 0 0 0
Dr 0 0 0
At SMD N 00000002
Ne 0 ""
Po -6.749999 0
.LocalClearance 0.07493
$EndPAD
$PAD
Sh "42" R 0.349999 3.550006 0 0 0
Dr 0 0 0
At SMD N 00000002
Ne 0 ""
Po -4.750003 0
.LocalClearance 0.07493
$EndPAD
$PAD
Sh "41" R 0.349999 3.550006 0 0 0
Dr 0 0 0
At SMD N 00000002
Ne 0 ""
Po -4.250004 0
.LocalClearance 0.07493
$EndPAD
$PAD
Sh "43" R 0.349999 3.550006 0 0 0
Dr 0 0 0
At SMD N 00000002
Ne 0 ""
Po -5.250002 0
.LocalClearance 0.07493
$EndPAD
$PAD
Sh "44" R 0.349999 3.550006 0 0 0
Dr 0 0 0
At SMD N 00000002
Ne 0 ""
Po -5.750001 0
.LocalClearance 0.07493
$EndPAD
$PAD
Sh "36" R 0.349999 3.550006 0 0 0
Dr 0 0 0
At SMD N 00000002
Ne 0 ""
Po -1.749999 0
.LocalClearance 0.07493
$EndPAD
$PAD
Sh "35" R 0.349999 3.550006 0 0 0
Dr 0 0 0
At SMD N 00000002
Ne 0 ""
Po -1.25 0
.LocalClearance 0.07493
$EndPAD
$PAD
Sh "33" R 0.349999 3.550006 0 0 0
Dr 0 0 0
At SMD N 00000002
Ne 0 ""
Po -0.25 0
.LocalClearance 0.07493
$EndPAD
$PAD
Sh "34" R 0.349999 3.550006 0 0 0
Dr 0 0 0
At SMD N 00000002
Ne 0 ""
Po -0.750001 0
.LocalClearance 0.07493
$EndPAD
$PAD
Sh "38" R 0.349999 3.550006 0 0 0
Dr 0 0 0
At SMD N 00000002
Ne 0 ""
Po -2.750007 0
.LocalClearance 0.07493
$EndPAD
$PAD
Sh "37" R 0.349999 3.550006 0 0 0
Dr 0 0 0
At SMD N 00000002
Ne 0 ""
Po -2.250001 0
.LocalClearance 0.07493
$EndPAD
$PAD
Sh "39" R 0.349999 3.550006 0 0 0
Dr 0 0 0
At SMD N 00000002
Ne 0 ""
Po -3.250006 0
.LocalClearance 0.07493
$EndPAD
$PAD
Sh "40" R 0.349999 3.550006 0 0 0
Dr 0 0 0
At SMD N 00000002
Ne 0 ""
Po -3.750005 0
.LocalClearance 0.07493
$EndPAD
$PAD
Sh "56" R 0.349999 3.550006 0 0 0
Dr 0 0 0
At SMD N 00000002
Ne 0 ""
Po -11.749989 0
.LocalClearance 0.07493
$EndPAD
$PAD
Sh "55" R 0.349999 3.550006 0 0 0
Dr 0 0 0
At SMD N 00000002
Ne 0 ""
Po -11.24999 0
.LocalClearance 0.07493
$EndPAD
$PAD
Sh "53" R 0.349999 3.550006 0 0 0
Dr 0 0 0
At SMD N 00000002
Ne 0 ""
Po -10.249992 0
.LocalClearance 0.07493
$EndPAD
$PAD
Sh "54" R 0.349999 3.550006 0 0 0
Dr 0 0 0
At SMD N 00000002
Ne 0 ""
Po -10.749991 0
.LocalClearance 0.07493
$EndPAD
$PAD
Sh "50" R 0.349999 3.550006 0 0 0
Dr 0 0 0
At SMD N 00000002
Ne 0 ""
Po -8.749995 0
.LocalClearance 0.07493
$EndPAD
$PAD
Sh "49" R 0.349999 3.550006 0 0 0
Dr 0 0 0
At SMD N 00000002
Ne 0 ""
Po -8.249996 0
.LocalClearance 0.07493
$EndPAD
$PAD
Sh "51" R 0.349999 3.550006 0 0 0
Dr 0 0 0
At SMD N 00000002
Ne 0 ""
Po -9.249994 0
.LocalClearance 0.07493
$EndPAD
$PAD
Sh "52" R 0.349999 3.550006 0 0 0
Dr 0 0 0
At SMD N 00000002
Ne 0 ""
Po -9.749993 0
.LocalClearance 0.07493
$EndPAD
$PAD
Sh "60" R 0.349999 3.550006 0 0 0
Dr 0 0 0
At SMD N 00000002
Ne 0 ""
Po -13.750011 0
.LocalClearance 0.07493
$EndPAD
$PAD
Sh "59" R 0.349999 3.550006 0 0 0
Dr 0 0 0
At SMD N 00000002
Ne 0 ""
Po -13.250012 0
.LocalClearance 0.07493
$EndPAD
$PAD
Sh "57" R 0.349999 3.550006 0 0 0
Dr 0 0 0
At SMD N 00000002
Ne 0 ""
Po -12.249988 0
.LocalClearance 0.07493
$EndPAD
$PAD
Sh "58" R 0.349999 3.550006 0 0 0
Dr 0 0 0
At SMD N 00000002
Ne 0 ""
Po -12.750013 0
.LocalClearance 0.07493
$EndPAD
$PAD
Sh "62" R 0.349999 3.550006 0 0 0
Dr 0 0 0
At SMD N 00000002
Ne 0 ""
Po -14.750009 0
.LocalClearance 0.07493
$EndPAD
$PAD
Sh "61" R 0.349999 3.550006 0 0 0
Dr 0 0 0
At SMD N 00000002
Ne 0 ""
Po -14.25001 0
.LocalClearance 0.07493
$EndPAD
$PAD
Sh "63" R 0.349999 3.550006 0 0 0
Dr 0 0 0
At SMD N 00000002
Ne 0 ""
Po -15.250008 0
.LocalClearance 0.07493
$EndPAD
$PAD
Sh "64" R 0.349999 3.550006 0 0 0
Dr 0 0 0
At SMD N 00000002
Ne 0 ""
Po -15.750008 0
.LocalClearance 0.07493
$EndPAD
$EndMODULE FLEX_EDGE_64
$EndLIBRARY
