(export (version D)
  (design
    (source /home/dan/work/g-2/NewElectronics/Flexi/TestBeam_A/TestBeam_A.sch)
    (date "Wed 17 Dec 2014 12:43:58 PM EST")
    (tool "eeschema (2013-10-07 BZR 4378)-stable"))
  (components
    (comp (ref J1)
      (value LSHM-1-40-025-F-DV-N)
      (libsource (lib lshm-1-40-025-f-dv-n) (part LSHM-1-40-025-F-DV-N))
      (sheetpath (names /) (tstamps /))
      (tstamp 54332C83))
    (comp (ref J2)
      (value FLEX_EDGE_64)
      (libsource (lib flex_edge_64) (part FLEX_EDGE_64))
      (sheetpath (names /) (tstamps /))
      (tstamp 543475D9)))
  (libparts
    (libpart (lib lshm-1-40-025-f-dv-n) (part LSHM-1-40-025-F-DV-N)
      (fields
        (field (name Reference) J)
        (field (name Value) LSHM-1-40-025-F-DV-N))
      (pins
        (pin (num 1) (name 1) (type passive))
        (pin (num 2) (name 2) (type passive))
        (pin (num 3) (name 3) (type passive))
        (pin (num 4) (name 4) (type passive))
        (pin (num 5) (name 5) (type passive))
        (pin (num 6) (name 6) (type passive))
        (pin (num 7) (name 7) (type passive))
        (pin (num 8) (name 8) (type passive))
        (pin (num 9) (name 9) (type passive))
        (pin (num 10) (name 10) (type passive))
        (pin (num 11) (name 11) (type passive))
        (pin (num 12) (name 12) (type passive))
        (pin (num 13) (name 13) (type passive))
        (pin (num 14) (name 14) (type passive))
        (pin (num 15) (name 15) (type passive))
        (pin (num 16) (name 16) (type passive))
        (pin (num 17) (name 17) (type passive))
        (pin (num 18) (name 18) (type passive))
        (pin (num 19) (name 19) (type passive))
        (pin (num 20) (name 20) (type passive))
        (pin (num 21) (name 21) (type passive))
        (pin (num 22) (name 22) (type passive))
        (pin (num 23) (name 23) (type passive))
        (pin (num 24) (name 24) (type passive))
        (pin (num 25) (name 25) (type passive))
        (pin (num 26) (name 26) (type passive))
        (pin (num 27) (name 27) (type passive))
        (pin (num 28) (name 28) (type passive))
        (pin (num 29) (name 29) (type passive))
        (pin (num 30) (name 30) (type passive))
        (pin (num 31) (name 31) (type passive))
        (pin (num 32) (name 32) (type passive))
        (pin (num 33) (name 33) (type passive))
        (pin (num 34) (name 34) (type passive))
        (pin (num 35) (name 35) (type passive))
        (pin (num 36) (name 36) (type passive))
        (pin (num 37) (name 37) (type passive))
        (pin (num 38) (name 38) (type passive))
        (pin (num 39) (name 39) (type passive))
        (pin (num 40) (name 40) (type passive))
        (pin (num 41) (name 41) (type passive))
        (pin (num 42) (name 42) (type passive))
        (pin (num 43) (name 43) (type passive))
        (pin (num 44) (name 44) (type passive))
        (pin (num 45) (name 45) (type passive))
        (pin (num 46) (name 46) (type passive))
        (pin (num 47) (name 47) (type passive))
        (pin (num 48) (name 48) (type passive))
        (pin (num 49) (name 49) (type passive))
        (pin (num 50) (name 50) (type passive))
        (pin (num 51) (name 51) (type passive))
        (pin (num 52) (name 52) (type passive))
        (pin (num 53) (name 53) (type passive))
        (pin (num 54) (name 54) (type passive))
        (pin (num 55) (name 55) (type passive))
        (pin (num 56) (name 56) (type passive))
        (pin (num 57) (name 57) (type passive))
        (pin (num 58) (name 58) (type passive))
        (pin (num 59) (name 59) (type passive))
        (pin (num 60) (name 60) (type passive))
        (pin (num 61) (name 61) (type passive))
        (pin (num 62) (name 62) (type passive))
        (pin (num 63) (name 63) (type passive))
        (pin (num 64) (name 64) (type passive))
        (pin (num 65) (name 65) (type passive))
        (pin (num 66) (name 66) (type passive))
        (pin (num 67) (name 67) (type passive))
        (pin (num 68) (name 68) (type passive))
        (pin (num 69) (name 69) (type passive))
        (pin (num 70) (name 70) (type passive))
        (pin (num 71) (name 71) (type passive))
        (pin (num 72) (name 72) (type passive))
        (pin (num 73) (name 73) (type passive))
        (pin (num 74) (name 74) (type passive))
        (pin (num 75) (name 75) (type passive))
        (pin (num 76) (name 76) (type passive))
        (pin (num 77) (name 77) (type passive))
        (pin (num 78) (name 78) (type passive))
        (pin (num 79) (name 79) (type passive))
        (pin (num 80) (name 80) (type passive))))
    (libpart (lib flex_edge_64) (part FLEX_EDGE_64)
      (fields
        (field (name Reference) J)
        (field (name Value) FLEX_EDGE_64))
      (pins
        (pin (num 1) (name 1) (type passive))
        (pin (num 2) (name 2) (type passive))
        (pin (num 3) (name 3) (type passive))
        (pin (num 4) (name 4) (type passive))
        (pin (num 5) (name 5) (type passive))
        (pin (num 6) (name 6) (type passive))
        (pin (num 7) (name 7) (type passive))
        (pin (num 8) (name 8) (type passive))
        (pin (num 9) (name 9) (type passive))
        (pin (num 10) (name 10) (type passive))
        (pin (num 11) (name 11) (type passive))
        (pin (num 12) (name 12) (type passive))
        (pin (num 13) (name 13) (type passive))
        (pin (num 14) (name 14) (type passive))
        (pin (num 15) (name 15) (type passive))
        (pin (num 16) (name 16) (type passive))
        (pin (num 17) (name 17) (type passive))
        (pin (num 18) (name 18) (type passive))
        (pin (num 19) (name 19) (type passive))
        (pin (num 20) (name 20) (type passive))
        (pin (num 21) (name 21) (type passive))
        (pin (num 22) (name 22) (type passive))
        (pin (num 23) (name 23) (type passive))
        (pin (num 24) (name 24) (type passive))
        (pin (num 25) (name 25) (type passive))
        (pin (num 26) (name 26) (type passive))
        (pin (num 27) (name 27) (type passive))
        (pin (num 28) (name 28) (type passive))
        (pin (num 29) (name 29) (type passive))
        (pin (num 30) (name 30) (type passive))
        (pin (num 31) (name 31) (type passive))
        (pin (num 32) (name 32) (type passive))
        (pin (num 33) (name 33) (type passive))
        (pin (num 34) (name 34) (type passive))
        (pin (num 35) (name 35) (type passive))
        (pin (num 36) (name 36) (type passive))
        (pin (num 37) (name 37) (type passive))
        (pin (num 38) (name 38) (type passive))
        (pin (num 39) (name 39) (type passive))
        (pin (num 40) (name 40) (type passive))
        (pin (num 41) (name 41) (type passive))
        (pin (num 42) (name 42) (type passive))
        (pin (num 43) (name 43) (type passive))
        (pin (num 44) (name 44) (type passive))
        (pin (num 45) (name 45) (type passive))
        (pin (num 46) (name 46) (type passive))
        (pin (num 47) (name 47) (type passive))
        (pin (num 48) (name 48) (type passive))
        (pin (num 49) (name 49) (type passive))
        (pin (num 50) (name 50) (type passive))
        (pin (num 51) (name 51) (type passive))
        (pin (num 52) (name 52) (type passive))
        (pin (num 53) (name 53) (type passive))
        (pin (num 54) (name 54) (type passive))
        (pin (num 55) (name 55) (type passive))
        (pin (num 56) (name 56) (type passive))
        (pin (num 57) (name 57) (type passive))
        (pin (num 58) (name 58) (type passive))
        (pin (num 59) (name 59) (type passive))
        (pin (num 60) (name 60) (type passive))
        (pin (num 61) (name 61) (type passive))
        (pin (num 62) (name 62) (type passive))
        (pin (num 63) (name 63) (type passive))
        (pin (num 64) (name 64) (type passive)))))
  (libraries
    (library (logical lshm-1-40-025-f-dv-n)
      (uri ../lib/lshm-1-40-025-f-dv-n.lib))
    (library (logical flex_edge_64)
      (uri ../lib/flex_edge_64.lib)))
  (nets
    (net (code 1) (name /+3V)
      (node (ref J1) (pin 20))
      (node (ref J2) (pin 60))
      (node (ref J1) (pin 18))
      (node (ref J1) (pin 22))
      (node (ref J2) (pin 59)))
    (net (code 2) (name /-3V)
      (node (ref J2) (pin 64))
      (node (ref J2) (pin 63))
      (node (ref J1) (pin 8))
      (node (ref J1) (pin 6))
      (node (ref J1) (pin 10)))
    (net (code 3) (name /TSTN2_IN)
      (node (ref J1) (pin 70))
      (node (ref J2) (pin 7)))
    (net (code 4) (name /TREFE_IN)
      (node (ref J1) (pin 60))
      (node (ref J2) (pin 3)))
    (net (code 5) (name /TREFO_IN)
      (node (ref J2) (pin 4))
      (node (ref J1) (pin 58)))
    (net (code 6) (name /IBLR)
      (node (ref J1) (pin 56))
      (node (ref J2) (pin 1)))
    (net (code 7) (name /DTHR)
      (node (ref J1) (pin 54))
      (node (ref J2) (pin 2)))
    (net (code 8) (name GND)
      (node (ref J2) (pin 12))
      (node (ref J2) (pin 32))
      (node (ref J1) (pin 50))
      (node (ref J2) (pin 52))
      (node (ref J1) (pin 37))
      (node (ref J2) (pin 62))
      (node (ref J2) (pin 13))
      (node (ref J1) (pin 38))
      (node (ref J2) (pin 33))
      (node (ref J1) (pin 28))
      (node (ref J1) (pin 76))
      (node (ref J1) (pin 77))
      (node (ref J1) (pin 78))
      (node (ref J1) (pin 48))
      (node (ref J1) (pin 79))
      (node (ref J1) (pin 39))
      (node (ref J2) (pin 55))
      (node (ref J2) (pin 57))
      (node (ref J2) (pin 35))
      (node (ref J2) (pin 54))
      (node (ref J2) (pin 34))
      (node (ref J2) (pin 53))
      (node (ref J1) (pin 1))
      (node (ref J1) (pin 44))
      (node (ref J2) (pin 31))
      (node (ref J1) (pin 46))
      (node (ref J2) (pin 11))
      (node (ref J2) (pin 30))
      (node (ref J2) (pin 6))
      (node (ref J1) (pin 42))
      (node (ref J1) (pin 12))
      (node (ref J1) (pin 41))
      (node (ref J1) (pin 80))
      (node (ref J1) (pin 52))
      (node (ref J2) (pin 58))
      (node (ref J1) (pin 40))
      (node (ref J1) (pin 4))
      (node (ref J1) (pin 3))
      (node (ref J1) (pin 2))
      (node (ref J2) (pin 61))
      (node (ref J1) (pin 36))
      (node (ref J1) (pin 26))
      (node (ref J1) (pin 16))
      (node (ref J1) (pin 74))
      (node (ref J1) (pin 34))
      (node (ref J1) (pin 24))
      (node (ref J1) (pin 14))
      (node (ref J1) (pin 43))
      (node (ref J1) (pin 62)))
    (net (code 9) (name /TEMP_P)
      (node (ref J1) (pin 72))
      (node (ref J2) (pin 5)))
    (net (code 10) (name /TSTP2_IN)
      (node (ref J1) (pin 68))
      (node (ref J2) (pin 8)))
    (net (code 11) (name /TSTN1_IN)
      (node (ref J2) (pin 9))
      (node (ref J1) (pin 66)))
    (net (code 12) (name /TSTP1_IN)
      (node (ref J1) (pin 64))
      (node (ref J2) (pin 10)))
    (net (code 13) (name /TDC_IN_10N)
      (node (ref J2) (pin 24))
      (node (ref J1) (pin 55)))
    (net (code 14) (name /TDC_IN_9N)
      (node (ref J1) (pin 51))
      (node (ref J2) (pin 26)))
    (net (code 15) (name /TDC_IN_8N)
      (node (ref J1) (pin 47))
      (node (ref J2) (pin 28)))
    (net (code 16) (name /TDC_IN_15N)
      (node (ref J1) (pin 75))
      (node (ref J2) (pin 14)))
    (net (code 17) (name /TDC_IN_15P)
      (node (ref J1) (pin 73))
      (node (ref J2) (pin 15)))
    (net (code 18) (name /TDC_IN_14N)
      (node (ref J1) (pin 71))
      (node (ref J2) (pin 16)))
    (net (code 19) (name /TDC_IN_14P)
      (node (ref J1) (pin 69))
      (node (ref J2) (pin 17)))
    (net (code 20) (name /TDC_IN_13N)
      (node (ref J2) (pin 18))
      (node (ref J1) (pin 67)))
    (net (code 21) (name /TDC_IN_13P)
      (node (ref J2) (pin 19))
      (node (ref J1) (pin 65)))
    (net (code 22) (name /TDC_IN_12N)
      (node (ref J2) (pin 20))
      (node (ref J1) (pin 63)))
    (net (code 23) (name /+1.4V)
      (node (ref J1) (pin 32))
      (node (ref J1) (pin 30))
      (node (ref J2) (pin 56)))
    (net (code 24) (name /TDC_IN_11N)
      (node (ref J2) (pin 22))
      (node (ref J1) (pin 59)))
    (net (code 25) (name /TDC_IN_9P)
      (node (ref J1) (pin 49))
      (node (ref J2) (pin 27)))
    (net (code 26) (name /TDC_IN_6P)
      (node (ref J1) (pin 29))
      (node (ref J2) (pin 39)))
    (net (code 27) (name /TDC_IN_3N)
      (node (ref J1) (pin 19))
      (node (ref J2) (pin 44)))
    (net (code 28) (name /TDC_IN_12P)
      (node (ref J2) (pin 21))
      (node (ref J1) (pin 61)))
    (net (code 29) (name /TDC_IN_11P)
      (node (ref J1) (pin 57))
      (node (ref J2) (pin 23)))
    (net (code 30) (name /TDC_IN_5N)
      (node (ref J2) (pin 40))
      (node (ref J1) (pin 27)))
    (net (code 31) (name /TDC_IN_1P)
      (node (ref J1) (pin 9))
      (node (ref J2) (pin 49)))
    (net (code 32) (name /TDC_IN_0N)
      (node (ref J1) (pin 7))
      (node (ref J2) (pin 50)))
    (net (code 33) (name /TDC_IN_0P)
      (node (ref J1) (pin 5))
      (node (ref J2) (pin 51)))
    (net (code 34) (name /TDC_IN_8P)
      (node (ref J1) (pin 45))
      (node (ref J2) (pin 29)))
    (net (code 35) (name /TDC_IN_5P)
      (node (ref J1) (pin 25))
      (node (ref J2) (pin 41)))
    (net (code 36) (name /TDC_IN_2N)
      (node (ref J1) (pin 15))
      (node (ref J2) (pin 46)))
    (net (code 37) (name /TDC_IN_4P)
      (node (ref J2) (pin 43))
      (node (ref J1) (pin 21)))
    (net (code 38) (name /TDC_IN_4N)
      (node (ref J2) (pin 42))
      (node (ref J1) (pin 23)))
    (net (code 39) (name /TDC_IN_2P)
      (node (ref J2) (pin 47))
      (node (ref J1) (pin 13)))
    (net (code 40) (name /TDC_IN_10P)
      (node (ref J1) (pin 53))
      (node (ref J2) (pin 25)))
    (net (code 41) (name /TDC_IN_6N)
      (node (ref J1) (pin 31))
      (node (ref J2) (pin 38)))
    (net (code 42) (name /TDC_IN_7P)
      (node (ref J2) (pin 37))
      (node (ref J1) (pin 33)))
    (net (code 43) (name /TDC_IN_7N)
      (node (ref J1) (pin 35))
      (node (ref J2) (pin 36)))
    (net (code 44) (name /TDC_IN_1N)
      (node (ref J1) (pin 11))
      (node (ref J2) (pin 48)))
    (net (code 45) (name /TDC_IN_3P)
      (node (ref J1) (pin 17))
      (node (ref J2) (pin 45)))))