M48
;DRILL file {Pcbnew (2013-10-07 BZR 4378)-stable} date Fri 19 Dec 2014 03:59:52 PM EST
;FORMAT={-:-/ absolute / inch / decimal}
FMAT,2
INCH,TZ
T1C0.006
T2C0.020
%
G90
G05
M72
T1
X3.74Y-8.145
X3.74Y-8.17
X3.74Y-8.195
X3.74Y-8.22
X3.74Y-8.245
X3.74Y-8.286
X3.74Y-8.342
X3.74Y-8.381
X3.74Y-8.421
X3.74Y-8.46
X3.74Y-8.5
X3.74Y-8.539
X3.74Y-8.579
X3.74Y-8.618
X3.74Y-8.776
X3.74Y-8.815
X3.74Y-8.853
X3.74Y-8.894
X3.74Y-8.934
X3.74Y-8.973
X3.74Y-9.013
X3.74Y-9.052
X3.74Y-9.106
X3.74Y-9.15
X3.74Y-9.189
X3.74Y-9.2265
X3.74Y-9.286
X3.74Y-9.325
X3.748Y-8.723
X3.761Y-8.689
X3.7715Y-9.089
X3.773Y-8.2655
X3.773Y-8.321
X3.7765Y-8.7345
X3.779Y-9.258
X3.78Y-9.299
X3.781Y-9.145
X3.7905Y-8.675
X3.8065Y-8.2655
X3.809Y-8.7535
X3.811Y-8.3105
X3.8265Y-8.6565
X3.8545Y-8.305
X5.348Y-8.723
X5.348Y-9.106
X5.361Y-8.689
X5.388Y-9.17
X5.406Y-9.258
X5.43Y-8.305
X5.548Y-8.723
X5.548Y-9.106
X5.561Y-8.689
X5.588Y-9.1705
X5.606Y-9.299
X5.63Y-8.305
X5.748Y-8.723
X5.748Y-9.106
X5.761Y-8.689
X5.788Y-9.1705
X5.806Y-9.258
X5.83Y-8.305
X5.948Y-8.723
X5.948Y-9.106
X5.961Y-8.689
X5.988Y-9.1705
X6.006Y-9.299
X6.03Y-8.305
X6.148Y-8.723
X6.148Y-9.106
X6.161Y-8.689
X6.188Y-9.1705
X6.206Y-9.258
X6.23Y-8.305
X6.348Y-8.6885
X6.348Y-8.723
X6.3485Y-9.1055
X6.386Y-9.1715
X6.43Y-8.305
X6.44Y-9.0165
X6.48Y-8.853
X6.4885Y-9.0705
X6.493Y-8.8225
X6.521Y-9.19
X6.568Y-9.232
X6.608Y-8.483
X6.68Y-9.0165
X6.6955Y-9.0635
X6.778Y-8.8225
X6.785Y-8.6595
X6.794Y-8.853
X6.88Y-9.0165
X6.8955Y-9.0635
X6.978Y-8.8225
X6.994Y-8.853
X7.08Y-9.0165
X7.09Y-8.6595
X7.0955Y-9.0635
X7.178Y-8.8225
X7.194Y-8.853
X7.28Y-9.0165
X7.29Y-8.6595
X7.2955Y-9.0635
X7.378Y-8.8225
X7.394Y-8.853
X7.48Y-9.0165
X7.49Y-8.6595
X7.4955Y-9.0635
X7.578Y-8.8225
X7.594Y-8.853
X7.68Y-9.0165
X7.69Y-8.6595
X7.6955Y-9.0635
X7.778Y-8.8225
X7.794Y-8.853
X7.88Y-9.0165
X7.89Y-8.6595
X7.8955Y-9.0635
X7.978Y-8.8225
X7.994Y-8.853
X8.08Y-9.0165
X8.09Y-8.6595
X8.0955Y-9.0635
X8.178Y-8.8225
X8.194Y-8.853
X8.28Y-9.0165
X8.29Y-8.6595
X8.2955Y-9.0635
X8.378Y-8.8225
X8.394Y-8.853
X8.48Y-9.0165
X8.49Y-8.6595
X8.4955Y-9.0635
X8.578Y-8.8225
X8.594Y-8.853
X8.68Y-9.0165
X8.69Y-8.6595
X8.6955Y-9.0635
X8.778Y-8.8225
X8.794Y-8.853
X8.88Y-9.0165
X8.89Y-8.6595
X8.8955Y-9.0635
X8.978Y-8.8225
X8.994Y-8.853
X9.08Y-9.0165
X9.09Y-8.6595
X9.0955Y-9.0635
X9.178Y-8.8225
X9.194Y-8.853
X9.28Y-9.0165
X9.29Y-8.6595
X9.2955Y-9.0635
X9.378Y-8.8225
X9.394Y-8.853
X9.48Y-9.0165
X9.49Y-8.6595
X9.4955Y-9.0635
X9.578Y-8.8225
X9.594Y-8.853
X9.68Y-9.0165
X9.69Y-8.6595
X9.6955Y-9.0635
X9.778Y-8.8225
X9.794Y-8.853
X9.88Y-9.0165
X9.89Y-8.6595
X9.8955Y-9.0635
X9.978Y-8.8225
X9.994Y-8.853
X10.08Y-9.0165
X10.09Y-8.6595
X10.0955Y-9.0635
X10.178Y-8.8225
X10.194Y-8.853
X10.28Y-9.0165
X10.29Y-8.6595
X10.2955Y-9.0635
X10.378Y-8.8225
X10.394Y-8.853
X10.48Y-9.0165
X10.49Y-8.6595
X10.4955Y-9.0635
X10.578Y-8.8225
X10.594Y-8.853
X10.68Y-9.0165
X10.69Y-8.6595
X10.6955Y-9.0635
X10.778Y-8.8225
X10.794Y-8.853
X10.88Y-9.0165
X10.89Y-8.6595
X10.8955Y-9.0635
X10.978Y-8.8225
X10.994Y-8.853
X11.08Y-9.0165
X11.09Y-8.6595
X11.0955Y-9.0635
X12.4371Y-8.8225
X12.4531Y-8.853
X12.48Y-9.0165
X12.4955Y-9.0635
X12.5491Y-8.6595
X12.6371Y-8.8225
X12.6531Y-8.853
X12.7391Y-9.0165
X12.7491Y-8.6595
X12.7641Y-9.0625
X12.8371Y-8.8225
X12.8531Y-8.853
X12.9391Y-9.0165
X12.9491Y-8.6595
X12.9641Y-9.0625
X13.0371Y-8.8225
X13.0531Y-8.853
X13.1391Y-9.0165
X13.1491Y-8.6595
X13.1641Y-9.0625
X13.2371Y-8.8225
X13.2531Y-8.853
X13.3391Y-9.0165
X13.3491Y-8.6595
X13.3641Y-9.0625
X13.4371Y-8.8225
X13.4531Y-8.853
X13.5391Y-9.0165
X13.5491Y-8.6595
X13.5641Y-9.0625
X13.6371Y-8.8225
X13.6531Y-8.853
X13.7391Y-9.0165
X13.7491Y-8.6595
X13.7641Y-9.0625
X13.8371Y-8.8225
X13.8531Y-8.853
X13.9391Y-9.0165
X13.9491Y-8.6595
X13.9641Y-9.0625
X14.0371Y-8.8225
X14.0531Y-8.853
X14.1391Y-9.0165
X14.1491Y-8.6595
X14.1641Y-9.0625
X14.2371Y-8.8225
X14.2531Y-8.853
X14.3391Y-9.0165
X14.3491Y-8.6595
X14.3641Y-9.0625
X14.4371Y-8.8225
X14.4531Y-8.853
X14.5391Y-9.0165
X14.5466Y-8.6565
X14.5641Y-9.0625
X14.6371Y-8.8225
X14.6531Y-8.853
X14.6646Y-8.5375
X14.7396Y-9.017
X14.7641Y-9.0625
X14.7881Y-8.
X14.7881Y-8.2
X14.7881Y-8.4
X14.7891Y-7.8
X14.7951Y-8.6655
X14.8171Y-8.6885
X14.8751Y-7.734
X14.8816Y-8.875
X14.8931Y-7.75
X14.9091Y-8.918
X14.9131Y-7.734
X14.9336Y-7.75
X14.9511Y-8.509
X14.9516Y-8.016
X14.9521Y-8.266
X14.9531Y-7.734
X14.9731Y-7.75
X14.9821Y-8.274
X14.9821Y-8.5225
X14.9841Y-8.028
X14.9931Y-7.734
X15.0036Y-8.753
X15.0121Y-7.75
X15.0311Y-7.734
X15.0506Y-8.7765
X15.0516Y-7.75
X15.0711Y-7.734
X15.0911Y-7.75
X15.1111Y-7.734
X15.1306Y-7.75
X15.1446Y-8.6115
X15.1461Y-8.199
X15.1461Y-8.41
X15.1491Y-7.734
X15.1661Y-7.8
X15.1701Y-7.75
X15.1921Y-8.635
X15.1931Y-8.421
X15.1961Y-8.221
X15.2121Y-7.8
X15.2671Y-7.734
X15.2841Y-8.0585
X15.2881Y-7.75
X15.3071Y-7.734
X15.3276Y-7.75
X15.3366Y-8.078
X15.3471Y-7.462
X15.3471Y-7.734
X15.3666Y-7.75
X15.3671Y-7.49
X15.3871Y-7.468
X15.3871Y-7.734
X15.3986Y-7.9435
X15.4061Y-7.75
X15.4071Y-7.488
X15.4251Y-7.734
X15.4361Y-7.9785
X15.4451Y-7.596
X15.4456Y-7.75
X15.4651Y-7.58
X15.4651Y-7.734
X15.4846Y-7.75
X15.4851Y-7.596
X15.5046Y-7.58
X15.5051Y-7.734
X15.5241Y-7.75
X15.538Y-7.583
X15.5406Y-7.8015
X15.5431Y-7.734
X15.5631Y-7.75
X15.5776Y-7.837
T2
X14.6691Y-7.48
X14.8941Y-7.474
X14.9531Y-7.474
X15.0121Y-7.474
X15.0711Y-7.474
X15.1191Y-7.6
X15.1891Y-7.61
X15.2491Y-7.61
X15.3091Y-7.61
X15.7681Y-7.481
T0
M30
