PCBNEW-LibModule-V1  Thu 04 Dec 2014 04:44:25 PM EST
# encoding utf-8
Units mm
$INDEX
2x4_Pin
$EndINDEX
$MODULE 2x4_Pin
Po 0 0 0 15 5480D5A3 00000000 ~~
Li 2x4_Pin
Sc 0
AR 
Op 0 0 0
T0 0 -6.35 1 1 0 0.15 N V 21 N "2x4_Pin"
T1 0 6.35 1 1 0 0.15 N V 21 N "VAL**"
DS 2.54 -2.286 2.54 -2.794 0.15 21
DS 2.54 0.254 2.54 -0.254 0.15 21
DS 2.54 2.794 2.54 2.286 0.15 21
DS 2.54 5.08 2.54 4.826 0.15 21
DS -2.54 5.08 -2.54 4.826 0.15 21
DS -2.54 2.286 -2.54 2.794 0.15 21
DS -2.54 -0.254 -2.54 0.254 0.15 21
DS -2.54 -2.794 -2.54 -2.286 0.15 21
DS 2.54 -5.08 2.54 -4.826 0.15 21
DS -2.54 -5.08 -2.54 -4.826 0.15 21
DS -2.54 -5.08 2.54 -5.08 0.15 21
DS -2.54 5.08 2.54 5.08 0.15 21
$PAD
Sh "2" R 3.683 1.27 0 0 0
Dr 0 0 0
At SMD N 00888000
Ne 0 ""
Po 2.2352 -3.81
$EndPAD
$PAD
Sh "1" R 3.683 1.27 0 0 0
Dr 0 0 0
At SMD N 00888000
Ne 0 ""
Po -2.2352 -3.81
$EndPAD
$PAD
Sh "3" R 3.683 1.27 0 0 0
Dr 0 0 0
At SMD N 00888000
Ne 0 ""
Po -2.2352 -1.27
$EndPAD
$PAD
Sh "4" R 3.683 1.27 0 0 0
Dr 0 0 0
At SMD N 00888000
Ne 0 ""
Po 2.2352 -1.27
$EndPAD
$PAD
Sh "5" R 3.683 1.27 0 0 0
Dr 0 0 0
At SMD N 00888000
Ne 0 ""
Po -2.2352 1.27
$EndPAD
$PAD
Sh "6" R 3.683 1.27 0 0 0
Dr 0 0 0
At SMD N 00888000
Ne 0 ""
Po 2.2352 1.27
$EndPAD
$PAD
Sh "7" R 3.683 1.27 0 0 0
Dr 0 0 0
At SMD N 00888000
Ne 0 ""
Po -2.2352 3.81
$EndPAD
$PAD
Sh "8" R 3.683 1.27 0 0 0
Dr 0 0 0
At SMD N 00888000
Ne 0 ""
Po 2.2352 3.81
$EndPAD
$EndMODULE 2x4_Pin
$EndLIBRARY
