EESchema Schematic File Version 2
LIBS:erf8-050-05
LIBS:2x4pin_connector
LIBS:board_connect
LIBS:ds18b20_connector-2X4pin
LIBS:fh40-64s-0
LIBS:HV-1X30pin
LIBS:feedthrough-cache
EELAYER 24 0
EELAYER END
$Descr A4 11693 8268
encoding utf-8
Sheet 1 9
Title ""
Date "12 jan 2015"
Rev ""
Comp ""
Comment1 ""
Comment2 ""
Comment3 ""
Comment4 ""
$EndDescr
Text Label 2000 4050 2    60   ~ 0
+1.4VRet1
Text Label 2000 3950 2    60   ~ 0
+1.4V1
Text Label 9750 4350 0    60   ~ 0
+1.4VRet3
Text Label 9750 4250 0    60   ~ 0
+1.4V3
Text Label 9750 4050 0    60   ~ 0
-3V3
Text Label 9750 4150 0    60   ~ 0
-3VRet3
Text Label 9750 3950 0    60   ~ 0
+3VRet3
Text Label 9750 3850 0    60   ~ 0
+3V3
Text Label 9350 6350 0    60   ~ 0
+3V4
Text Label 9350 6450 0    60   ~ 0
+3VRet4
Text Label 9350 6650 0    60   ~ 0
-3VRet4
Text Label 9350 6550 0    60   ~ 0
-3V4
Text Label 9350 6750 0    60   ~ 0
+1.4V4
Text Label 9350 6850 0    60   ~ 0
+1.4VRet4
Text Label 2000 3550 2    60   ~ 0
+3V1
Text Label 2000 3650 2    60   ~ 0
+3VRet1
Text Label 2000 3850 2    60   ~ 0
-3VRet1
Text Label 2000 3750 2    60   ~ 0
-3V1
Text Label 2000 6850 0    60   ~ 0
+1.4VRet2
Text Label 2000 6750 0    60   ~ 0
+1.4V2
Text Label 2000 6550 0    60   ~ 0
-3V2
Text Label 2000 6650 0    60   ~ 0
-3VRet2
Text Label 2000 6450 0    60   ~ 0
+3VRet2
Text Label 2000 6350 0    60   ~ 0
+3V2
$Sheet
S 1150 4600 750  2300
U 542B5662
F0 "ASDQ2" 60
F1 "sch/ASDQ.sch" 60
F2 "+1.4VRet" O R 1900 6850 60 
F3 "+1.4V" I R 1900 6750 60 
F4 "-3VRet" O R 1900 6650 60 
F5 "-3V" I R 1900 6550 60 
F6 "+3VRet" O R 1900 6450 60 
F7 "+3V" I R 1900 6350 60 
F8 "VRef[3..0]" I R 1900 6150 60 
F9 "TP2_[1..0]" I R 1900 5950 60 
F10 "TP1_[1..0]" I R 1900 5850 60 
F11 "TEMP" B R 1900 5600 60 
F12 "AP[7..0]" O R 1900 4900 60 
F13 "AN[7..0]" O R 1900 5000 60 
F14 "BP[7..0]" O R 1900 5100 60 
F15 "BN[7..0]" O R 1900 5200 60 
F16 "ShieldA" O R 1900 4700 60 
F17 "ShieldB" O R 1900 4800 60 
F18 "Vref_gnd" U R 1900 5700 60 
$EndSheet
$Sheet
S 700  1800 750  2300
U 542B5663
F0 "ASDQ1" 60
F1 "sch/ASDQ.sch" 60
F2 "+1.4VRet" O R 1450 4050 60 
F3 "+1.4V" I R 1450 3950 60 
F4 "-3VRet" O R 1450 3850 60 
F5 "-3V" I R 1450 3750 60 
F6 "+3VRet" O R 1450 3650 60 
F7 "+3V" I R 1450 3550 60 
F8 "VRef[3..0]" I R 1450 3350 60 
F9 "TP2_[1..0]" I R 1450 3150 60 
F10 "TP1_[1..0]" I R 1450 3050 60 
F11 "TEMP" B R 1450 2800 60 
F12 "AP[7..0]" O R 1450 2100 60 
F13 "AN[7..0]" O R 1450 2200 60 
F14 "BP[7..0]" O R 1450 2300 60 
F15 "BN[7..0]" O R 1450 2400 60 
F16 "ShieldA" O R 1450 1900 60 
F17 "ShieldB" O R 1450 2000 60 
F18 "Vref_gnd" U R 1450 2900 60 
$EndSheet
$Sheet
S 2700 850  1750 1400
U 542B54BD
F0 "TDC_MB1" 60
F1 "sch/TDC_MB.sch" 60
F2 "TDC2_C5_[1..0]" I R 4450 2100 60 
F3 "TDC2_8b10b_[1..0]" O R 4450 2200 60 
F4 "TDC1_8b10b_[1..0]" O R 4450 1900 60 
F5 "TDC1_C5_[1..0]" I R 4450 1800 60 
F6 "+4VRet" I R 4450 1000 60 
F7 "+4V" I R 4450 900 60 
F8 "JTAG_TMS" I R 4450 1400 60 
F9 "JTAG_TDO" O R 4450 1600 60 
F10 "JTAG_TDI" I R 4450 1500 60 
F11 "JTAG_TCK" I R 4450 1300 60 
F12 "ASDQ2_AP[7..0]" I L 2700 1800 60 
F13 "ASDQ2_AN[7..0]" I L 2700 1900 60 
F14 "ASDQ1_AN[7..0]" I L 2700 1200 60 
F15 "ASDQ1_AP[7..0]" I L 2700 1100 60 
F16 "ASDQ1_BP[7..0]" I L 2700 1300 60 
F17 "ASDQ1_BN[7..0]" I L 2700 1400 60 
F18 "ASDQ2_BP[7..0]" I L 2700 2000 60 
F19 "ASDQ2_BN[7..0]" I L 2700 2100 60 
F20 "ASDQ1_ShieldA" U L 2700 900 60 
F21 "ASDQ2_ShieldA" U L 2700 1600 60 
F22 "ASDQ1_ShieldB" U L 2700 1000 60 
F23 "ASDQ2_ShieldB" U L 2700 1700 60 
F24 "TDC_SCL" I R 4450 1100 60 
F25 "TDC_SDA" I R 4450 1200 60 
$EndSheet
$Sheet
S 10300 2100 750  2300
U 542B50F4
F0 "ASDQ3" 60
F1 "sch/ASDQ.sch" 60
F2 "+1.4VRet" O L 10300 4350 60 
F3 "+1.4V" I L 10300 4250 60 
F4 "-3VRet" O L 10300 4150 60 
F5 "-3V" I L 10300 4050 60 
F6 "+3VRet" O L 10300 3950 60 
F7 "+3V" I L 10300 3850 60 
F8 "VRef[3..0]" I L 10300 3650 60 
F9 "TP2_[1..0]" I L 10300 3450 60 
F10 "TP1_[1..0]" I L 10300 3350 60 
F11 "TEMP" B L 10300 3100 60 
F12 "AP[7..0]" O L 10300 2400 60 
F13 "AN[7..0]" O L 10300 2500 60 
F14 "ShieldA" O L 10300 2200 60 
F15 "ShieldB" O L 10300 2300 60 
F16 "BP[7..0]" O L 10300 2600 60 
F17 "BN[7..0]" O L 10300 2700 60 
F18 "Vref_gnd" U L 10300 3200 60 
$EndSheet
$Comp
L DS18B20_CONNECTOR J1
U 1 1 5451AD3C
P 5850 5500
F 0 "J1" V 5300 5500 60  0000 C CNN
F 1 "DS18B20_CONNECTOR" H 5850 5500 60  0000 C CNN
F 2 "2x4_Pin" H 5600 5500 60  0001 C CNN
F 3 "~" H 5600 5500 60  0000 C CNN
F 4 "WM6889CT-ND" V 5850 5500 60  0001 C CNN "Field1"
F 5 "Digi-Key" V 5850 5500 60  0001 C CNN "Field2"
	1    5850 5500
	0    -1   -1   0   
$EndComp
Text Notes 6950 6250 2    60   ~ 0
Connect 4 additional temp sensors seperately.
Text Notes 5600 6750 0    60   ~ 0
High Voltage\n Connection
$Sheet
S 5400 6500 1000 500 
U 545BAD44
F0 "HV_Conn" 50
F1 "sch/HV_Conn.sch" 50
$EndSheet
Text Label 2000 5600 0    60   ~ 0
TEMP_0
Text Label 5150 5250 2    60   ~ 0
TEMP_1
Text Label 2000 5700 0    60   ~ 0
Vref_gnd
Text Label 6550 5250 0    60   ~ 0
TEMP_RET_1
Text Label 10200 3200 2    60   ~ 0
Vref_gnd
Text Label 9800 5700 2    60   ~ 0
Vref_gnd
Text Label 1550 2900 0    60   ~ 0
Vref_gnd
Text Label 1550 2800 0    60   ~ 0
TEMP_0
Text Label 10200 3100 2    60   ~ 0
TEMP_0
Text Label 9800 5600 2    60   ~ 0
TEMP_0
Text Label 6950 3200 0    60   ~ 0
TEMP_0
Text Label 6950 3300 0    60   ~ 0
Vref_gnd
$Sheet
S 7250 850  1750 1400
U 542B4354
F0 "TDC_MB2" 60
F1 "sch/TDC_MB.sch" 60
F2 "TDC2_C5_[1..0]" I L 7250 2100 60 
F3 "TDC2_8b10b_[1..0]" O L 7250 2200 60 
F4 "TDC1_8b10b_[1..0]" O L 7250 1900 60 
F5 "TDC1_C5_[1..0]" I L 7250 1800 60 
F6 "+4VRet" I L 7250 1000 60 
F7 "+4V" I L 7250 900 60 
F8 "JTAG_TMS" I L 7250 1400 60 
F9 "JTAG_TDO" O L 7250 1600 60 
F10 "JTAG_TDI" I L 7250 1500 60 
F11 "JTAG_TCK" I L 7250 1300 60 
F12 "ASDQ1_ShieldA" U R 9000 900 60 
F13 "ASDQ2_ShieldA" U R 9000 1600 60 
F14 "ASDQ2_AP[7..0]" I R 9000 1800 60 
F15 "ASDQ2_AN[7..0]" I R 9000 1900 60 
F16 "ASDQ1_AN[7..0]" I R 9000 1200 60 
F17 "ASDQ1_AP[7..0]" I R 9000 1100 60 
F18 "ASDQ1_ShieldB" U R 9000 1000 60 
F19 "ASDQ2_ShieldB" U R 9000 1700 60 
F20 "ASDQ1_BP[7..0]" I R 9000 1300 60 
F21 "ASDQ1_BN[7..0]" I R 9000 1400 60 
F22 "ASDQ2_BP[7..0]" I R 9000 2000 60 
F23 "ASDQ2_BN[7..0]" I R 9000 2100 60 
F24 "TDC_SCL" I L 7250 1100 60 
F25 "TDC_SDA" I L 7250 1200 60 
$EndSheet
Text Label 6950 3800 0    60   ~ 0
TEMP_RET_1
Text Label 6950 3700 0    60   ~ 0
TEMP_1
$Sheet
S 4900 850  1900 3950
U 542AF429
F0 "LogicBoard" 50
F1 "sch/LogicBoardConnection.sch" 50
F2 "+4V" O L 4900 900 60 
F3 "+4VRet" I L 4900 1000 60 
F4 "VRef_ASDQ1_[3..0]" O L 4900 2900 60 
F5 "VRef_ASDQ2_[3..0]" O L 4900 3000 60 
F6 "VRef_ASDQ3_[3..0]" O R 6800 2900 60 
F7 "VRef_ASDQ4_[3..0]" O R 6800 3000 60 
F8 "JTAG1_TDO" I L 4900 1600 60 
F9 "JTAG1_TMS" O L 4900 1400 60 
F10 "JTAG1_TDI" O L 4900 1500 60 
F11 "JTAG2_TDO" I R 6800 1600 60 
F12 "JTAG2_TMS" O R 6800 1400 60 
F13 "JTAG2_TDI" O R 6800 1500 60 
F14 "TDC1_C5_[1..0]" O L 4900 1800 60 
F15 "TDC2_C5_[1..0]" O L 4900 2100 60 
F16 "TDC3_C5_[1..0]" O R 6800 1800 60 
F17 "TDC4_C5_[1..0]" O R 6800 2100 60 
F18 "TDC1_8B10B_[1..0]" I L 4900 1900 60 
F19 "TDC2_8B10B_[1..0]" I L 4900 2200 60 
F20 "TDC3_8B10B_[1..0]" I R 6800 1900 60 
F21 "TDC4_8B10B_[1..0]" I R 6800 2200 60 
F22 "ASDQ1_TP1_[1..0]" O L 4900 2400 60 
F23 "ASDQ1_TP2_[1..0]" O L 4900 2500 60 
F24 "ASDQ2_TP1_[1..0]" O L 4900 2600 60 
F25 "ASDQ2_TP2_[1..0]" O L 4900 2700 60 
F26 "ASDQ3_TP1_[1..0]" O R 6800 2400 60 
F27 "ASDQ3_TP2_[1..0]" O R 6800 2500 60 
F28 "ASDQ4_TP1_[1..0]" O R 6800 2600 60 
F29 "ASDQ4_TP2_[1..0]" O R 6800 2700 60 
F30 "JTAG2_TCK" O R 6800 1300 60 
F31 "JTAG1_TCK" O L 4900 1300 60 
F32 "+3V[4..1]" O L 4900 3200 60 
F33 "-3V[4..1]" O L 4900 4200 60 
F34 "TEMP_0" B R 6800 3200 60 
F35 "+1.4V[4..1]" O R 6800 4200 60 
F36 "TEMP_1" B R 6800 3700 60 
F37 "TEMP_RET_1" U R 6800 3800 60 
F38 "TDC_SCL" I L 4900 1100 60 
F39 "TDC_SDA" I L 4900 1200 60 
F40 "+3VRet[4..1]" I L 4900 3700 60 
F41 "-3VRet[4..1]" I L 4900 4700 60 
F42 "+1.4VRet[4..1]" I R 6800 4700 60 
F43 "Vref_gnd" U R 6800 3300 60 
$EndSheet
Text Label 6900 4700 0    60   ~ 0
+1.4VRet[4..1]
Text Label 6900 4200 0    60   ~ 0
+1.4V[4..1]
Text Label 4800 4700 2    60   ~ 0
-3VRet[4..1]
Text Label 4800 4200 2    60   ~ 0
-3V[4..1]
Text Label 4800 3700 2    60   ~ 0
+3VRet[4..1]
Text Label 4800 3200 2    60   ~ 0
+3V[4..1]
Wire Wire Line
	1450 3650 2000 3650
Wire Wire Line
	1450 3950 2000 3950
Wire Wire Line
	1450 3750 2000 3750
Wire Wire Line
	1450 3550 2000 3550
Wire Wire Line
	1900 6450 2000 6450
Wire Wire Line
	2000 6650 1900 6650
Wire Wire Line
	1900 6850 2000 6850
Wire Wire Line
	9350 6750 9900 6750
Wire Wire Line
	9350 6550 9900 6550
Wire Wire Line
	9350 6350 9900 6350
Wire Wire Line
	9750 4250 10300 4250
Wire Wire Line
	9750 4050 10300 4050
Wire Wire Line
	9750 3850 10300 3850
Wire Bus Line
	7750 3650 10300 3650
Wire Bus Line
	7750 2900 7750 3650
Wire Bus Line
	7950 5850 9900 5850
Wire Bus Line
	7950 2600 7950 5850
Wire Bus Line
	3800 5850 1900 5850
Wire Bus Line
	3600 2400 3600 3050
Wire Bus Line
	1700 1100 2700 1100
Wire Bus Line
	1800 1200 2700 1200
Wire Bus Line
	3900 5950 1900 5950
Wire Bus Line
	7850 5950 9900 5950
Wire Bus Line
	7850 2700 7850 5950
Wire Bus Line
	7650 3000 7650 6150
Wire Bus Line
	7650 6150 9900 6150
Wire Wire Line
	9750 3950 10300 3950
Wire Wire Line
	9750 4150 10300 4150
Wire Wire Line
	9750 4350 10300 4350
Wire Wire Line
	9350 6450 9900 6450
Wire Wire Line
	9350 6650 9900 6650
Wire Wire Line
	9350 6850 9900 6850
Wire Wire Line
	1900 6750 2000 6750
Wire Wire Line
	1900 6550 2000 6550
Wire Wire Line
	1900 6350 2000 6350
Wire Bus Line
	3600 3050 1450 3050
Wire Wire Line
	1450 3850 2000 3850
Wire Wire Line
	1450 4050 2000 4050
Wire Wire Line
	1600 1000 2700 1000
Wire Wire Line
	1500 900  2700 900 
Wire Wire Line
	4900 1500 4450 1500
Wire Wire Line
	4900 1600 4450 1600
Wire Wire Line
	4450 1400 4900 1400
Wire Wire Line
	4450 1300 4900 1300
Wire Wire Line
	4450 1000 4900 1000
Wire Wire Line
	4450 900  4900 900 
Wire Bus Line
	4450 2100 4900 2100
Wire Bus Line
	4900 2200 4450 2200
Wire Bus Line
	4450 1800 4900 1800
Wire Bus Line
	4900 1900 4450 1900
Wire Bus Line
	2600 5200 1900 5200
Wire Bus Line
	2500 5100 1900 5100
Wire Bus Line
	2700 2100 2600 2100
Wire Bus Line
	2600 2100 2600 5200
Wire Bus Line
	2500 5100 2500 2000
Wire Bus Line
	2500 2000 2700 2000
Wire Bus Line
	1900 5000 2400 5000
Wire Bus Line
	2400 5000 2400 1900
Wire Bus Line
	2400 1900 2700 1900
Wire Bus Line
	1900 4900 2300 4900
Wire Bus Line
	2300 4900 2300 1800
Wire Bus Line
	2300 1800 2700 1800
Wire Wire Line
	2700 1700 2200 1700
Wire Wire Line
	2200 1700 2200 4800
Wire Wire Line
	2200 4800 1900 4800
Wire Wire Line
	1900 4700 2100 4700
Wire Wire Line
	2100 4700 2100 1600
Wire Wire Line
	2100 1600 2700 1600
Wire Bus Line
	1450 2400 2000 2400
Wire Bus Line
	2000 2400 2000 1400
Wire Bus Line
	2000 1400 2700 1400
Wire Bus Line
	1450 2300 1900 2300
Wire Bus Line
	1900 2300 1900 1300
Wire Bus Line
	1900 1300 2700 1300
Wire Bus Line
	1800 1200 1800 2200
Wire Bus Line
	1800 2200 1450 2200
Wire Bus Line
	1450 2100 1700 2100
Wire Bus Line
	1700 2100 1700 1100
Wire Wire Line
	1450 2000 1600 2000
Wire Wire Line
	1600 2000 1600 1000
Wire Wire Line
	1450 1900 1500 1900
Wire Wire Line
	1500 1900 1500 900 
Wire Bus Line
	9900 5200 9100 5200
Wire Bus Line
	9100 5200 9100 2100
Wire Bus Line
	9100 2100 9000 2100
Wire Bus Line
	9900 5100 9200 5100
Wire Bus Line
	9200 5100 9200 2000
Wire Bus Line
	9200 2000 9000 2000
Wire Bus Line
	9900 5000 9300 5000
Wire Bus Line
	9300 5000 9300 1900
Wire Bus Line
	9300 1900 9000 1900
Wire Bus Line
	9900 4900 9400 4900
Wire Bus Line
	9400 4900 9400 1800
Wire Bus Line
	9400 1800 9000 1800
Wire Wire Line
	9900 4800 9500 4800
Wire Wire Line
	9500 4800 9500 1700
Wire Wire Line
	9500 1700 9000 1700
Wire Wire Line
	9900 4700 9600 4700
Wire Wire Line
	9600 4700 9600 1600
Wire Wire Line
	9600 1600 9000 1600
Wire Bus Line
	10300 2700 9700 2700
Wire Bus Line
	9700 2700 9700 1400
Wire Bus Line
	9700 1400 9000 1400
Wire Bus Line
	10300 2600 9800 2600
Wire Bus Line
	9800 2600 9800 1300
Wire Bus Line
	9800 1300 9000 1300
Wire Bus Line
	10300 2500 9900 2500
Wire Bus Line
	9900 2500 9900 1200
Wire Bus Line
	9900 1200 9000 1200
Wire Bus Line
	10300 2400 10000 2400
Wire Bus Line
	10000 2400 10000 1100
Wire Bus Line
	10000 1100 9000 1100
Wire Wire Line
	10300 2300 10100 2300
Wire Wire Line
	10100 2300 10100 1000
Wire Wire Line
	10100 1000 9000 1000
Wire Wire Line
	10300 2200 10200 2200
Wire Wire Line
	10200 2200 10200 900 
Wire Wire Line
	10200 900  9000 900 
Wire Wire Line
	6800 3200 6950 3200
Wire Wire Line
	6950 3300 6800 3300
Wire Wire Line
	10200 3100 10300 3100
Wire Wire Line
	10200 3200 10300 3200
Wire Wire Line
	9800 5600 9900 5600
Wire Wire Line
	9800 5700 9900 5700
Wire Wire Line
	1550 2900 1450 2900
Wire Wire Line
	1450 2800 1550 2800
Wire Wire Line
	6550 5250 6550 5650
Wire Wire Line
	6550 5650 6350 5650
Wire Wire Line
	6350 5550 6550 5550
Connection ~ 6550 5550
Wire Wire Line
	6350 5450 6550 5450
Connection ~ 6550 5450
Wire Wire Line
	6350 5350 6550 5350
Connection ~ 6550 5350
Wire Wire Line
	5150 5250 5150 5650
Wire Wire Line
	5150 5650 5350 5650
Wire Wire Line
	5350 5550 5150 5550
Connection ~ 5150 5550
Wire Wire Line
	5350 5450 5150 5450
Connection ~ 5150 5450
Wire Wire Line
	5350 5350 5150 5350
Connection ~ 5150 5350
Wire Wire Line
	2000 5700 1900 5700
Wire Wire Line
	1900 5600 2000 5600
Wire Bus Line
	6800 2200 7250 2200
Wire Bus Line
	7250 2100 6800 2100
Wire Bus Line
	7250 1900 6800 1900
Wire Bus Line
	6800 1800 7250 1800
Wire Wire Line
	7250 1600 6800 1600
Wire Wire Line
	6800 1500 7250 1500
Wire Wire Line
	7250 1400 6800 1400
Wire Wire Line
	6800 1300 7250 1300
Wire Bus Line
	3600 2400 4900 2400
Wire Bus Line
	3800 2600 4900 2600
Wire Bus Line
	3900 2700 4900 2700
Wire Bus Line
	7850 2700 6800 2700
Wire Bus Line
	7950 2600 6800 2600
Wire Bus Line
	7750 2900 6800 2900
Wire Bus Line
	6800 3000 7650 3000
Wire Bus Line
	4000 2900 4900 2900
Wire Bus Line
	4100 3000 4900 3000
Wire Wire Line
	6800 3700 6950 3700
Wire Wire Line
	6800 3800 6950 3800
Wire Bus Line
	4900 4200 4800 4200
Wire Bus Line
	4800 3700 4900 3700
Wire Bus Line
	4800 3200 4900 3200
Wire Bus Line
	3800 2600 3800 5850
Wire Bus Line
	3900 2700 3900 5950
Wire Bus Line
	4000 2900 4000 3350
Wire Bus Line
	4000 3350 1450 3350
Wire Bus Line
	1900 6150 4100 6150
Wire Bus Line
	4100 6150 4100 3000
Wire Bus Line
	4900 4700 4800 4700
Wire Bus Line
	6800 4700 6900 4700
Wire Bus Line
	6800 4200 6900 4200
Wire Bus Line
	4900 2500 3700 2500
Wire Bus Line
	3700 2500 3700 3150
Wire Bus Line
	3700 3150 1450 3150
Wire Bus Line
	6800 2500 8050 2500
Wire Bus Line
	8050 2500 8050 3450
Wire Bus Line
	8050 3450 10300 3450
Wire Bus Line
	8200 2400 8200 3350
Wire Bus Line
	8200 3350 10300 3350
Wire Bus Line
	6800 2400 8200 2400
Wire Wire Line
	7250 900  7150 900 
Wire Wire Line
	7150 900  7150 600 
Wire Wire Line
	7150 600  4550 600 
Wire Wire Line
	4550 600  4550 900 
Connection ~ 4550 900 
Wire Wire Line
	7250 1000 7100 1000
Wire Wire Line
	7100 1000 7100 650 
Wire Wire Line
	7100 650  4600 650 
Wire Wire Line
	4600 650  4600 1000
Connection ~ 4600 1000
$Sheet
S 9900 4600 750  2300
U 542B52D3
F0 "ASDQ4" 60
F1 "sch/ASDQ.sch" 60
F2 "+1.4VRet" O L 9900 6850 60 
F3 "+1.4V" I L 9900 6750 60 
F4 "-3VRet" O L 9900 6650 60 
F5 "-3V" I L 9900 6550 60 
F6 "+3VRet" O L 9900 6450 60 
F7 "+3V" I L 9900 6350 60 
F8 "VRef[3..0]" I L 9900 6150 60 
F9 "TP2_[1..0]" I L 9900 5950 60 
F10 "TP1_[1..0]" I L 9900 5850 60 
F11 "TEMP" B L 9900 5600 60 
F12 "AP[7..0]" O L 9900 4900 60 
F13 "AN[7..0]" O L 9900 5000 60 
F14 "ShieldA" O L 9900 4700 60 
F15 "ShieldB" O L 9900 4800 60 
F16 "BP[7..0]" O L 9900 5100 60 
F17 "BN[7..0]" O L 9900 5200 60 
F18 "Vref_gnd" U L 9900 5700 60 
$EndSheet
$Comp
L CONN_1 P1
U 1 1 54935D8E
P 3000 6800
F 0 "P1" H 3080 6800 40  0000 L CNN
F 1 "CONN_1" H 3000 6855 30  0001 C CNN
F 2 "" H 3000 6800 60  0000 C CNN
F 3 "" H 3000 6800 60  0000 C CNN
	1    3000 6800
	1    0    0    -1  
$EndComp
$Comp
L CONN_1 P2
U 1 1 549364ED
P 3000 6900
F 0 "P2" H 3080 6900 40  0000 L CNN
F 1 "CONN_1" H 3000 6955 30  0001 C CNN
F 2 "" H 3000 6900 60  0000 C CNN
F 3 "" H 3000 6900 60  0000 C CNN
	1    3000 6900
	1    0    0    -1  
$EndComp
$Comp
L CONN_1 P3
U 1 1 549366D0
P 3000 7000
F 0 "P3" H 3080 7000 40  0000 L CNN
F 1 "CONN_1" H 3000 7055 30  0001 C CNN
F 2 "" H 3000 7000 60  0000 C CNN
F 3 "" H 3000 7000 60  0000 C CNN
	1    3000 7000
	1    0    0    -1  
$EndComp
$Comp
L CONN_1 P4
U 1 1 54936A87
P 3000 7100
F 0 "P4" H 3080 7100 40  0000 L CNN
F 1 "CONN_1" H 3000 7155 30  0001 C CNN
F 2 "" H 3000 7100 60  0000 C CNN
F 3 "" H 3000 7100 60  0000 C CNN
	1    3000 7100
	1    0    0    -1  
$EndComp
$Comp
L CONN_1 P5
U 1 1 54936C6A
P 3000 7200
F 0 "P5" H 3080 7200 40  0000 L CNN
F 1 "CONN_1" H 3000 7255 30  0001 C CNN
F 2 "" H 3000 7200 60  0000 C CNN
F 3 "" H 3000 7200 60  0000 C CNN
	1    3000 7200
	1    0    0    -1  
$EndComp
$Comp
L CONN_1 P6
U 1 1 54936E4D
P 3000 7300
F 0 "P6" H 3080 7300 40  0000 L CNN
F 1 "CONN_1" H 3000 7355 30  0001 C CNN
F 2 "" H 3000 7300 60  0000 C CNN
F 3 "" H 3000 7300 60  0000 C CNN
	1    3000 7300
	1    0    0    -1  
$EndComp
$Comp
L CONN_1 P7
U 1 1 549373DA
P 3550 6800
F 0 "P7" H 3630 6800 40  0000 L CNN
F 1 "CONN_1" H 3550 6855 30  0001 C CNN
F 2 "" H 3550 6800 60  0000 C CNN
F 3 "" H 3550 6800 60  0000 C CNN
	1    3550 6800
	1    0    0    -1  
$EndComp
$Comp
L CONN_1 P8
U 1 1 549373E0
P 3550 6900
F 0 "P8" H 3630 6900 40  0000 L CNN
F 1 "CONN_1" H 3550 6955 30  0001 C CNN
F 2 "" H 3550 6900 60  0000 C CNN
F 3 "" H 3550 6900 60  0000 C CNN
	1    3550 6900
	1    0    0    -1  
$EndComp
$Comp
L CONN_1 P9
U 1 1 549373E6
P 3550 7000
F 0 "P9" H 3630 7000 40  0000 L CNN
F 1 "CONN_1" H 3550 7055 30  0001 C CNN
F 2 "" H 3550 7000 60  0000 C CNN
F 3 "" H 3550 7000 60  0000 C CNN
	1    3550 7000
	1    0    0    -1  
$EndComp
$Comp
L CONN_1 P10
U 1 1 549373EC
P 3550 7100
F 0 "P10" H 3630 7100 40  0000 L CNN
F 1 "CONN_1" H 3550 7155 30  0001 C CNN
F 2 "" H 3550 7100 60  0000 C CNN
F 3 "" H 3550 7100 60  0000 C CNN
	1    3550 7100
	1    0    0    -1  
$EndComp
$Comp
L CONN_1 P11
U 1 1 549373F2
P 3550 7200
F 0 "P11" H 3630 7200 40  0000 L CNN
F 1 "CONN_1" H 3550 7255 30  0001 C CNN
F 2 "" H 3550 7200 60  0000 C CNN
F 3 "" H 3550 7200 60  0000 C CNN
	1    3550 7200
	1    0    0    -1  
$EndComp
$Comp
L CONN_1 P12
U 1 1 549373F8
P 3550 7300
F 0 "P12" H 3630 7300 40  0000 L CNN
F 1 "CONN_1" H 3550 7355 30  0001 C CNN
F 2 "" H 3550 7300 60  0000 C CNN
F 3 "" H 3550 7300 60  0000 C CNN
	1    3550 7300
	1    0    0    -1  
$EndComp
$Comp
L CONN_1 P13
U 1 1 5493797A
P 4100 6800
F 0 "P13" H 4180 6800 40  0000 L CNN
F 1 "CONN_1" H 4100 6855 30  0001 C CNN
F 2 "" H 4100 6800 60  0000 C CNN
F 3 "" H 4100 6800 60  0000 C CNN
	1    4100 6800
	1    0    0    -1  
$EndComp
$Comp
L CONN_1 P14
U 1 1 54937980
P 4100 6900
F 0 "P14" H 4180 6900 40  0000 L CNN
F 1 "CONN_1" H 4100 6955 30  0001 C CNN
F 2 "" H 4100 6900 60  0000 C CNN
F 3 "" H 4100 6900 60  0000 C CNN
	1    4100 6900
	1    0    0    -1  
$EndComp
$Comp
L CONN_1 P15
U 1 1 54937986
P 4100 7000
F 0 "P15" H 4180 7000 40  0000 L CNN
F 1 "CONN_1" H 4100 7055 30  0001 C CNN
F 2 "" H 4100 7000 60  0000 C CNN
F 3 "" H 4100 7000 60  0000 C CNN
	1    4100 7000
	1    0    0    -1  
$EndComp
$Comp
L CONN_1 P16
U 1 1 5493798C
P 4100 7100
F 0 "P16" H 4180 7100 40  0000 L CNN
F 1 "CONN_1" H 4100 7155 30  0001 C CNN
F 2 "" H 4100 7100 60  0000 C CNN
F 3 "" H 4100 7100 60  0000 C CNN
	1    4100 7100
	1    0    0    -1  
$EndComp
$Comp
L CONN_1 P17
U 1 1 54937992
P 4100 7200
F 0 "P17" H 4180 7200 40  0000 L CNN
F 1 "CONN_1" H 4100 7255 30  0001 C CNN
F 2 "" H 4100 7200 60  0000 C CNN
F 3 "" H 4100 7200 60  0000 C CNN
	1    4100 7200
	1    0    0    -1  
$EndComp
$Comp
L CONN_1 P18
U 1 1 54937998
P 4100 7300
F 0 "P18" H 4180 7300 40  0000 L CNN
F 1 "CONN_1" H 4100 7355 30  0001 C CNN
F 2 "" H 4100 7300 60  0000 C CNN
F 3 "" H 4100 7300 60  0000 C CNN
	1    4100 7300
	1    0    0    -1  
$EndComp
Connection ~ 2850 6900
Connection ~ 2850 7000
Connection ~ 2850 7100
Wire Wire Line
	4450 1100 4900 1100
Wire Wire Line
	4450 1200 4900 1200
Wire Wire Line
	7250 1100 7000 1100
Wire Wire Line
	7000 1100 7000 700 
Wire Wire Line
	7000 700  4700 700 
Wire Wire Line
	4700 700  4700 1100
Connection ~ 4700 1100
Wire Wire Line
	4750 1200 4750 750 
Wire Wire Line
	4750 750  6900 750 
Wire Wire Line
	6900 750  6900 1200
Wire Wire Line
	6900 1200 7250 1200
Connection ~ 4750 1200
Text Notes 7300 700  0    60   ~ 0
Next to Logic board (upper) TDC 1,2
Text Notes 2800 700  0    60   ~ 0
Next to HV board (lower)  TDC 2,3
$EndSCHEMATC
