PCBNEW-LibModule-V1  Mon 05 Jan 2015 01:26:04 PM EST
# encoding utf-8
Units mm
$INDEX
ERF8-050-05.0-S-DV-K-TR
ERF8-050-05.0-S-DV-K-TR-RevB
$EndINDEX
$MODULE ERF8-050-05.0-S-DV-K-TR
Po 0 0 0 15 54AAD3F0 00000000 ~~
Li ERF8-050-05.0-S-DV-K-TR
Sc 0
AR /542AF429/545BE30C
Op 0 0 0
T0 0 -27 1 1 0 0.15 N V 21 N "J8"
T1 0 24.8 1 1 0 0.15 N I 21 N "ERF8-050-05.0-S-DV-K-TR"
DC 0 0.4 0.4 0.8 0.15 21
DC 0 0.4 0.6 1 0.15 21
DS 2.2 -22.6 -1.4 -22.6 0.15 21
DS -1.4 -22.6 -2.8 -21.2 0.15 21
DS -2.8 -21.2 -2.8 -19.8 0.15 21
DS 2.2 -22.6 2.8 -22.6 0.15 21
DS 2.8 -22.6 2.8 -19.8 0.15 21
DS 2.2 23.4 -2.8 23.4 0.15 21
DS -2.8 23.4 -2.8 20.6 0.15 21
DS 2.2 23.4 2.8 23.4 0.15 21
DS 2.8 23.4 2.8 20.6 0.15 21
T2 3.75 20.05 0.4 0.4 0 0.1 N V 21 N "100"
T2 -3.75 20.1 0.4 0.4 0 0.1 N V 21 N "99"
T2 3.75 -19.25 0.5 0.5 0 0.125 N V 21 N "2"
T2 -3.75 -19.25 0.5 0.5 0 0.125 N V 21 N "1"
$PAD
Sh "2" R 1.1 0.5 0 0 0
Dr 0 0 0
At SMD N 00888000
Ne 66 "/LogicBoard/TDC1_C5_1"
Po 2.25 -19.2
$EndPAD
$PAD
Sh "1" R 1.1 0.5 0 0 0
Dr 0 0 0
At SMD N 00888000
Ne 78 "/TDC_MB2/TDC1_C5_1"
Po -2.25 -19.2
$EndPAD
$PAD
Sh "3" R 1.1 0.5 0 0 0
Dr 0 0 0
At SMD N 00888000
Ne 77 "/TDC_MB2/TDC1_C5_0"
Po -2.25 -18.4
$EndPAD
$PAD
Sh "4" R 1.1 0.5 0 0 0
Dr 0 0 0
At SMD N 00888000
Ne 65 "/LogicBoard/TDC1_C5_0"
Po 2.25 -18.4
$EndPAD
$PAD
Sh "5" R 1.1 0.5 0 0 0
Dr 0 0 0
At SMD N 00888000
Ne 82 "/TDC_MB2/TDC2_C5_1"
Po -2.25 -17.6
$EndPAD
$PAD
Sh "6" R 1.1 0.5 0 0 0
Dr 0 0 0
At SMD N 00888000
Ne 70 "/LogicBoard/TDC2_C5_1"
Po 2.25 -17.6
$EndPAD
$PAD
Sh "7" R 1.1 0.5 0 0 0
Dr 0 0 0
At SMD N 00888000
Ne 81 "/TDC_MB2/TDC2_C5_0"
Po -2.25 -16.8
$EndPAD
$PAD
Sh "8" R 1.1 0.5 0 0 0
Dr 0 0 0
At SMD N 00888000
Ne 69 "/LogicBoard/TDC2_C5_0"
Po 2.25 -16.8
$EndPAD
$PAD
Sh "9" R 1.1 0.5 0 0 0
Dr 0 0 0
At SMD N 00888000
Ne 28 "/ASDQ3/VRef3"
Po -2.25 -16
$EndPAD
$PAD
Sh "10" R 1.1 0.5 0 0 0
Dr 0 0 0
At SMD N 00888000
Ne 11 "/ASDQ1/VRef3"
Po 2.25 -16
$EndPAD
$PAD
Sh "11" R 1.1 0.5 0 0 0
Dr 0 0 0
At SMD N 00888000
Ne 27 "/ASDQ3/VRef2"
Po -2.25 -15.2
$EndPAD
$PAD
Sh "12" R 1.1 0.5 0 0 0
Dr 0 0 0
At SMD N 00888000
Ne 10 "/ASDQ1/VRef2"
Po 2.25 -15.2
$EndPAD
$PAD
Sh "13" R 1.1 0.5 0 0 0
Dr 0 0 0
At SMD N 00888000
Ne 26 "/ASDQ3/VRef1"
Po -2.25 -14.4
$EndPAD
$PAD
Sh "14" R 1.1 0.5 0 0 0
Dr 0 0 0
At SMD N 00888000
Ne 9 "/ASDQ1/VRef1"
Po 2.25 -14.4
$EndPAD
$PAD
Sh "15" R 1.1 0.5 0 0 0
Dr 0 0 0
At SMD N 00888000
Ne 25 "/ASDQ3/VRef0"
Po -2.25 -13.6
$EndPAD
$PAD
Sh "16" R 1.1 0.5 0 0 0
Dr 0 0 0
At SMD N 00888000
Ne 8 "/ASDQ1/VRef0"
Po 2.25 -13.6
$EndPAD
$PAD
Sh "17" R 1.1 0.5 0 0 0
Dr 0 0 0
At SMD N 00888000
Ne 36 "/ASDQ4/VRef3"
Po -2.25 -12.8
$EndPAD
$PAD
Sh "18" R 1.1 0.5 0 0 0
Dr 0 0 0
At SMD N 00888000
Ne 20 "/ASDQ2/VRef3"
Po 2.25 -12.8
$EndPAD
$PAD
Sh "19" R 1.1 0.5 0 0 0
Dr 0 0 0
At SMD N 00888000
Ne 35 "/ASDQ4/VRef2"
Po -2.25 -12
$EndPAD
$PAD
Sh "20" R 1.1 0.5 0 0 0
Dr 0 0 0
At SMD N 00888000
Ne 19 "/ASDQ2/VRef2"
Po 2.25 -12
$EndPAD
$PAD
Sh "21" R 1.1 0.5 0 0 0
Dr 0 0 0
At SMD N 00888000
Ne 34 "/ASDQ4/VRef1"
Po -2.25 -11.2
$EndPAD
$PAD
Sh "22" R 1.1 0.5 0 0 0
Dr 0 0 0
At SMD N 00888000
Ne 18 "/ASDQ2/VRef1"
Po 2.25 -11.2
$EndPAD
$PAD
Sh "23" R 1.1 0.5 0 0 0
Dr 0 0 0
At SMD N 00888000
Ne 33 "/ASDQ4/VRef0"
Po -2.25 -10.4
$EndPAD
$PAD
Sh "24" R 1.1 0.5 0 0 0
Dr 0 0 0
At SMD N 00888000
Ne 17 "/ASDQ2/VRef0"
Po 2.25 -10.4
$EndPAD
$PAD
Sh "25" R 1.1 0.5 0 0 0
Dr 0 0 0
At SMD N 00888000
Ne 71 "/LogicBoard/TDCA_En"
Po -2.25 -9.6
$EndPAD
$PAD
Sh "26" R 1.1 0.5 0 0 0
Dr 0 0 0
At SMD N 00888000
Ne 72 "/LogicBoard/TDCB_En"
Po 2.25 -9.6
$EndPAD
$PAD
Sh "27" R 1.1 0.5 0 0 0
Dr 0 0 0
At SMD N 00888000
Ne 7 "/ASDQ1/TEMP"
Po -2.25 -8.8
$EndPAD
$PAD
Sh "28" R 1.1 0.5 0 0 0
Dr 0 0 0
At SMD N 00888000
Ne 12 "/ASDQ1/Vref_gnd"
Po 2.25 -8.8
$EndPAD
$PAD
Sh "29" R 1.1 0.5 0 0 0
Dr 0 0 0
At SMD N 00888000
Ne 73 "/LogicBoard/TEMP_1"
Po -2.25 -8
$EndPAD
$PAD
Sh "30" R 1.1 0.5 0 0 0
Dr 0 0 0
At SMD N 00888000
Ne 74 "/LogicBoard/TEMP_RET_1"
Po 2.25 -8
$EndPAD
$PAD
Sh "31" R 1.1 0.5 0 0 0
Dr 0 0 0
At SMD N 00888000
Ne 76 "/TDC_MB2/TDC1_8b10b_1"
Po -2.25 -7.2
$EndPAD
$PAD
Sh "32" R 1.1 0.5 0 0 0
Dr 0 0 0
At SMD N 00888000
Ne 64 "/LogicBoard/TDC1_8B10B_1"
Po 2.25 -7.2
$EndPAD
$PAD
Sh "33" R 1.1 0.5 0 0 0
Dr 0 0 0
At SMD N 00888000
Ne 75 "/TDC_MB2/TDC1_8b10b_0"
Po -2.25 -6.4
$EndPAD
$PAD
Sh "34" R 1.1 0.5 0 0 0
Dr 0 0 0
At SMD N 00888000
Ne 63 "/LogicBoard/TDC1_8B10B_0"
Po 2.25 -6.4
$EndPAD
$PAD
Sh "35" R 1.1 0.5 0 0 0
Dr 0 0 0
At SMD N 00888000
Ne 80 "/TDC_MB2/TDC2_8b10b_1"
Po -2.25 -5.6
$EndPAD
$PAD
Sh "36" R 1.1 0.5 0 0 0
Dr 0 0 0
At SMD N 00888000
Ne 68 "/LogicBoard/TDC2_8B10B_1"
Po 2.25 -5.6
$EndPAD
$PAD
Sh "37" R 1.1 0.5 0 0 0
Dr 0 0 0
At SMD N 00888000
Ne 79 "/TDC_MB2/TDC2_8b10b_0"
Po -2.25 -4.8
$EndPAD
$PAD
Sh "38" R 1.1 0.5 0 0 0
Dr 0 0 0
At SMD N 00888000
Ne 67 "/LogicBoard/TDC2_8B10B_0"
Po 2.25 -4.8
$EndPAD
$PAD
Sh "39" R 1.1 0.5 0 0 0
Dr 0 0 0
At SMD N 00888000
Ne 59 "/LogicBoard/JTAG2_TCK"
Po -2.25 -4
$EndPAD
$PAD
Sh "40" R 1.1 0.5 0 0 0
Dr 0 0 0
At SMD N 00888000
Ne 55 "/LogicBoard/JTAG1_TCK"
Po 2.25 -4
$EndPAD
$PAD
Sh "41" R 1.1 0.5 0 0 0
Dr 0 0 0
At SMD N 00888000
Ne 60 "/LogicBoard/JTAG2_TDI"
Po -2.25 -3.2
$EndPAD
$PAD
Sh "42" R 1.1 0.5 0 0 0
Dr 0 0 0
At SMD N 00888000
Ne 56 "/LogicBoard/JTAG1_TDI"
Po 2.25 -3.2
$EndPAD
$PAD
Sh "43" R 1.1 0.5 0 0 0
Dr 0 0 0
At SMD N 00888000
Ne 61 "/LogicBoard/JTAG2_TDO"
Po -2.25 -2.4
$EndPAD
$PAD
Sh "44" R 1.1 0.5 0 0 0
Dr 0 0 0
At SMD N 00888000
Ne 57 "/LogicBoard/JTAG1_TDO"
Po 2.25 -2.4
$EndPAD
$PAD
Sh "45" R 1.1 0.5 0 0 0
Dr 0 0 0
At SMD N 00888000
Ne 62 "/LogicBoard/JTAG2_TMS"
Po -2.25 -1.6
$EndPAD
$PAD
Sh "46" R 1.1 0.5 0 0 0
Dr 0 0 0
At SMD N 00888000
Ne 58 "/LogicBoard/JTAG1_TMS"
Po 2.25 -1.6
$EndPAD
$PAD
Sh "47" R 1.1 0.5 0 0 0
Dr 0 0 0
At SMD N 00888000
Ne 6 "/ASDQ1/-3VRet"
Po -2.25 -0.8
$EndPAD
$PAD
Sh "48" R 1.1 0.5 0 0 0
Dr 0 0 0
At SMD N 00888000
Ne 5 "/ASDQ1/-3V"
Po 2.25 -0.8
$EndPAD
$PAD
Sh "49" R 1.1 0.5 0 0 0
Dr 0 0 0
At SMD N 00888000
Ne 16 "/ASDQ2/-3VRet"
Po -2.25 0
$EndPAD
$PAD
Sh "50" R 1.1 0.5 0 0 0
Dr 0 0 0
At SMD N 00888000
Ne 15 "/ASDQ2/-3V"
Po 2.25 0
$EndPAD
$PAD
Sh "51" R 1.1 0.5 0 0 0
Dr 0 0 0
At SMD N 00888000
Ne 24 "/ASDQ3/-3VRet"
Po -2.25 0.8
$EndPAD
$PAD
Sh "52" R 1.1 0.5 0 0 0
Dr 0 0 0
At SMD N 00888000
Ne 23 "/ASDQ3/-3V"
Po 2.25 0.8
$EndPAD
$PAD
Sh "53" R 1.1 0.5 0 0 0
Dr 0 0 0
At SMD N 00888000
Ne 32 "/ASDQ4/-3VRet"
Po -2.25 1.6
$EndPAD
$PAD
Sh "54" R 1.1 0.5 0 0 0
Dr 0 0 0
At SMD N 00888000
Ne 31 "/ASDQ4/-3V"
Po 2.25 1.6
$EndPAD
$PAD
Sh "55" R 1.1 0.5 0 0 0
Dr 0 0 0
At SMD N 00888000
Ne 4 "/ASDQ1/+3VRet"
Po -2.25 2.4
$EndPAD
$PAD
Sh "56" R 1.1 0.5 0 0 0
Dr 0 0 0
At SMD N 00888000
Ne 3 "/ASDQ1/+3V"
Po 2.25 2.4
$EndPAD
$PAD
Sh "57" R 1.1 0.5 0 0 0
Dr 0 0 0
At SMD N 00888000
Ne 14 "/ASDQ2/+3VRet"
Po -2.25 3.2
$EndPAD
$PAD
Sh "58" R 1.1 0.5 0 0 0
Dr 0 0 0
At SMD N 00888000
Ne 13 "/ASDQ2/+3V"
Po 2.25 3.2
$EndPAD
$PAD
Sh "59" R 1.1 0.5 0 0 0
Dr 0 0 0
At SMD N 00888000
Ne 22 "/ASDQ3/+3VRet"
Po -2.25 4
$EndPAD
$PAD
Sh "60" R 1.1 0.5 0 0 0
Dr 0 0 0
At SMD N 00888000
Ne 21 "/ASDQ3/+3V"
Po 2.25 4
$EndPAD
$PAD
Sh "61" R 1.1 0.5 0 0 0
Dr 0 0 0
At SMD N 00888000
Ne 30 "/ASDQ4/+3VRet"
Po -2.25 4.8
$EndPAD
$PAD
Sh "62" R 1.1 0.5 0 0 0
Dr 0 0 0
At SMD N 00888000
Ne 29 "/ASDQ4/+3V"
Po 2.25 4.8
$EndPAD
$PAD
Sh "63" R 1.1 0.5 0 0 0
Dr 0 0 0
At SMD N 00888000
Ne 12 "/ASDQ1/Vref_gnd"
Po -2.25 5.6
$EndPAD
$PAD
Sh "64" R 1.1 0.5 0 0 0
Dr 0 0 0
At SMD N 00888000
Ne 12 "/ASDQ1/Vref_gnd"
Po 2.25 5.6
$EndPAD
$PAD
Sh "65" R 1.1 0.5 0 0 0
Dr 0 0 0
At SMD N 00888000
Ne 52 "/LogicBoard/ASDQ4_TP1_1"
Po -2.25 6.4
$EndPAD
$PAD
Sh "66" R 1.1 0.5 0 0 0
Dr 0 0 0
At SMD N 00888000
Ne 44 "/LogicBoard/ASDQ2_TP1_1"
Po 2.25 6.4
$EndPAD
$PAD
Sh "67" R 1.1 0.5 0 0 0
Dr 0 0 0
At SMD N 00888000
Ne 51 "/LogicBoard/ASDQ4_TP1_0"
Po -2.25 7.2
$EndPAD
$PAD
Sh "68" R 1.1 0.5 0 0 0
Dr 0 0 0
At SMD N 00888000
Ne 43 "/LogicBoard/ASDQ2_TP1_0"
Po 2.25 7.2
$EndPAD
$PAD
Sh "69" R 1.1 0.5 0 0 0
Dr 0 0 0
At SMD N 00888000
Ne 54 "/LogicBoard/ASDQ4_TP2_1"
Po -2.25 8
$EndPAD
$PAD
Sh "70" R 1.1 0.5 0 0 0
Dr 0 0 0
At SMD N 00888000
Ne 46 "/LogicBoard/ASDQ2_TP2_1"
Po 2.25 8
$EndPAD
$PAD
Sh "71" R 1.1 0.5 0 0 0
Dr 0 0 0
At SMD N 00888000
Ne 53 "/LogicBoard/ASDQ4_TP2_0"
Po -2.25 8.8
$EndPAD
$PAD
Sh "72" R 1.1 0.5 0 0 0
Dr 0 0 0
At SMD N 00888000
Ne 45 "/LogicBoard/ASDQ2_TP2_0"
Po 2.25 8.8
$EndPAD
$PAD
Sh "73" R 1.1 0.5 0 0 0
Dr 0 0 0
At SMD N 00888000
Ne 48 "/LogicBoard/ASDQ3_TP1_1"
Po -2.25 9.6
$EndPAD
$PAD
Sh "74" R 1.1 0.5 0 0 0
Dr 0 0 0
At SMD N 00888000
Ne 40 "/LogicBoard/ASDQ1_TP1_1"
Po 2.25 9.6
$EndPAD
$PAD
Sh "75" R 1.1 0.5 0 0 0
Dr 0 0 0
At SMD N 00888000
Ne 47 "/LogicBoard/ASDQ3_TP1_0"
Po -2.25 10.4
$EndPAD
$PAD
Sh "76" R 1.1 0.5 0 0 0
Dr 0 0 0
At SMD N 00888000
Ne 39 "/LogicBoard/ASDQ1_TP1_0"
Po 2.25 10.4
$EndPAD
$PAD
Sh "77" R 1.1 0.5 0 0 0
Dr 0 0 0
At SMD N 00888000
Ne 50 "/LogicBoard/ASDQ3_TP2_1"
Po -2.25 11.2
$EndPAD
$PAD
Sh "78" R 1.1 0.5 0 0 0
Dr 0 0 0
At SMD N 00888000
Ne 42 "/LogicBoard/ASDQ1_TP2_1"
Po 2.25 11.2
$EndPAD
$PAD
Sh "79" R 1.1 0.5 0 0 0
Dr 0 0 0
At SMD N 00888000
Ne 49 "/LogicBoard/ASDQ3_TP2_0"
Po -2.25 12
$EndPAD
$PAD
Sh "80" R 1.1 0.5 0 0 0
Dr 0 0 0
At SMD N 00888000
Ne 41 "/LogicBoard/ASDQ1_TP2_0"
Po 2.25 12
$EndPAD
$PAD
Sh "81" R 1.1 0.5 0 0 0
Dr 0 0 0
At SMD N 00888000
Ne 12 "/ASDQ1/Vref_gnd"
Po -2.25 12.8
$EndPAD
$PAD
Sh "82" R 1.1 0.5 0 0 0
Dr 0 0 0
At SMD N 00888000
Ne 12 "/ASDQ1/Vref_gnd"
Po 2.25 12.8
$EndPAD
$PAD
Sh "83" R 1.1 0.5 0 0 0
Dr 0 0 0
At SMD N 00888000
Ne 2 "/ASDQ1/+1.4VRet"
Po -2.25 13.6
$EndPAD
$PAD
Sh "84" R 1.1 0.5 0 0 0
Dr 0 0 0
At SMD N 00888000
Ne 1 "/ASDQ1/+1.4V"
Po 2.25 13.6
$EndPAD
$PAD
Sh "85" R 1.1 0.5 0 0 0
Dr 0 0 0
At SMD N 00888000
Ne 2 "/ASDQ1/+1.4VRet"
Po -2.25 14.4
$EndPAD
$PAD
Sh "86" R 1.1 0.5 0 0 0
Dr 0 0 0
At SMD N 00888000
Ne 1 "/ASDQ1/+1.4V"
Po 2.25 14.4
$EndPAD
$PAD
Sh "87" R 1.1 0.5 0 0 0
Dr 0 0 0
At SMD N 00888000
Ne 2 "/ASDQ1/+1.4VRet"
Po -2.25 15.2
$EndPAD
$PAD
Sh "88" R 1.1 0.5 0 0 0
Dr 0 0 0
At SMD N 00888000
Ne 1 "/ASDQ1/+1.4V"
Po 2.25 15.2
$EndPAD
$PAD
Sh "89" R 1.1 0.5 0 0 0
Dr 0 0 0
At SMD N 00888000
Ne 2 "/ASDQ1/+1.4VRet"
Po -2.25 16
$EndPAD
$PAD
Sh "90" R 1.1 0.5 0 0 0
Dr 0 0 0
At SMD N 00888000
Ne 1 "/ASDQ1/+1.4V"
Po 2.25 16
$EndPAD
$PAD
Sh "91" R 1.1 0.5 0 0 0
Dr 0 0 0
At SMD N 00888000
Ne 38 "/LogicBoard/+4VRet"
Po -2.25 16.8
$EndPAD
$PAD
Sh "92" R 1.1 0.5 0 0 0
Dr 0 0 0
At SMD N 00888000
Ne 37 "/LogicBoard/+4V"
Po 2.25 16.8
$EndPAD
$PAD
Sh "93" R 1.1 0.5 0 0 0
Dr 0 0 0
At SMD N 00888000
Ne 38 "/LogicBoard/+4VRet"
Po -2.25 17.6
$EndPAD
$PAD
Sh "94" R 1.1 0.5 0 0 0
Dr 0 0 0
At SMD N 00888000
Ne 37 "/LogicBoard/+4V"
Po 2.25 17.6
$EndPAD
$PAD
Sh "95" R 1.1 0.5 0 0 0
Dr 0 0 0
At SMD N 00888000
Ne 38 "/LogicBoard/+4VRet"
Po -2.25 18.4
$EndPAD
$PAD
Sh "96" R 1.1 0.5 0 0 0
Dr 0 0 0
At SMD N 00888000
Ne 37 "/LogicBoard/+4V"
Po 2.25 18.4
$EndPAD
$PAD
Sh "97" R 1.1 0.5 0 0 0
Dr 0 0 0
At SMD N 00888000
Ne 38 "/LogicBoard/+4VRet"
Po -2.25 19.2
$EndPAD
$PAD
Sh "98" R 1.1 0.5 0 0 0
Dr 0 0 0
At SMD N 00888000
Ne 37 "/LogicBoard/+4V"
Po 2.25 19.2
$EndPAD
$PAD
Sh "99" R 1.1 0.5 0 0 0
Dr 0 0 0
At SMD N 00888000
Ne 38 "/LogicBoard/+4VRet"
Po -2.25 20
$EndPAD
$PAD
Sh "100" R 1.1 0.5 0 0 0
Dr 0 0 0
At SMD N 00888000
Ne 37 "/LogicBoard/+4V"
Po 2.25 20
$EndPAD
$PAD
Sh "" C 1.45 1.45 0 0 0
Dr 1.45 0 0
At HOLE N 00E0FFFF
Ne 0 ""
Po 1.5 -21
$EndPAD
$PAD
Sh "" C 1.45 1.45 0 0 0
Dr 1.45 0 0
At HOLE N 00E0FFFF
Ne 0 ""
Po 1.5 21.8
$EndPAD
$EndMODULE ERF8-050-05.0-S-DV-K-TR
$MODULE ERF8-050-05.0-S-DV-K-TR-RevB
Po 0 0 0 15 54AAD3F0 00000000 ~~
Li ERF8-050-05.0-S-DV-K-TR-RevB
Sc 0
AR /542AF429/545BE30C
Op 0 0 0
T0 0 -27 1 1 0 0.15 N V 21 N "J8"
T1 0 24.8 1 1 0 0.15 N I 21 N "ERF8-050-05.0-S-DV-K-TR"
DC 0 0.4 0.4 0.8 0.15 21
DC 0 0.4 0.6 1 0.15 21
DS 2.2 -22.6 -1.4 -22.6 0.15 21
DS -1.4 -22.6 -2.8 -21.2 0.15 21
DS -2.8 -21.2 -2.8 -19.8 0.15 21
DS 2.2 -22.6 2.8 -22.6 0.15 21
DS 2.8 -22.6 2.8 -19.8 0.15 21
DS 2.2 23.4 -2.8 23.4 0.15 21
DS -2.8 23.4 -2.8 20.6 0.15 21
DS 2.2 23.4 2.8 23.4 0.15 21
DS 2.8 23.4 2.8 20.6 0.15 21
T2 3.75 20.05 0.4 0.4 0 0.1 N V 21 N "100"
T2 -3.75 20.1 0.4 0.4 0 0.1 N V 21 N "99"
T2 3.75 -19.25 0.5 0.5 0 0.125 N V 21 N "2"
T2 -3.75 -19.25 0.5 0.5 0 0.125 N V 21 N "1"
$PAD
Sh "2" R 1.1 0.5 0 0 0
Dr 0 0 0
At SMD N 00888000
Ne 66 "/LogicBoard/TDC1_C5_1"
Po 2.25 -19.2
$EndPAD
$PAD
Sh "1" R 1.1 0.5 0 0 0
Dr 0 0 0
At SMD N 00888000
Ne 78 "/TDC_MB2/TDC1_C5_1"
Po -2.25 -19.2
$EndPAD
$PAD
Sh "3" R 1.1 0.5 0 0 0
Dr 0 0 0
At SMD N 00888000
Ne 77 "/TDC_MB2/TDC1_C5_0"
Po -2.25 -18.4
$EndPAD
$PAD
Sh "4" R 1.1 0.5 0 0 0
Dr 0 0 0
At SMD N 00888000
Ne 65 "/LogicBoard/TDC1_C5_0"
Po 2.25 -18.4
$EndPAD
$PAD
Sh "5" R 1.1 0.5 0 0 0
Dr 0 0 0
At SMD N 00888000
Ne 82 "/TDC_MB2/TDC2_C5_1"
Po -2.25 -17.6
$EndPAD
$PAD
Sh "6" R 1.1 0.5 0 0 0
Dr 0 0 0
At SMD N 00888000
Ne 70 "/LogicBoard/TDC2_C5_1"
Po 2.25 -17.6
$EndPAD
$PAD
Sh "7" R 1.1 0.5 0 0 0
Dr 0 0 0
At SMD N 00888000
Ne 81 "/TDC_MB2/TDC2_C5_0"
Po -2.25 -16.8
$EndPAD
$PAD
Sh "8" R 1.1 0.5 0 0 0
Dr 0 0 0
At SMD N 00888000
Ne 69 "/LogicBoard/TDC2_C5_0"
Po 2.25 -16.8
$EndPAD
$PAD
Sh "9" R 1.1 0.5 0 0 0
Dr 0 0 0
At SMD N 00888000
Ne 28 "/ASDQ3/VRef3"
Po -2.25 -16
$EndPAD
$PAD
Sh "10" R 1.1 0.5 0 0 0
Dr 0 0 0
At SMD N 00888000
Ne 11 "/ASDQ1/VRef3"
Po 2.25 -16
$EndPAD
$PAD
Sh "11" R 1.1 0.5 0 0 0
Dr 0 0 0
At SMD N 00888000
Ne 27 "/ASDQ3/VRef2"
Po -2.25 -15.2
$EndPAD
$PAD
Sh "12" R 1.1 0.5 0 0 0
Dr 0 0 0
At SMD N 00888000
Ne 10 "/ASDQ1/VRef2"
Po 2.25 -15.2
$EndPAD
$PAD
Sh "13" R 1.1 0.5 0 0 0
Dr 0 0 0
At SMD N 00888000
Ne 26 "/ASDQ3/VRef1"
Po -2.25 -14.4
$EndPAD
$PAD
Sh "14" R 1.1 0.5 0 0 0
Dr 0 0 0
At SMD N 00888000
Ne 9 "/ASDQ1/VRef1"
Po 2.25 -14.4
$EndPAD
$PAD
Sh "15" R 1.1 0.5 0 0 0
Dr 0 0 0
At SMD N 00888000
Ne 25 "/ASDQ3/VRef0"
Po -2.25 -13.6
$EndPAD
$PAD
Sh "16" R 1.1 0.5 0 0 0
Dr 0 0 0
At SMD N 00888000
Ne 8 "/ASDQ1/VRef0"
Po 2.25 -13.6
$EndPAD
$PAD
Sh "17" R 1.1 0.5 0 0 0
Dr 0 0 0
At SMD N 00888000
Ne 36 "/ASDQ4/VRef3"
Po -2.25 -12.8
$EndPAD
$PAD
Sh "18" R 1.1 0.5 0 0 0
Dr 0 0 0
At SMD N 00888000
Ne 20 "/ASDQ2/VRef3"
Po 2.25 -12.8
$EndPAD
$PAD
Sh "19" R 1.1 0.5 0 0 0
Dr 0 0 0
At SMD N 00888000
Ne 35 "/ASDQ4/VRef2"
Po -2.25 -12
$EndPAD
$PAD
Sh "20" R 1.1 0.5 0 0 0
Dr 0 0 0
At SMD N 00888000
Ne 19 "/ASDQ2/VRef2"
Po 2.25 -12
$EndPAD
$PAD
Sh "21" R 1.1 0.5 0 0 0
Dr 0 0 0
At SMD N 00888000
Ne 34 "/ASDQ4/VRef1"
Po -2.25 -11.2
$EndPAD
$PAD
Sh "22" R 1.1 0.5 0 0 0
Dr 0 0 0
At SMD N 00888000
Ne 18 "/ASDQ2/VRef1"
Po 2.25 -11.2
$EndPAD
$PAD
Sh "23" R 1.1 0.5 0 0 0
Dr 0 0 0
At SMD N 00888000
Ne 33 "/ASDQ4/VRef0"
Po -2.25 -10.4
$EndPAD
$PAD
Sh "24" R 1.1 0.5 0 0 0
Dr 0 0 0
At SMD N 00888000
Ne 17 "/ASDQ2/VRef0"
Po 2.25 -10.4
$EndPAD
$PAD
Sh "25" R 1.1 0.5 0 0 0
Dr 0 0 0
At SMD N 00888000
Ne 71 "/LogicBoard/TDCA_En"
Po -2.25 -9.6
$EndPAD
$PAD
Sh "26" R 1.1 0.5 0 0 0
Dr 0 0 0
At SMD N 00888000
Ne 72 "/LogicBoard/TDCB_En"
Po 2.25 -9.6
$EndPAD
$PAD
Sh "27" R 1.1 0.5 0 0 0
Dr 0 0 0
At SMD N 00888000
Ne 7 "/ASDQ1/TEMP"
Po -2.25 -8.8
$EndPAD
$PAD
Sh "28" R 1.1 0.5 0 0 0
Dr 0 0 0
At SMD N 00888000
Ne 12 "/ASDQ1/Vref_gnd"
Po 2.25 -8.8
$EndPAD
$PAD
Sh "29" R 1.1 0.5 0 0 0
Dr 0 0 0
At SMD N 00888000
Ne 73 "/LogicBoard/TEMP_1"
Po -2.25 -8
$EndPAD
$PAD
Sh "30" R 1.1 0.5 0 0 0
Dr 0 0 0
At SMD N 00888000
Ne 74 "/LogicBoard/TEMP_RET_1"
Po 2.25 -8
$EndPAD
$PAD
Sh "31" R 1.1 0.5 0 0 0
Dr 0 0 0
At SMD N 00888000
Ne 76 "/TDC_MB2/TDC1_8b10b_1"
Po -2.25 -7.2
$EndPAD
$PAD
Sh "32" R 1.1 0.5 0 0 0
Dr 0 0 0
At SMD N 00888000
Ne 64 "/LogicBoard/TDC1_8B10B_1"
Po 2.25 -7.2
$EndPAD
$PAD
Sh "33" R 1.1 0.5 0 0 0
Dr 0 0 0
At SMD N 00888000
Ne 75 "/TDC_MB2/TDC1_8b10b_0"
Po -2.25 -6.4
$EndPAD
$PAD
Sh "34" R 1.1 0.5 0 0 0
Dr 0 0 0
At SMD N 00888000
Ne 63 "/LogicBoard/TDC1_8B10B_0"
Po 2.25 -6.4
$EndPAD
$PAD
Sh "35" R 1.1 0.5 0 0 0
Dr 0 0 0
At SMD N 00888000
Ne 80 "/TDC_MB2/TDC2_8b10b_1"
Po -2.25 -5.6
$EndPAD
$PAD
Sh "36" R 1.1 0.5 0 0 0
Dr 0 0 0
At SMD N 00888000
Ne 68 "/LogicBoard/TDC2_8B10B_1"
Po 2.25 -5.6
$EndPAD
$PAD
Sh "37" R 1.1 0.5 0 0 0
Dr 0 0 0
At SMD N 00888000
Ne 79 "/TDC_MB2/TDC2_8b10b_0"
Po -2.25 -4.8
$EndPAD
$PAD
Sh "38" R 1.1 0.5 0 0 0
Dr 0 0 0
At SMD N 00888000
Ne 67 "/LogicBoard/TDC2_8B10B_0"
Po 2.25 -4.8
$EndPAD
$PAD
Sh "39" R 1.1 0.5 0 0 0
Dr 0 0 0
At SMD N 00888000
Ne 59 "/LogicBoard/JTAG2_TCK"
Po -2.25 -4
$EndPAD
$PAD
Sh "40" R 1.1 0.5 0 0 0
Dr 0 0 0
At SMD N 00888000
Ne 55 "/LogicBoard/JTAG1_TCK"
Po 2.25 -4
$EndPAD
$PAD
Sh "41" R 1.1 0.5 0 0 0
Dr 0 0 0
At SMD N 00888000
Ne 60 "/LogicBoard/JTAG2_TDI"
Po -2.25 -3.2
$EndPAD
$PAD
Sh "42" R 1.1 0.5 0 0 0
Dr 0 0 0
At SMD N 00888000
Ne 56 "/LogicBoard/JTAG1_TDI"
Po 2.25 -3.2
$EndPAD
$PAD
Sh "43" R 1.1 0.5 0 0 0
Dr 0 0 0
At SMD N 00888000
Ne 61 "/LogicBoard/JTAG2_TDO"
Po -2.25 -2.4
$EndPAD
$PAD
Sh "44" R 1.1 0.5 0 0 0
Dr 0 0 0
At SMD N 00888000
Ne 57 "/LogicBoard/JTAG1_TDO"
Po 2.25 -2.4
$EndPAD
$PAD
Sh "45" R 1.1 0.5 0 0 0
Dr 0 0 0
At SMD N 00888000
Ne 62 "/LogicBoard/JTAG2_TMS"
Po -2.25 -1.6
$EndPAD
$PAD
Sh "46" R 1.1 0.5 0 0 0
Dr 0 0 0
At SMD N 00888000
Ne 58 "/LogicBoard/JTAG1_TMS"
Po 2.25 -1.6
$EndPAD
$PAD
Sh "47" R 1.1 0.5 0 0 0
Dr 0 0 0
At SMD N 00888000
Ne 6 "/ASDQ1/-3VRet"
Po -2.25 -0.8
$EndPAD
$PAD
Sh "48" R 1.1 0.5 0 0 0
Dr 0 0 0
At SMD N 00888000
Ne 5 "/ASDQ1/-3V"
Po 2.25 -0.8
$EndPAD
$PAD
Sh "49" R 1.1 0.5 0 0 0
Dr 0 0 0
At SMD N 00888000
Ne 16 "/ASDQ2/-3VRet"
Po -2.25 0
$EndPAD
$PAD
Sh "50" R 1.1 0.5 0 0 0
Dr 0 0 0
At SMD N 00888000
Ne 15 "/ASDQ2/-3V"
Po 2.25 0
$EndPAD
$PAD
Sh "51" R 1.1 0.5 0 0 0
Dr 0 0 0
At SMD N 00888000
Ne 24 "/ASDQ3/-3VRet"
Po -2.25 0.8
$EndPAD
$PAD
Sh "52" R 1.1 0.5 0 0 0
Dr 0 0 0
At SMD N 00888000
Ne 23 "/ASDQ3/-3V"
Po 2.25 0.8
$EndPAD
$PAD
Sh "53" R 1.1 0.5 0 0 0
Dr 0 0 0
At SMD N 00888000
Ne 32 "/ASDQ4/-3VRet"
Po -2.25 1.6
$EndPAD
$PAD
Sh "54" R 1.1 0.5 0 0 0
Dr 0 0 0
At SMD N 00888000
Ne 31 "/ASDQ4/-3V"
Po 2.25 1.6
$EndPAD
$PAD
Sh "55" R 1.1 0.5 0 0 0
Dr 0 0 0
At SMD N 00888000
Ne 4 "/ASDQ1/+3VRet"
Po -2.25 2.4
$EndPAD
$PAD
Sh "56" R 1.1 0.5 0 0 0
Dr 0 0 0
At SMD N 00888000
Ne 3 "/ASDQ1/+3V"
Po 2.25 2.4
$EndPAD
$PAD
Sh "57" R 1.1 0.5 0 0 0
Dr 0 0 0
At SMD N 00888000
Ne 14 "/ASDQ2/+3VRet"
Po -2.25 3.2
$EndPAD
$PAD
Sh "58" R 1.1 0.5 0 0 0
Dr 0 0 0
At SMD N 00888000
Ne 13 "/ASDQ2/+3V"
Po 2.25 3.2
$EndPAD
$PAD
Sh "59" R 1.1 0.5 0 0 0
Dr 0 0 0
At SMD N 00888000
Ne 22 "/ASDQ3/+3VRet"
Po -2.25 4
$EndPAD
$PAD
Sh "60" R 1.1 0.5 0 0 0
Dr 0 0 0
At SMD N 00888000
Ne 21 "/ASDQ3/+3V"
Po 2.25 4
$EndPAD
$PAD
Sh "61" R 1.1 0.5 0 0 0
Dr 0 0 0
At SMD N 00888000
Ne 30 "/ASDQ4/+3VRet"
Po -2.25 4.8
$EndPAD
$PAD
Sh "62" R 1.1 0.5 0 0 0
Dr 0 0 0
At SMD N 00888000
Ne 29 "/ASDQ4/+3V"
Po 2.25 4.8
$EndPAD
$PAD
Sh "63" R 1.1 0.5 0 0 0
Dr 0 0 0
At SMD N 00888000
Ne 12 "/ASDQ1/Vref_gnd"
Po -2.25 5.6
$EndPAD
$PAD
Sh "64" R 1.1 0.5 0 0 0
Dr 0 0 0
At SMD N 00888000
Ne 12 "/ASDQ1/Vref_gnd"
Po 2.25 5.6
$EndPAD
$PAD
Sh "65" R 1.1 0.5 0 0 0
Dr 0 0 0
At SMD N 00888000
Ne 52 "/LogicBoard/ASDQ4_TP1_1"
Po -2.25 6.4
$EndPAD
$PAD
Sh "66" R 1.1 0.5 0 0 0
Dr 0 0 0
At SMD N 00888000
Ne 44 "/LogicBoard/ASDQ2_TP1_1"
Po 2.25 6.4
$EndPAD
$PAD
Sh "67" R 1.1 0.5 0 0 0
Dr 0 0 0
At SMD N 00888000
Ne 51 "/LogicBoard/ASDQ4_TP1_0"
Po -2.25 7.2
$EndPAD
$PAD
Sh "68" R 1.1 0.5 0 0 0
Dr 0 0 0
At SMD N 00888000
Ne 43 "/LogicBoard/ASDQ2_TP1_0"
Po 2.25 7.2
$EndPAD
$PAD
Sh "69" R 1.1 0.5 0 0 0
Dr 0 0 0
At SMD N 00888000
Ne 54 "/LogicBoard/ASDQ4_TP2_1"
Po -2.25 8
$EndPAD
$PAD
Sh "70" R 1.1 0.5 0 0 0
Dr 0 0 0
At SMD N 00888000
Ne 46 "/LogicBoard/ASDQ2_TP2_1"
Po 2.25 8
$EndPAD
$PAD
Sh "71" R 1.1 0.5 0 0 0
Dr 0 0 0
At SMD N 00888000
Ne 53 "/LogicBoard/ASDQ4_TP2_0"
Po -2.25 8.8
$EndPAD
$PAD
Sh "72" R 1.1 0.5 0 0 0
Dr 0 0 0
At SMD N 00888000
Ne 45 "/LogicBoard/ASDQ2_TP2_0"
Po 2.25 8.8
$EndPAD
$PAD
Sh "73" R 1.1 0.5 0 0 0
Dr 0 0 0
At SMD N 00888000
Ne 48 "/LogicBoard/ASDQ3_TP1_1"
Po -2.25 9.6
$EndPAD
$PAD
Sh "74" R 1.1 0.5 0 0 0
Dr 0 0 0
At SMD N 00888000
Ne 40 "/LogicBoard/ASDQ1_TP1_1"
Po 2.25 9.6
$EndPAD
$PAD
Sh "75" R 1.1 0.5 0 0 0
Dr 0 0 0
At SMD N 00888000
Ne 47 "/LogicBoard/ASDQ3_TP1_0"
Po -2.25 10.4
$EndPAD
$PAD
Sh "76" R 1.1 0.5 0 0 0
Dr 0 0 0
At SMD N 00888000
Ne 39 "/LogicBoard/ASDQ1_TP1_0"
Po 2.25 10.4
$EndPAD
$PAD
Sh "77" R 1.1 0.5 0 0 0
Dr 0 0 0
At SMD N 00888000
Ne 50 "/LogicBoard/ASDQ3_TP2_1"
Po -2.25 11.2
$EndPAD
$PAD
Sh "78" R 1.1 0.5 0 0 0
Dr 0 0 0
At SMD N 00888000
Ne 42 "/LogicBoard/ASDQ1_TP2_1"
Po 2.25 11.2
$EndPAD
$PAD
Sh "79" R 1.1 0.5 0 0 0
Dr 0 0 0
At SMD N 00888000
Ne 49 "/LogicBoard/ASDQ3_TP2_0"
Po -2.25 12
$EndPAD
$PAD
Sh "80" R 1.1 0.5 0 0 0
Dr 0 0 0
At SMD N 00888000
Ne 41 "/LogicBoard/ASDQ1_TP2_0"
Po 2.25 12
$EndPAD
$PAD
Sh "81" R 1.1 0.5 0 0 0
Dr 0 0 0
At SMD N 00888000
Ne 12 "/ASDQ1/Vref_gnd"
Po -2.25 12.8
$EndPAD
$PAD
Sh "82" R 1.1 0.5 0 0 0
Dr 0 0 0
At SMD N 00888000
Ne 12 "/ASDQ1/Vref_gnd"
Po 2.25 12.8
$EndPAD
$PAD
Sh "83" R 1.1 0.5 0 0 0
Dr 0 0 0
At SMD N 00888000
Ne 2 "/ASDQ1/+1.4VRet"
Po -2.25 13.6
$EndPAD
$PAD
Sh "84" R 1.1 0.5 0 0 0
Dr 0 0 0
At SMD N 00888000
Ne 1 "/ASDQ1/+1.4V"
Po 2.25 13.6
$EndPAD
$PAD
Sh "85" R 1.1 0.5 0 0 0
Dr 0 0 0
At SMD N 00888000
Ne 2 "/ASDQ1/+1.4VRet"
Po -2.25 14.4
$EndPAD
$PAD
Sh "86" R 1.1 0.5 0 0 0
Dr 0 0 0
At SMD N 00888000
Ne 1 "/ASDQ1/+1.4V"
Po 2.25 14.4
$EndPAD
$PAD
Sh "87" R 1.1 0.5 0 0 0
Dr 0 0 0
At SMD N 00888000
Ne 2 "/ASDQ1/+1.4VRet"
Po -2.25 15.2
$EndPAD
$PAD
Sh "88" R 1.1 0.5 0 0 0
Dr 0 0 0
At SMD N 00888000
Ne 1 "/ASDQ1/+1.4V"
Po 2.25 15.2
$EndPAD
$PAD
Sh "89" R 1.1 0.5 0 0 0
Dr 0 0 0
At SMD N 00888000
Ne 2 "/ASDQ1/+1.4VRet"
Po -2.25 16
$EndPAD
$PAD
Sh "90" R 1.1 0.5 0 0 0
Dr 0 0 0
At SMD N 00888000
Ne 1 "/ASDQ1/+1.4V"
Po 2.25 16
$EndPAD
$PAD
Sh "91" R 1.1 0.5 0 0 0
Dr 0 0 0
At SMD N 00888000
Ne 38 "/LogicBoard/+4VRet"
Po -2.25 16.8
$EndPAD
$PAD
Sh "92" R 1.1 0.5 0 0 0
Dr 0 0 0
At SMD N 00888000
Ne 37 "/LogicBoard/+4V"
Po 2.25 16.8
$EndPAD
$PAD
Sh "93" R 1.1 0.5 0 0 0
Dr 0 0 0
At SMD N 00888000
Ne 38 "/LogicBoard/+4VRet"
Po -2.25 17.6
$EndPAD
$PAD
Sh "94" R 1.1 0.5 0 0 0
Dr 0 0 0
At SMD N 00888000
Ne 37 "/LogicBoard/+4V"
Po 2.25 17.6
$EndPAD
$PAD
Sh "95" R 1.1 0.5 0 0 0
Dr 0 0 0
At SMD N 00888000
Ne 38 "/LogicBoard/+4VRet"
Po -2.25 18.4
$EndPAD
$PAD
Sh "96" R 1.1 0.5 0 0 0
Dr 0 0 0
At SMD N 00888000
Ne 37 "/LogicBoard/+4V"
Po 2.25 18.4
$EndPAD
$PAD
Sh "97" R 1.1 0.5 0 0 0
Dr 0 0 0
At SMD N 00888000
Ne 38 "/LogicBoard/+4VRet"
Po -2.25 19.2
$EndPAD
$PAD
Sh "98" R 1.1 0.5 0 0 0
Dr 0 0 0
At SMD N 00888000
Ne 37 "/LogicBoard/+4V"
Po 2.25 19.2
$EndPAD
$PAD
Sh "99" R 1.1 0.5 0 0 0
Dr 0 0 0
At SMD N 00888000
Ne 38 "/LogicBoard/+4VRet"
Po -2.25 20
$EndPAD
$PAD
Sh "100" R 1.1 0.5 0 0 0
Dr 0 0 0
At SMD N 00888000
Ne 37 "/LogicBoard/+4V"
Po 2.25 20
$EndPAD
$PAD
Sh "" C 1.45 1.45 0 0 0
Dr 1.45 0 0
At HOLE N 00E0FFFF
Ne 0 ""
Po 1.5 -21
$EndPAD
$PAD
Sh "" C 1.45 1.45 0 0 0
Dr 1.45 0 0
At HOLE N 00E0FFFF
Ne 0 ""
Po 1.5 21.8
$EndPAD
$EndMODULE ERF8-050-05.0-S-DV-K-TR-RevB
$EndLIBRARY
