PCBNEW-LibModule-V1  Mon 05 Jan 2015 03:28:52 PM EST
# encoding utf-8
Units mm
$INDEX
FH40-64S-0.5SV
FH40-64S-0.5SV_RevB
$EndINDEX
$MODULE FH40-64S-0.5SV
Po 0 0 0 15 546F9853 00000000 ~~
Li FH40-64S-0.5SV
Sc 0
AR 
Op 0 0 0
T0 0 -20 1 1 0 0.15 N V 21 N "FH40-64S-0.5SV"
T1 0 19.5 1 1 0 0.15 N V 21 N "VAL**"
DS -2.1 17.7 -2.1 17.4 0.15 21
DS 2.1 16.6 2.1 16.3 0.15 21
DS 2.5 -15.7 3.5 -14.7 0.15 21
DS 3.5 -14.7 3.5 14.8 0.15 21
DS 3.5 14.8 2.5 15.8 0.15 21
T2 -1.7 -17.2 0.8 0.8 0 0.15 N V 21 N "*"
T2 -3.1 -15.7 0.6 0.6 0 0.15 N V 21 N "1"
DS 0 -17.9 -2.1 -17.9 0.15 21
DS -2.1 -17.9 -2.1 -16.3 0.15 21
DS 0 -17.9 2.1 -17.9 0.15 21
DS 2.1 -17.9 2.1 -15.8 0.15 21
DS 0 17.7 -2.1 17.7 0.15 21
DS -2.1 17.45 -2.1 15.85 0.15 21
DS 0 17.7 2.1 17.7 0.15 21
DS 2.1 17.7 2.1 16.6 0.15 21
$PAD
Sh "1" R 1.3 0.45 0 0 0
Dr 0 0 0
At SMD N 00888000
Ne 0 ""
Po -1.525 -15.75
$EndPAD
$PAD
Sh "2" R 1.3 0.45 0 0 0
Dr 0 0 0
At SMD N 00888000
Ne 0 ""
Po 1.525 -15.25
$EndPAD
$PAD
Sh "3" R 1.3 0.45 0 0 0
Dr 0 0 0
At SMD N 00888000
Ne 0 ""
Po -1.525 -14.75
$EndPAD
$PAD
Sh "4" R 1.3 0.45 0 0 0
Dr 0 0 0
At SMD N 00888000
Ne 0 ""
Po 1.525 -14.25
$EndPAD
$PAD
Sh "5" R 1.3 0.45 0 0 0
Dr 0 0 0
At SMD N 00888000
Ne 0 ""
Po -1.525 -13.75
$EndPAD
$PAD
Sh "6" R 1.3 0.45 0 0 0
Dr 0 0 0
At SMD N 00888000
Ne 0 ""
Po 1.525 -13.25
$EndPAD
$PAD
Sh "7" R 1.3 0.45 0 0 0
Dr 0 0 0
At SMD N 00888000
Ne 0 ""
Po -1.525 -12.75
$EndPAD
$PAD
Sh "8" R 1.3 0.45 0 0 0
Dr 0 0 0
At SMD N 00888000
Ne 0 ""
Po 1.525 -12.25
$EndPAD
$PAD
Sh "9" R 1.3 0.45 0 0 0
Dr 0 0 0
At SMD N 00888000
Ne 0 ""
Po -1.525 -11.75
$EndPAD
$PAD
Sh "10" R 1.3 0.45 0 0 0
Dr 0 0 0
At SMD N 00888000
Ne 0 ""
Po 1.525 -11.25
$EndPAD
$PAD
Sh "11" R 1.3 0.45 0 0 0
Dr 0 0 0
At SMD N 00888000
Ne 0 ""
Po -1.525 -10.75
$EndPAD
$PAD
Sh "12" R 1.3 0.45 0 0 0
Dr 0 0 0
At SMD N 00888000
Ne 0 ""
Po 1.525 -10.25
$EndPAD
$PAD
Sh "13" R 1.3 0.45 0 0 0
Dr 0 0 0
At SMD N 00888000
Ne 0 ""
Po -1.525 -9.75
$EndPAD
$PAD
Sh "14" R 1.3 0.45 0 0 0
Dr 0 0 0
At SMD N 00888000
Ne 0 ""
Po 1.525 -9.25
$EndPAD
$PAD
Sh "15" R 1.3 0.45 0 0 0
Dr 0 0 0
At SMD N 00888000
Ne 0 ""
Po -1.525 -8.75
$EndPAD
$PAD
Sh "16" R 1.3 0.45 0 0 0
Dr 0 0 0
At SMD N 00888000
Ne 0 ""
Po 1.525 -8.25
$EndPAD
$PAD
Sh "17" R 1.3 0.45 0 0 0
Dr 0 0 0
At SMD N 00888000
Ne 0 ""
Po -1.525 -7.75
$EndPAD
$PAD
Sh "18" R 1.3 0.45 0 0 0
Dr 0 0 0
At SMD N 00888000
Ne 0 ""
Po 1.525 -7.25
$EndPAD
$PAD
Sh "19" R 1.3 0.45 0 0 0
Dr 0 0 0
At SMD N 00888000
Ne 0 ""
Po -1.525 -6.75
$EndPAD
$PAD
Sh "20" R 1.3 0.45 0 0 0
Dr 0 0 0
At SMD N 00888000
Ne 0 ""
Po 1.525 -6.25
$EndPAD
$PAD
Sh "21" R 1.3 0.45 0 0 0
Dr 0 0 0
At SMD N 00888000
Ne 0 ""
Po -1.525 -5.75
$EndPAD
$PAD
Sh "22" R 1.3 0.45 0 0 0
Dr 0 0 0
At SMD N 00888000
Ne 0 ""
Po 1.525 -5.25
$EndPAD
$PAD
Sh "23" R 1.3 0.45 0 0 0
Dr 0 0 0
At SMD N 00888000
Ne 0 ""
Po -1.525 -4.75
$EndPAD
$PAD
Sh "24" R 1.3 0.45 0 0 0
Dr 0 0 0
At SMD N 00888000
Ne 0 ""
Po 1.525 -4.25
$EndPAD
$PAD
Sh "25" R 1.3 0.45 0 0 0
Dr 0 0 0
At SMD N 00888000
Ne 0 ""
Po -1.525 -3.75
$EndPAD
$PAD
Sh "26" R 1.3 0.45 0 0 0
Dr 0 0 0
At SMD N 00888000
Ne 0 ""
Po 1.525 -3.25
$EndPAD
$PAD
Sh "27" R 1.3 0.45 0 0 0
Dr 0 0 0
At SMD N 00888000
Ne 0 ""
Po -1.525 -2.75
$EndPAD
$PAD
Sh "28" R 1.3 0.45 0 0 0
Dr 0 0 0
At SMD N 00888000
Ne 0 ""
Po 1.525 -2.25
$EndPAD
$PAD
Sh "29" R 1.3 0.45 0 0 0
Dr 0 0 0
At SMD N 00888000
Ne 0 ""
Po -1.525 -1.75
$EndPAD
$PAD
Sh "30" R 1.3 0.45 0 0 0
Dr 0 0 0
At SMD N 00888000
Ne 0 ""
Po 1.525 -1.25
$EndPAD
$PAD
Sh "31" R 1.3 0.45 0 0 0
Dr 0 0 0
At SMD N 00888000
Ne 0 ""
Po -1.525 -0.75
$EndPAD
$PAD
Sh "32" R 1.3 0.45 0 0 0
Dr 0 0 0
At SMD N 00888000
Ne 0 ""
Po 1.525 -0.25
$EndPAD
$PAD
Sh "33" R 1.3 0.45 0 0 0
Dr 0 0 0
At SMD N 00888000
Ne 0 ""
Po -1.525 0.25
$EndPAD
$PAD
Sh "34" R 1.3 0.45 0 0 0
Dr 0 0 0
At SMD N 00888000
Ne 0 ""
Po 1.525 0.75
$EndPAD
$PAD
Sh "35" R 1.3 0.45 0 0 0
Dr 0 0 0
At SMD N 00888000
Ne 0 ""
Po -1.525 1.25
$EndPAD
$PAD
Sh "36" R 1.3 0.45 0 0 0
Dr 0 0 0
At SMD N 00888000
Ne 0 ""
Po 1.525 1.75
$EndPAD
$PAD
Sh "37" R 1.3 0.45 0 0 0
Dr 0 0 0
At SMD N 00888000
Ne 0 ""
Po -1.525 2.25
$EndPAD
$PAD
Sh "38" R 1.3 0.45 0 0 0
Dr 0 0 0
At SMD N 00888000
Ne 0 ""
Po 1.525 2.75
$EndPAD
$PAD
Sh "39" R 1.3 0.45 0 0 0
Dr 0 0 0
At SMD N 00888000
Ne 0 ""
Po -1.525 3.25
$EndPAD
$PAD
Sh "40" R 1.3 0.45 0 0 0
Dr 0 0 0
At SMD N 00888000
Ne 0 ""
Po 1.525 3.75
$EndPAD
$PAD
Sh "41" R 1.3 0.45 0 0 0
Dr 0 0 0
At SMD N 00888000
Ne 0 ""
Po -1.525 4.25
$EndPAD
$PAD
Sh "42" R 1.3 0.45 0 0 0
Dr 0 0 0
At SMD N 00888000
Ne 0 ""
Po 1.525 4.75
$EndPAD
$PAD
Sh "43" R 1.3 0.45 0 0 0
Dr 0 0 0
At SMD N 00888000
Ne 0 ""
Po -1.525 5.25
$EndPAD
$PAD
Sh "44" R 1.3 0.45 0 0 0
Dr 0 0 0
At SMD N 00888000
Ne 0 ""
Po 1.525 5.75
$EndPAD
$PAD
Sh "45" R 1.3 0.45 0 0 0
Dr 0 0 0
At SMD N 00888000
Ne 0 ""
Po -1.525 6.25
$EndPAD
$PAD
Sh "46" R 1.3 0.45 0 0 0
Dr 0 0 0
At SMD N 00888000
Ne 0 ""
Po 1.525 6.75
$EndPAD
$PAD
Sh "47" R 1.3 0.45 0 0 0
Dr 0 0 0
At SMD N 00888000
Ne 0 ""
Po -1.525 7.25
$EndPAD
$PAD
Sh "48" R 1.3 0.45 0 0 0
Dr 0 0 0
At SMD N 00888000
Ne 0 ""
Po 1.525 7.75
$EndPAD
$PAD
Sh "49" R 1.3 0.45 0 0 0
Dr 0 0 0
At SMD N 00888000
Ne 0 ""
Po -1.525 8.25
$EndPAD
$PAD
Sh "50" R 1.3 0.45 0 0 0
Dr 0 0 0
At SMD N 00888000
Ne 0 ""
Po 1.525 8.75
$EndPAD
$PAD
Sh "51" R 1.3 0.45 0 0 0
Dr 0 0 0
At SMD N 00888000
Ne 0 ""
Po -1.525 9.25
$EndPAD
$PAD
Sh "52" R 1.3 0.45 0 0 0
Dr 0 0 0
At SMD N 00888000
Ne 0 ""
Po 1.525 9.75
$EndPAD
$PAD
Sh "53" R 1.3 0.45 0 0 0
Dr 0 0 0
At SMD N 00888000
Ne 0 ""
Po -1.525 10.25
$EndPAD
$PAD
Sh "54" R 1.3 0.45 0 0 0
Dr 0 0 0
At SMD N 00888000
Ne 0 ""
Po 1.525 10.75
$EndPAD
$PAD
Sh "55" R 1.3 0.45 0 0 0
Dr 0 0 0
At SMD N 00888000
Ne 0 ""
Po -1.525 11.25
$EndPAD
$PAD
Sh "56" R 1.3 0.45 0 0 0
Dr 0 0 0
At SMD N 00888000
Ne 0 ""
Po 1.525 11.75
$EndPAD
$PAD
Sh "57" R 1.3 0.45 0 0 0
Dr 0 0 0
At SMD N 00888000
Ne 0 ""
Po -1.525 12.25
$EndPAD
$PAD
Sh "58" R 1.3 0.45 0 0 0
Dr 0 0 0
At SMD N 00888000
Ne 0 ""
Po 1.525 12.75
$EndPAD
$PAD
Sh "59" R 1.3 0.45 0 0 0
Dr 0 0 0
At SMD N 00888000
Ne 0 ""
Po -1.525 13.25
$EndPAD
$PAD
Sh "60" R 1.3 0.45 0 0 0
Dr 0 0 0
At SMD N 00888000
Ne 0 ""
Po 1.525 13.75
$EndPAD
$PAD
Sh "61" R 1.3 0.45 0 0 0
Dr 0 0 0
At SMD N 00888000
Ne 0 ""
Po -1.525 14.25
$EndPAD
$PAD
Sh "62" R 1.3 0.45 0 0 0
Dr 0 0 0
At SMD N 00888000
Ne 0 ""
Po 1.525 14.75
$EndPAD
$PAD
Sh "63" R 1.3 0.45 0 0 0
Dr 0 0 0
At SMD N 00888000
Ne 0 ""
Po -1.525 15.25
$EndPAD
$PAD
Sh "64" R 1.3 0.45 0 0 0
Dr 0 0 0
At SMD N 00888000
Ne 0 ""
Po 1.525 15.75
$EndPAD
$EndMODULE FH40-64S-0.5SV
$MODULE FH40-64S-0.5SV_RevB
Po 0 0 0 15 54AAF3EB 00000000 ~~
Li FH40-64S-0.5SV_RevB
Sc 0
AR /542B52D3/544A851D
Op 0 0 0
T0 0 -20 1 1 0 0.15 N V 21 N "J2"
T1 0 19.5 1 1 0 0.15 N I 21 N "FH40-64S-0.5SV"
DC 0 0 0.2 0.6 0.15 21
DC 0 0 0.2 0.2 0.15 21
DS -2.1 17.7 -2.1 17.4 0.15 21
DS 2.1 16.6 2.1 16.3 0.15 21
DS 2.5 -15.7 3.5 -14.7 0.15 21
DS 3.5 -14.7 3.5 14.8 0.15 21
DS 3.5 14.8 2.5 15.8 0.15 21
T2 -1.7 -17.2 0.8 0.8 0 0.15 N V 21 N "*"
T2 -3.1 -15.7 0.6 0.6 0 0.15 N V 21 N "1"
DS 0 -17.9 -2.1 -17.9 0.15 21
DS -2.1 -17.9 -2.1 -16.3 0.15 21
DS 0 -17.9 2.1 -17.9 0.15 21
DS 2.1 -17.9 2.1 -15.8 0.15 21
DS 0 17.7 -2.1 17.7 0.15 21
DS -2.1 17.45 -2.1 15.85 0.15 21
DS 0 17.7 2.1 17.7 0.15 21
DS 2.1 17.7 2.1 16.6 0.15 21
$PAD
Sh "1" R 1.3 0.45 0 0 0
Dr 0 0 0
At SMD N 00888000
Ne 25 "/ASDQ4/VRef0"
Po -1.525 -15.75
$EndPAD
$PAD
Sh "2" R 1.3 0.45 0 0 0
Dr 0 0 0
At SMD N 00888000
Ne 26 "/ASDQ4/VRef1"
Po 1.525 -15.25
$EndPAD
$PAD
Sh "3" R 1.3 0.45 0 0 0
Dr 0 0 0
At SMD N 00888000
Ne 27 "/ASDQ4/VRef2"
Po -1.525 -14.75
$EndPAD
$PAD
Sh "4" R 1.3 0.45 0 0 0
Dr 0 0 0
At SMD N 00888000
Ne 28 "/ASDQ4/VRef3"
Po 1.525 -14.25
$EndPAD
$PAD
Sh "5" R 1.3 0.45 0 0 0
Dr 0 0 0
At SMD N 00888000
Ne 3 "/ASDQ1/TEMP"
Po -1.525 -13.75
$EndPAD
$PAD
Sh "6" R 1.3 0.45 0 0 0
Dr 0 0 0
At SMD N 00888000
Ne 4 "/ASDQ1/Vref_gnd"
Po 1.525 -13.25
$EndPAD
$PAD
Sh "7" R 1.3 0.45 0 0 0
Dr 0 0 0
At SMD N 00888000
Ne 31 "/LogicBoard/ASDQ4_TP2_0"
Po -1.525 -12.75
$EndPAD
$PAD
Sh "8" R 1.3 0.45 0 0 0
Dr 0 0 0
At SMD N 00888000
Ne 32 "/LogicBoard/ASDQ4_TP2_1"
Po 1.525 -12.25
$EndPAD
$PAD
Sh "9" R 1.3 0.45 0 0 0
Dr 0 0 0
At SMD N 00888000
Ne 29 "/LogicBoard/ASDQ4_TP1_0"
Po -1.525 -11.75
$EndPAD
$PAD
Sh "10" R 1.3 0.45 0 0 0
Dr 0 0 0
At SMD N 00888000
Ne 30 "/LogicBoard/ASDQ4_TP1_1"
Po 1.525 -11.25
$EndPAD
$PAD
Sh "11" R 1.3 0.45 0 0 0
Dr 0 0 0
At SMD N 00888000
Ne 4 "/ASDQ1/Vref_gnd"
Po -1.525 -10.75
$EndPAD
$PAD
Sh "12" R 1.3 0.45 0 0 0
Dr 0 0 0
At SMD N 00888000
Ne 50 "/TDC_MB2/ASDQ2_ShieldB"
Po 1.525 -10.25
$EndPAD
$PAD
Sh "13" R 1.3 0.45 0 0 0
Dr 0 0 0
At SMD N 00888000
Ne 50 "/TDC_MB2/ASDQ2_ShieldB"
Po -1.525 -9.75
$EndPAD
$PAD
Sh "14" R 1.3 0.45 0 0 0
Dr 0 0 0
At SMD N 00888000
Ne 40 "/TDC_MB2/ASDQ2_BN7"
Po 1.525 -9.25
$EndPAD
$PAD
Sh "15" R 1.3 0.45 0 0 0
Dr 0 0 0
At SMD N 00888000
Ne 48 "/TDC_MB2/ASDQ2_BP7"
Po -1.525 -8.75
$EndPAD
$PAD
Sh "16" R 1.3 0.45 0 0 0
Dr 0 0 0
At SMD N 00888000
Ne 39 "/TDC_MB2/ASDQ2_BN6"
Po 1.525 -8.25
$EndPAD
$PAD
Sh "17" R 1.3 0.45 0 0 0
Dr 0 0 0
At SMD N 00888000
Ne 47 "/TDC_MB2/ASDQ2_BP6"
Po -1.525 -7.75
$EndPAD
$PAD
Sh "18" R 1.3 0.45 0 0 0
Dr 0 0 0
At SMD N 00888000
Ne 38 "/TDC_MB2/ASDQ2_BN5"
Po 1.525 -7.25
$EndPAD
$PAD
Sh "19" R 1.3 0.45 0 0 0
Dr 0 0 0
At SMD N 00888000
Ne 46 "/TDC_MB2/ASDQ2_BP5"
Po -1.525 -6.75
$EndPAD
$PAD
Sh "20" R 1.3 0.45 0 0 0
Dr 0 0 0
At SMD N 00888000
Ne 37 "/TDC_MB2/ASDQ2_BN4"
Po 1.525 -6.25
$EndPAD
$PAD
Sh "21" R 1.3 0.45 0 0 0
Dr 0 0 0
At SMD N 00888000
Ne 45 "/TDC_MB2/ASDQ2_BP4"
Po -1.525 -5.75
$EndPAD
$PAD
Sh "22" R 1.3 0.45 0 0 0
Dr 0 0 0
At SMD N 00888000
Ne 36 "/TDC_MB2/ASDQ2_BN3"
Po 1.525 -5.25
$EndPAD
$PAD
Sh "23" R 1.3 0.45 0 0 0
Dr 0 0 0
At SMD N 00888000
Ne 44 "/TDC_MB2/ASDQ2_BP3"
Po -1.525 -4.75
$EndPAD
$PAD
Sh "24" R 1.3 0.45 0 0 0
Dr 0 0 0
At SMD N 00888000
Ne 35 "/TDC_MB2/ASDQ2_BN2"
Po 1.525 -4.25
$EndPAD
$PAD
Sh "25" R 1.3 0.45 0 0 0
Dr 0 0 0
At SMD N 00888000
Ne 43 "/TDC_MB2/ASDQ2_BP2"
Po -1.525 -3.75
$EndPAD
$PAD
Sh "26" R 1.3 0.45 0 0 0
Dr 0 0 0
At SMD N 00888000
Ne 34 "/TDC_MB2/ASDQ2_BN1"
Po 1.525 -3.25
$EndPAD
$PAD
Sh "27" R 1.3 0.45 0 0 0
Dr 0 0 0
At SMD N 00888000
Ne 42 "/TDC_MB2/ASDQ2_BP1"
Po -1.525 -2.75
$EndPAD
$PAD
Sh "28" R 1.3 0.45 0 0 0
Dr 0 0 0
At SMD N 00888000
Ne 33 "/TDC_MB2/ASDQ2_BN0"
Po 1.525 -2.25
$EndPAD
$PAD
Sh "29" R 1.3 0.45 0 0 0
Dr 0 0 0
At SMD N 00888000
Ne 41 "/TDC_MB2/ASDQ2_BP0"
Po -1.525 -1.75
$EndPAD
$PAD
Sh "30" R 1.3 0.45 0 0 0
Dr 0 0 0
At SMD N 00888000
Ne 50 "/TDC_MB2/ASDQ2_ShieldB"
Po 1.525 -1.25
$EndPAD
$PAD
Sh "31" R 1.3 0.45 0 0 0
Dr 0 0 0
At SMD N 00888000
Ne 50 "/TDC_MB2/ASDQ2_ShieldB"
Po -1.525 -0.75
$EndPAD
$PAD
Sh "32" R 1.3 0.45 0 0 0
Dr 0 0 0
At SMD N 00888000
Ne 50 "/TDC_MB2/ASDQ2_ShieldB"
Po 1.525 -0.25
$EndPAD
$PAD
Sh "33" R 1.3 0.45 0 0 0
Dr 0 0 0
At SMD N 00888000
Ne 49 "/TDC_MB2/ASDQ2_ShieldA"
Po -1.525 0.25
$EndPAD
$PAD
Sh "34" R 1.3 0.45 0 0 0
Dr 0 0 0
At SMD N 00888000
Ne 49 "/TDC_MB2/ASDQ2_ShieldA"
Po 1.525 0.75
$EndPAD
$PAD
Sh "35" R 1.3 0.45 0 0 0
Dr 0 0 0
At SMD N 00888000
Ne 49 "/TDC_MB2/ASDQ2_ShieldA"
Po -1.525 1.25
$EndPAD
$PAD
Sh "36" R 1.3 0.45 0 0 0
Dr 0 0 0
At SMD N 00888000
Ne 16 "/ASDQ4/AN7"
Po 1.525 1.75
$EndPAD
$PAD
Sh "37" R 1.3 0.45 0 0 0
Dr 0 0 0
At SMD N 00888000
Ne 24 "/ASDQ4/AP7"
Po -1.525 2.25
$EndPAD
$PAD
Sh "38" R 1.3 0.45 0 0 0
Dr 0 0 0
At SMD N 00888000
Ne 15 "/ASDQ4/AN6"
Po 1.525 2.75
$EndPAD
$PAD
Sh "39" R 1.3 0.45 0 0 0
Dr 0 0 0
At SMD N 00888000
Ne 23 "/ASDQ4/AP6"
Po -1.525 3.25
$EndPAD
$PAD
Sh "40" R 1.3 0.45 0 0 0
Dr 0 0 0
At SMD N 00888000
Ne 14 "/ASDQ4/AN5"
Po 1.525 3.75
$EndPAD
$PAD
Sh "41" R 1.3 0.45 0 0 0
Dr 0 0 0
At SMD N 00888000
Ne 22 "/ASDQ4/AP5"
Po -1.525 4.25
$EndPAD
$PAD
Sh "42" R 1.3 0.45 0 0 0
Dr 0 0 0
At SMD N 00888000
Ne 13 "/ASDQ4/AN4"
Po 1.525 4.75
$EndPAD
$PAD
Sh "43" R 1.3 0.45 0 0 0
Dr 0 0 0
At SMD N 00888000
Ne 21 "/ASDQ4/AP4"
Po -1.525 5.25
$EndPAD
$PAD
Sh "44" R 1.3 0.45 0 0 0
Dr 0 0 0
At SMD N 00888000
Ne 12 "/ASDQ4/AN3"
Po 1.525 5.75
$EndPAD
$PAD
Sh "45" R 1.3 0.45 0 0 0
Dr 0 0 0
At SMD N 00888000
Ne 20 "/ASDQ4/AP3"
Po -1.525 6.25
$EndPAD
$PAD
Sh "46" R 1.3 0.45 0 0 0
Dr 0 0 0
At SMD N 00888000
Ne 11 "/ASDQ4/AN2"
Po 1.525 6.75
$EndPAD
$PAD
Sh "47" R 1.3 0.45 0 0 0
Dr 0 0 0
At SMD N 00888000
Ne 19 "/ASDQ4/AP2"
Po -1.525 7.25
$EndPAD
$PAD
Sh "48" R 1.3 0.45 0 0 0
Dr 0 0 0
At SMD N 00888000
Ne 10 "/ASDQ4/AN1"
Po 1.525 7.75
$EndPAD
$PAD
Sh "49" R 1.3 0.45 0 0 0
Dr 0 0 0
At SMD N 00888000
Ne 18 "/ASDQ4/AP1"
Po -1.525 8.25
$EndPAD
$PAD
Sh "50" R 1.3 0.45 0 0 0
Dr 0 0 0
At SMD N 00888000
Ne 9 "/ASDQ4/AN0"
Po 1.525 8.75
$EndPAD
$PAD
Sh "51" R 1.3 0.45 0 0 0
Dr 0 0 0
At SMD N 00888000
Ne 17 "/ASDQ4/AP0"
Po -1.525 9.25
$EndPAD
$PAD
Sh "52" R 1.3 0.45 0 0 0
Dr 0 0 0
At SMD N 00888000
Ne 49 "/TDC_MB2/ASDQ2_ShieldA"
Po 1.525 9.75
$EndPAD
$PAD
Sh "53" R 1.3 0.45 0 0 0
Dr 0 0 0
At SMD N 00888000
Ne 49 "/TDC_MB2/ASDQ2_ShieldA"
Po -1.525 10.25
$EndPAD
$PAD
Sh "54" R 1.3 0.45 0 0 0
Dr 0 0 0
At SMD N 00888000
Ne 49 "/TDC_MB2/ASDQ2_ShieldA"
Po 1.525 10.75
$EndPAD
$PAD
Sh "55" R 1.3 0.45 0 0 0
Dr 0 0 0
At SMD N 00888000
Ne 2 "/ASDQ1/+1.4VRet"
Po -1.525 11.25
$EndPAD
$PAD
Sh "56" R 1.3 0.45 0 0 0
Dr 0 0 0
At SMD N 00888000
Ne 1 "/ASDQ1/+1.4V"
Po 1.525 11.75
$EndPAD
$PAD
Sh "57" R 1.3 0.45 0 0 0
Dr 0 0 0
At SMD N 00888000
Ne 6 "/ASDQ4/+3VRet"
Po -1.525 12.25
$EndPAD
$PAD
Sh "58" R 1.3 0.45 0 0 0
Dr 0 0 0
At SMD N 00888000
Ne 6 "/ASDQ4/+3VRet"
Po 1.525 12.75
$EndPAD
$PAD
Sh "59" R 1.3 0.45 0 0 0
Dr 0 0 0
At SMD N 00888000
Ne 5 "/ASDQ4/+3V"
Po -1.525 13.25
$EndPAD
$PAD
Sh "60" R 1.3 0.45 0 0 0
Dr 0 0 0
At SMD N 00888000
Ne 5 "/ASDQ4/+3V"
Po 1.525 13.75
$EndPAD
$PAD
Sh "61" R 1.3 0.45 0 0 0
Dr 0 0 0
At SMD N 00888000
Ne 8 "/ASDQ4/-3VRet"
Po -1.525 14.25
$EndPAD
$PAD
Sh "62" R 1.3 0.45 0 0 0
Dr 0 0 0
At SMD N 00888000
Ne 8 "/ASDQ4/-3VRet"
Po 1.525 14.75
$EndPAD
$PAD
Sh "63" R 1.3 0.45 0 0 0
Dr 0 0 0
At SMD N 00888000
Ne 7 "/ASDQ4/-3V"
Po -1.525 15.25
$EndPAD
$PAD
Sh "64" R 1.3 0.45 0 0 0
Dr 0 0 0
At SMD N 00888000
Ne 7 "/ASDQ4/-3V"
Po 1.525 15.75
$EndPAD
$EndMODULE FH40-64S-0.5SV_RevB
$EndLIBRARY
