PCBNEW-LibModule-V1  Mon 05 Jan 2015 02:00:10 PM EST
# encoding utf-8
Units mm
$INDEX
HV_Board_Connector
HV_Board_Connector_RevB
$EndINDEX
$MODULE HV_Board_Connector
Po 0 0 0 15 546FA582 00000000 ~~
Li HV_Board_Connector
Sc 0
AR 
Op 0 0 0
T0 0.5 -10 1 1 0 0.15 N V 21 N "HV_Board_Connector"
T1 0 7.62 1 1 0 0.15 N V 21 N "VAL**"
DS 18.8 3 33.7 3 0.15 21
DS 33.7 3 33.7 0 0.15 21
DS -16.8 3 16.8 3 0.15 21
DS 33.7 0 33.7 -8.7 0.15 21
DS 33.7 -8.7 -33.7 -8.7 0.15 21
DS -33.7 -8.7 -33.7 0 0.15 21
DS -33.7 0 -33.7 3 0.15 21
DS -33.7 3 -18.8 3 0.15 21
T2 0 -7.5 1 1 0 0.15 N V 21 N "HV-Zone"
DS 21.59 -1.27 29.21 -1.27 0.15 21
DS 16.51 -1.27 19.05 -1.27 0.15 21
DS 6.35 -1.27 13.97 -1.27 0.15 21
DS -3.81 -1.27 3.81 -1.27 0.15 21
DS -13.97 -1.27 -6.35 -1.27 0.15 21
DS -19.05 -1.27 -16.51 -1.27 0.15 21
DS -29.21 -1.27 -21.59 -1.27 0.15 21
DS -19.05 1.27 -31.75 1.27 0.15 21
DS -31.75 1.27 -31.75 -1.27 0.15 21
DS 16.51 1.27 -16.51 1.27 0.15 21
DS 31.75 1.27 19.05 1.27 0.15 21
DS 31.75 1.27 31.75 -1.27 0.15 21
$PAD
Sh "1" R 1.27 6.35 0 0 0
Dr 0 0 0
At SMD N 00888000
Ne 0 ""
Po -30.48 -2.8575
$EndPAD
$PAD
Sh "5" R 1.27 6.35 0 0 0
Dr 0 0 0
At SMD N 00888000
Ne 0 ""
Po -20.32 -2.8575
$EndPAD
$PAD
Sh "6" R 1.27 6.35 0 0 0
Dr 0 0 0
At SMD N 00888000
Ne 0 ""
Po -17.78 2.8575
$EndPAD
$PAD
Sh "7" R 1.27 6.35 0 0 0
Dr 0 0 0
At SMD N 00888000
Ne 0 ""
Po -15.24 -2.8575
$EndPAD
$PAD
Sh "11" R 1.27 6.35 0 0 0
Dr 0 0 0
At SMD N 00888000
Ne 0 ""
Po -5.08 -2.8575
$EndPAD
$PAD
Sh "15" R 1.27 6.35 0 0 0
Dr 0 0 0
At SMD N 00888000
Ne 0 ""
Po 5.08 -2.8575
$EndPAD
$PAD
Sh "19" R 1.27 6.35 0 0 0
Dr 0 0 0
At SMD N 00888000
Ne 0 ""
Po 15.24 -2.8575
$EndPAD
$PAD
Sh "20" R 1.27 6.35 0 0 0
Dr 0 0 0
At SMD N 00888000
Ne 0 ""
Po 17.78 2.8575
$EndPAD
$PAD
Sh "21" R 1.27 6.35 0 0 0
Dr 0 0 0
At SMD N 00888000
Ne 0 ""
Po 20.32 -2.8575
$EndPAD
$PAD
Sh "25" R 1.27 6.35 0 0 0
Dr 0 0 0
At SMD N 00888000
Ne 0 ""
Po 30.48 -2.8575
$EndPAD
$EndMODULE HV_Board_Connector
$MODULE HV_Board_Connector_RevB
Po 0 0 0 15 54AADF06 00000000 ~~
Li HV_Board_Connector_RevB
Sc 0
AR /545BAD44/54651EA9
Op 0 0 0
T0 0.5 -10 1 1 0 0.15 N V 21 N "J10"
T1 0 7.62 1 1 0 0.15 N V 21 N "BOARD_CONNECT"
DC 0 0 0.4 1 0.15 21
DC 0 0 1 2 0.15 21
DS 18.8 3 33.7 3 0.15 21
DS 33.7 3 33.7 0 0.15 21
DS -16.8 3 16.8 3 0.15 21
DS 33.7 0 33.7 -8.7 0.15 21
DS 33.7 -8.7 -33.7 -8.7 0.15 21
DS -33.7 -8.7 -33.7 0 0.15 21
DS -33.7 0 -33.7 3 0.15 21
DS -33.7 3 -18.8 3 0.15 21
T2 0 -7.5 1 1 0 0.15 N V 21 N "HV-Zone"
DS 21.59 -1.27 29.21 -1.27 0.15 21
DS 16.51 -1.27 19.05 -1.27 0.15 21
DS 6.35 -1.27 13.97 -1.27 0.15 21
DS -3.81 -1.27 3.81 -1.27 0.15 21
DS -13.97 -1.27 -6.35 -1.27 0.15 21
DS -19.05 -1.27 -16.51 -1.27 0.15 21
DS -29.21 -1.27 -21.59 -1.27 0.15 21
DS -19.05 1.27 -31.75 1.27 0.15 21
DS -31.75 1.27 -31.75 -1.27 0.15 21
DS 16.51 1.27 -16.51 1.27 0.15 21
DS 31.75 1.27 19.05 1.27 0.15 21
DS 31.75 1.27 31.75 -1.27 0.15 21
$PAD
Sh "1" R 1.27 6.35 0 0 0
Dr 0 0 0
At SMD N 00888000
Ne 5 "/HV_Conn/HV_3"
Po -30.48 -2.8575
$EndPAD
$PAD
Sh "5" R 1.27 6.35 0 0 0
Dr 0 0 0
At SMD N 00888000
Ne 1 "/HV_Conn/GND"
Po -20.32 -2.8575
$EndPAD
$PAD
Sh "6" R 1.27 6.35 0 0 0
Dr 0 0 0
At SMD N 00888000
Ne 0 ""
Po -17.78 2.8575
$EndPAD
$PAD
Sh "7" R 1.27 6.35 0 0 0
Dr 0 0 0
At SMD N 00888000
Ne 1 "/HV_Conn/GND"
Po -15.24 -2.8575
$EndPAD
$PAD
Sh "11" R 1.27 6.35 0 0 0
Dr 0 0 0
At SMD N 00888000
Ne 4 "/HV_Conn/HV_2"
Po -5.08 -2.8575
$EndPAD
$PAD
Sh "15" R 1.27 6.35 0 0 0
Dr 0 0 0
At SMD N 00888000
Ne 3 "/HV_Conn/HV_1"
Po 5.08 -2.8575
$EndPAD
$PAD
Sh "19" R 1.27 6.35 0 0 0
Dr 0 0 0
At SMD N 00888000
Ne 1 "/HV_Conn/GND"
Po 15.24 -2.8575
$EndPAD
$PAD
Sh "20" R 1.27 6.35 0 0 0
Dr 0 0 0
At SMD N 00888000
Ne 0 ""
Po 17.78 2.8575
$EndPAD
$PAD
Sh "21" R 1.27 6.35 0 0 0
Dr 0 0 0
At SMD N 00888000
Ne 1 "/HV_Conn/GND"
Po 20.32 -2.8575
$EndPAD
$PAD
Sh "25" R 1.27 6.35 0 0 0
Dr 0 0 0
At SMD N 00888000
Ne 2 "/HV_Conn/HV_0"
Po 30.48 -2.8575
$EndPAD
$EndMODULE HV_Board_Connector_RevB
$EndLIBRARY
