PCBNEW-LibModule-V1  Thu 18 Dec 2014 05:14:39 PM EST
# encoding utf-8
Units mm
$INDEX
MTG_HOLE_M4.2
$EndINDEX
$MODULE MTG_HOLE_M4.2
Po 0 0 0 15 54934FBF 00000000 ~~
Li MTG_HOLE_M4.2
Sc 0
AR 
Op 0 0 0
T0 0 0 1 1 0 0.15 N V 21 N "MTG_HOLE_M4.2"
T1 0 0 1 1 0 0.15 N V 21 N "VAL**"
$PAD
Sh "1" C 5.08 5.08 0 0 0
Dr 4.191 0 0
At STD N 00E0FFFF
Ne 0 ""
Po 0 0
$EndPAD
$EndMODULE MTG_HOLE_M4.2
$EndLIBRARY
