ref,value,Field1,Field2,Item count
J1,DS18B20_CONNECTOR,WM6889CT-ND,Digi-Key,1
J2..J4,FH40-64S-0.5SV,HFW64CT-ND,Digi-Key,3
J5,ERF8-050-05.0-S-DV-K-TR,SAM8622CT-ND,Digi-Key,1
J6,FH40-64S-0.5SV,HFW64CT-ND,Digi-Key,1
J7..J8,ERF8-050-05.0-S-DV-K-TR,SAM8622CT-ND,Digi-Key,2
J9..J10,BOARD_CONNECT,S1033E-25-ND,Digi-Key,2
