M48
INCH
T01C.012
T02C.042
T03C.096
T04C.1
T05C.059
;LEADER: 12 
;HEADER: 
;CODE  : ASCII 
;FILE  : ASDQv3-1-6.drl for  ... layers TOP and BOTTOM
;DESIGN: ASDQv3_20141104A.brd
;T01 Holesize 1. = 12.000000 Tolerance = +3.000000/-3.000000 PLATED MILS Quantity = 364
;T02 Holesize 2. = 42.000000 Tolerance = +3.000000/-3.000000 PLATED MILS Quantity = 2
;T03 Holesize 3. = 96.000000 Tolerance = +3.000000/-3.000000 PLATED MILS Quantity = 7
;T04 Holesize 4. = 100.000000 Tolerance = +3.000000/-3.000000 PLATED MILS Quantity = 16
;T05 Holesize 5. = 59.000000 Tolerance = +3.000000/-3.000000 NON_PLATED MILS Quantity = 2
%
G90
T01
X0091450Y-0004765
X0033350Y-0004265
X0088450Y-0004765
X0036650Y-0004265
X0150350Y0178514
X0156250Y0137300
X-0009950Y0137300
X0160750Y0165864
X0060950Y0197800
X0063250Y0197900
X0062150Y0161900
X0062150Y0159500
X0075650Y0142661
X0101370Y0196863
X0103420Y0198108
X0080215Y0153165
X0161440Y0143790
X0028850Y0175100
X0114350Y0170600
X0069380Y0165370
X0052850Y0161400
X0091450Y0162100
X0074996Y0166754
X0051196Y0186346
X0066185Y0182865
X0063150Y0186300
X0123485Y0171465
X0079650Y0159500
X0023550Y0170900
X0047150Y0183100
X0090192Y0182850
X0085650Y0169600
X0087843Y0182367
X0120670Y0170300
X0097567Y0182057
X0123640Y0164790
X0061350Y0167500
X0118050Y0170400
X0109250Y0184800
X0117150Y0181100
X0057450Y0183200
X0080550Y0169700
X0085448Y0182500
X0012655Y0165595
X0039250Y0183334
X0058450Y0167400
X0010686Y0167936
X0034150Y0185200
X0049550Y0183400
X0119950Y0183000
X0101150Y0184500
X0112650Y0177100
X0066950Y0167600
X0048350Y0173100
X0052150Y0183200
X0117650Y0164500
X0060050Y0183200
X0103850Y0184700
X0115650Y0178800
X0027000Y0170850
X0045625Y0173071
X0088400Y0169350
X0054650Y0183200
X0064050Y0167900
X0083050Y0182500
X0083200Y0169650
X0014623Y0168373
X0042250Y0183754
X0044750Y0183746
X0045050Y0103600
X0138850Y0104769
X0036970Y0104454
X0059450Y0115700
X-0019400Y0091716
X-0017350Y0100700
X0063750Y0107000
X-0002550Y0117200
X0052750Y0104700
X0044460Y0113810
X0039650Y0104483
X0029386Y0104800
X0016850Y0104302
X0004150Y0104500
X0057583Y0103400
X0026450Y0107100
X0120950Y0104700
X0021701Y0103207
X0115766Y0106416
X0132350Y0104000
X0161500Y0092216
X0144361Y0103311
X0079050Y0092216
X0124150Y0104800
X0117850Y0104300
X0113602Y0105000
X0102916Y0104466
X0135300Y0104500
X0069150Y0115900
X0072450Y0106500
X0147950Y0114800
X0065650Y0109300
X0137850Y0119447
X0049933Y0104617
X0143150Y0109000
X0008550Y0106500
X0034750Y0138100
X0103850Y0121300
X0146550Y0181400
X0146550Y0178500
X0013050Y0131300
X0098103Y0133553
X0148850Y0131300
X0146660Y0140410
X0007450Y0134900
X0014350Y0117700
X0147080Y0166230
X0139050Y0183200
X0141050Y0183200
X0160793Y0169342
X-0019380Y0166130
X0119350Y0128500
X0119150Y0132300
X0114950Y0135800
X0116632Y0127282
X0114600Y0125550
X0098534Y0137484
X0007066Y0137584
X0021250Y0134600
X0030050Y0132900
X0029950Y0129300
X0022550Y0125600
X0025150Y0125700
X0088961Y0196993
X0085733Y0187517
X-0007590Y0137729
X0019950Y0105200
X0043760Y0129710
X-0001211Y0167561
X0081550Y0187500
X0086950Y0198300
X0034860Y0143490
X0000450Y0118300
X0055610Y0104800
X0044097Y0133647
X0132750Y0175500
X0132750Y0178200
X0028450Y0154000
X0057750Y0150200
X0118750Y0151700
X0114950Y0151700
X0145377Y0147327
X0088250Y0146404
X0025050Y0154100
X-0003050Y0148100
X0007050Y0104200
X0037650Y0125900
X0031962Y0104420
X0007191Y0108477
X0015290Y0176400
X0015290Y0174160
X0020750Y0151700
X0044508Y0145458
X0006940Y0143490
X0006950Y0148500
X0007014Y0151364
X0044286Y0151364
X0020750Y0148800
X0098550Y0142200
X0135150Y0145500
X0135586Y0151264
X0098450Y0148225
X0098386Y0151264
X-0005150Y0152500
X0160850Y0151000
X0006750Y0123200
X0019750Y0181400
X0022250Y0181400
X0135718Y0135300
X0146250Y0125400
X0088123Y0125673
X-0003023Y0125773
X0054123Y0125773
X0009300Y0120650
X0044050Y0136100
X0105450Y0102300
X0105650Y0106400
X0127163Y0139162
X0097050Y0110187
X0113797Y0108200
X0133650Y0129610
X0125450Y0145300
X0094150Y0116300
X0137050Y0109200
X0135150Y0131800
X0099400Y0104350
X0129750Y0124626
X0128950Y0103400
X0101050Y0107400
X0020050Y0197100
X0014200Y0202450
X0037050Y0198100
X0039350Y0198100
X0049350Y0198100
X0051450Y0198100
X0127600Y0204350
X0121950Y0199900
X0123450Y0191400
X0003350Y0190100
X0145550Y0135200
X0110550Y0125135
X0070650Y0135500
X0070750Y0125200
X0145751Y0132800
X0110650Y0121100
X0098857Y0126807
X0093659Y0186174
X0095554Y0187644
X0098650Y0129610
X0006850Y0130800
X0089850Y0187646
X0007150Y0127000
X0095556Y0197000
X0088050Y0138600
X-0005850Y0173900
X0017050Y0135500
X0007650Y0140100
X0015600Y0124350
X-0016540Y0175290
X0010050Y0102900
X-0016705Y0137700
X0088150Y0134674
X0026450Y0130100
X-0007000Y0122750
X0065750Y0115800
X0062950Y0115700
X-0012850Y0118100
X-0005238Y0137257
X0107950Y0131975
X0108100Y0135650
X0069890Y0106500
X0075810Y0092216
X-0015650Y0091716
X0153250Y0092401
X0142068Y0102561
X0107750Y0138200
X-0019450Y0130400
X-0014612Y0129763
X-0007550Y0128100
X0011350Y0117800
X-0005750Y0116600
X0148850Y0118011
X0133803Y0112600
X0067959Y0092000
X0061790Y0109600
X0086627Y0136669
X0070150Y0130300
X0036820Y0136330
X0148380Y0162770
X-0002250Y0153783
X0069972Y0172822
X0068947Y0182600
X0029550Y0177800
X0112150Y0180400
X0073935Y0182042
X0071950Y0183204
X0109299Y0196654
X0107334Y0197984
X0105362Y0196700
X0091586Y0197398
X0081793Y0198143
X0079822Y0196672
X0077852Y0198098
X0075882Y0196468
X0073913Y0197937
X0071943Y0196393
X0069972Y0197878
X0068002Y0196448
X0066033Y0197917
X0058152Y0198200
X0056182Y0196655
X0054213Y0198300
X0046333Y0198517
X0044363Y0196687
X0042393Y0198357
X0034513Y0198337
X0032543Y0196893
X0153987Y0162500
X0070677Y0155650
X0019050Y0190100
X0007900Y0201750
X0138750Y0191600
X0131850Y0204400
X0053950Y0186300
X0072350Y0171400
X0084787Y0128100
X0160560Y0157410
X0160820Y0154430
X0158850Y0137500
X-0019120Y0162670
X-0008150Y0158500
X0112220Y0130070
X0122950Y0151400
X0128820Y0153530
X0128720Y0143030
X0129515Y0139634
X0125650Y0137300
X0118950Y0135400
X0111980Y0145370
X0107950Y0143000
X0107950Y0147000
X0108050Y0151200
X0145150Y0150118
X0141850Y0153900
X0145250Y0129900
X0145150Y0123100
X0132280Y0127270
X0130950Y0119700
X0128220Y0122070
X0122350Y0119800
X0088380Y0121370
X0092150Y0154000
X-0002850Y0122700
X0032020Y0136970
X0025050Y0135100
X0013380Y0134730
X0018420Y0128370
X0054250Y0123100
X0053829Y0131679
X0054250Y0136400
X0022080Y0145270
X0054450Y0150200
X0050750Y0154100
X0035450Y0146300
X0038420Y0152730
X0031850Y0152100
X0015850Y0145900
X0015950Y0149400
X0015850Y0152700
X0040750Y0123300
X0041050Y0117966
X0038220Y0122370
X0032935Y0119600
X0106550Y0092063
X0118250Y0092163
X0130150Y0092163
X0141250Y0092163
X0131650Y0101100
X0119750Y0101200
X0109950Y0104600
X0096450Y0103700
X0091950Y0101100
X0081950Y0092300
X-0003450Y0100800
X0058170Y0091950
X0048336Y0101900
X0036150Y0102200
X0047050Y0092300
X0034950Y0092100
X0025001Y0103400
X0022950Y0092100
X0013420Y0103700
X0011050Y0092063
X0001279Y0103500
X0065450Y0187200
T02
X0051550Y0013800
X0051550Y-0006200
T03
X0000150Y0000100
X-0011650Y0108800
X-0014350Y0185900
X0083650Y0108800
X0155150Y0108800
X0125750Y0000100
X0156150Y0185800
T04
X-0020450Y0048500
X0003450Y0048500
X0027250Y0048500
X-0008450Y0069000
X0015350Y0069000
X0086850Y0069000
X0110650Y0069000
X0146350Y0048500
X0039250Y0068900
X0062950Y0069000
X0098750Y0048500
X0122550Y0048500
X0134450Y0069000
X0158250Y0069000
X0051050Y0048500
X0074850Y0048500
T05
X0027643Y0188346
X0114257Y0188346
M30
