(module 1.4mm_Mounting_Hole (layer F.Cu) (tedit 61F83D4E)
  (fp_text reference REF** (at 0 -1.4) (layer F.SilkS)
    (effects (font (size 1 1) (thickness 0.15)))
  )
  (fp_text value 1.4mm_Mounting_Hole (at 0 1.1) (layer F.Fab)
    (effects (font (size 1 1) (thickness 0.15)))
  )
  (pad "" thru_hole circle (at 0 0) (size 1.524 1.524) (drill 1.4) (layers *.Cu *.Mask))
)
