(module 7693_ScrewTerminal (layer F.Cu) (tedit 62227F03)
  (fp_text reference REF** (at 0 -7) (layer F.SilkS)
    (effects (font (size 1 1) (thickness 0.15)))
  )
  (fp_text value 7693_ScrewTerminal (at 0 0) (layer F.Fab)
    (effects (font (size 1 1) (thickness 0.15)))
  )
  (fp_line (start -5 -5) (end 5 -5) (layer F.SilkS) (width 0.12))
  (fp_line (start 5 -5) (end 5 5) (layer F.SilkS) (width 0.12))
  (fp_line (start 5 5) (end -5 5) (layer F.SilkS) (width 0.12))
  (fp_line (start -5 5) (end -5 -5) (layer F.SilkS) (width 0.12))
  (pad 1 thru_hole circle (at 2.5 -3.5) (size 2 2) (drill 1.85) (layers *.Cu *.Mask))
  (pad 1 thru_hole circle (at 2.5 3.5) (size 2 2) (drill 1.85) (layers *.Cu *.Mask))
  (pad 1 thru_hole circle (at -2.5 -3.5) (size 2 2) (drill 1.85) (layers *.Cu *.Mask))
  (pad 1 thru_hole circle (at -2.5 3.5) (size 2 2) (drill 1.85) (layers *.Cu *.Mask))
)
