(module SAMTEC_ET60T-D02-3-08-000-X-R1-S (layer F.Cu) (tedit 62226D16)
  (fp_text reference REF** (at -21.825 -8.635) (layer F.SilkS)
    (effects (font (size 1 1) (thickness 0.15)))
  )
  (fp_text value SAMTEC_ET60T-D02-3-08-000-X-R1-S (at -4.68 -7.135) (layer F.Fab)
    (effects (font (size 1 1) (thickness 0.15)))
  )
  (fp_text user PCB-EDGE (at 25.354 7.671) (layer F.Fab)
    (effects (font (size 0.64 0.64) (thickness 0.15)))
  )
  (fp_line (start -24.88 -5.6) (end 24.88 -5.6) (layer F.Fab) (width 0.1))
  (fp_line (start 30.73 7.9) (end -24.88 7.9) (layer F.Fab) (width 0.1))
  (fp_line (start 24.88 -5.6) (end 24.88 7.9) (layer F.SilkS) (width 0.2))
  (fp_line (start -24.88 7.9) (end -24.88 -5.6) (layer F.SilkS) (width 0.2))
  (fp_line (start 25.13 -6.015) (end -25.13 -6.015) (layer F.CrtYd) (width 0.05))
  (fp_line (start -25.13 -6.015) (end -25.13 23.9) (layer F.CrtYd) (width 0.05))
  (fp_line (start -25.13 23.9) (end 25.13 23.9) (layer F.CrtYd) (width 0.05))
  (fp_line (start 25.13 23.9) (end 25.13 -6.015) (layer F.CrtYd) (width 0.05))
  (fp_line (start 24.88 23.65) (end 24.88 -5.6) (layer F.Fab) (width 0.1))
  (fp_line (start -24.88 23.65) (end -24.88 7.9) (layer F.Fab) (width 0.1))
  (fp_circle (center -25.59 3.7) (end -25.49 3.7) (layer F.Fab) (width 0.2))
  (fp_circle (center -25.59 3.7) (end -25.49 3.7) (layer F.SilkS) (width 0.2))
  (fp_line (start -24.88 7.9) (end -24.88 -5.6) (layer F.Fab) (width 0.1))
  (fp_line (start 24.88 -5.6) (end -6.33 -5.6) (layer F.SilkS) (width 0.2))
  (fp_line (start 24.88 23.65) (end -24.88 23.65) (layer F.Fab) (width 0.1))
  (fp_line (start 24.88 7.9) (end -24.88 7.9) (layer F.SilkS) (width 0.2))
  (fp_line (start -24.88 -5.6) (end -16.88 -5.6) (layer F.SilkS) (width 0.2))
  (pad 24 thru_hole circle (at 15.57 -1.58) (size 1.53 1.53) (drill 0.7) (layers *.Cu *.Mask))
  (pad 23 thru_hole circle (at 13.03 -1.58) (size 1.53 1.53) (drill 0.7) (layers *.Cu *.Mask))
  (pad 22 thru_hole circle (at 10.49 -1.58) (size 1.53 1.53) (drill 0.7) (layers *.Cu *.Mask))
  (pad 21 thru_hole circle (at 7.95 -1.58) (size 1.53 1.53) (drill 0.7) (layers *.Cu *.Mask))
  (pad 20 thru_hole circle (at 5.41 -1.58) (size 1.53 1.53) (drill 0.7) (layers *.Cu *.Mask))
  (pad 19 thru_hole circle (at 2.87 -1.58) (size 1.53 1.53) (drill 0.7) (layers *.Cu *.Mask))
  (pad 18 thru_hole circle (at 0.33 -1.58) (size 1.53 1.53) (drill 0.7) (layers *.Cu *.Mask))
  (pad 17 thru_hole circle (at -2.21 -1.58) (size 1.53 1.53) (drill 0.7) (layers *.Cu *.Mask))
  (pad 16 thru_hole circle (at 15.57 0.96) (size 1.53 1.53) (drill 0.7) (layers *.Cu *.Mask))
  (pad 15 thru_hole circle (at 13.03 0.96) (size 1.53 1.53) (drill 0.7) (layers *.Cu *.Mask))
  (pad 14 thru_hole circle (at 10.49 0.96) (size 1.53 1.53) (drill 0.7) (layers *.Cu *.Mask))
  (pad 13 thru_hole circle (at 7.95 0.96) (size 1.53 1.53) (drill 0.7) (layers *.Cu *.Mask))
  (pad 12 thru_hole circle (at 5.41 0.96) (size 1.53 1.53) (drill 0.7) (layers *.Cu *.Mask))
  (pad 11 thru_hole circle (at 2.87 0.96) (size 1.53 1.53) (drill 0.7) (layers *.Cu *.Mask))
  (pad 10 thru_hole circle (at 0.33 0.96) (size 1.53 1.53) (drill 0.7) (layers *.Cu *.Mask))
  (pad 09 thru_hole circle (at -2.21 0.96) (size 1.53 1.53) (drill 0.7) (layers *.Cu *.Mask))
  (pad 08 thru_hole circle (at 15.57 3.5) (size 1.53 1.53) (drill 0.7) (layers *.Cu *.Mask))
  (pad 07 thru_hole circle (at 13.03 3.5) (size 1.53 1.53) (drill 0.7) (layers *.Cu *.Mask))
  (pad 06 thru_hole circle (at 10.49 3.5) (size 1.53 1.53) (drill 0.7) (layers *.Cu *.Mask))
  (pad 05 thru_hole circle (at 7.95 3.5) (size 1.53 1.53) (drill 0.7) (layers *.Cu *.Mask))
  (pad 04 thru_hole circle (at 5.41 3.5) (size 1.53 1.53) (drill 0.7) (layers *.Cu *.Mask))
  (pad 03 thru_hole circle (at 2.87 3.5) (size 1.53 1.53) (drill 0.7) (layers *.Cu *.Mask))
  (pad 02 thru_hole circle (at 0.33 3.5) (size 1.53 1.53) (drill 0.7) (layers *.Cu *.Mask))
  (pad 01 thru_hole rect (at -2.21 3.5) (size 1.53 1.53) (drill 0.7) (layers *.Cu *.Mask))
  (pad P02_6 thru_hole circle (at -7.38 5) (size 1.53 1.53) (drill 1.02) (layers *.Cu *.Mask))
  (pad P02_7 thru_hole circle (at -7.38 2.5) (size 1.53 1.53) (drill 1.02) (layers *.Cu *.Mask))
  (pad P02_10 thru_hole circle (at -7.38 -5) (size 1.53 1.53) (drill 1.02) (layers *.Cu *.Mask))
  (pad P02_9 thru_hole circle (at -7.38 -2.5) (size 1.53 1.53) (drill 1.02) (layers *.Cu *.Mask))
  (pad P02_8 thru_hole circle (at -7.38 0) (size 1.53 1.53) (drill 1.02) (layers *.Cu *.Mask))
  (pad P02_5 thru_hole circle (at -10.38 5) (size 1.53 1.53) (drill 1.02) (layers *.Cu *.Mask))
  (pad P02_4 thru_hole circle (at -10.38 2.5) (size 1.53 1.53) (drill 1.02) (layers *.Cu *.Mask))
  (pad P02_1 thru_hole circle (at -10.38 -5) (size 1.53 1.53) (drill 1.02) (layers *.Cu *.Mask))
  (pad P02_2 thru_hole circle (at -10.38 -2.5) (size 1.53 1.53) (drill 1.02) (layers *.Cu *.Mask))
  (pad P02_3 thru_hole circle (at -10.38 0) (size 1.53 1.53) (drill 1.02) (layers *.Cu *.Mask))
  (pad P01_6 thru_hole circle (at -12.88 5) (size 1.53 1.53) (drill 1.02) (layers *.Cu *.Mask))
  (pad P01_7 thru_hole circle (at -12.88 2.5) (size 1.53 1.53) (drill 1.02) (layers *.Cu *.Mask))
  (pad P01_10 thru_hole circle (at -12.88 -5) (size 1.53 1.53) (drill 1.02) (layers *.Cu *.Mask))
  (pad P01_9 thru_hole circle (at -12.88 -2.5) (size 1.53 1.53) (drill 1.02) (layers *.Cu *.Mask))
  (pad P01_8 thru_hole circle (at -12.88 0) (size 1.53 1.53) (drill 1.02) (layers *.Cu *.Mask))
  (pad P01_5 thru_hole circle (at -15.88 5) (size 1.53 1.53) (drill 1.02) (layers *.Cu *.Mask))
  (pad P01_4 thru_hole circle (at -15.88 2.5) (size 1.53 1.53) (drill 1.02) (layers *.Cu *.Mask))
  (pad P01_1 thru_hole circle (at -15.88 -5) (size 1.53 1.53) (drill 1.02) (layers *.Cu *.Mask))
  (pad P01_2 thru_hole circle (at -15.88 -2.5) (size 1.53 1.53) (drill 1.02) (layers *.Cu *.Mask))
  (pad P01_3 thru_hole circle (at -15.88 0) (size 1.53 1.53) (drill 1.02) (layers *.Cu *.Mask))
  (pad None np_thru_hole circle (at -21.38 0) (size 3.2 3.2) (drill 3.2) (layers *.Cu *.Mask))
  (pad None np_thru_hole circle (at 21.38 0) (size 3.2 3.2) (drill 3.2) (layers *.Cu *.Mask))
)
