[01m[K/home/jettanan/morf_ANC/controllers/neuroendocrine_control/real/neutronController.cpp:[m[K In member function ‘[01m[Kvoid neutronController::actuateRobot()[m[K’:
[01m[K/home/jettanan/morf_ANC/controllers/neuroendocrine_control/real/neutronController.cpp:450:43:[m[K [01;35m[Kwarning: [m[Knarrowing conversion of ‘[01m[K-((neutronController*)this)->neutronController::positions.std::vector<double>::at(0)[m[K’ from ‘[01m[K__gnu_cxx::__alloc_traits<std::allocator<double> >::value_type {aka double}[m[K’ to ‘[01m[Kfloat[m[K’ inside { } [[01;35m[K-Wnarrowing[m[K]
     std::vector<float> positionsNew = {11,[01;35m[K-positions.at(BC0)[m[K,12,positions.at(CF0),13,positions.at(FT0),
                                           [01;35m[K^~~~~~~~~~~~~~~~~~[m[K
[01m[K/home/jettanan/morf_ANC/controllers/neuroendocrine_control/real/neutronController.cpp:450:43:[m[K [01;35m[Kwarning: [m[Knarrowing conversion of ‘[01m[K-((neutronController*)this)->neutronController::positions.std::vector<double>::at(0)[m[K’ from ‘[01m[K__gnu_cxx::__alloc_traits<std::allocator<double> >::value_type {aka double}[m[K’ to ‘[01m[Kfloat[m[K’ inside { } [[01;35m[K-Wnarrowing[m[K]
[01m[K/home/jettanan/morf_ANC/controllers/neuroendocrine_control/real/neutronController.cpp:450:77:[m[K [01;35m[Kwarning: [m[Knarrowing conversion of ‘[01m[K((neutronController*)this)->neutronController::positions.std::vector<double>::at(6)[m[K’ from ‘[01m[K__gnu_cxx::__alloc_traits<std::allocator<double> >::value_type {aka double}[m[K’ to ‘[01m[Kfloat[m[K’ inside { } [[01;35m[K-Wnarrowing[m[K]
     std::vector<float> positionsNew = {11,-positions.at(BC0),12,[01;35m[Kpositions.at(CF0)[m[K,13,positions.at(FT0),
                                                                 [01;35m[K~~~~~~~~~~~~^~~~~[m[K
[01m[K/home/jettanan/morf_ANC/controllers/neuroendocrine_control/real/neutronController.cpp:450:77:[m[K [01;35m[Kwarning: [m[Knarrowing conversion of ‘[01m[K((neutronController*)this)->neutronController::positions.std::vector<double>::at(6)[m[K’ from ‘[01m[K__gnu_cxx::__alloc_traits<std::allocator<double> >::value_type {aka double}[m[K’ to ‘[01m[Kfloat[m[K’ inside { } [[01;35m[K-Wnarrowing[m[K]
[01m[K/home/jettanan/morf_ANC/controllers/neuroendocrine_control/real/neutronController.cpp:450:98:[m[K [01;35m[Kwarning: [m[Knarrowing conversion of ‘[01m[K((neutronController*)this)->neutronController::positions.std::vector<double>::at(12)[m[K’ from ‘[01m[K__gnu_cxx::__alloc_traits<std::allocator<double> >::value_type {aka double}[m[K’ to ‘[01m[Kfloat[m[K’ inside { } [[01;35m[K-Wnarrowing[m[K]
     std::vector<float> positionsNew = {11,-positions.at(BC0),12,positions.at(CF0),13,[01;35m[Kpositions.at(FT0)[m[K,
                                                                                      [01;35m[K~~~~~~~~~~~~^~~~~[m[K
[01m[K/home/jettanan/morf_ANC/controllers/neuroendocrine_control/real/neutronController.cpp:450:98:[m[K [01;35m[Kwarning: [m[Knarrowing conversion of ‘[01m[K((neutronController*)this)->neutronController::positions.std::vector<double>::at(12)[m[K’ from ‘[01m[K__gnu_cxx::__alloc_traits<std::allocator<double> >::value_type {aka double}[m[K’ to ‘[01m[Kfloat[m[K’ inside { } [[01;35m[K-Wnarrowing[m[K]
[01m[K/home/jettanan/morf_ANC/controllers/neuroendocrine_control/real/neutronController.cpp:451:43:[m[K [01;35m[Kwarning: [m[Knarrowing conversion of ‘[01m[K-((neutronController*)this)->neutronController::positions.std::vector<double>::at(1)[m[K’ from ‘[01m[K__gnu_cxx::__alloc_traits<std::allocator<double> >::value_type {aka double}[m[K’ to ‘[01m[Kfloat[m[K’ inside { } [[01;35m[K-Wnarrowing[m[K]
                                        21,[01;35m[K-positions.at(BC1)[m[K,22,positions.at(CF1),23,positions.at(FT1),
                                           [01;35m[K^~~~~~~~~~~~~~~~~~[m[K
[01m[K/home/jettanan/morf_ANC/controllers/neuroendocrine_control/real/neutronController.cpp:451:43:[m[K [01;35m[Kwarning: [m[Knarrowing conversion of ‘[01m[K-((neutronController*)this)->neutronController::positions.std::vector<double>::at(1)[m[K’ from ‘[01m[K__gnu_cxx::__alloc_traits<std::allocator<double> >::value_type {aka double}[m[K’ to ‘[01m[Kfloat[m[K’ inside { } [[01;35m[K-Wnarrowing[m[K]
[01m[K/home/jettanan/morf_ANC/controllers/neuroendocrine_control/real/neutronController.cpp:451:77:[m[K [01;35m[Kwarning: [m[Knarrowing conversion of ‘[01m[K((neutronController*)this)->neutronController::positions.std::vector<double>::at(7)[m[K’ from ‘[01m[K__gnu_cxx::__alloc_traits<std::allocator<double> >::value_type {aka double}[m[K’ to ‘[01m[Kfloat[m[K’ inside { } [[01;35m[K-Wnarrowing[m[K]
                                        21,-positions.at(BC1),22,[01;35m[Kpositions.at(CF1)[m[K,23,positions.at(FT1),
                                                                 [01;35m[K~~~~~~~~~~~~^~~~~[m[K
[01m[K/home/jettanan/morf_ANC/controllers/neuroendocrine_control/real/neutronController.cpp:451:77:[m[K [01;35m[Kwarning: [m[Knarrowing conversion of ‘[01m[K((neutronController*)this)->neutronController::positions.std::vector<double>::at(7)[m[K’ from ‘[01m[K__gnu_cxx::__alloc_traits<std::allocator<double> >::value_type {aka double}[m[K’ to ‘[01m[Kfloat[m[K’ inside { } [[01;35m[K-Wnarrowing[m[K]
[01m[K/home/jettanan/morf_ANC/controllers/neuroendocrine_control/real/neutronController.cpp:451:98:[m[K [01;35m[Kwarning: [m[Knarrowing conversion of ‘[01m[K((neutronController*)this)->neutronController::positions.std::vector<double>::at(13)[m[K’ from ‘[01m[K__gnu_cxx::__alloc_traits<std::allocator<double> >::value_type {aka double}[m[K’ to ‘[01m[Kfloat[m[K’ inside { } [[01;35m[K-Wnarrowing[m[K]
                                        21,-positions.at(BC1),22,positions.at(CF1),23,[01;35m[Kpositions.at(FT1)[m[K,
                                                                                      [01;35m[K~~~~~~~~~~~~^~~~~[m[K
[01m[K/home/jettanan/morf_ANC/controllers/neuroendocrine_control/real/neutronController.cpp:451:98:[m[K [01;35m[Kwarning: [m[Knarrowing conversion of ‘[01m[K((neutronController*)this)->neutronController::positions.std::vector<double>::at(13)[m[K’ from ‘[01m[K__gnu_cxx::__alloc_traits<std::allocator<double> >::value_type {aka double}[m[K’ to ‘[01m[Kfloat[m[K’ inside { } [[01;35m[K-Wnarrowing[m[K]
[01m[K/home/jettanan/morf_ANC/controllers/neuroendocrine_control/real/neutronController.cpp:452:43:[m[K [01;35m[Kwarning: [m[Knarrowing conversion of ‘[01m[K-((neutronController*)this)->neutronController::positions.std::vector<double>::at(2)[m[K’ from ‘[01m[K__gnu_cxx::__alloc_traits<std::allocator<double> >::value_type {aka double}[m[K’ to ‘[01m[Kfloat[m[K’ inside { } [[01;35m[K-Wnarrowing[m[K]
                                        31,[01;35m[K-positions.at(BC2)[m[K,32,positions.at(CF2),33,positions.at(FT2),
                                           [01;35m[K^~~~~~~~~~~~~~~~~~[m[K
[01m[K/home/jettanan/morf_ANC/controllers/neuroendocrine_control/real/neutronController.cpp:452:43:[m[K [01;35m[Kwarning: [m[Knarrowing conversion of ‘[01m[K-((neutronController*)this)->neutronController::positions.std::vector<double>::at(2)[m[K’ from ‘[01m[K__gnu_cxx::__alloc_traits<std::allocator<double> >::value_type {aka double}[m[K’ to ‘[01m[Kfloat[m[K’ inside { } [[01;35m[K-Wnarrowing[m[K]
[01m[K/home/jettanan/morf_ANC/controllers/neuroendocrine_control/real/neutronController.cpp:452:77:[m[K [01;35m[Kwarning: [m[Knarrowing conversion of ‘[01m[K((neutronController*)this)->neutronController::positions.std::vector<double>::at(8)[m[K’ from ‘[01m[K__gnu_cxx::__alloc_traits<std::allocator<double> >::value_type {aka double}[m[K’ to ‘[01m[Kfloat[m[K’ inside { } [[01;35m[K-Wnarrowing[m[K]
                                        31,-positions.at(BC2),32,[01;35m[Kpositions.at(CF2)[m[K,33,positions.at(FT2),
                                                                 [01;35m[K~~~~~~~~~~~~^~~~~[m[K
[01m[K/home/jettanan/morf_ANC/controllers/neuroendocrine_control/real/neutronController.cpp:452:77:[m[K [01;35m[Kwarning: [m[Knarrowing conversion of ‘[01m[K((neutronController*)this)->neutronController::positions.std::vector<double>::at(8)[m[K’ from ‘[01m[K__gnu_cxx::__alloc_traits<std::allocator<double> >::value_type {aka double}[m[K’ to ‘[01m[Kfloat[m[K’ inside { } [[01;35m[K-Wnarrowing[m[K]
[01m[K/home/jettanan/morf_ANC/controllers/neuroendocrine_control/real/neutronController.cpp:452:98:[m[K [01;35m[Kwarning: [m[Knarrowing conversion of ‘[01m[K((neutronController*)this)->neutronController::positions.std::vector<double>::at(14)[m[K’ from ‘[01m[K__gnu_cxx::__alloc_traits<std::allocator<double> >::value_type {aka double}[m[K’ to ‘[01m[Kfloat[m[K’ inside { } [[01;35m[K-Wnarrowing[m[K]
                                        31,-positions.at(BC2),32,positions.at(CF2),33,[01;35m[Kpositions.at(FT2)[m[K,
                                                                                      [01;35m[K~~~~~~~~~~~~^~~~~[m[K
[01m[K/home/jettanan/morf_ANC/controllers/neuroendocrine_control/real/neutronController.cpp:452:98:[m[K [01;35m[Kwarning: [m[Knarrowing conversion of ‘[01m[K((neutronController*)this)->neutronController::positions.std::vector<double>::at(14)[m[K’ from ‘[01m[K__gnu_cxx::__alloc_traits<std::allocator<double> >::value_type {aka double}[m[K’ to ‘[01m[Kfloat[m[K’ inside { } [[01;35m[K-Wnarrowing[m[K]
[01m[K/home/jettanan/morf_ANC/controllers/neuroendocrine_control/real/neutronController.cpp:453:55:[m[K [01;35m[Kwarning: [m[Knarrowing conversion of ‘[01m[K((neutronController*)this)->neutronController::positions.std::vector<double>::at(3)[m[K’ from ‘[01m[K__gnu_cxx::__alloc_traits<std::allocator<double> >::value_type {aka double}[m[K’ to ‘[01m[Kfloat[m[K’ inside { } [[01;35m[K-Wnarrowing[m[K]
                                        41,[01;35m[Kpositions.at(BC3)[m[K,42,positions.at(CF3),43,positions.at(FT3),
                                           [01;35m[K~~~~~~~~~~~~^~~~~[m[K
[01m[K/home/jettanan/morf_ANC/controllers/neuroendocrine_control/real/neutronController.cpp:453:55:[m[K [01;35m[Kwarning: [m[Knarrowing conversion of ‘[01m[K((neutronController*)this)->neutronController::positions.std::vector<double>::at(3)[m[K’ from ‘[01m[K__gnu_cxx::__alloc_traits<std::allocator<double> >::value_type {aka double}[m[K’ to ‘[01m[Kfloat[m[K’ inside { } [[01;35m[K-Wnarrowing[m[K]
[01m[K/home/jettanan/morf_ANC/controllers/neuroendocrine_control/real/neutronController.cpp:453:76:[m[K [01;35m[Kwarning: [m[Knarrowing conversion of ‘[01m[K((neutronController*)this)->neutronController::positions.std::vector<double>::at(9)[m[K’ from ‘[01m[K__gnu_cxx::__alloc_traits<std::allocator<double> >::value_type {aka double}[m[K’ to ‘[01m[Kfloat[m[K’ inside { } [[01;35m[K-Wnarrowing[m[K]
                                        41,positions.at(BC3),42,[01;35m[Kpositions.at(CF3)[m[K,43,positions.at(FT3),
                                                                [01;35m[K~~~~~~~~~~~~^~~~~[m[K
[01m[K/home/jettanan/morf_ANC/controllers/neuroendocrine_control/real/neutronController.cpp:453:76:[m[K [01;35m[Kwarning: [m[Knarrowing conversion of ‘[01m[K((neutronController*)this)->neutronController::positions.std::vector<double>::at(9)[m[K’ from ‘[01m[K__gnu_cxx::__alloc_traits<std::allocator<double> >::value_type {aka double}[m[K’ to ‘[01m[Kfloat[m[K’ inside { } [[01;35m[K-Wnarrowing[m[K]
[01m[K/home/jettanan/morf_ANC/controllers/neuroendocrine_control/real/neutronController.cpp:453:97:[m[K [01;35m[Kwarning: [m[Knarrowing conversion of ‘[01m[K((neutronController*)this)->neutronController::positions.std::vector<double>::at(15)[m[K’ from ‘[01m[K__gnu_cxx::__alloc_traits<std::allocator<double> >::value_type {aka double}[m[K’ to ‘[01m[Kfloat[m[K’ inside { } [[01;35m[K-Wnarrowing[m[K]
                                        41,positions.at(BC3),42,positions.at(CF3),43,[01;35m[Kpositions.at(FT3)[m[K,
                                                                                     [01;35m[K~~~~~~~~~~~~^~~~~[m[K
[01m[K/home/jettanan/morf_ANC/controllers/neuroendocrine_control/real/neutronController.cpp:453:97:[m[K [01;35m[Kwarning: [m[Knarrowing conversion of ‘[01m[K((neutronController*)this)->neutronController::positions.std::vector<double>::at(15)[m[K’ from ‘[01m[K__gnu_cxx::__alloc_traits<std::allocator<double> >::value_type {aka double}[m[K’ to ‘[01m[Kfloat[m[K’ inside { } [[01;35m[K-Wnarrowing[m[K]
[01m[K/home/jettanan/morf_ANC/controllers/neuroendocrine_control/real/neutronController.cpp:454:55:[m[K [01;35m[Kwarning: [m[Knarrowing conversion of ‘[01m[K((neutronController*)this)->neutronController::positions.std::vector<double>::at(4)[m[K’ from ‘[01m[K__gnu_cxx::__alloc_traits<std::allocator<double> >::value_type {aka double}[m[K’ to ‘[01m[Kfloat[m[K’ inside { } [[01;35m[K-Wnarrowing[m[K]
                                        51,[01;35m[Kpositions.at(BC4)[m[K,52,positions.at(CF4),53,positions.at(FT4),
                                           [01;35m[K~~~~~~~~~~~~^~~~~[m[K
[01m[K/home/jettanan/morf_ANC/controllers/neuroendocrine_control/real/neutronController.cpp:454:55:[m[K [01;35m[Kwarning: [m[Knarrowing conversion of ‘[01m[K((neutronController*)this)->neutronController::positions.std::vector<double>::at(4)[m[K’ from ‘[01m[K__gnu_cxx::__alloc_traits<std::allocator<double> >::value_type {aka double}[m[K’ to ‘[01m[Kfloat[m[K’ inside { } [[01;35m[K-Wnarrowing[m[K]
[01m[K/home/jettanan/morf_ANC/controllers/neuroendocrine_control/real/neutronController.cpp:454:76:[m[K [01;35m[Kwarning: [m[Knarrowing conversion of ‘[01m[K((neutronController*)this)->neutronController::positions.std::vector<double>::at(10)[m[K’ from ‘[01m[K__gnu_cxx::__alloc_traits<std::allocator<double> >::value_type {aka double}[m[K’ to ‘[01m[Kfloat[m[K’ inside { } [[01;35m[K-Wnarrowing[m[K]
                                        51,positions.at(BC4),52,[01;35m[Kpositions.at(CF4)[m[K,53,positions.at(FT4),
                                                                [01;35m[K~~~~~~~~~~~~^~~~~[m[K
[01m[K/home/jettanan/morf_ANC/controllers/neuroendocrine_control/real/neutronController.cpp:454:76:[m[K [01;35m[Kwarning: [m[Knarrowing conversion of ‘[01m[K((neutronController*)this)->neutronController::positions.std::vector<double>::at(10)[m[K’ from ‘[01m[K__gnu_cxx::__alloc_traits<std::allocator<double> >::value_type {aka double}[m[K’ to ‘[01m[Kfloat[m[K’ inside { } [[01;35m[K-Wnarrowing[m[K]
[01m[K/home/jettanan/morf_ANC/controllers/neuroendocrine_control/real/neutronController.cpp:454:97:[m[K [01;35m[Kwarning: [m[Knarrowing conversion of ‘[01m[K((neutronController*)this)->neutronController::positions.std::vector<double>::at(16)[m[K’ from ‘[01m[K__gnu_cxx::__alloc_traits<std::allocator<double> >::value_type {aka double}[m[K’ to ‘[01m[Kfloat[m[K’ inside { } [[01;35m[K-Wnarrowing[m[K]
                                        51,positions.at(BC4),52,positions.at(CF4),53,[01;35m[Kpositions.at(FT4)[m[K,
                                                                                     [01;35m[K~~~~~~~~~~~~^~~~~[m[K
[01m[K/home/jettanan/morf_ANC/controllers/neuroendocrine_control/real/neutronController.cpp:454:97:[m[K [01;35m[Kwarning: [m[Knarrowing conversion of ‘[01m[K((neutronController*)this)->neutronController::positions.std::vector<double>::at(16)[m[K’ from ‘[01m[K__gnu_cxx::__alloc_traits<std::allocator<double> >::value_type {aka double}[m[K’ to ‘[01m[Kfloat[m[K’ inside { } [[01;35m[K-Wnarrowing[m[K]
[01m[K/home/jettanan/morf_ANC/controllers/neuroendocrine_control/real/neutronController.cpp:455:55:[m[K [01;35m[Kwarning: [m[Knarrowing conversion of ‘[01m[K((neutronController*)this)->neutronController::positions.std::vector<double>::at(5)[m[K’ from ‘[01m[K__gnu_cxx::__alloc_traits<std::allocator<double> >::value_type {aka double}[m[K’ to ‘[01m[Kfloat[m[K’ inside { } [[01;35m[K-Wnarrowing[m[K]
                                        61,[01;35m[Kpositions.at(BC5)[m[K,62,positions.at(CF5),63,positions.at(FT5)};//*/
                                           [01;35m[K~~~~~~~~~~~~^~~~~[m[K
[01m[K/home/jettanan/morf_ANC/controllers/neuroendocrine_control/real/neutronController.cpp:455:55:[m[K [01;35m[Kwarning: [m[Knarrowing conversion of ‘[01m[K((neutronController*)this)->neutronController::positions.std::vector<double>::at(5)[m[K’ from ‘[01m[K__gnu_cxx::__alloc_traits<std::allocator<double> >::value_type {aka double}[m[K’ to ‘[01m[Kfloat[m[K’ inside { } [[01;35m[K-Wnarrowing[m[K]
[01m[K/home/jettanan/morf_ANC/controllers/neuroendocrine_control/real/neutronController.cpp:455:76:[m[K [01;35m[Kwarning: [m[Knarrowing conversion of ‘[01m[K((neutronController*)this)->neutronController::positions.std::vector<double>::at(11)[m[K’ from ‘[01m[K__gnu_cxx::__alloc_traits<std::allocator<double> >::value_type {aka double}[m[K’ to ‘[01m[Kfloat[m[K’ inside { } [[01;35m[K-Wnarrowing[m[K]
                                        61,positions.at(BC5),62,[01;35m[Kpositions.at(CF5)[m[K,63,positions.at(FT5)};//*/
                                                                [01;35m[K~~~~~~~~~~~~^~~~~[m[K
[01m[K/home/jettanan/morf_ANC/controllers/neuroendocrine_control/real/neutronController.cpp:455:76:[m[K [01;35m[Kwarning: [m[Knarrowing conversion of ‘[01m[K((neutronController*)this)->neutronController::positions.std::vector<double>::at(11)[m[K’ from ‘[01m[K__gnu_cxx::__alloc_traits<std::allocator<double> >::value_type {aka double}[m[K’ to ‘[01m[Kfloat[m[K’ inside { } [[01;35m[K-Wnarrowing[m[K]
[01m[K/home/jettanan/morf_ANC/controllers/neuroendocrine_control/real/neutronController.cpp:455:97:[m[K [01;35m[Kwarning: [m[Knarrowing conversion of ‘[01m[K((neutronController*)this)->neutronController::positions.std::vector<double>::at(17)[m[K’ from ‘[01m[K__gnu_cxx::__alloc_traits<std::allocator<double> >::value_type {aka double}[m[K’ to ‘[01m[Kfloat[m[K’ inside { } [[01;35m[K-Wnarrowing[m[K]
                                        61,positions.at(BC5),62,positions.at(CF5),63,[01;35m[Kpositions.at(FT5)[m[K};//*/
                                                                                     [01;35m[K~~~~~~~~~~~~^~~~~[m[K
[01m[K/home/jettanan/morf_ANC/controllers/neuroendocrine_control/real/neutronController.cpp:455:97:[m[K [01;35m[Kwarning: [m[Knarrowing conversion of ‘[01m[K((neutronController*)this)->neutronController::positions.std::vector<double>::at(17)[m[K’ from ‘[01m[K__gnu_cxx::__alloc_traits<std::allocator<double> >::value_type {aka double}[m[K’ to ‘[01m[Kfloat[m[K’ inside { } [[01;35m[K-Wnarrowing[m[K]
