digraph "twoDegreesRelationshipsDiagram" {
  graph [    rankdir="RL"    bgcolor="#ffffff"    label="\nGenerated by SchemaSpy"    labeljust="l"    nodesep="0.18"    ranksep="0.46"    fontname="Helvetica"    fontsize="11"    ration="compress"  ];  node [    fontname="Helvetica"    fontsize="11"    shape="plaintext"  ];  edge [    arrowsize="0.8"  ];
  "batiment_groupe":"elipses":w -> "parcelle_unifiee":"parcelle_unifiee_id":e [arrowhead=none dir=back arrowtail=crowodot];
  "parcelle":"elipses":w -> "parcelle_unifiee":"parcelle_unifiee_id":e [arrowhead=none dir=back arrowtail=crowodot];
  "parcelle_unifiee_metrique":"parcelle_unifiee_id":w -> "parcelle_unifiee":"parcelle_unifiee_id":e [arrowhead=none dir=back arrowtail=teeodot];
  "batiment_groupe" [
   label=<
    <TABLE BORDER="0" CELLBORDER="1" CELLSPACING="0" BGCOLOR="#ffffff">
      <TR><TD COLSPAN="3"  BGCOLOR="#f5f5f5"><TABLE BORDER="0" CELLSPACING="0"><TR><TD ALIGN="LEFT" FIXEDSIZE="TRUE" WIDTH="102" HEIGHT="16"><B>batiment_groupe</B></TD><TD ALIGN="RIGHT">[table]</TD></TR></TABLE></TD></TR>
      <TR><TD PORT="elipses" COLSPAN="3" ALIGN="LEFT">...</TD></TR>
      <TR><TD ALIGN="LEFT" BGCOLOR="#ffffff">&lt; 1</TD><TD ALIGN="RIGHT" BGCOLOR="#ffffff">23,439,072 rows</TD><TD ALIGN="RIGHT" BGCOLOR="#ffffff">40 &gt;</TD></TR>
    </TABLE>>
    URL="batiment_groupe.html"
    target="_top"
    tooltip="batiment_groupe"
  ];
  "parcelle" [
   label=<
    <TABLE BORDER="0" CELLBORDER="1" CELLSPACING="0" BGCOLOR="#ffffff">
      <TR><TD COLSPAN="3"  BGCOLOR="#f5f5f5"><TABLE BORDER="0" CELLSPACING="0"><TR><TD ALIGN="LEFT" FIXEDSIZE="TRUE" WIDTH="47" HEIGHT="16"><B>parcelle</B></TD><TD ALIGN="RIGHT">[table]</TD></TR></TABLE></TD></TR>
      <TR><TD PORT="elipses" COLSPAN="3" ALIGN="LEFT">...</TD></TR>
      <TR><TD ALIGN="LEFT" BGCOLOR="#ffffff">&lt; 1</TD><TD ALIGN="RIGHT" BGCOLOR="#ffffff">92,057,400 rows</TD><TD ALIGN="RIGHT" BGCOLOR="#ffffff">1 &gt;</TD></TR>
    </TABLE>>
    URL="parcelle.html"
    target="_top"
    tooltip="parcelle"
  ];
  "parcelle_unifiee" [
   label=<
    <TABLE BORDER="0" CELLBORDER="1" CELLSPACING="0" BGCOLOR="#ffffff">
      <TR><TD COLSPAN="3"  BGCOLOR="#f5f5f5"><TABLE BORDER="0" CELLSPACING="0"><TR><TD ALIGN="LEFT" FIXEDSIZE="TRUE" WIDTH="94" HEIGHT="16"><B>parcelle_unifiee</B></TD><TD ALIGN="RIGHT">[table]</TD></TR></TABLE></TD></TR>
      <TR><TD PORT="parcelle_unifiee_id" COLSPAN="3" ALIGN="LEFT"><TABLE BORDER="0" CELLSPACING="0" ALIGN="LEFT"><TR ALIGN="LEFT"><TD ALIGN="LEFT" FIXEDSIZE="TRUE" WIDTH="15" HEIGHT="16"><IMG SRC="../../images/primaryKeys.png"/></TD><TD ALIGN="LEFT" FIXEDSIZE="TRUE" WIDTH="175" HEIGHT="16">parcelle_unifiee_id</TD></TR></TABLE></TD></TR>
      <TR><TD PORT="code_departement_insee" COLSPAN="3" BGCOLOR="#ffffff" ALIGN="LEFT"><TABLE BORDER="0" CELLSPACING="0" ALIGN="LEFT"><TR ALIGN="LEFT"><TD ALIGN="LEFT" FIXEDSIZE="TRUE" WIDTH="15" HEIGHT="16"></TD><TD ALIGN="LEFT" FIXEDSIZE="TRUE" WIDTH="175" HEIGHT="16">code_departement_insee</TD></TR></TABLE></TD></TR>
      <TR><TD PORT="geom_parcelle_unifiee" COLSPAN="3" BGCOLOR="#ffffff" ALIGN="LEFT"><TABLE BORDER="0" CELLSPACING="0" ALIGN="LEFT"><TR ALIGN="LEFT"><TD ALIGN="LEFT" FIXEDSIZE="TRUE" WIDTH="15" HEIGHT="16"></TD><TD ALIGN="LEFT" FIXEDSIZE="TRUE" WIDTH="175" HEIGHT="16">geom_parcelle_unifiee</TD></TR></TABLE></TD></TR>
      <TR><TD PORT="elipses" COLSPAN="3" ALIGN="LEFT">...</TD></TR>
      <TR><TD ALIGN="LEFT" BGCOLOR="#ffffff">  </TD><TD ALIGN="RIGHT" BGCOLOR="#ffffff">22,648,552 rows</TD><TD ALIGN="RIGHT" BGCOLOR="#ffffff">3 &gt;</TD></TR>
    </TABLE>>
    URL="parcelle_unifiee.html"
    target="_top"
    tooltip="parcelle_unifiee"
  ];
  "parcelle_unifiee_metrique" [
   label=<
    <TABLE BORDER="2" CELLBORDER="1" CELLSPACING="0" BGCOLOR="#ffffff">
      <TR><TD COLSPAN="4"  BGCOLOR="#f5f5f5"><TABLE BORDER="0" CELLSPACING="0"><TR><TD ALIGN="LEFT" FIXEDSIZE="TRUE" WIDTH="155" HEIGHT="16"><B>parcelle_unifiee_metrique</B></TD><TD ALIGN="RIGHT">[table]</TD></TR></TABLE></TD></TR>
      <TR><TD PORT="parcelle_unifiee_id" COLSPAN="2" ALIGN="LEFT"><TABLE BORDER="0" CELLSPACING="0" ALIGN="LEFT"><TR ALIGN="LEFT"><TD ALIGN="LEFT" FIXEDSIZE="TRUE" WIDTH="15" HEIGHT="16"><IMG SRC="../../images/primaryKeys.png"/></TD><TD ALIGN="LEFT" FIXEDSIZE="TRUE" WIDTH="157" HEIGHT="16">parcelle_unifiee_id</TD></TR></TABLE></TD><TD PORT="parcelle_unifiee_id.type" ALIGN="LEFT">varchar[14]</TD></TR>
      <TR><TD PORT="code_departement_insee" COLSPAN="2" BGCOLOR="#ffffff" ALIGN="LEFT"><TABLE BORDER="0" CELLSPACING="0" ALIGN="LEFT"><TR ALIGN="LEFT"><TD ALIGN="LEFT" FIXEDSIZE="TRUE" WIDTH="15" HEIGHT="16"></TD><TD ALIGN="LEFT" FIXEDSIZE="TRUE" WIDTH="157" HEIGHT="16">code_departement_insee</TD></TR></TABLE></TD><TD PORT="code_departement_insee.type" ALIGN="LEFT">varchar[2]</TD></TR>
      <TR><TD PORT="nb_parcelle" COLSPAN="2" ALIGN="LEFT"><TABLE BORDER="0" CELLSPACING="0" ALIGN="LEFT"><TR ALIGN="LEFT"><TD ALIGN="LEFT" FIXEDSIZE="TRUE" WIDTH="15" HEIGHT="16"></TD><TD ALIGN="LEFT" FIXEDSIZE="TRUE" WIDTH="157" HEIGHT="16">nb_parcelle</TD></TR></TABLE></TD><TD PORT="nb_parcelle.type" ALIGN="LEFT">int4[10]</TD></TR>
      <TR><TD PORT="nb_batiment_groupe" COLSPAN="2" ALIGN="LEFT"><TABLE BORDER="0" CELLSPACING="0" ALIGN="LEFT"><TR ALIGN="LEFT"><TD ALIGN="LEFT" FIXEDSIZE="TRUE" WIDTH="15" HEIGHT="16"></TD><TD ALIGN="LEFT" FIXEDSIZE="TRUE" WIDTH="157" HEIGHT="16">nb_batiment_groupe</TD></TR></TABLE></TD><TD PORT="nb_batiment_groupe.type" ALIGN="LEFT">int4[10]</TD></TR>
      <TR><TD PORT="nb_batiment" COLSPAN="2" ALIGN="LEFT"><TABLE BORDER="0" CELLSPACING="0" ALIGN="LEFT"><TR ALIGN="LEFT"><TD ALIGN="LEFT" FIXEDSIZE="TRUE" WIDTH="15" HEIGHT="16"></TD><TD ALIGN="LEFT" FIXEDSIZE="TRUE" WIDTH="157" HEIGHT="16">nb_batiment</TD></TR></TABLE></TD><TD PORT="nb_batiment.type" ALIGN="LEFT">int4[10]</TD></TR>
      <TR><TD PORT="nb_batiment_construction" COLSPAN="2" ALIGN="LEFT"><TABLE BORDER="0" CELLSPACING="0" ALIGN="LEFT"><TR ALIGN="LEFT"><TD ALIGN="LEFT" FIXEDSIZE="TRUE" WIDTH="15" HEIGHT="16"></TD><TD ALIGN="LEFT" FIXEDSIZE="TRUE" WIDTH="157" HEIGHT="16">nb_batiment_construction</TD></TR></TABLE></TD><TD PORT="nb_batiment_construction.type" ALIGN="LEFT">int4[10]</TD></TR>
      <TR><TD PORT="nb_adresse" COLSPAN="2" ALIGN="LEFT"><TABLE BORDER="0" CELLSPACING="0" ALIGN="LEFT"><TR ALIGN="LEFT"><TD ALIGN="LEFT" FIXEDSIZE="TRUE" WIDTH="15" HEIGHT="16"></TD><TD ALIGN="LEFT" FIXEDSIZE="TRUE" WIDTH="157" HEIGHT="16">nb_adresse</TD></TR></TABLE></TD><TD PORT="nb_adresse.type" ALIGN="LEFT">int4[10]</TD></TR>
      <TR><TD PORT="nb_adresse_valide" COLSPAN="2" ALIGN="LEFT"><TABLE BORDER="0" CELLSPACING="0" ALIGN="LEFT"><TR ALIGN="LEFT"><TD ALIGN="LEFT" FIXEDSIZE="TRUE" WIDTH="15" HEIGHT="16"></TD><TD ALIGN="LEFT" FIXEDSIZE="TRUE" WIDTH="157" HEIGHT="16">nb_adresse_valide</TD></TR></TABLE></TD><TD PORT="nb_adresse_valide.type" ALIGN="LEFT">int4[10]</TD></TR>
      <TR><TD PORT="nb_adresse_valide_ban" COLSPAN="2" ALIGN="LEFT"><TABLE BORDER="0" CELLSPACING="0" ALIGN="LEFT"><TR ALIGN="LEFT"><TD ALIGN="LEFT" FIXEDSIZE="TRUE" WIDTH="15" HEIGHT="16"></TD><TD ALIGN="LEFT" FIXEDSIZE="TRUE" WIDTH="157" HEIGHT="16">nb_adresse_valide_ban</TD></TR></TABLE></TD><TD PORT="nb_adresse_valide_ban.type" ALIGN="LEFT">int4[10]</TD></TR>
      <TR><TD PORT="nb_adresse_valide_arcep" COLSPAN="2" ALIGN="LEFT"><TABLE BORDER="0" CELLSPACING="0" ALIGN="LEFT"><TR ALIGN="LEFT"><TD ALIGN="LEFT" FIXEDSIZE="TRUE" WIDTH="15" HEIGHT="16"></TD><TD ALIGN="LEFT" FIXEDSIZE="TRUE" WIDTH="157" HEIGHT="16">nb_adresse_valide_arcep</TD></TR></TABLE></TD><TD PORT="nb_adresse_valide_arcep.type" ALIGN="LEFT">int4[10]</TD></TR>
      <TR><TD PORT="nb_adresse_valide_ffo" COLSPAN="2" ALIGN="LEFT"><TABLE BORDER="0" CELLSPACING="0" ALIGN="LEFT"><TR ALIGN="LEFT"><TD ALIGN="LEFT" FIXEDSIZE="TRUE" WIDTH="15" HEIGHT="16"></TD><TD ALIGN="LEFT" FIXEDSIZE="TRUE" WIDTH="157" HEIGHT="16">nb_adresse_valide_ffo</TD></TR></TABLE></TD><TD PORT="nb_adresse_valide_ffo.type" ALIGN="LEFT">int4[10]</TD></TR>
      <TR><TD PORT="cle_interop_adr_principale" COLSPAN="2" BGCOLOR="#ffffff" ALIGN="LEFT"><TABLE BORDER="0" CELLSPACING="0" ALIGN="LEFT"><TR ALIGN="LEFT"><TD ALIGN="LEFT" FIXEDSIZE="TRUE" WIDTH="15" HEIGHT="16"></TD><TD ALIGN="LEFT" FIXEDSIZE="TRUE" WIDTH="157" HEIGHT="16">cle_interop_adr_principale</TD></TR></TABLE></TD><TD PORT="cle_interop_adr_principale.type" ALIGN="LEFT">text[2147483647]</TD></TR>
      <TR><TD PORT="libelle_adr_principale" COLSPAN="2" ALIGN="LEFT"><TABLE BORDER="0" CELLSPACING="0" ALIGN="LEFT"><TR ALIGN="LEFT"><TD ALIGN="LEFT" FIXEDSIZE="TRUE" WIDTH="15" HEIGHT="16"></TD><TD ALIGN="LEFT" FIXEDSIZE="TRUE" WIDTH="157" HEIGHT="16">libelle_adr_principale</TD></TR></TABLE></TD><TD PORT="libelle_adr_principale.type" ALIGN="LEFT">text[2147483647]</TD></TR>
      <TR><TD PORT="fiabilite_cr_adr_niv_1" COLSPAN="2" ALIGN="LEFT"><TABLE BORDER="0" CELLSPACING="0" ALIGN="LEFT"><TR ALIGN="LEFT"><TD ALIGN="LEFT" FIXEDSIZE="TRUE" WIDTH="15" HEIGHT="16"></TD><TD ALIGN="LEFT" FIXEDSIZE="TRUE" WIDTH="157" HEIGHT="16">fiabilite_cr_adr_niv_1</TD></TR></TABLE></TD><TD PORT="fiabilite_cr_adr_niv_1.type" ALIGN="LEFT">text[2147483647]</TD></TR>
      <TR><TD PORT="fiabilite_cr_adr_niv_2" COLSPAN="2" ALIGN="LEFT"><TABLE BORDER="0" CELLSPACING="0" ALIGN="LEFT"><TR ALIGN="LEFT"><TD ALIGN="LEFT" FIXEDSIZE="TRUE" WIDTH="15" HEIGHT="16"></TD><TD ALIGN="LEFT" FIXEDSIZE="TRUE" WIDTH="157" HEIGHT="16">fiabilite_cr_adr_niv_2</TD></TR></TABLE></TD><TD PORT="fiabilite_cr_adr_niv_2.type" ALIGN="LEFT">text[2147483647]</TD></TR>
      <TR><TD ALIGN="LEFT" BGCOLOR="#ffffff">&lt; 1</TD><TD ALIGN="RIGHT" BGCOLOR="#ffffff">22,662,300 rows</TD><TD ALIGN="RIGHT" BGCOLOR="#ffffff">0 &gt;</TD></TR>
    </TABLE>>
    URL="parcelle_unifiee_metrique.html"
    target="_top"
    tooltip="parcelle_unifiee_metrique"
  ];
}
