digraph "oneDegreeRelationshipsDiagramImplied" {
  graph [    rankdir="RL"    bgcolor="#ffffff"    label="\nGenerated by SchemaSpy"    labeljust="l"    nodesep="0.18"    ranksep="0.46"    fontname="Helvetica"    fontsize="11"    ration="compress"  ];  node [    fontname="Helvetica"    fontsize="11"    shape="plaintext"  ];  edge [    arrowsize="0.8"  ];
  "local_simulations_dpe":"batiment_groupe_id":w -> "batiment_groupe":"batiment_groupe_id":e [arrowhead=none dir=back arrowtail=crowodot];
  "local_simulations_dpe":"local_id":w -> "local":"local_id":e [arrowhead=none dir=back arrowtail=crowodot];
  "batiment_groupe" [
   label=<
    <TABLE BORDER="0" CELLBORDER="1" CELLSPACING="0" BGCOLOR="#ffffff">
      <TR><TD COLSPAN="3"  BGCOLOR="#f5f5f5"><TABLE BORDER="0" CELLSPACING="0"><TR><TD ALIGN="LEFT" FIXEDSIZE="TRUE" WIDTH="102" HEIGHT="16"><B>batiment_groupe</B></TD><TD ALIGN="RIGHT">[table]</TD></TR></TABLE></TD></TR>
      <TR><TD PORT="batiment_groupe_id" COLSPAN="3" ALIGN="LEFT"><TABLE BORDER="0" CELLSPACING="0" ALIGN="LEFT"><TR ALIGN="LEFT"><TD ALIGN="LEFT" FIXEDSIZE="TRUE" WIDTH="15" HEIGHT="16"><IMG SRC="../../images/primaryKeys.png"/></TD><TD ALIGN="LEFT" FIXEDSIZE="TRUE" WIDTH="177" HEIGHT="16">batiment_groupe_id</TD></TR></TABLE></TD></TR>
      <TR><TD PORT="parcelle_unifiee_id" COLSPAN="3" BGCOLOR="#ffffff" ALIGN="LEFT"><TABLE BORDER="0" CELLSPACING="0" ALIGN="LEFT"><TR ALIGN="LEFT"><TD ALIGN="LEFT" FIXEDSIZE="TRUE" WIDTH="15" HEIGHT="16"><IMG SRC="../../images/foreignKeys.png"/></TD><TD ALIGN="LEFT" FIXEDSIZE="TRUE" WIDTH="177" HEIGHT="16">parcelle_unifiee_id</TD></TR></TABLE></TD></TR>
      <TR><TD PORT="code_departement_insee" COLSPAN="3" BGCOLOR="#ffffff" ALIGN="LEFT"><TABLE BORDER="0" CELLSPACING="0" ALIGN="LEFT"><TR ALIGN="LEFT"><TD ALIGN="LEFT" FIXEDSIZE="TRUE" WIDTH="15" HEIGHT="16"></TD><TD ALIGN="LEFT" FIXEDSIZE="TRUE" WIDTH="177" HEIGHT="16">code_departement_insee</TD></TR></TABLE></TD></TR>
      <TR><TD PORT="code_iris" COLSPAN="3" BGCOLOR="#ffffff" ALIGN="LEFT"><TABLE BORDER="0" CELLSPACING="0" ALIGN="LEFT"><TR ALIGN="LEFT"><TD ALIGN="LEFT" FIXEDSIZE="TRUE" WIDTH="15" HEIGHT="16"></TD><TD ALIGN="LEFT" FIXEDSIZE="TRUE" WIDTH="177" HEIGHT="16">code_iris</TD></TR></TABLE></TD></TR>
      <TR><TD PORT="code_commune_insee" COLSPAN="3" BGCOLOR="#ffffff" ALIGN="LEFT"><TABLE BORDER="0" CELLSPACING="0" ALIGN="LEFT"><TR ALIGN="LEFT"><TD ALIGN="LEFT" FIXEDSIZE="TRUE" WIDTH="15" HEIGHT="16"></TD><TD ALIGN="LEFT" FIXEDSIZE="TRUE" WIDTH="177" HEIGHT="16">code_commune_insee</TD></TR></TABLE></TD></TR>
      <TR><TD PORT="code_epci_insee" COLSPAN="3" BGCOLOR="#ffffff" ALIGN="LEFT"><TABLE BORDER="0" CELLSPACING="0" ALIGN="LEFT"><TR ALIGN="LEFT"><TD ALIGN="LEFT" FIXEDSIZE="TRUE" WIDTH="15" HEIGHT="16"></TD><TD ALIGN="LEFT" FIXEDSIZE="TRUE" WIDTH="177" HEIGHT="16">code_epci_insee</TD></TR></TABLE></TD></TR>
      <TR><TD PORT="geom_groupe" COLSPAN="3" BGCOLOR="#ffffff" ALIGN="LEFT"><TABLE BORDER="0" CELLSPACING="0" ALIGN="LEFT"><TR ALIGN="LEFT"><TD ALIGN="LEFT" FIXEDSIZE="TRUE" WIDTH="15" HEIGHT="16"></TD><TD ALIGN="LEFT" FIXEDSIZE="TRUE" WIDTH="177" HEIGHT="16">geom_groupe</TD></TR></TABLE></TD></TR>
      <TR><TD PORT="elipses" COLSPAN="3" ALIGN="LEFT">...</TD></TR>
      <TR><TD ALIGN="LEFT" BGCOLOR="#ffffff">&lt; 1</TD><TD ALIGN="RIGHT" BGCOLOR="#ffffff">23,439,072 rows</TD><TD ALIGN="RIGHT" BGCOLOR="#ffffff">40 &gt;</TD></TR>
    </TABLE>>
    URL="batiment_groupe.html"
    target="_top"
    tooltip="batiment_groupe"
  ];
  "local" [
   label=<
    <TABLE BORDER="0" CELLBORDER="1" CELLSPACING="0" BGCOLOR="#ffffff">
      <TR><TD COLSPAN="3"  BGCOLOR="#f5f5f5"><TABLE BORDER="0" CELLSPACING="0"><TR><TD ALIGN="LEFT" FIXEDSIZE="TRUE" WIDTH="28" HEIGHT="16"><B>local</B></TD><TD ALIGN="RIGHT">[table]</TD></TR></TABLE></TD></TR>
      <TR><TD PORT="local_id" COLSPAN="3" ALIGN="LEFT"><TABLE BORDER="0" CELLSPACING="0" ALIGN="LEFT"><TR ALIGN="LEFT"><TD ALIGN="LEFT" FIXEDSIZE="TRUE" WIDTH="15" HEIGHT="16"><IMG SRC="../../images/primaryKeys.png"/></TD><TD ALIGN="LEFT" FIXEDSIZE="TRUE" WIDTH="149" HEIGHT="16">local_id</TD></TR></TABLE></TD></TR>
      <TR><TD PORT="code_departement_insee" COLSPAN="3" BGCOLOR="#ffffff" ALIGN="LEFT"><TABLE BORDER="0" CELLSPACING="0" ALIGN="LEFT"><TR ALIGN="LEFT"><TD ALIGN="LEFT" FIXEDSIZE="TRUE" WIDTH="15" HEIGHT="16"></TD><TD ALIGN="LEFT" FIXEDSIZE="TRUE" WIDTH="149" HEIGHT="16">code_departement_insee</TD></TR></TABLE></TD></TR>
      <TR><TD PORT="batiment_id" COLSPAN="3" BGCOLOR="#ffffff" ALIGN="LEFT"><TABLE BORDER="0" CELLSPACING="0" ALIGN="LEFT"><TR ALIGN="LEFT"><TD ALIGN="LEFT" FIXEDSIZE="TRUE" WIDTH="15" HEIGHT="16"><IMG SRC="../../images/foreignKeys.png"/></TD><TD ALIGN="LEFT" FIXEDSIZE="TRUE" WIDTH="149" HEIGHT="16">batiment_id</TD></TR></TABLE></TD></TR>
      <TR><TD PORT="parcelle_id" COLSPAN="3" BGCOLOR="#ffffff" ALIGN="LEFT"><TABLE BORDER="0" CELLSPACING="0" ALIGN="LEFT"><TR ALIGN="LEFT"><TD ALIGN="LEFT" FIXEDSIZE="TRUE" WIDTH="15" HEIGHT="16"><IMG SRC="../../images/foreignKeys.png"/></TD><TD ALIGN="LEFT" FIXEDSIZE="TRUE" WIDTH="149" HEIGHT="16">parcelle_id</TD></TR></TABLE></TD></TR>
      <TR><TD PORT="code_commune_insee" COLSPAN="3" BGCOLOR="#ffffff" ALIGN="LEFT"><TABLE BORDER="0" CELLSPACING="0" ALIGN="LEFT"><TR ALIGN="LEFT"><TD ALIGN="LEFT" FIXEDSIZE="TRUE" WIDTH="15" HEIGHT="16"></TD><TD ALIGN="LEFT" FIXEDSIZE="TRUE" WIDTH="149" HEIGHT="16">code_commune_insee</TD></TR></TABLE></TD></TR>
      <TR><TD PORT="elipses" COLSPAN="3" ALIGN="LEFT">...</TD></TR>
      <TR><TD ALIGN="LEFT" BGCOLOR="#ffffff">&lt; 1</TD><TD ALIGN="RIGHT" BGCOLOR="#ffffff">51,101,820 rows</TD><TD ALIGN="RIGHT" BGCOLOR="#ffffff">1 &gt;</TD></TR>
    </TABLE>>
    URL="local.html"
    target="_top"
    tooltip="local"
  ];
  "local_simulations_dpe" [
   label=<
    <TABLE BORDER="2" CELLBORDER="1" CELLSPACING="0" BGCOLOR="#ffffff">
      <TR><TD COLSPAN="4"  BGCOLOR="#f5f5f5"><TABLE BORDER="0" CELLSPACING="0"><TR><TD ALIGN="LEFT" FIXEDSIZE="TRUE" WIDTH="130" HEIGHT="16"><B>local_simulations_dpe</B></TD><TD ALIGN="RIGHT">[table]</TD></TR></TABLE></TD></TR>
      <TR><TD PORT="cstb_local_oid" COLSPAN="2" ALIGN="LEFT"><TABLE BORDER="0" CELLSPACING="0" ALIGN="LEFT"><TR ALIGN="LEFT"><TD ALIGN="LEFT" FIXEDSIZE="TRUE" WIDTH="15" HEIGHT="16"><IMG SRC="../../images/primaryKeys.png"/></TD><TD ALIGN="LEFT" FIXEDSIZE="TRUE" WIDTH="352" HEIGHT="16">cstb_local_oid</TD></TR></TABLE></TD><TD PORT="cstb_local_oid.type" ALIGN="LEFT">serial[10]</TD></TR>
      <TR><TD PORT="local_id" COLSPAN="2" BGCOLOR="#ffffff" ALIGN="LEFT"><TABLE BORDER="0" CELLSPACING="0" ALIGN="LEFT"><TR ALIGN="LEFT"><TD ALIGN="LEFT" FIXEDSIZE="TRUE" WIDTH="15" HEIGHT="16"><IMG SRC="../../images/foreignKeys.png"/></TD><TD ALIGN="LEFT" FIXEDSIZE="TRUE" WIDTH="352" HEIGHT="16">local_id</TD></TR></TABLE></TD><TD PORT="local_id.type" ALIGN="LEFT">varchar[12]</TD></TR>
      <TR><TD PORT="batiment_groupe_id" COLSPAN="2" ALIGN="LEFT"><TABLE BORDER="0" CELLSPACING="0" ALIGN="LEFT"><TR ALIGN="LEFT"><TD ALIGN="LEFT" FIXEDSIZE="TRUE" WIDTH="15" HEIGHT="16"><IMG SRC="../../images/foreignKeys.png"/></TD><TD ALIGN="LEFT" FIXEDSIZE="TRUE" WIDTH="352" HEIGHT="16">batiment_groupe_id</TD></TR></TABLE></TD><TD PORT="batiment_groupe_id.type" ALIGN="LEFT">varchar[30]</TD></TR>
      <TR><TD PORT="code_departement_insee" COLSPAN="2" BGCOLOR="#ffffff" ALIGN="LEFT"><TABLE BORDER="0" CELLSPACING="0" ALIGN="LEFT"><TR ALIGN="LEFT"><TD ALIGN="LEFT" FIXEDSIZE="TRUE" WIDTH="15" HEIGHT="16"></TD><TD ALIGN="LEFT" FIXEDSIZE="TRUE" WIDTH="352" HEIGHT="16">code_departement_insee</TD></TR></TABLE></TD><TD PORT="code_departement_insee.type" ALIGN="LEFT">varchar[2]</TD></TR>
      <TR><TD PORT="position_logement" COLSPAN="2" ALIGN="LEFT"><TABLE BORDER="0" CELLSPACING="0" ALIGN="LEFT"><TR ALIGN="LEFT"><TD ALIGN="LEFT" FIXEDSIZE="TRUE" WIDTH="15" HEIGHT="16"></TD><TD ALIGN="LEFT" FIXEDSIZE="TRUE" WIDTH="352" HEIGHT="16">position_logement</TD></TR></TABLE></TD><TD PORT="position_logement.type" ALIGN="LEFT">text[2147483647]</TD></TR>
      <TR><TD PORT="stoth" COLSPAN="2" ALIGN="LEFT"><TABLE BORDER="0" CELLSPACING="0" ALIGN="LEFT"><TR ALIGN="LEFT"><TD ALIGN="LEFT" FIXEDSIZE="TRUE" WIDTH="15" HEIGHT="16"></TD><TD ALIGN="LEFT" FIXEDSIZE="TRUE" WIDTH="352" HEIGHT="16">stoth</TD></TR></TABLE></TD><TD PORT="stoth.type" ALIGN="LEFT">int4[10]</TD></TR>
      <TR><TD PORT="indecence_energetique_initial" COLSPAN="2" ALIGN="LEFT"><TABLE BORDER="0" CELLSPACING="0" ALIGN="LEFT"><TR ALIGN="LEFT"><TD ALIGN="LEFT" FIXEDSIZE="TRUE" WIDTH="15" HEIGHT="16"></TD><TD ALIGN="LEFT" FIXEDSIZE="TRUE" WIDTH="352" HEIGHT="16">indecence_energetique_initial</TD></TR></TABLE></TD><TD PORT="indecence_energetique_initial.type" ALIGN="LEFT">numeric[0]</TD></TR>
      <TR><TD PORT="indecence_energetique_renove" COLSPAN="2" ALIGN="LEFT"><TABLE BORDER="0" CELLSPACING="0" ALIGN="LEFT"><TR ALIGN="LEFT"><TD ALIGN="LEFT" FIXEDSIZE="TRUE" WIDTH="15" HEIGHT="16"></TD><TD ALIGN="LEFT" FIXEDSIZE="TRUE" WIDTH="352" HEIGHT="16">indecence_energetique_renove</TD></TR></TABLE></TD><TD PORT="indecence_energetique_renove.type" ALIGN="LEFT">numeric[0]</TD></TR>
      <TR><TD PORT="gisement_gain_conso_finale_total" COLSPAN="2" ALIGN="LEFT"><TABLE BORDER="0" CELLSPACING="0" ALIGN="LEFT"><TR ALIGN="LEFT"><TD ALIGN="LEFT" FIXEDSIZE="TRUE" WIDTH="15" HEIGHT="16"></TD><TD ALIGN="LEFT" FIXEDSIZE="TRUE" WIDTH="352" HEIGHT="16">gisement_gain_conso_finale_total</TD></TR></TABLE></TD><TD PORT="gisement_gain_conso_finale_total.type" ALIGN="LEFT">int4[10]</TD></TR>
      <TR><TD PORT="gisement_gain_ges_mean" COLSPAN="2" ALIGN="LEFT"><TABLE BORDER="0" CELLSPACING="0" ALIGN="LEFT"><TR ALIGN="LEFT"><TD ALIGN="LEFT" FIXEDSIZE="TRUE" WIDTH="15" HEIGHT="16"></TD><TD ALIGN="LEFT" FIXEDSIZE="TRUE" WIDTH="352" HEIGHT="16">gisement_gain_ges_mean</TD></TR></TABLE></TD><TD PORT="gisement_gain_ges_mean.type" ALIGN="LEFT">int4[10]</TD></TR>
      <TR><TD PORT="gisement_gain_energetique_mean" COLSPAN="2" ALIGN="LEFT"><TABLE BORDER="0" CELLSPACING="0" ALIGN="LEFT"><TR ALIGN="LEFT"><TD ALIGN="LEFT" FIXEDSIZE="TRUE" WIDTH="15" HEIGHT="16"></TD><TD ALIGN="LEFT" FIXEDSIZE="TRUE" WIDTH="352" HEIGHT="16">gisement_gain_energetique_mean</TD></TR></TABLE></TD><TD PORT="gisement_gain_energetique_mean.type" ALIGN="LEFT">int4[10]</TD></TR>
      <TR><TD PORT="etat_initial_consommation_energie_estim_inc" COLSPAN="2" ALIGN="LEFT"><TABLE BORDER="0" CELLSPACING="0" ALIGN="LEFT"><TR ALIGN="LEFT"><TD ALIGN="LEFT" FIXEDSIZE="TRUE" WIDTH="15" HEIGHT="16"></TD><TD ALIGN="LEFT" FIXEDSIZE="TRUE" WIDTH="352" HEIGHT="16">etat_initial_consommation_energie_estim_inc</TD></TR></TABLE></TD><TD PORT="etat_initial_consommation_energie_estim_inc.type" ALIGN="LEFT">int4[10]</TD></TR>
      <TR><TD PORT="etat_initial_consommation_energie_estim_lower" COLSPAN="2" ALIGN="LEFT"><TABLE BORDER="0" CELLSPACING="0" ALIGN="LEFT"><TR ALIGN="LEFT"><TD ALIGN="LEFT" FIXEDSIZE="TRUE" WIDTH="15" HEIGHT="16"></TD><TD ALIGN="LEFT" FIXEDSIZE="TRUE" WIDTH="352" HEIGHT="16">etat_initial_consommation_energie_estim_lower</TD></TR></TABLE></TD><TD PORT="etat_initial_consommation_energie_estim_lower.type" ALIGN="LEFT">int4[10]</TD></TR>
      <TR><TD PORT="etat_initial_consommation_energie_estim_mean" COLSPAN="2" ALIGN="LEFT"><TABLE BORDER="0" CELLSPACING="0" ALIGN="LEFT"><TR ALIGN="LEFT"><TD ALIGN="LEFT" FIXEDSIZE="TRUE" WIDTH="15" HEIGHT="16"></TD><TD ALIGN="LEFT" FIXEDSIZE="TRUE" WIDTH="352" HEIGHT="16">etat_initial_consommation_energie_estim_mean</TD></TR></TABLE></TD><TD PORT="etat_initial_consommation_energie_estim_mean.type" ALIGN="LEFT">int4[10]</TD></TR>
      <TR><TD PORT="etat_initial_consommation_energie_estim_upper" COLSPAN="2" ALIGN="LEFT"><TABLE BORDER="0" CELLSPACING="0" ALIGN="LEFT"><TR ALIGN="LEFT"><TD ALIGN="LEFT" FIXEDSIZE="TRUE" WIDTH="15" HEIGHT="16"></TD><TD ALIGN="LEFT" FIXEDSIZE="TRUE" WIDTH="352" HEIGHT="16">etat_initial_consommation_energie_estim_upper</TD></TR></TABLE></TD><TD PORT="etat_initial_consommation_energie_estim_upper.type" ALIGN="LEFT">int4[10]</TD></TR>
      <TR><TD PORT="etat_initial_consommation_energie_primaire_estim_lower" COLSPAN="2" ALIGN="LEFT"><TABLE BORDER="0" CELLSPACING="0" ALIGN="LEFT"><TR ALIGN="LEFT"><TD ALIGN="LEFT" FIXEDSIZE="TRUE" WIDTH="15" HEIGHT="16"></TD><TD ALIGN="LEFT" FIXEDSIZE="TRUE" WIDTH="352" HEIGHT="16">etat_initial_consommation_energie_primaire_estim_lower</TD></TR></TABLE></TD><TD PORT="etat_initial_consommation_energie_primaire_estim_lower.type" ALIGN="LEFT">int4[10]</TD></TR>
      <TR><TD PORT="etat_initial_consommation_energie_primaire_estim_mean" COLSPAN="2" ALIGN="LEFT"><TABLE BORDER="0" CELLSPACING="0" ALIGN="LEFT"><TR ALIGN="LEFT"><TD ALIGN="LEFT" FIXEDSIZE="TRUE" WIDTH="15" HEIGHT="16"></TD><TD ALIGN="LEFT" FIXEDSIZE="TRUE" WIDTH="352" HEIGHT="16">etat_initial_consommation_energie_primaire_estim_mean</TD></TR></TABLE></TD><TD PORT="etat_initial_consommation_energie_primaire_estim_mean.type" ALIGN="LEFT">int4[10]</TD></TR>
      <TR><TD PORT="etat_initial_consommation_energie_primaire_estim_upper" COLSPAN="2" ALIGN="LEFT"><TABLE BORDER="0" CELLSPACING="0" ALIGN="LEFT"><TR ALIGN="LEFT"><TD ALIGN="LEFT" FIXEDSIZE="TRUE" WIDTH="15" HEIGHT="16"></TD><TD ALIGN="LEFT" FIXEDSIZE="TRUE" WIDTH="352" HEIGHT="16">etat_initial_consommation_energie_primaire_estim_upper</TD></TR></TABLE></TD><TD PORT="etat_initial_consommation_energie_primaire_estim_upper.type" ALIGN="LEFT">int4[10]</TD></TR>
      <TR><TD PORT="etat_initial_consommation_ges_estim_inc" COLSPAN="2" ALIGN="LEFT"><TABLE BORDER="0" CELLSPACING="0" ALIGN="LEFT"><TR ALIGN="LEFT"><TD ALIGN="LEFT" FIXEDSIZE="TRUE" WIDTH="15" HEIGHT="16"></TD><TD ALIGN="LEFT" FIXEDSIZE="TRUE" WIDTH="352" HEIGHT="16">etat_initial_consommation_ges_estim_inc</TD></TR></TABLE></TD><TD PORT="etat_initial_consommation_ges_estim_inc.type" ALIGN="LEFT">int4[10]</TD></TR>
      <TR><TD PORT="etat_initial_ges_estim_lower" COLSPAN="2" ALIGN="LEFT"><TABLE BORDER="0" CELLSPACING="0" ALIGN="LEFT"><TR ALIGN="LEFT"><TD ALIGN="LEFT" FIXEDSIZE="TRUE" WIDTH="15" HEIGHT="16"></TD><TD ALIGN="LEFT" FIXEDSIZE="TRUE" WIDTH="352" HEIGHT="16">etat_initial_ges_estim_lower</TD></TR></TABLE></TD><TD PORT="etat_initial_ges_estim_lower.type" ALIGN="LEFT">int4[10]</TD></TR>
      <TR><TD PORT="etat_initial_ges_estim_mean" COLSPAN="2" ALIGN="LEFT"><TABLE BORDER="0" CELLSPACING="0" ALIGN="LEFT"><TR ALIGN="LEFT"><TD ALIGN="LEFT" FIXEDSIZE="TRUE" WIDTH="15" HEIGHT="16"></TD><TD ALIGN="LEFT" FIXEDSIZE="TRUE" WIDTH="352" HEIGHT="16">etat_initial_ges_estim_mean</TD></TR></TABLE></TD><TD PORT="etat_initial_ges_estim_mean.type" ALIGN="LEFT">int4[10]</TD></TR>
      <TR><TD PORT="etat_initial_ges_estim_upper" COLSPAN="2" ALIGN="LEFT"><TABLE BORDER="0" CELLSPACING="0" ALIGN="LEFT"><TR ALIGN="LEFT"><TD ALIGN="LEFT" FIXEDSIZE="TRUE" WIDTH="15" HEIGHT="16"></TD><TD ALIGN="LEFT" FIXEDSIZE="TRUE" WIDTH="352" HEIGHT="16">etat_initial_ges_estim_upper</TD></TR></TABLE></TD><TD PORT="etat_initial_ges_estim_upper.type" ALIGN="LEFT">int4[10]</TD></TR>
      <TR><TD PORT="etat_initial_risque_canicule" COLSPAN="2" ALIGN="LEFT"><TABLE BORDER="0" CELLSPACING="0" ALIGN="LEFT"><TR ALIGN="LEFT"><TD ALIGN="LEFT" FIXEDSIZE="TRUE" WIDTH="15" HEIGHT="16"></TD><TD ALIGN="LEFT" FIXEDSIZE="TRUE" WIDTH="352" HEIGHT="16">etat_initial_risque_canicule</TD></TR></TABLE></TD><TD PORT="etat_initial_risque_canicule.type" ALIGN="LEFT">int4[10]</TD></TR>
      <TR><TD PORT="etat_initial_risque_canicule_inc" COLSPAN="2" ALIGN="LEFT"><TABLE BORDER="0" CELLSPACING="0" ALIGN="LEFT"><TR ALIGN="LEFT"><TD ALIGN="LEFT" FIXEDSIZE="TRUE" WIDTH="15" HEIGHT="16"></TD><TD ALIGN="LEFT" FIXEDSIZE="TRUE" WIDTH="352" HEIGHT="16">etat_initial_risque_canicule_inc</TD></TR></TABLE></TD><TD PORT="etat_initial_risque_canicule_inc.type" ALIGN="LEFT">int4[10]</TD></TR>
      <TR><TD PORT="etat_renove_consommation_energie_estim_inc" COLSPAN="2" ALIGN="LEFT"><TABLE BORDER="0" CELLSPACING="0" ALIGN="LEFT"><TR ALIGN="LEFT"><TD ALIGN="LEFT" FIXEDSIZE="TRUE" WIDTH="15" HEIGHT="16"></TD><TD ALIGN="LEFT" FIXEDSIZE="TRUE" WIDTH="352" HEIGHT="16">etat_renove_consommation_energie_estim_inc</TD></TR></TABLE></TD><TD PORT="etat_renove_consommation_energie_estim_inc.type" ALIGN="LEFT">int4[10]</TD></TR>
      <TR><TD PORT="etat_renove_consommation_energie_estim_lower" COLSPAN="2" ALIGN="LEFT"><TABLE BORDER="0" CELLSPACING="0" ALIGN="LEFT"><TR ALIGN="LEFT"><TD ALIGN="LEFT" FIXEDSIZE="TRUE" WIDTH="15" HEIGHT="16"></TD><TD ALIGN="LEFT" FIXEDSIZE="TRUE" WIDTH="352" HEIGHT="16">etat_renove_consommation_energie_estim_lower</TD></TR></TABLE></TD><TD PORT="etat_renove_consommation_energie_estim_lower.type" ALIGN="LEFT">int4[10]</TD></TR>
      <TR><TD PORT="etat_renove_consommation_energie_estim_mean" COLSPAN="2" ALIGN="LEFT"><TABLE BORDER="0" CELLSPACING="0" ALIGN="LEFT"><TR ALIGN="LEFT"><TD ALIGN="LEFT" FIXEDSIZE="TRUE" WIDTH="15" HEIGHT="16"></TD><TD ALIGN="LEFT" FIXEDSIZE="TRUE" WIDTH="352" HEIGHT="16">etat_renove_consommation_energie_estim_mean</TD></TR></TABLE></TD><TD PORT="etat_renove_consommation_energie_estim_mean.type" ALIGN="LEFT">int4[10]</TD></TR>
      <TR><TD PORT="etat_renove_consommation_energie_estim_upper" COLSPAN="2" ALIGN="LEFT"><TABLE BORDER="0" CELLSPACING="0" ALIGN="LEFT"><TR ALIGN="LEFT"><TD ALIGN="LEFT" FIXEDSIZE="TRUE" WIDTH="15" HEIGHT="16"></TD><TD ALIGN="LEFT" FIXEDSIZE="TRUE" WIDTH="352" HEIGHT="16">etat_renove_consommation_energie_estim_upper</TD></TR></TABLE></TD><TD PORT="etat_renove_consommation_energie_estim_upper.type" ALIGN="LEFT">int4[10]</TD></TR>
      <TR><TD PORT="etat_renove_consommation_energie_primaire_estim_lower" COLSPAN="2" ALIGN="LEFT"><TABLE BORDER="0" CELLSPACING="0" ALIGN="LEFT"><TR ALIGN="LEFT"><TD ALIGN="LEFT" FIXEDSIZE="TRUE" WIDTH="15" HEIGHT="16"></TD><TD ALIGN="LEFT" FIXEDSIZE="TRUE" WIDTH="352" HEIGHT="16">etat_renove_consommation_energie_primaire_estim_lower</TD></TR></TABLE></TD><TD PORT="etat_renove_consommation_energie_primaire_estim_lower.type" ALIGN="LEFT">int4[10]</TD></TR>
      <TR><TD PORT="etat_renove_consommation_energie_primaire_estim_mean" COLSPAN="2" ALIGN="LEFT"><TABLE BORDER="0" CELLSPACING="0" ALIGN="LEFT"><TR ALIGN="LEFT"><TD ALIGN="LEFT" FIXEDSIZE="TRUE" WIDTH="15" HEIGHT="16"></TD><TD ALIGN="LEFT" FIXEDSIZE="TRUE" WIDTH="352" HEIGHT="16">etat_renove_consommation_energie_primaire_estim_mean</TD></TR></TABLE></TD><TD PORT="etat_renove_consommation_energie_primaire_estim_mean.type" ALIGN="LEFT">int4[10]</TD></TR>
      <TR><TD PORT="etat_renove_consommation_energie_primaire_estim_upper" COLSPAN="2" ALIGN="LEFT"><TABLE BORDER="0" CELLSPACING="0" ALIGN="LEFT"><TR ALIGN="LEFT"><TD ALIGN="LEFT" FIXEDSIZE="TRUE" WIDTH="15" HEIGHT="16"></TD><TD ALIGN="LEFT" FIXEDSIZE="TRUE" WIDTH="352" HEIGHT="16">etat_renove_consommation_energie_primaire_estim_upper</TD></TR></TABLE></TD><TD PORT="etat_renove_consommation_energie_primaire_estim_upper.type" ALIGN="LEFT">int4[10]</TD></TR>
      <TR><TD PORT="etat_renove_consommation_ges_estim_inc" COLSPAN="2" ALIGN="LEFT"><TABLE BORDER="0" CELLSPACING="0" ALIGN="LEFT"><TR ALIGN="LEFT"><TD ALIGN="LEFT" FIXEDSIZE="TRUE" WIDTH="15" HEIGHT="16"></TD><TD ALIGN="LEFT" FIXEDSIZE="TRUE" WIDTH="352" HEIGHT="16">etat_renove_consommation_ges_estim_inc</TD></TR></TABLE></TD><TD PORT="etat_renove_consommation_ges_estim_inc.type" ALIGN="LEFT">int4[10]</TD></TR>
      <TR><TD PORT="etat_renove_ges_estim_lower" COLSPAN="2" ALIGN="LEFT"><TABLE BORDER="0" CELLSPACING="0" ALIGN="LEFT"><TR ALIGN="LEFT"><TD ALIGN="LEFT" FIXEDSIZE="TRUE" WIDTH="15" HEIGHT="16"></TD><TD ALIGN="LEFT" FIXEDSIZE="TRUE" WIDTH="352" HEIGHT="16">etat_renove_ges_estim_lower</TD></TR></TABLE></TD><TD PORT="etat_renove_ges_estim_lower.type" ALIGN="LEFT">int4[10]</TD></TR>
      <TR><TD PORT="etat_renove_ges_estim_mean" COLSPAN="2" ALIGN="LEFT"><TABLE BORDER="0" CELLSPACING="0" ALIGN="LEFT"><TR ALIGN="LEFT"><TD ALIGN="LEFT" FIXEDSIZE="TRUE" WIDTH="15" HEIGHT="16"></TD><TD ALIGN="LEFT" FIXEDSIZE="TRUE" WIDTH="352" HEIGHT="16">etat_renove_ges_estim_mean</TD></TR></TABLE></TD><TD PORT="etat_renove_ges_estim_mean.type" ALIGN="LEFT">int4[10]</TD></TR>
      <TR><TD PORT="etat_renove_ges_estim_upper" COLSPAN="2" ALIGN="LEFT"><TABLE BORDER="0" CELLSPACING="0" ALIGN="LEFT"><TR ALIGN="LEFT"><TD ALIGN="LEFT" FIXEDSIZE="TRUE" WIDTH="15" HEIGHT="16"></TD><TD ALIGN="LEFT" FIXEDSIZE="TRUE" WIDTH="352" HEIGHT="16">etat_renove_ges_estim_upper</TD></TR></TABLE></TD><TD PORT="etat_renove_ges_estim_upper.type" ALIGN="LEFT">int4[10]</TD></TR>
      <TR><TD PORT="etat_renove_risque_canicule" COLSPAN="2" ALIGN="LEFT"><TABLE BORDER="0" CELLSPACING="0" ALIGN="LEFT"><TR ALIGN="LEFT"><TD ALIGN="LEFT" FIXEDSIZE="TRUE" WIDTH="15" HEIGHT="16"></TD><TD ALIGN="LEFT" FIXEDSIZE="TRUE" WIDTH="352" HEIGHT="16">etat_renove_risque_canicule</TD></TR></TABLE></TD><TD PORT="etat_renove_risque_canicule.type" ALIGN="LEFT">int4[10]</TD></TR>
      <TR><TD PORT="etat_renove_risque_canicule_inc" COLSPAN="2" ALIGN="LEFT"><TABLE BORDER="0" CELLSPACING="0" ALIGN="LEFT"><TR ALIGN="LEFT"><TD ALIGN="LEFT" FIXEDSIZE="TRUE" WIDTH="15" HEIGHT="16"></TD><TD ALIGN="LEFT" FIXEDSIZE="TRUE" WIDTH="352" HEIGHT="16">etat_renove_risque_canicule_inc</TD></TR></TABLE></TD><TD PORT="etat_renove_risque_canicule_inc.type" ALIGN="LEFT">int4[10]</TD></TR>
      <TR><TD PORT="etiquette_dpe_initial_a" COLSPAN="2" ALIGN="LEFT"><TABLE BORDER="0" CELLSPACING="0" ALIGN="LEFT"><TR ALIGN="LEFT"><TD ALIGN="LEFT" FIXEDSIZE="TRUE" WIDTH="15" HEIGHT="16"></TD><TD ALIGN="LEFT" FIXEDSIZE="TRUE" WIDTH="352" HEIGHT="16">etiquette_dpe_initial_a</TD></TR></TABLE></TD><TD PORT="etiquette_dpe_initial_a.type" ALIGN="LEFT">float4[8,8]</TD></TR>
      <TR><TD PORT="etiquette_dpe_initial_b" COLSPAN="2" ALIGN="LEFT"><TABLE BORDER="0" CELLSPACING="0" ALIGN="LEFT"><TR ALIGN="LEFT"><TD ALIGN="LEFT" FIXEDSIZE="TRUE" WIDTH="15" HEIGHT="16"></TD><TD ALIGN="LEFT" FIXEDSIZE="TRUE" WIDTH="352" HEIGHT="16">etiquette_dpe_initial_b</TD></TR></TABLE></TD><TD PORT="etiquette_dpe_initial_b.type" ALIGN="LEFT">float4[8,8]</TD></TR>
      <TR><TD PORT="etiquette_dpe_initial_c" COLSPAN="2" ALIGN="LEFT"><TABLE BORDER="0" CELLSPACING="0" ALIGN="LEFT"><TR ALIGN="LEFT"><TD ALIGN="LEFT" FIXEDSIZE="TRUE" WIDTH="15" HEIGHT="16"></TD><TD ALIGN="LEFT" FIXEDSIZE="TRUE" WIDTH="352" HEIGHT="16">etiquette_dpe_initial_c</TD></TR></TABLE></TD><TD PORT="etiquette_dpe_initial_c.type" ALIGN="LEFT">float4[8,8]</TD></TR>
      <TR><TD PORT="etiquette_dpe_initial_d" COLSPAN="2" ALIGN="LEFT"><TABLE BORDER="0" CELLSPACING="0" ALIGN="LEFT"><TR ALIGN="LEFT"><TD ALIGN="LEFT" FIXEDSIZE="TRUE" WIDTH="15" HEIGHT="16"></TD><TD ALIGN="LEFT" FIXEDSIZE="TRUE" WIDTH="352" HEIGHT="16">etiquette_dpe_initial_d</TD></TR></TABLE></TD><TD PORT="etiquette_dpe_initial_d.type" ALIGN="LEFT">float4[8,8]</TD></TR>
      <TR><TD PORT="etiquette_dpe_initial_e" COLSPAN="2" ALIGN="LEFT"><TABLE BORDER="0" CELLSPACING="0" ALIGN="LEFT"><TR ALIGN="LEFT"><TD ALIGN="LEFT" FIXEDSIZE="TRUE" WIDTH="15" HEIGHT="16"></TD><TD ALIGN="LEFT" FIXEDSIZE="TRUE" WIDTH="352" HEIGHT="16">etiquette_dpe_initial_e</TD></TR></TABLE></TD><TD PORT="etiquette_dpe_initial_e.type" ALIGN="LEFT">float4[8,8]</TD></TR>
      <TR><TD PORT="etiquette_dpe_initial_f" COLSPAN="2" ALIGN="LEFT"><TABLE BORDER="0" CELLSPACING="0" ALIGN="LEFT"><TR ALIGN="LEFT"><TD ALIGN="LEFT" FIXEDSIZE="TRUE" WIDTH="15" HEIGHT="16"></TD><TD ALIGN="LEFT" FIXEDSIZE="TRUE" WIDTH="352" HEIGHT="16">etiquette_dpe_initial_f</TD></TR></TABLE></TD><TD PORT="etiquette_dpe_initial_f.type" ALIGN="LEFT">float4[8,8]</TD></TR>
      <TR><TD PORT="etiquette_dpe_initial_g" COLSPAN="2" ALIGN="LEFT"><TABLE BORDER="0" CELLSPACING="0" ALIGN="LEFT"><TR ALIGN="LEFT"><TD ALIGN="LEFT" FIXEDSIZE="TRUE" WIDTH="15" HEIGHT="16"></TD><TD ALIGN="LEFT" FIXEDSIZE="TRUE" WIDTH="352" HEIGHT="16">etiquette_dpe_initial_g</TD></TR></TABLE></TD><TD PORT="etiquette_dpe_initial_g.type" ALIGN="LEFT">float4[8,8]</TD></TR>
      <TR><TD PORT="etiquette_dpe_initial_error" COLSPAN="2" ALIGN="LEFT"><TABLE BORDER="0" CELLSPACING="0" ALIGN="LEFT"><TR ALIGN="LEFT"><TD ALIGN="LEFT" FIXEDSIZE="TRUE" WIDTH="15" HEIGHT="16"></TD><TD ALIGN="LEFT" FIXEDSIZE="TRUE" WIDTH="352" HEIGHT="16">etiquette_dpe_initial_error</TD></TR></TABLE></TD><TD PORT="etiquette_dpe_initial_error.type" ALIGN="LEFT">float4[8,8]</TD></TR>
      <TR><TD PORT="etiquette_dpe_initial_map" COLSPAN="2" ALIGN="LEFT"><TABLE BORDER="0" CELLSPACING="0" ALIGN="LEFT"><TR ALIGN="LEFT"><TD ALIGN="LEFT" FIXEDSIZE="TRUE" WIDTH="15" HEIGHT="16"></TD><TD ALIGN="LEFT" FIXEDSIZE="TRUE" WIDTH="352" HEIGHT="16">etiquette_dpe_initial_map</TD></TR></TABLE></TD><TD PORT="etiquette_dpe_initial_map.type" ALIGN="LEFT">varchar[1]</TD></TR>
      <TR><TD PORT="etiquette_dpe_initial_map_2nd" COLSPAN="2" ALIGN="LEFT"><TABLE BORDER="0" CELLSPACING="0" ALIGN="LEFT"><TR ALIGN="LEFT"><TD ALIGN="LEFT" FIXEDSIZE="TRUE" WIDTH="15" HEIGHT="16"></TD><TD ALIGN="LEFT" FIXEDSIZE="TRUE" WIDTH="352" HEIGHT="16">etiquette_dpe_initial_map_2nd</TD></TR></TABLE></TD><TD PORT="etiquette_dpe_initial_map_2nd.type" ALIGN="LEFT">varchar[3]</TD></TR>
      <TR><TD PORT="etiquette_dpe_initial_map_prob" COLSPAN="2" ALIGN="LEFT"><TABLE BORDER="0" CELLSPACING="0" ALIGN="LEFT"><TR ALIGN="LEFT"><TD ALIGN="LEFT" FIXEDSIZE="TRUE" WIDTH="15" HEIGHT="16"></TD><TD ALIGN="LEFT" FIXEDSIZE="TRUE" WIDTH="352" HEIGHT="16">etiquette_dpe_initial_map_prob</TD></TR></TABLE></TD><TD PORT="etiquette_dpe_initial_map_prob.type" ALIGN="LEFT">float4[8,8]</TD></TR>
      <TR><TD PORT="etiquette_dpe_initial_map_2nd_prob" COLSPAN="2" ALIGN="LEFT"><TABLE BORDER="0" CELLSPACING="0" ALIGN="LEFT"><TR ALIGN="LEFT"><TD ALIGN="LEFT" FIXEDSIZE="TRUE" WIDTH="15" HEIGHT="16"></TD><TD ALIGN="LEFT" FIXEDSIZE="TRUE" WIDTH="352" HEIGHT="16">etiquette_dpe_initial_map_2nd_prob</TD></TR></TABLE></TD><TD PORT="etiquette_dpe_initial_map_2nd_prob.type" ALIGN="LEFT">float4[8,8]</TD></TR>
      <TR><TD PORT="etiquette_dpe_initial_inc" COLSPAN="2" ALIGN="LEFT"><TABLE BORDER="0" CELLSPACING="0" ALIGN="LEFT"><TR ALIGN="LEFT"><TD ALIGN="LEFT" FIXEDSIZE="TRUE" WIDTH="15" HEIGHT="16"></TD><TD ALIGN="LEFT" FIXEDSIZE="TRUE" WIDTH="352" HEIGHT="16">etiquette_dpe_initial_inc</TD></TR></TABLE></TD><TD PORT="etiquette_dpe_initial_inc.type" ALIGN="LEFT">float4[8,8]</TD></TR>
      <TR><TD PORT="etiquette_dpe_renove_a" COLSPAN="2" ALIGN="LEFT"><TABLE BORDER="0" CELLSPACING="0" ALIGN="LEFT"><TR ALIGN="LEFT"><TD ALIGN="LEFT" FIXEDSIZE="TRUE" WIDTH="15" HEIGHT="16"></TD><TD ALIGN="LEFT" FIXEDSIZE="TRUE" WIDTH="352" HEIGHT="16">etiquette_dpe_renove_a</TD></TR></TABLE></TD><TD PORT="etiquette_dpe_renove_a.type" ALIGN="LEFT">float4[8,8]</TD></TR>
      <TR><TD PORT="etiquette_dpe_renove_b" COLSPAN="2" ALIGN="LEFT"><TABLE BORDER="0" CELLSPACING="0" ALIGN="LEFT"><TR ALIGN="LEFT"><TD ALIGN="LEFT" FIXEDSIZE="TRUE" WIDTH="15" HEIGHT="16"></TD><TD ALIGN="LEFT" FIXEDSIZE="TRUE" WIDTH="352" HEIGHT="16">etiquette_dpe_renove_b</TD></TR></TABLE></TD><TD PORT="etiquette_dpe_renove_b.type" ALIGN="LEFT">float4[8,8]</TD></TR>
      <TR><TD PORT="etiquette_dpe_renove_c" COLSPAN="2" ALIGN="LEFT"><TABLE BORDER="0" CELLSPACING="0" ALIGN="LEFT"><TR ALIGN="LEFT"><TD ALIGN="LEFT" FIXEDSIZE="TRUE" WIDTH="15" HEIGHT="16"></TD><TD ALIGN="LEFT" FIXEDSIZE="TRUE" WIDTH="352" HEIGHT="16">etiquette_dpe_renove_c</TD></TR></TABLE></TD><TD PORT="etiquette_dpe_renove_c.type" ALIGN="LEFT">float4[8,8]</TD></TR>
      <TR><TD PORT="etiquette_dpe_renove_d" COLSPAN="2" ALIGN="LEFT"><TABLE BORDER="0" CELLSPACING="0" ALIGN="LEFT"><TR ALIGN="LEFT"><TD ALIGN="LEFT" FIXEDSIZE="TRUE" WIDTH="15" HEIGHT="16"></TD><TD ALIGN="LEFT" FIXEDSIZE="TRUE" WIDTH="352" HEIGHT="16">etiquette_dpe_renove_d</TD></TR></TABLE></TD><TD PORT="etiquette_dpe_renove_d.type" ALIGN="LEFT">float4[8,8]</TD></TR>
      <TR><TD PORT="etiquette_dpe_renove_e" COLSPAN="2" ALIGN="LEFT"><TABLE BORDER="0" CELLSPACING="0" ALIGN="LEFT"><TR ALIGN="LEFT"><TD ALIGN="LEFT" FIXEDSIZE="TRUE" WIDTH="15" HEIGHT="16"></TD><TD ALIGN="LEFT" FIXEDSIZE="TRUE" WIDTH="352" HEIGHT="16">etiquette_dpe_renove_e</TD></TR></TABLE></TD><TD PORT="etiquette_dpe_renove_e.type" ALIGN="LEFT">float4[8,8]</TD></TR>
      <TR><TD PORT="etiquette_dpe_renove_f" COLSPAN="2" ALIGN="LEFT"><TABLE BORDER="0" CELLSPACING="0" ALIGN="LEFT"><TR ALIGN="LEFT"><TD ALIGN="LEFT" FIXEDSIZE="TRUE" WIDTH="15" HEIGHT="16"></TD><TD ALIGN="LEFT" FIXEDSIZE="TRUE" WIDTH="352" HEIGHT="16">etiquette_dpe_renove_f</TD></TR></TABLE></TD><TD PORT="etiquette_dpe_renove_f.type" ALIGN="LEFT">float4[8,8]</TD></TR>
      <TR><TD PORT="etiquette_dpe_renove_g" COLSPAN="2" ALIGN="LEFT"><TABLE BORDER="0" CELLSPACING="0" ALIGN="LEFT"><TR ALIGN="LEFT"><TD ALIGN="LEFT" FIXEDSIZE="TRUE" WIDTH="15" HEIGHT="16"></TD><TD ALIGN="LEFT" FIXEDSIZE="TRUE" WIDTH="352" HEIGHT="16">etiquette_dpe_renove_g</TD></TR></TABLE></TD><TD PORT="etiquette_dpe_renove_g.type" ALIGN="LEFT">float4[8,8]</TD></TR>
      <TR><TD PORT="etiquette_dpe_renove_error" COLSPAN="2" ALIGN="LEFT"><TABLE BORDER="0" CELLSPACING="0" ALIGN="LEFT"><TR ALIGN="LEFT"><TD ALIGN="LEFT" FIXEDSIZE="TRUE" WIDTH="15" HEIGHT="16"></TD><TD ALIGN="LEFT" FIXEDSIZE="TRUE" WIDTH="352" HEIGHT="16">etiquette_dpe_renove_error</TD></TR></TABLE></TD><TD PORT="etiquette_dpe_renove_error.type" ALIGN="LEFT">float4[8,8]</TD></TR>
      <TR><TD PORT="etiquette_dpe_renove_map" COLSPAN="2" ALIGN="LEFT"><TABLE BORDER="0" CELLSPACING="0" ALIGN="LEFT"><TR ALIGN="LEFT"><TD ALIGN="LEFT" FIXEDSIZE="TRUE" WIDTH="15" HEIGHT="16"></TD><TD ALIGN="LEFT" FIXEDSIZE="TRUE" WIDTH="352" HEIGHT="16">etiquette_dpe_renove_map</TD></TR></TABLE></TD><TD PORT="etiquette_dpe_renove_map.type" ALIGN="LEFT">varchar[1]</TD></TR>
      <TR><TD PORT="etiquette_dpe_renove_map_2nd" COLSPAN="2" ALIGN="LEFT"><TABLE BORDER="0" CELLSPACING="0" ALIGN="LEFT"><TR ALIGN="LEFT"><TD ALIGN="LEFT" FIXEDSIZE="TRUE" WIDTH="15" HEIGHT="16"></TD><TD ALIGN="LEFT" FIXEDSIZE="TRUE" WIDTH="352" HEIGHT="16">etiquette_dpe_renove_map_2nd</TD></TR></TABLE></TD><TD PORT="etiquette_dpe_renove_map_2nd.type" ALIGN="LEFT">varchar[3]</TD></TR>
      <TR><TD PORT="etiquette_dpe_renove_map_prob" COLSPAN="2" ALIGN="LEFT"><TABLE BORDER="0" CELLSPACING="0" ALIGN="LEFT"><TR ALIGN="LEFT"><TD ALIGN="LEFT" FIXEDSIZE="TRUE" WIDTH="15" HEIGHT="16"></TD><TD ALIGN="LEFT" FIXEDSIZE="TRUE" WIDTH="352" HEIGHT="16">etiquette_dpe_renove_map_prob</TD></TR></TABLE></TD><TD PORT="etiquette_dpe_renove_map_prob.type" ALIGN="LEFT">float4[8,8]</TD></TR>
      <TR><TD PORT="etiquette_dpe_renove_map_2nd_prob" COLSPAN="2" ALIGN="LEFT"><TABLE BORDER="0" CELLSPACING="0" ALIGN="LEFT"><TR ALIGN="LEFT"><TD ALIGN="LEFT" FIXEDSIZE="TRUE" WIDTH="15" HEIGHT="16"></TD><TD ALIGN="LEFT" FIXEDSIZE="TRUE" WIDTH="352" HEIGHT="16">etiquette_dpe_renove_map_2nd_prob</TD></TR></TABLE></TD><TD PORT="etiquette_dpe_renove_map_2nd_prob.type" ALIGN="LEFT">float4[8,8]</TD></TR>
      <TR><TD PORT="etiquette_dpe_renove_inc" COLSPAN="2" ALIGN="LEFT"><TABLE BORDER="0" CELLSPACING="0" ALIGN="LEFT"><TR ALIGN="LEFT"><TD ALIGN="LEFT" FIXEDSIZE="TRUE" WIDTH="15" HEIGHT="16"></TD><TD ALIGN="LEFT" FIXEDSIZE="TRUE" WIDTH="352" HEIGHT="16">etiquette_dpe_renove_inc</TD></TR></TABLE></TD><TD PORT="etiquette_dpe_renove_inc.type" ALIGN="LEFT">float4[8,8]</TD></TR>
      <TR><TD ALIGN="LEFT" BGCOLOR="#ffffff">&lt; 2</TD><TD ALIGN="RIGHT" BGCOLOR="#ffffff">16,110,420 rows</TD><TD ALIGN="RIGHT" BGCOLOR="#ffffff">0 &gt;</TD></TR>
    </TABLE>>
    URL="local_simulations_dpe.html"
    target="_top"
    tooltip="local_simulations_dpe"
  ];
}
