digraph "twoDegreesRelationshipsDiagram" {
  graph [    rankdir="RL"    bgcolor="#ffffff"    label="\nGenerated by SchemaSpy"    labeljust="l"    nodesep="0.18"    ranksep="0.46"    fontname="Helvetica"    fontsize="11"    ration="compress"  ];  node [    fontname="Helvetica"    fontsize="11"    shape="plaintext"  ];  edge [    arrowsize="0.8"  ];
  "rel_batiment_groupe_dpe_logement":"cle_interop_adr":w -> "adresse":"elipses":e [arrowhead=none dir=back arrowtail=crowodot];
  "rel_batiment_groupe_dpe_logement":"identifiant_dpe":w -> "dpe_logement":"identifiant_dpe.type":e [arrowhead=none dir=back arrowtail=crowodot];
  "adresse" [
   label=<
    <TABLE BORDER="0" CELLBORDER="1" CELLSPACING="0" BGCOLOR="#ffffff">
      <TR><TD COLSPAN="3"  BGCOLOR="#f5f5f5"><TABLE BORDER="0" CELLSPACING="0"><TR><TD ALIGN="LEFT" FIXEDSIZE="TRUE" WIDTH="46" HEIGHT="16"><B>adresse</B></TD><TD ALIGN="RIGHT">[table]</TD></TR></TABLE></TD></TR>
      <TR><TD PORT="elipses" COLSPAN="3" ALIGN="LEFT">...</TD></TR>
      <TR><TD ALIGN="LEFT" BGCOLOR="#ffffff">  </TD><TD ALIGN="RIGHT" BGCOLOR="#ffffff">41,202,488 rows</TD><TD ALIGN="RIGHT" BGCOLOR="#ffffff">12 &gt;</TD></TR>
    </TABLE>>
    URL="adresse.html"
    target="_top"
    tooltip="adresse"
  ];
  "dpe_logement" [
   label=<
    <TABLE BORDER="2" CELLBORDER="1" CELLSPACING="0" BGCOLOR="#ffffff">
      <TR><TD COLSPAN="4"  BGCOLOR="#f5f5f5"><TABLE BORDER="0" CELLSPACING="0"><TR><TD ALIGN="LEFT" FIXEDSIZE="TRUE" WIDTH="84" HEIGHT="16"><B>dpe_logement</B></TD><TD ALIGN="RIGHT">[table]</TD></TR></TABLE></TD></TR>
      <TR><TD PORT="identifiant_dpe" COLSPAN="2" ALIGN="LEFT"><TABLE BORDER="0" CELLSPACING="0" ALIGN="LEFT"><TR ALIGN="LEFT"><TD ALIGN="LEFT" FIXEDSIZE="TRUE" WIDTH="15" HEIGHT="16"><IMG SRC="../../images/primaryKeys.png"/></TD><TD ALIGN="LEFT" FIXEDSIZE="TRUE" WIDTH="287" HEIGHT="16">identifiant_dpe</TD></TR></TABLE></TD><TD PORT="identifiant_dpe.type" ALIGN="LEFT">text[2147483647]</TD></TR>
      <TR><TD PORT="code_departement_insee" COLSPAN="2" BGCOLOR="#ffffff" ALIGN="LEFT"><TABLE BORDER="0" CELLSPACING="0" ALIGN="LEFT"><TR ALIGN="LEFT"><TD ALIGN="LEFT" FIXEDSIZE="TRUE" WIDTH="15" HEIGHT="16"></TD><TD ALIGN="LEFT" FIXEDSIZE="TRUE" WIDTH="287" HEIGHT="16">code_departement_insee</TD></TR></TABLE></TD><TD PORT="code_departement_insee.type" ALIGN="LEFT">varchar[2]</TD></TR>
      <TR><TD PORT="arrete_2021" COLSPAN="2" ALIGN="LEFT"><TABLE BORDER="0" CELLSPACING="0" ALIGN="LEFT"><TR ALIGN="LEFT"><TD ALIGN="LEFT" FIXEDSIZE="TRUE" WIDTH="15" HEIGHT="16"></TD><TD ALIGN="LEFT" FIXEDSIZE="TRUE" WIDTH="287" HEIGHT="16">arrete_2021</TD></TR></TABLE></TD><TD PORT="arrete_2021.type" ALIGN="LEFT">bool[1]</TD></TR>
      <TR><TD PORT="type_dpe" COLSPAN="2" ALIGN="LEFT"><TABLE BORDER="0" CELLSPACING="0" ALIGN="LEFT"><TR ALIGN="LEFT"><TD ALIGN="LEFT" FIXEDSIZE="TRUE" WIDTH="15" HEIGHT="16"></TD><TD ALIGN="LEFT" FIXEDSIZE="TRUE" WIDTH="287" HEIGHT="16">type_dpe</TD></TR></TABLE></TD><TD PORT="type_dpe.type" ALIGN="LEFT">text[2147483647]</TD></TR>
      <TR><TD PORT="type_batiment_dpe" COLSPAN="2" ALIGN="LEFT"><TABLE BORDER="0" CELLSPACING="0" ALIGN="LEFT"><TR ALIGN="LEFT"><TD ALIGN="LEFT" FIXEDSIZE="TRUE" WIDTH="15" HEIGHT="16"></TD><TD ALIGN="LEFT" FIXEDSIZE="TRUE" WIDTH="287" HEIGHT="16">type_batiment_dpe</TD></TR></TABLE></TD><TD PORT="type_batiment_dpe.type" ALIGN="LEFT">text[2147483647]</TD></TR>
      <TR><TD PORT="periode_construction_dpe" COLSPAN="2" ALIGN="LEFT"><TABLE BORDER="0" CELLSPACING="0" ALIGN="LEFT"><TR ALIGN="LEFT"><TD ALIGN="LEFT" FIXEDSIZE="TRUE" WIDTH="15" HEIGHT="16"></TD><TD ALIGN="LEFT" FIXEDSIZE="TRUE" WIDTH="287" HEIGHT="16">periode_construction_dpe</TD></TR></TABLE></TD><TD PORT="periode_construction_dpe.type" ALIGN="LEFT">text[2147483647]</TD></TR>
      <TR><TD PORT="annee_construction_dpe" COLSPAN="2" ALIGN="LEFT"><TABLE BORDER="0" CELLSPACING="0" ALIGN="LEFT"><TR ALIGN="LEFT"><TD ALIGN="LEFT" FIXEDSIZE="TRUE" WIDTH="15" HEIGHT="16"></TD><TD ALIGN="LEFT" FIXEDSIZE="TRUE" WIDTH="287" HEIGHT="16">annee_construction_dpe</TD></TR></TABLE></TD><TD PORT="annee_construction_dpe.type" ALIGN="LEFT">int2[5]</TD></TR>
      <TR><TD PORT="version" COLSPAN="2" ALIGN="LEFT"><TABLE BORDER="0" CELLSPACING="0" ALIGN="LEFT"><TR ALIGN="LEFT"><TD ALIGN="LEFT" FIXEDSIZE="TRUE" WIDTH="15" HEIGHT="16"></TD><TD ALIGN="LEFT" FIXEDSIZE="TRUE" WIDTH="287" HEIGHT="16">version</TD></TR></TABLE></TD><TD PORT="version.type" ALIGN="LEFT">text[2147483647]</TD></TR>
      <TR><TD PORT="date_etablissement_dpe" COLSPAN="2" ALIGN="LEFT"><TABLE BORDER="0" CELLSPACING="0" ALIGN="LEFT"><TR ALIGN="LEFT"><TD ALIGN="LEFT" FIXEDSIZE="TRUE" WIDTH="15" HEIGHT="16"></TD><TD ALIGN="LEFT" FIXEDSIZE="TRUE" WIDTH="287" HEIGHT="16">date_etablissement_dpe</TD></TR></TABLE></TD><TD PORT="date_etablissement_dpe.type" ALIGN="LEFT">timestamp[29,6]</TD></TR>
      <TR><TD PORT="date_reception_dpe" COLSPAN="2" ALIGN="LEFT"><TABLE BORDER="0" CELLSPACING="0" ALIGN="LEFT"><TR ALIGN="LEFT"><TD ALIGN="LEFT" FIXEDSIZE="TRUE" WIDTH="15" HEIGHT="16"></TD><TD ALIGN="LEFT" FIXEDSIZE="TRUE" WIDTH="287" HEIGHT="16">date_reception_dpe</TD></TR></TABLE></TD><TD PORT="date_reception_dpe.type" ALIGN="LEFT">timestamp[29,6]</TD></TR>
      <TR><TD PORT="nombre_niveau_logement" COLSPAN="2" ALIGN="LEFT"><TABLE BORDER="0" CELLSPACING="0" ALIGN="LEFT"><TR ALIGN="LEFT"><TD ALIGN="LEFT" FIXEDSIZE="TRUE" WIDTH="15" HEIGHT="16"></TD><TD ALIGN="LEFT" FIXEDSIZE="TRUE" WIDTH="287" HEIGHT="16">nombre_niveau_logement</TD></TR></TABLE></TD><TD PORT="nombre_niveau_logement.type" ALIGN="LEFT">int2[5]</TD></TR>
      <TR><TD PORT="nombre_niveau_immeuble" COLSPAN="2" ALIGN="LEFT"><TABLE BORDER="0" CELLSPACING="0" ALIGN="LEFT"><TR ALIGN="LEFT"><TD ALIGN="LEFT" FIXEDSIZE="TRUE" WIDTH="15" HEIGHT="16"></TD><TD ALIGN="LEFT" FIXEDSIZE="TRUE" WIDTH="287" HEIGHT="16">nombre_niveau_immeuble</TD></TR></TABLE></TD><TD PORT="nombre_niveau_immeuble.type" ALIGN="LEFT">int2[5]</TD></TR>
      <TR><TD PORT="surface_habitable_immeuble" COLSPAN="2" ALIGN="LEFT"><TABLE BORDER="0" CELLSPACING="0" ALIGN="LEFT"><TR ALIGN="LEFT"><TD ALIGN="LEFT" FIXEDSIZE="TRUE" WIDTH="15" HEIGHT="16"></TD><TD ALIGN="LEFT" FIXEDSIZE="TRUE" WIDTH="287" HEIGHT="16">surface_habitable_immeuble</TD></TR></TABLE></TD><TD PORT="surface_habitable_immeuble.type" ALIGN="LEFT">numeric[0]</TD></TR>
      <TR><TD PORT="surface_habitable_logement" COLSPAN="2" ALIGN="LEFT"><TABLE BORDER="0" CELLSPACING="0" ALIGN="LEFT"><TR ALIGN="LEFT"><TD ALIGN="LEFT" FIXEDSIZE="TRUE" WIDTH="15" HEIGHT="16"></TD><TD ALIGN="LEFT" FIXEDSIZE="TRUE" WIDTH="287" HEIGHT="16">surface_habitable_logement</TD></TR></TABLE></TD><TD PORT="surface_habitable_logement.type" ALIGN="LEFT">numeric[0]</TD></TR>
      <TR><TD PORT="conso_5_usages_ep_m2" COLSPAN="2" ALIGN="LEFT"><TABLE BORDER="0" CELLSPACING="0" ALIGN="LEFT"><TR ALIGN="LEFT"><TD ALIGN="LEFT" FIXEDSIZE="TRUE" WIDTH="15" HEIGHT="16"></TD><TD ALIGN="LEFT" FIXEDSIZE="TRUE" WIDTH="287" HEIGHT="16">conso_5_usages_ep_m2</TD></TR></TABLE></TD><TD PORT="conso_5_usages_ep_m2.type" ALIGN="LEFT">numeric[0]</TD></TR>
      <TR><TD PORT="conso_5_usages_ef_m2" COLSPAN="2" ALIGN="LEFT"><TABLE BORDER="0" CELLSPACING="0" ALIGN="LEFT"><TR ALIGN="LEFT"><TD ALIGN="LEFT" FIXEDSIZE="TRUE" WIDTH="15" HEIGHT="16"></TD><TD ALIGN="LEFT" FIXEDSIZE="TRUE" WIDTH="287" HEIGHT="16">conso_5_usages_ef_m2</TD></TR></TABLE></TD><TD PORT="conso_5_usages_ef_m2.type" ALIGN="LEFT">numeric[0]</TD></TR>
      <TR><TD PORT="emission_ges_5_usages_m2" COLSPAN="2" ALIGN="LEFT"><TABLE BORDER="0" CELLSPACING="0" ALIGN="LEFT"><TR ALIGN="LEFT"><TD ALIGN="LEFT" FIXEDSIZE="TRUE" WIDTH="15" HEIGHT="16"></TD><TD ALIGN="LEFT" FIXEDSIZE="TRUE" WIDTH="287" HEIGHT="16">emission_ges_5_usages_m2</TD></TR></TABLE></TD><TD PORT="emission_ges_5_usages_m2.type" ALIGN="LEFT">numeric[0]</TD></TR>
      <TR><TD PORT="classe_bilan_dpe" COLSPAN="2" ALIGN="LEFT"><TABLE BORDER="0" CELLSPACING="0" ALIGN="LEFT"><TR ALIGN="LEFT"><TD ALIGN="LEFT" FIXEDSIZE="TRUE" WIDTH="15" HEIGHT="16"></TD><TD ALIGN="LEFT" FIXEDSIZE="TRUE" WIDTH="287" HEIGHT="16">classe_bilan_dpe</TD></TR></TABLE></TD><TD PORT="classe_bilan_dpe.type" ALIGN="LEFT">text[2147483647]</TD></TR>
      <TR><TD PORT="classe_emission_ges" COLSPAN="2" ALIGN="LEFT"><TABLE BORDER="0" CELLSPACING="0" ALIGN="LEFT"><TR ALIGN="LEFT"><TD ALIGN="LEFT" FIXEDSIZE="TRUE" WIDTH="15" HEIGHT="16"></TD><TD ALIGN="LEFT" FIXEDSIZE="TRUE" WIDTH="287" HEIGHT="16">classe_emission_ges</TD></TR></TABLE></TD><TD PORT="classe_emission_ges.type" ALIGN="LEFT">text[2147483647]</TD></TR>
      <TR><TD PORT="classe_conso_energie_arrete_2012" COLSPAN="2" ALIGN="LEFT"><TABLE BORDER="0" CELLSPACING="0" ALIGN="LEFT"><TR ALIGN="LEFT"><TD ALIGN="LEFT" FIXEDSIZE="TRUE" WIDTH="15" HEIGHT="16"></TD><TD ALIGN="LEFT" FIXEDSIZE="TRUE" WIDTH="287" HEIGHT="16">classe_conso_energie_arrete_2012</TD></TR></TABLE></TD><TD PORT="classe_conso_energie_arrete_2012.type" ALIGN="LEFT">text[2147483647]</TD></TR>
      <TR><TD PORT="classe_emission_ges_arrete_2012" COLSPAN="2" ALIGN="LEFT"><TABLE BORDER="0" CELLSPACING="0" ALIGN="LEFT"><TR ALIGN="LEFT"><TD ALIGN="LEFT" FIXEDSIZE="TRUE" WIDTH="15" HEIGHT="16"></TD><TD ALIGN="LEFT" FIXEDSIZE="TRUE" WIDTH="287" HEIGHT="16">classe_emission_ges_arrete_2012</TD></TR></TABLE></TD><TD PORT="classe_emission_ges_arrete_2012.type" ALIGN="LEFT">text[2147483647]</TD></TR>
      <TR><TD PORT="conso_3_usages_ep_m2_arrete_2012" COLSPAN="2" ALIGN="LEFT"><TABLE BORDER="0" CELLSPACING="0" ALIGN="LEFT"><TR ALIGN="LEFT"><TD ALIGN="LEFT" FIXEDSIZE="TRUE" WIDTH="15" HEIGHT="16"></TD><TD ALIGN="LEFT" FIXEDSIZE="TRUE" WIDTH="287" HEIGHT="16">conso_3_usages_ep_m2_arrete_2012</TD></TR></TABLE></TD><TD PORT="conso_3_usages_ep_m2_arrete_2012.type" ALIGN="LEFT">numeric[0]</TD></TR>
      <TR><TD PORT="emission_ges_3_usages_ep_m2_arrete_2012" COLSPAN="2" ALIGN="LEFT"><TABLE BORDER="0" CELLSPACING="0" ALIGN="LEFT"><TR ALIGN="LEFT"><TD ALIGN="LEFT" FIXEDSIZE="TRUE" WIDTH="15" HEIGHT="16"></TD><TD ALIGN="LEFT" FIXEDSIZE="TRUE" WIDTH="287" HEIGHT="16">emission_ges_3_usages_ep_m2_arrete_2012</TD></TR></TABLE></TD><TD PORT="emission_ges_3_usages_ep_m2_arrete_2012.type" ALIGN="LEFT">numeric[0]</TD></TR>
      <TR><TD PORT="type_installation_chauffage" COLSPAN="2" ALIGN="LEFT"><TABLE BORDER="0" CELLSPACING="0" ALIGN="LEFT"><TR ALIGN="LEFT"><TD ALIGN="LEFT" FIXEDSIZE="TRUE" WIDTH="15" HEIGHT="16"></TD><TD ALIGN="LEFT" FIXEDSIZE="TRUE" WIDTH="287" HEIGHT="16">type_installation_chauffage</TD></TR></TABLE></TD><TD PORT="type_installation_chauffage.type" ALIGN="LEFT">text[2147483647]</TD></TR>
      <TR><TD PORT="type_energie_chauffage" COLSPAN="2" ALIGN="LEFT"><TABLE BORDER="0" CELLSPACING="0" ALIGN="LEFT"><TR ALIGN="LEFT"><TD ALIGN="LEFT" FIXEDSIZE="TRUE" WIDTH="15" HEIGHT="16"></TD><TD ALIGN="LEFT" FIXEDSIZE="TRUE" WIDTH="287" HEIGHT="16">type_energie_chauffage</TD></TR></TABLE></TD><TD PORT="type_energie_chauffage.type" ALIGN="LEFT">text[2147483647]</TD></TR>
      <TR><TD PORT="type_generateur_chauffage" COLSPAN="2" ALIGN="LEFT"><TABLE BORDER="0" CELLSPACING="0" ALIGN="LEFT"><TR ALIGN="LEFT"><TD ALIGN="LEFT" FIXEDSIZE="TRUE" WIDTH="15" HEIGHT="16"></TD><TD ALIGN="LEFT" FIXEDSIZE="TRUE" WIDTH="287" HEIGHT="16">type_generateur_chauffage</TD></TR></TABLE></TD><TD PORT="type_generateur_chauffage.type" ALIGN="LEFT">text[2147483647]</TD></TR>
      <TR><TD PORT="type_generateur_chauffage_anciennete" COLSPAN="2" ALIGN="LEFT"><TABLE BORDER="0" CELLSPACING="0" ALIGN="LEFT"><TR ALIGN="LEFT"><TD ALIGN="LEFT" FIXEDSIZE="TRUE" WIDTH="15" HEIGHT="16"></TD><TD ALIGN="LEFT" FIXEDSIZE="TRUE" WIDTH="287" HEIGHT="16">type_generateur_chauffage_anciennete</TD></TR></TABLE></TD><TD PORT="type_generateur_chauffage_anciennete.type" ALIGN="LEFT">text[2147483647]</TD></TR>
      <TR><TD PORT="type_energie_chauffage_appoint" COLSPAN="2" ALIGN="LEFT"><TABLE BORDER="0" CELLSPACING="0" ALIGN="LEFT"><TR ALIGN="LEFT"><TD ALIGN="LEFT" FIXEDSIZE="TRUE" WIDTH="15" HEIGHT="16"></TD><TD ALIGN="LEFT" FIXEDSIZE="TRUE" WIDTH="287" HEIGHT="16">type_energie_chauffage_appoint</TD></TR></TABLE></TD><TD PORT="type_energie_chauffage_appoint.type" ALIGN="LEFT">text[2147483647]</TD></TR>
      <TR><TD PORT="type_generateur_chauffage_appoint" COLSPAN="2" ALIGN="LEFT"><TABLE BORDER="0" CELLSPACING="0" ALIGN="LEFT"><TR ALIGN="LEFT"><TD ALIGN="LEFT" FIXEDSIZE="TRUE" WIDTH="15" HEIGHT="16"></TD><TD ALIGN="LEFT" FIXEDSIZE="TRUE" WIDTH="287" HEIGHT="16">type_generateur_chauffage_appoint</TD></TR></TABLE></TD><TD PORT="type_generateur_chauffage_appoint.type" ALIGN="LEFT">text[2147483647]</TD></TR>
      <TR><TD PORT="type_generateur_chauffage_anciennete_appoint" COLSPAN="2" ALIGN="LEFT"><TABLE BORDER="0" CELLSPACING="0" ALIGN="LEFT"><TR ALIGN="LEFT"><TD ALIGN="LEFT" FIXEDSIZE="TRUE" WIDTH="15" HEIGHT="16"></TD><TD ALIGN="LEFT" FIXEDSIZE="TRUE" WIDTH="287" HEIGHT="16">type_generateur_chauffage_anciennete_appoint</TD></TR></TABLE></TD><TD PORT="type_generateur_chauffage_anciennete_appoint.type" ALIGN="LEFT">text[2147483647]</TD></TR>
      <TR><TD PORT="chauffage_solaire" COLSPAN="2" ALIGN="LEFT"><TABLE BORDER="0" CELLSPACING="0" ALIGN="LEFT"><TR ALIGN="LEFT"><TD ALIGN="LEFT" FIXEDSIZE="TRUE" WIDTH="15" HEIGHT="16"></TD><TD ALIGN="LEFT" FIXEDSIZE="TRUE" WIDTH="287" HEIGHT="16">chauffage_solaire</TD></TR></TABLE></TD><TD PORT="chauffage_solaire.type" ALIGN="LEFT">bool[1]</TD></TR>
      <TR><TD PORT="nb_generateur_chauffage" COLSPAN="2" ALIGN="LEFT"><TABLE BORDER="0" CELLSPACING="0" ALIGN="LEFT"><TR ALIGN="LEFT"><TD ALIGN="LEFT" FIXEDSIZE="TRUE" WIDTH="15" HEIGHT="16"></TD><TD ALIGN="LEFT" FIXEDSIZE="TRUE" WIDTH="287" HEIGHT="16">nb_generateur_chauffage</TD></TR></TABLE></TD><TD PORT="nb_generateur_chauffage.type" ALIGN="LEFT">int2[5]</TD></TR>
      <TR><TD PORT="nb_installation_chauffage" COLSPAN="2" ALIGN="LEFT"><TABLE BORDER="0" CELLSPACING="0" ALIGN="LEFT"><TR ALIGN="LEFT"><TD ALIGN="LEFT" FIXEDSIZE="TRUE" WIDTH="15" HEIGHT="16"></TD><TD ALIGN="LEFT" FIXEDSIZE="TRUE" WIDTH="287" HEIGHT="16">nb_installation_chauffage</TD></TR></TABLE></TD><TD PORT="nb_installation_chauffage.type" ALIGN="LEFT">int2[5]</TD></TR>
      <TR><TD PORT="type_energie_climatisation" COLSPAN="2" ALIGN="LEFT"><TABLE BORDER="0" CELLSPACING="0" ALIGN="LEFT"><TR ALIGN="LEFT"><TD ALIGN="LEFT" FIXEDSIZE="TRUE" WIDTH="15" HEIGHT="16"></TD><TD ALIGN="LEFT" FIXEDSIZE="TRUE" WIDTH="287" HEIGHT="16">type_energie_climatisation</TD></TR></TABLE></TD><TD PORT="type_energie_climatisation.type" ALIGN="LEFT">text[2147483647]</TD></TR>
      <TR><TD PORT="type_generateur_climatisation" COLSPAN="2" ALIGN="LEFT"><TABLE BORDER="0" CELLSPACING="0" ALIGN="LEFT"><TR ALIGN="LEFT"><TD ALIGN="LEFT" FIXEDSIZE="TRUE" WIDTH="15" HEIGHT="16"></TD><TD ALIGN="LEFT" FIXEDSIZE="TRUE" WIDTH="287" HEIGHT="16">type_generateur_climatisation</TD></TR></TABLE></TD><TD PORT="type_generateur_climatisation.type" ALIGN="LEFT">text[2147483647]</TD></TR>
      <TR><TD PORT="type_generateur_climatisation_anciennete" COLSPAN="2" ALIGN="LEFT"><TABLE BORDER="0" CELLSPACING="0" ALIGN="LEFT"><TR ALIGN="LEFT"><TD ALIGN="LEFT" FIXEDSIZE="TRUE" WIDTH="15" HEIGHT="16"></TD><TD ALIGN="LEFT" FIXEDSIZE="TRUE" WIDTH="287" HEIGHT="16">type_generateur_climatisation_anciennete</TD></TR></TABLE></TD><TD PORT="type_generateur_climatisation_anciennete.type" ALIGN="LEFT">text[2147483647]</TD></TR>
      <TR><TD PORT="type_installation_ecs" COLSPAN="2" ALIGN="LEFT"><TABLE BORDER="0" CELLSPACING="0" ALIGN="LEFT"><TR ALIGN="LEFT"><TD ALIGN="LEFT" FIXEDSIZE="TRUE" WIDTH="15" HEIGHT="16"></TD><TD ALIGN="LEFT" FIXEDSIZE="TRUE" WIDTH="287" HEIGHT="16">type_installation_ecs</TD></TR></TABLE></TD><TD PORT="type_installation_ecs.type" ALIGN="LEFT">text[2147483647]</TD></TR>
      <TR><TD PORT="type_energie_ecs" COLSPAN="2" ALIGN="LEFT"><TABLE BORDER="0" CELLSPACING="0" ALIGN="LEFT"><TR ALIGN="LEFT"><TD ALIGN="LEFT" FIXEDSIZE="TRUE" WIDTH="15" HEIGHT="16"></TD><TD ALIGN="LEFT" FIXEDSIZE="TRUE" WIDTH="287" HEIGHT="16">type_energie_ecs</TD></TR></TABLE></TD><TD PORT="type_energie_ecs.type" ALIGN="LEFT">text[2147483647]</TD></TR>
      <TR><TD PORT="type_generateur_ecs" COLSPAN="2" ALIGN="LEFT"><TABLE BORDER="0" CELLSPACING="0" ALIGN="LEFT"><TR ALIGN="LEFT"><TD ALIGN="LEFT" FIXEDSIZE="TRUE" WIDTH="15" HEIGHT="16"></TD><TD ALIGN="LEFT" FIXEDSIZE="TRUE" WIDTH="287" HEIGHT="16">type_generateur_ecs</TD></TR></TABLE></TD><TD PORT="type_generateur_ecs.type" ALIGN="LEFT">text[2147483647]</TD></TR>
      <TR><TD PORT="type_generateur_ecs_anciennete" COLSPAN="2" ALIGN="LEFT"><TABLE BORDER="0" CELLSPACING="0" ALIGN="LEFT"><TR ALIGN="LEFT"><TD ALIGN="LEFT" FIXEDSIZE="TRUE" WIDTH="15" HEIGHT="16"></TD><TD ALIGN="LEFT" FIXEDSIZE="TRUE" WIDTH="287" HEIGHT="16">type_generateur_ecs_anciennete</TD></TR></TABLE></TD><TD PORT="type_generateur_ecs_anciennete.type" ALIGN="LEFT">text[2147483647]</TD></TR>
      <TR><TD PORT="type_energie_ecs_appoint" COLSPAN="2" ALIGN="LEFT"><TABLE BORDER="0" CELLSPACING="0" ALIGN="LEFT"><TR ALIGN="LEFT"><TD ALIGN="LEFT" FIXEDSIZE="TRUE" WIDTH="15" HEIGHT="16"></TD><TD ALIGN="LEFT" FIXEDSIZE="TRUE" WIDTH="287" HEIGHT="16">type_energie_ecs_appoint</TD></TR></TABLE></TD><TD PORT="type_energie_ecs_appoint.type" ALIGN="LEFT">text[2147483647]</TD></TR>
      <TR><TD PORT="type_generateur_ecs_appoint" COLSPAN="2" ALIGN="LEFT"><TABLE BORDER="0" CELLSPACING="0" ALIGN="LEFT"><TR ALIGN="LEFT"><TD ALIGN="LEFT" FIXEDSIZE="TRUE" WIDTH="15" HEIGHT="16"></TD><TD ALIGN="LEFT" FIXEDSIZE="TRUE" WIDTH="287" HEIGHT="16">type_generateur_ecs_appoint</TD></TR></TABLE></TD><TD PORT="type_generateur_ecs_appoint.type" ALIGN="LEFT">text[2147483647]</TD></TR>
      <TR><TD PORT="type_generateur_ecs_anciennete_appoint" COLSPAN="2" ALIGN="LEFT"><TABLE BORDER="0" CELLSPACING="0" ALIGN="LEFT"><TR ALIGN="LEFT"><TD ALIGN="LEFT" FIXEDSIZE="TRUE" WIDTH="15" HEIGHT="16"></TD><TD ALIGN="LEFT" FIXEDSIZE="TRUE" WIDTH="287" HEIGHT="16">type_generateur_ecs_anciennete_appoint</TD></TR></TABLE></TD><TD PORT="type_generateur_ecs_anciennete_appoint.type" ALIGN="LEFT">text[2147483647]</TD></TR>
      <TR><TD PORT="ecs_solaire" COLSPAN="2" ALIGN="LEFT"><TABLE BORDER="0" CELLSPACING="0" ALIGN="LEFT"><TR ALIGN="LEFT"><TD ALIGN="LEFT" FIXEDSIZE="TRUE" WIDTH="15" HEIGHT="16"></TD><TD ALIGN="LEFT" FIXEDSIZE="TRUE" WIDTH="287" HEIGHT="16">ecs_solaire</TD></TR></TABLE></TD><TD PORT="ecs_solaire.type" ALIGN="LEFT">bool[1]</TD></TR>
      <TR><TD PORT="nb_generateur_ecs" COLSPAN="2" ALIGN="LEFT"><TABLE BORDER="0" CELLSPACING="0" ALIGN="LEFT"><TR ALIGN="LEFT"><TD ALIGN="LEFT" FIXEDSIZE="TRUE" WIDTH="15" HEIGHT="16"></TD><TD ALIGN="LEFT" FIXEDSIZE="TRUE" WIDTH="287" HEIGHT="16">nb_generateur_ecs</TD></TR></TABLE></TD><TD PORT="nb_generateur_ecs.type" ALIGN="LEFT">int2[5]</TD></TR>
      <TR><TD PORT="nb_installation_ecs" COLSPAN="2" ALIGN="LEFT"><TABLE BORDER="0" CELLSPACING="0" ALIGN="LEFT"><TR ALIGN="LEFT"><TD ALIGN="LEFT" FIXEDSIZE="TRUE" WIDTH="15" HEIGHT="16"></TD><TD ALIGN="LEFT" FIXEDSIZE="TRUE" WIDTH="287" HEIGHT="16">nb_installation_ecs</TD></TR></TABLE></TD><TD PORT="nb_installation_ecs.type" ALIGN="LEFT">int2[5]</TD></TR>
      <TR><TD PORT="plusieurs_facade_exposee" COLSPAN="2" ALIGN="LEFT"><TABLE BORDER="0" CELLSPACING="0" ALIGN="LEFT"><TR ALIGN="LEFT"><TD ALIGN="LEFT" FIXEDSIZE="TRUE" WIDTH="15" HEIGHT="16"></TD><TD ALIGN="LEFT" FIXEDSIZE="TRUE" WIDTH="287" HEIGHT="16">plusieurs_facade_exposee</TD></TR></TABLE></TD><TD PORT="plusieurs_facade_exposee.type" ALIGN="LEFT">bool[1]</TD></TR>
      <TR><TD PORT="type_ventilation" COLSPAN="2" ALIGN="LEFT"><TABLE BORDER="0" CELLSPACING="0" ALIGN="LEFT"><TR ALIGN="LEFT"><TD ALIGN="LEFT" FIXEDSIZE="TRUE" WIDTH="15" HEIGHT="16"></TD><TD ALIGN="LEFT" FIXEDSIZE="TRUE" WIDTH="287" HEIGHT="16">type_ventilation</TD></TR></TABLE></TD><TD PORT="type_ventilation.type" ALIGN="LEFT">text[2147483647]</TD></TR>
      <TR><TD PORT="type_production_energie_renouvelable" COLSPAN="2" ALIGN="LEFT"><TABLE BORDER="0" CELLSPACING="0" ALIGN="LEFT"><TR ALIGN="LEFT"><TD ALIGN="LEFT" FIXEDSIZE="TRUE" WIDTH="15" HEIGHT="16"></TD><TD ALIGN="LEFT" FIXEDSIZE="TRUE" WIDTH="287" HEIGHT="16">type_production_energie_renouvelable</TD></TR></TABLE></TD><TD PORT="type_production_energie_renouvelable.type" ALIGN="LEFT">text[2147483647]</TD></TR>
      <TR><TD PORT="type_vitrage" COLSPAN="2" ALIGN="LEFT"><TABLE BORDER="0" CELLSPACING="0" ALIGN="LEFT"><TR ALIGN="LEFT"><TD ALIGN="LEFT" FIXEDSIZE="TRUE" WIDTH="15" HEIGHT="16"></TD><TD ALIGN="LEFT" FIXEDSIZE="TRUE" WIDTH="287" HEIGHT="16">type_vitrage</TD></TR></TABLE></TD><TD PORT="type_vitrage.type" ALIGN="LEFT">text[2147483647]</TD></TR>
      <TR><TD PORT="type_materiaux_menuiserie" COLSPAN="2" ALIGN="LEFT"><TABLE BORDER="0" CELLSPACING="0" ALIGN="LEFT"><TR ALIGN="LEFT"><TD ALIGN="LEFT" FIXEDSIZE="TRUE" WIDTH="15" HEIGHT="16"></TD><TD ALIGN="LEFT" FIXEDSIZE="TRUE" WIDTH="287" HEIGHT="16">type_materiaux_menuiserie</TD></TR></TABLE></TD><TD PORT="type_materiaux_menuiserie.type" ALIGN="LEFT">text[2147483647]</TD></TR>
      <TR><TD PORT="type_gaz_lame" COLSPAN="2" ALIGN="LEFT"><TABLE BORDER="0" CELLSPACING="0" ALIGN="LEFT"><TR ALIGN="LEFT"><TD ALIGN="LEFT" FIXEDSIZE="TRUE" WIDTH="15" HEIGHT="16"></TD><TD ALIGN="LEFT" FIXEDSIZE="TRUE" WIDTH="287" HEIGHT="16">type_gaz_lame</TD></TR></TABLE></TD><TD PORT="type_gaz_lame.type" ALIGN="LEFT">text[2147483647]</TD></TR>
      <TR><TD PORT="type_fermeture" COLSPAN="2" ALIGN="LEFT"><TABLE BORDER="0" CELLSPACING="0" ALIGN="LEFT"><TR ALIGN="LEFT"><TD ALIGN="LEFT" FIXEDSIZE="TRUE" WIDTH="15" HEIGHT="16"></TD><TD ALIGN="LEFT" FIXEDSIZE="TRUE" WIDTH="287" HEIGHT="16">type_fermeture</TD></TR></TABLE></TD><TD PORT="type_fermeture.type" ALIGN="LEFT">text[2147483647]</TD></TR>
      <TR><TD PORT="epaisseur_lame" COLSPAN="2" ALIGN="LEFT"><TABLE BORDER="0" CELLSPACING="0" ALIGN="LEFT"><TR ALIGN="LEFT"><TD ALIGN="LEFT" FIXEDSIZE="TRUE" WIDTH="15" HEIGHT="16"></TD><TD ALIGN="LEFT" FIXEDSIZE="TRUE" WIDTH="287" HEIGHT="16">epaisseur_lame</TD></TR></TABLE></TD><TD PORT="epaisseur_lame.type" ALIGN="LEFT">int2[5]</TD></TR>
      <TR><TD PORT="vitrage_vir" COLSPAN="2" ALIGN="LEFT"><TABLE BORDER="0" CELLSPACING="0" ALIGN="LEFT"><TR ALIGN="LEFT"><TD ALIGN="LEFT" FIXEDSIZE="TRUE" WIDTH="15" HEIGHT="16"></TD><TD ALIGN="LEFT" FIXEDSIZE="TRUE" WIDTH="287" HEIGHT="16">vitrage_vir</TD></TR></TABLE></TD><TD PORT="vitrage_vir.type" ALIGN="LEFT">bool[1]</TD></TR>
      <TR><TD PORT="surface_vitree_nord" COLSPAN="2" ALIGN="LEFT"><TABLE BORDER="0" CELLSPACING="0" ALIGN="LEFT"><TR ALIGN="LEFT"><TD ALIGN="LEFT" FIXEDSIZE="TRUE" WIDTH="15" HEIGHT="16"></TD><TD ALIGN="LEFT" FIXEDSIZE="TRUE" WIDTH="287" HEIGHT="16">surface_vitree_nord</TD></TR></TABLE></TD><TD PORT="surface_vitree_nord.type" ALIGN="LEFT">numeric[0]</TD></TR>
      <TR><TD PORT="surface_vitree_sud" COLSPAN="2" ALIGN="LEFT"><TABLE BORDER="0" CELLSPACING="0" ALIGN="LEFT"><TR ALIGN="LEFT"><TD ALIGN="LEFT" FIXEDSIZE="TRUE" WIDTH="15" HEIGHT="16"></TD><TD ALIGN="LEFT" FIXEDSIZE="TRUE" WIDTH="287" HEIGHT="16">surface_vitree_sud</TD></TR></TABLE></TD><TD PORT="surface_vitree_sud.type" ALIGN="LEFT">numeric[0]</TD></TR>
      <TR><TD PORT="surface_vitree_ouest" COLSPAN="2" ALIGN="LEFT"><TABLE BORDER="0" CELLSPACING="0" ALIGN="LEFT"><TR ALIGN="LEFT"><TD ALIGN="LEFT" FIXEDSIZE="TRUE" WIDTH="15" HEIGHT="16"></TD><TD ALIGN="LEFT" FIXEDSIZE="TRUE" WIDTH="287" HEIGHT="16">surface_vitree_ouest</TD></TR></TABLE></TD><TD PORT="surface_vitree_ouest.type" ALIGN="LEFT">numeric[0]</TD></TR>
      <TR><TD PORT="surface_vitree_est" COLSPAN="2" ALIGN="LEFT"><TABLE BORDER="0" CELLSPACING="0" ALIGN="LEFT"><TR ALIGN="LEFT"><TD ALIGN="LEFT" FIXEDSIZE="TRUE" WIDTH="15" HEIGHT="16"></TD><TD ALIGN="LEFT" FIXEDSIZE="TRUE" WIDTH="287" HEIGHT="16">surface_vitree_est</TD></TR></TABLE></TD><TD PORT="surface_vitree_est.type" ALIGN="LEFT">numeric[0]</TD></TR>
      <TR><TD PORT="surface_vitree_horizontal" COLSPAN="2" ALIGN="LEFT"><TABLE BORDER="0" CELLSPACING="0" ALIGN="LEFT"><TR ALIGN="LEFT"><TD ALIGN="LEFT" FIXEDSIZE="TRUE" WIDTH="15" HEIGHT="16"></TD><TD ALIGN="LEFT" FIXEDSIZE="TRUE" WIDTH="287" HEIGHT="16">surface_vitree_horizontal</TD></TR></TABLE></TD><TD PORT="surface_vitree_horizontal.type" ALIGN="LEFT">numeric[0]</TD></TR>
      <TR><TD PORT="traversant" COLSPAN="2" ALIGN="LEFT"><TABLE BORDER="0" CELLSPACING="0" ALIGN="LEFT"><TR ALIGN="LEFT"><TD ALIGN="LEFT" FIXEDSIZE="TRUE" WIDTH="15" HEIGHT="16"></TD><TD ALIGN="LEFT" FIXEDSIZE="TRUE" WIDTH="287" HEIGHT="16">traversant</TD></TR></TABLE></TD><TD PORT="traversant.type" ALIGN="LEFT">text[2147483647]</TD></TR>
      <TR><TD PORT="u_baie_vitree" COLSPAN="2" ALIGN="LEFT"><TABLE BORDER="0" CELLSPACING="0" ALIGN="LEFT"><TR ALIGN="LEFT"><TD ALIGN="LEFT" FIXEDSIZE="TRUE" WIDTH="15" HEIGHT="16"></TD><TD ALIGN="LEFT" FIXEDSIZE="TRUE" WIDTH="287" HEIGHT="16">u_baie_vitree</TD></TR></TABLE></TD><TD PORT="u_baie_vitree.type" ALIGN="LEFT">numeric[0]</TD></TR>
      <TR><TD PORT="uw" COLSPAN="2" ALIGN="LEFT"><TABLE BORDER="0" CELLSPACING="0" ALIGN="LEFT"><TR ALIGN="LEFT"><TD ALIGN="LEFT" FIXEDSIZE="TRUE" WIDTH="15" HEIGHT="16"></TD><TD ALIGN="LEFT" FIXEDSIZE="TRUE" WIDTH="287" HEIGHT="16">uw</TD></TR></TABLE></TD><TD PORT="uw.type" ALIGN="LEFT">numeric[0]</TD></TR>
      <TR><TD PORT="facteur_solaire_baie_vitree" COLSPAN="2" ALIGN="LEFT"><TABLE BORDER="0" CELLSPACING="0" ALIGN="LEFT"><TR ALIGN="LEFT"><TD ALIGN="LEFT" FIXEDSIZE="TRUE" WIDTH="15" HEIGHT="16"></TD><TD ALIGN="LEFT" FIXEDSIZE="TRUE" WIDTH="287" HEIGHT="16">facteur_solaire_baie_vitree</TD></TR></TABLE></TD><TD PORT="facteur_solaire_baie_vitree.type" ALIGN="LEFT">numeric[0]</TD></TR>
      <TR><TD PORT="presence_balcon" COLSPAN="2" ALIGN="LEFT"><TABLE BORDER="0" CELLSPACING="0" ALIGN="LEFT"><TR ALIGN="LEFT"><TD ALIGN="LEFT" FIXEDSIZE="TRUE" WIDTH="15" HEIGHT="16"></TD><TD ALIGN="LEFT" FIXEDSIZE="TRUE" WIDTH="287" HEIGHT="16">presence_balcon</TD></TR></TABLE></TD><TD PORT="presence_balcon.type" ALIGN="LEFT">bool[1]</TD></TR>
      <TR><TD PORT="l_orientation_baie_vitree" COLSPAN="2" ALIGN="LEFT"><TABLE BORDER="0" CELLSPACING="0" ALIGN="LEFT"><TR ALIGN="LEFT"><TD ALIGN="LEFT" FIXEDSIZE="TRUE" WIDTH="15" HEIGHT="16"></TD><TD ALIGN="LEFT" FIXEDSIZE="TRUE" WIDTH="287" HEIGHT="16">l_orientation_baie_vitree</TD></TR></TABLE></TD><TD PORT="l_orientation_baie_vitree.type" ALIGN="LEFT">_text[2147483647]</TD></TR>
      <TR><TD PORT="pourcentage_surface_baie_vitree_exterieur" COLSPAN="2" ALIGN="LEFT"><TABLE BORDER="0" CELLSPACING="0" ALIGN="LEFT"><TR ALIGN="LEFT"><TD ALIGN="LEFT" FIXEDSIZE="TRUE" WIDTH="15" HEIGHT="16"></TD><TD ALIGN="LEFT" FIXEDSIZE="TRUE" WIDTH="287" HEIGHT="16">pourcentage_surface_baie_vitree_exterieur</TD></TR></TABLE></TD><TD PORT="pourcentage_surface_baie_vitree_exterieur.type" ALIGN="LEFT">numeric[0]</TD></TR>
      <TR><TD PORT="type_isolation_mur_exterieur" COLSPAN="2" ALIGN="LEFT"><TABLE BORDER="0" CELLSPACING="0" ALIGN="LEFT"><TR ALIGN="LEFT"><TD ALIGN="LEFT" FIXEDSIZE="TRUE" WIDTH="15" HEIGHT="16"></TD><TD ALIGN="LEFT" FIXEDSIZE="TRUE" WIDTH="287" HEIGHT="16">type_isolation_mur_exterieur</TD></TR></TABLE></TD><TD PORT="type_isolation_mur_exterieur.type" ALIGN="LEFT">text[2147483647]</TD></TR>
      <TR><TD PORT="epaisseur_isolation_mur_exterieur_estim" COLSPAN="2" ALIGN="LEFT"><TABLE BORDER="0" CELLSPACING="0" ALIGN="LEFT"><TR ALIGN="LEFT"><TD ALIGN="LEFT" FIXEDSIZE="TRUE" WIDTH="15" HEIGHT="16"></TD><TD ALIGN="LEFT" FIXEDSIZE="TRUE" WIDTH="287" HEIGHT="16">epaisseur_isolation_mur_exterieur_estim</TD></TR></TABLE></TD><TD PORT="epaisseur_isolation_mur_exterieur_estim.type" ALIGN="LEFT">int4[10]</TD></TR>
      <TR><TD PORT="materiaux_structure_mur_exterieur" COLSPAN="2" ALIGN="LEFT"><TABLE BORDER="0" CELLSPACING="0" ALIGN="LEFT"><TR ALIGN="LEFT"><TD ALIGN="LEFT" FIXEDSIZE="TRUE" WIDTH="15" HEIGHT="16"></TD><TD ALIGN="LEFT" FIXEDSIZE="TRUE" WIDTH="287" HEIGHT="16">materiaux_structure_mur_exterieur</TD></TR></TABLE></TD><TD PORT="materiaux_structure_mur_exterieur.type" ALIGN="LEFT">text[2147483647]</TD></TR>
      <TR><TD PORT="epaisseur_structure_mur_exterieur" COLSPAN="2" ALIGN="LEFT"><TABLE BORDER="0" CELLSPACING="0" ALIGN="LEFT"><TR ALIGN="LEFT"><TD ALIGN="LEFT" FIXEDSIZE="TRUE" WIDTH="15" HEIGHT="16"></TD><TD ALIGN="LEFT" FIXEDSIZE="TRUE" WIDTH="287" HEIGHT="16">epaisseur_structure_mur_exterieur</TD></TR></TABLE></TD><TD PORT="epaisseur_structure_mur_exterieur.type" ALIGN="LEFT">text[2147483647]</TD></TR>
      <TR><TD PORT="surface_mur_totale" COLSPAN="2" ALIGN="LEFT"><TABLE BORDER="0" CELLSPACING="0" ALIGN="LEFT"><TR ALIGN="LEFT"><TD ALIGN="LEFT" FIXEDSIZE="TRUE" WIDTH="15" HEIGHT="16"></TD><TD ALIGN="LEFT" FIXEDSIZE="TRUE" WIDTH="287" HEIGHT="16">surface_mur_totale</TD></TR></TABLE></TD><TD PORT="surface_mur_totale.type" ALIGN="LEFT">numeric[0]</TD></TR>
      <TR><TD PORT="surface_mur_exterieur" COLSPAN="2" ALIGN="LEFT"><TABLE BORDER="0" CELLSPACING="0" ALIGN="LEFT"><TR ALIGN="LEFT"><TD ALIGN="LEFT" FIXEDSIZE="TRUE" WIDTH="15" HEIGHT="16"></TD><TD ALIGN="LEFT" FIXEDSIZE="TRUE" WIDTH="287" HEIGHT="16">surface_mur_exterieur</TD></TR></TABLE></TD><TD PORT="surface_mur_exterieur.type" ALIGN="LEFT">numeric[0]</TD></TR>
      <TR><TD PORT="surface_mur_deperditif" COLSPAN="2" ALIGN="LEFT"><TABLE BORDER="0" CELLSPACING="0" ALIGN="LEFT"><TR ALIGN="LEFT"><TD ALIGN="LEFT" FIXEDSIZE="TRUE" WIDTH="15" HEIGHT="16"></TD><TD ALIGN="LEFT" FIXEDSIZE="TRUE" WIDTH="287" HEIGHT="16">surface_mur_deperditif</TD></TR></TABLE></TD><TD PORT="surface_mur_deperditif.type" ALIGN="LEFT">numeric[0]</TD></TR>
      <TR><TD PORT="u_mur_exterieur" COLSPAN="2" ALIGN="LEFT"><TABLE BORDER="0" CELLSPACING="0" ALIGN="LEFT"><TR ALIGN="LEFT"><TD ALIGN="LEFT" FIXEDSIZE="TRUE" WIDTH="15" HEIGHT="16"></TD><TD ALIGN="LEFT" FIXEDSIZE="TRUE" WIDTH="287" HEIGHT="16">u_mur_exterieur</TD></TR></TABLE></TD><TD PORT="u_mur_exterieur.type" ALIGN="LEFT">numeric[0]</TD></TR>
      <TR><TD PORT="l_local_non_chauffe_mur" COLSPAN="2" ALIGN="LEFT"><TABLE BORDER="0" CELLSPACING="0" ALIGN="LEFT"><TR ALIGN="LEFT"><TD ALIGN="LEFT" FIXEDSIZE="TRUE" WIDTH="15" HEIGHT="16"></TD><TD ALIGN="LEFT" FIXEDSIZE="TRUE" WIDTH="287" HEIGHT="16">l_local_non_chauffe_mur</TD></TR></TABLE></TD><TD PORT="l_local_non_chauffe_mur.type" ALIGN="LEFT">_text[2147483647]</TD></TR>
      <TR><TD PORT="local_non_chauffe_principal_mur" COLSPAN="2" ALIGN="LEFT"><TABLE BORDER="0" CELLSPACING="0" ALIGN="LEFT"><TR ALIGN="LEFT"><TD ALIGN="LEFT" FIXEDSIZE="TRUE" WIDTH="15" HEIGHT="16"></TD><TD ALIGN="LEFT" FIXEDSIZE="TRUE" WIDTH="287" HEIGHT="16">local_non_chauffe_principal_mur</TD></TR></TABLE></TD><TD PORT="local_non_chauffe_principal_mur.type" ALIGN="LEFT">text[2147483647]</TD></TR>
      <TR><TD PORT="l_orientation_mur_exterieur" COLSPAN="2" ALIGN="LEFT"><TABLE BORDER="0" CELLSPACING="0" ALIGN="LEFT"><TR ALIGN="LEFT"><TD ALIGN="LEFT" FIXEDSIZE="TRUE" WIDTH="15" HEIGHT="16"></TD><TD ALIGN="LEFT" FIXEDSIZE="TRUE" WIDTH="287" HEIGHT="16">l_orientation_mur_exterieur</TD></TR></TABLE></TD><TD PORT="l_orientation_mur_exterieur.type" ALIGN="LEFT">_text[2147483647]</TD></TR>
      <TR><TD PORT="type_isolation_plancher_bas" COLSPAN="2" ALIGN="LEFT"><TABLE BORDER="0" CELLSPACING="0" ALIGN="LEFT"><TR ALIGN="LEFT"><TD ALIGN="LEFT" FIXEDSIZE="TRUE" WIDTH="15" HEIGHT="16"></TD><TD ALIGN="LEFT" FIXEDSIZE="TRUE" WIDTH="287" HEIGHT="16">type_isolation_plancher_bas</TD></TR></TABLE></TD><TD PORT="type_isolation_plancher_bas.type" ALIGN="LEFT">text[2147483647]</TD></TR>
      <TR><TD PORT="type_plancher_bas_deperditif" COLSPAN="2" ALIGN="LEFT"><TABLE BORDER="0" CELLSPACING="0" ALIGN="LEFT"><TR ALIGN="LEFT"><TD ALIGN="LEFT" FIXEDSIZE="TRUE" WIDTH="15" HEIGHT="16"></TD><TD ALIGN="LEFT" FIXEDSIZE="TRUE" WIDTH="287" HEIGHT="16">type_plancher_bas_deperditif</TD></TR></TABLE></TD><TD PORT="type_plancher_bas_deperditif.type" ALIGN="LEFT">text[2147483647]</TD></TR>
      <TR><TD PORT="surface_plancher_bas_totale" COLSPAN="2" ALIGN="LEFT"><TABLE BORDER="0" CELLSPACING="0" ALIGN="LEFT"><TR ALIGN="LEFT"><TD ALIGN="LEFT" FIXEDSIZE="TRUE" WIDTH="15" HEIGHT="16"></TD><TD ALIGN="LEFT" FIXEDSIZE="TRUE" WIDTH="287" HEIGHT="16">surface_plancher_bas_totale</TD></TR></TABLE></TD><TD PORT="surface_plancher_bas_totale.type" ALIGN="LEFT">numeric[0]</TD></TR>
      <TR><TD PORT="surface_plancher_bas_deperditif" COLSPAN="2" ALIGN="LEFT"><TABLE BORDER="0" CELLSPACING="0" ALIGN="LEFT"><TR ALIGN="LEFT"><TD ALIGN="LEFT" FIXEDSIZE="TRUE" WIDTH="15" HEIGHT="16"></TD><TD ALIGN="LEFT" FIXEDSIZE="TRUE" WIDTH="287" HEIGHT="16">surface_plancher_bas_deperditif</TD></TR></TABLE></TD><TD PORT="surface_plancher_bas_deperditif.type" ALIGN="LEFT">numeric[0]</TD></TR>
      <TR><TD PORT="u_plancher_bas_final_deperditif" COLSPAN="2" ALIGN="LEFT"><TABLE BORDER="0" CELLSPACING="0" ALIGN="LEFT"><TR ALIGN="LEFT"><TD ALIGN="LEFT" FIXEDSIZE="TRUE" WIDTH="15" HEIGHT="16"></TD><TD ALIGN="LEFT" FIXEDSIZE="TRUE" WIDTH="287" HEIGHT="16">u_plancher_bas_final_deperditif</TD></TR></TABLE></TD><TD PORT="u_plancher_bas_final_deperditif.type" ALIGN="LEFT">numeric[0]</TD></TR>
      <TR><TD PORT="u_plancher_bas_brut_deperditif" COLSPAN="2" ALIGN="LEFT"><TABLE BORDER="0" CELLSPACING="0" ALIGN="LEFT"><TR ALIGN="LEFT"><TD ALIGN="LEFT" FIXEDSIZE="TRUE" WIDTH="15" HEIGHT="16"></TD><TD ALIGN="LEFT" FIXEDSIZE="TRUE" WIDTH="287" HEIGHT="16">u_plancher_bas_brut_deperditif</TD></TR></TABLE></TD><TD PORT="u_plancher_bas_brut_deperditif.type" ALIGN="LEFT">numeric[0]</TD></TR>
      <TR><TD PORT="l_local_non_chauffe_plancher_bas" COLSPAN="2" ALIGN="LEFT"><TABLE BORDER="0" CELLSPACING="0" ALIGN="LEFT"><TR ALIGN="LEFT"><TD ALIGN="LEFT" FIXEDSIZE="TRUE" WIDTH="15" HEIGHT="16"></TD><TD ALIGN="LEFT" FIXEDSIZE="TRUE" WIDTH="287" HEIGHT="16">l_local_non_chauffe_plancher_bas</TD></TR></TABLE></TD><TD PORT="l_local_non_chauffe_plancher_bas.type" ALIGN="LEFT">_text[2147483647]</TD></TR>
      <TR><TD PORT="local_non_chauffe_principal_plancher_bas" COLSPAN="2" ALIGN="LEFT"><TABLE BORDER="0" CELLSPACING="0" ALIGN="LEFT"><TR ALIGN="LEFT"><TD ALIGN="LEFT" FIXEDSIZE="TRUE" WIDTH="15" HEIGHT="16"></TD><TD ALIGN="LEFT" FIXEDSIZE="TRUE" WIDTH="287" HEIGHT="16">local_non_chauffe_principal_plancher_bas</TD></TR></TABLE></TD><TD PORT="local_non_chauffe_principal_plancher_bas.type" ALIGN="LEFT">text[2147483647]</TD></TR>
      <TR><TD PORT="type_adjacence_principal_plancher_bas" COLSPAN="2" ALIGN="LEFT"><TABLE BORDER="0" CELLSPACING="0" ALIGN="LEFT"><TR ALIGN="LEFT"><TD ALIGN="LEFT" FIXEDSIZE="TRUE" WIDTH="15" HEIGHT="16"></TD><TD ALIGN="LEFT" FIXEDSIZE="TRUE" WIDTH="287" HEIGHT="16">type_adjacence_principal_plancher_bas</TD></TR></TABLE></TD><TD PORT="type_adjacence_principal_plancher_bas.type" ALIGN="LEFT">text[2147483647]</TD></TR>
      <TR><TD PORT="type_isolation_plancher_haut" COLSPAN="2" ALIGN="LEFT"><TABLE BORDER="0" CELLSPACING="0" ALIGN="LEFT"><TR ALIGN="LEFT"><TD ALIGN="LEFT" FIXEDSIZE="TRUE" WIDTH="15" HEIGHT="16"></TD><TD ALIGN="LEFT" FIXEDSIZE="TRUE" WIDTH="287" HEIGHT="16">type_isolation_plancher_haut</TD></TR></TABLE></TD><TD PORT="type_isolation_plancher_haut.type" ALIGN="LEFT">text[2147483647]</TD></TR>
      <TR><TD PORT="type_plancher_haut_deperditif" COLSPAN="2" ALIGN="LEFT"><TABLE BORDER="0" CELLSPACING="0" ALIGN="LEFT"><TR ALIGN="LEFT"><TD ALIGN="LEFT" FIXEDSIZE="TRUE" WIDTH="15" HEIGHT="16"></TD><TD ALIGN="LEFT" FIXEDSIZE="TRUE" WIDTH="287" HEIGHT="16">type_plancher_haut_deperditif</TD></TR></TABLE></TD><TD PORT="type_plancher_haut_deperditif.type" ALIGN="LEFT">text[2147483647]</TD></TR>
      <TR><TD PORT="surface_plancher_haut_totale" COLSPAN="2" ALIGN="LEFT"><TABLE BORDER="0" CELLSPACING="0" ALIGN="LEFT"><TR ALIGN="LEFT"><TD ALIGN="LEFT" FIXEDSIZE="TRUE" WIDTH="15" HEIGHT="16"></TD><TD ALIGN="LEFT" FIXEDSIZE="TRUE" WIDTH="287" HEIGHT="16">surface_plancher_haut_totale</TD></TR></TABLE></TD><TD PORT="surface_plancher_haut_totale.type" ALIGN="LEFT">numeric[0]</TD></TR>
      <TR><TD PORT="surface_plancher_haut_deperditif" COLSPAN="2" ALIGN="LEFT"><TABLE BORDER="0" CELLSPACING="0" ALIGN="LEFT"><TR ALIGN="LEFT"><TD ALIGN="LEFT" FIXEDSIZE="TRUE" WIDTH="15" HEIGHT="16"></TD><TD ALIGN="LEFT" FIXEDSIZE="TRUE" WIDTH="287" HEIGHT="16">surface_plancher_haut_deperditif</TD></TR></TABLE></TD><TD PORT="surface_plancher_haut_deperditif.type" ALIGN="LEFT">numeric[0]</TD></TR>
      <TR><TD PORT="u_plancher_haut_deperditif" COLSPAN="2" ALIGN="LEFT"><TABLE BORDER="0" CELLSPACING="0" ALIGN="LEFT"><TR ALIGN="LEFT"><TD ALIGN="LEFT" FIXEDSIZE="TRUE" WIDTH="15" HEIGHT="16"></TD><TD ALIGN="LEFT" FIXEDSIZE="TRUE" WIDTH="287" HEIGHT="16">u_plancher_haut_deperditif</TD></TR></TABLE></TD><TD PORT="u_plancher_haut_deperditif.type" ALIGN="LEFT">numeric[0]</TD></TR>
      <TR><TD PORT="l_local_non_chauffe_plancher_haut" COLSPAN="2" ALIGN="LEFT"><TABLE BORDER="0" CELLSPACING="0" ALIGN="LEFT"><TR ALIGN="LEFT"><TD ALIGN="LEFT" FIXEDSIZE="TRUE" WIDTH="15" HEIGHT="16"></TD><TD ALIGN="LEFT" FIXEDSIZE="TRUE" WIDTH="287" HEIGHT="16">l_local_non_chauffe_plancher_haut</TD></TR></TABLE></TD><TD PORT="l_local_non_chauffe_plancher_haut.type" ALIGN="LEFT">_text[2147483647]</TD></TR>
      <TR><TD PORT="local_non_chauffe_principal_plancher_haut" COLSPAN="2" ALIGN="LEFT"><TABLE BORDER="0" CELLSPACING="0" ALIGN="LEFT"><TR ALIGN="LEFT"><TD ALIGN="LEFT" FIXEDSIZE="TRUE" WIDTH="15" HEIGHT="16"></TD><TD ALIGN="LEFT" FIXEDSIZE="TRUE" WIDTH="287" HEIGHT="16">local_non_chauffe_principal_plancher_haut</TD></TR></TABLE></TD><TD PORT="local_non_chauffe_principal_plancher_haut.type" ALIGN="LEFT">text[2147483647]</TD></TR>
      <TR><TD PORT="type_adjacence_principal_plancher_haut" COLSPAN="2" ALIGN="LEFT"><TABLE BORDER="0" CELLSPACING="0" ALIGN="LEFT"><TR ALIGN="LEFT"><TD ALIGN="LEFT" FIXEDSIZE="TRUE" WIDTH="15" HEIGHT="16"></TD><TD ALIGN="LEFT" FIXEDSIZE="TRUE" WIDTH="287" HEIGHT="16">type_adjacence_principal_plancher_haut</TD></TR></TABLE></TD><TD PORT="type_adjacence_principal_plancher_haut.type" ALIGN="LEFT">text[2147483647]</TD></TR>
      <TR><TD PORT="type_porte" COLSPAN="2" ALIGN="LEFT"><TABLE BORDER="0" CELLSPACING="0" ALIGN="LEFT"><TR ALIGN="LEFT"><TD ALIGN="LEFT" FIXEDSIZE="TRUE" WIDTH="15" HEIGHT="16"></TD><TD ALIGN="LEFT" FIXEDSIZE="TRUE" WIDTH="287" HEIGHT="16">type_porte</TD></TR></TABLE></TD><TD PORT="type_porte.type" ALIGN="LEFT">text[2147483647]</TD></TR>
      <TR><TD PORT="surface_porte" COLSPAN="2" ALIGN="LEFT"><TABLE BORDER="0" CELLSPACING="0" ALIGN="LEFT"><TR ALIGN="LEFT"><TD ALIGN="LEFT" FIXEDSIZE="TRUE" WIDTH="15" HEIGHT="16"></TD><TD ALIGN="LEFT" FIXEDSIZE="TRUE" WIDTH="287" HEIGHT="16">surface_porte</TD></TR></TABLE></TD><TD PORT="surface_porte.type" ALIGN="LEFT">numeric[0]</TD></TR>
      <TR><TD PORT="u_porte" COLSPAN="2" ALIGN="LEFT"><TABLE BORDER="0" CELLSPACING="0" ALIGN="LEFT"><TR ALIGN="LEFT"><TD ALIGN="LEFT" FIXEDSIZE="TRUE" WIDTH="15" HEIGHT="16"></TD><TD ALIGN="LEFT" FIXEDSIZE="TRUE" WIDTH="287" HEIGHT="16">u_porte</TD></TR></TABLE></TD><TD PORT="u_porte.type" ALIGN="LEFT">numeric[0]</TD></TR>
      <TR><TD PORT="classe_inertie" COLSPAN="2" ALIGN="LEFT"><TABLE BORDER="0" CELLSPACING="0" ALIGN="LEFT"><TR ALIGN="LEFT"><TD ALIGN="LEFT" FIXEDSIZE="TRUE" WIDTH="15" HEIGHT="16"></TD><TD ALIGN="LEFT" FIXEDSIZE="TRUE" WIDTH="287" HEIGHT="16">classe_inertie</TD></TR></TABLE></TD><TD PORT="classe_inertie.type" ALIGN="LEFT">text[2147483647]</TD></TR>
      <TR><TD PORT="deperdition_mur" COLSPAN="2" ALIGN="LEFT"><TABLE BORDER="0" CELLSPACING="0" ALIGN="LEFT"><TR ALIGN="LEFT"><TD ALIGN="LEFT" FIXEDSIZE="TRUE" WIDTH="15" HEIGHT="16"></TD><TD ALIGN="LEFT" FIXEDSIZE="TRUE" WIDTH="287" HEIGHT="16">deperdition_mur</TD></TR></TABLE></TD><TD PORT="deperdition_mur.type" ALIGN="LEFT">numeric[0]</TD></TR>
      <TR><TD PORT="deperdition_baie_vitree" COLSPAN="2" ALIGN="LEFT"><TABLE BORDER="0" CELLSPACING="0" ALIGN="LEFT"><TR ALIGN="LEFT"><TD ALIGN="LEFT" FIXEDSIZE="TRUE" WIDTH="15" HEIGHT="16"></TD><TD ALIGN="LEFT" FIXEDSIZE="TRUE" WIDTH="287" HEIGHT="16">deperdition_baie_vitree</TD></TR></TABLE></TD><TD PORT="deperdition_baie_vitree.type" ALIGN="LEFT">numeric[0]</TD></TR>
      <TR><TD PORT="deperdition_plancher_bas" COLSPAN="2" ALIGN="LEFT"><TABLE BORDER="0" CELLSPACING="0" ALIGN="LEFT"><TR ALIGN="LEFT"><TD ALIGN="LEFT" FIXEDSIZE="TRUE" WIDTH="15" HEIGHT="16"></TD><TD ALIGN="LEFT" FIXEDSIZE="TRUE" WIDTH="287" HEIGHT="16">deperdition_plancher_bas</TD></TR></TABLE></TD><TD PORT="deperdition_plancher_bas.type" ALIGN="LEFT">numeric[0]</TD></TR>
      <TR><TD PORT="deperdition_plancher_haut" COLSPAN="2" ALIGN="LEFT"><TABLE BORDER="0" CELLSPACING="0" ALIGN="LEFT"><TR ALIGN="LEFT"><TD ALIGN="LEFT" FIXEDSIZE="TRUE" WIDTH="15" HEIGHT="16"></TD><TD ALIGN="LEFT" FIXEDSIZE="TRUE" WIDTH="287" HEIGHT="16">deperdition_plancher_haut</TD></TR></TABLE></TD><TD PORT="deperdition_plancher_haut.type" ALIGN="LEFT">numeric[0]</TD></TR>
      <TR><TD PORT="deperdition_pont_thermique" COLSPAN="2" ALIGN="LEFT"><TABLE BORDER="0" CELLSPACING="0" ALIGN="LEFT"><TR ALIGN="LEFT"><TD ALIGN="LEFT" FIXEDSIZE="TRUE" WIDTH="15" HEIGHT="16"></TD><TD ALIGN="LEFT" FIXEDSIZE="TRUE" WIDTH="287" HEIGHT="16">deperdition_pont_thermique</TD></TR></TABLE></TD><TD PORT="deperdition_pont_thermique.type" ALIGN="LEFT">numeric[0]</TD></TR>
      <TR><TD PORT="deperdition_porte" COLSPAN="2" ALIGN="LEFT"><TABLE BORDER="0" CELLSPACING="0" ALIGN="LEFT"><TR ALIGN="LEFT"><TD ALIGN="LEFT" FIXEDSIZE="TRUE" WIDTH="15" HEIGHT="16"></TD><TD ALIGN="LEFT" FIXEDSIZE="TRUE" WIDTH="287" HEIGHT="16">deperdition_porte</TD></TR></TABLE></TD><TD PORT="deperdition_porte.type" ALIGN="LEFT">numeric[0]</TD></TR>
      <TR><TD ALIGN="LEFT" BGCOLOR="#ffffff">&lt; 0</TD><TD ALIGN="RIGHT" BGCOLOR="#ffffff">7,467,396 rows</TD><TD ALIGN="RIGHT" BGCOLOR="#ffffff">1 &gt;</TD></TR>
    </TABLE>>
    URL="dpe_logement.html"
    target="_top"
    tooltip="dpe_logement"
  ];
  "rel_batiment_groupe_dpe_logement" [
   label=<
    <TABLE BORDER="0" CELLBORDER="1" CELLSPACING="0" BGCOLOR="#ffffff">
      <TR><TD COLSPAN="3"  BGCOLOR="#f5f5f5"><TABLE BORDER="0" CELLSPACING="0"><TR><TD ALIGN="LEFT" FIXEDSIZE="TRUE" WIDTH="213" HEIGHT="16"><B>rel_batiment_groupe_dpe_logement</B></TD><TD ALIGN="RIGHT">[table]</TD></TR></TABLE></TD></TR>
      <TR><TD PORT="batiment_groupe_id" COLSPAN="3" ALIGN="LEFT"><TABLE BORDER="0" CELLSPACING="0" ALIGN="LEFT"><TR ALIGN="LEFT"><TD ALIGN="LEFT" FIXEDSIZE="TRUE" WIDTH="15" HEIGHT="16"><IMG SRC="../../images/primaryKeys.png"/></TD><TD ALIGN="LEFT" FIXEDSIZE="TRUE" WIDTH="213" HEIGHT="16">batiment_groupe_id</TD></TR></TABLE></TD></TR>
      <TR><TD PORT="identifiant_dpe" COLSPAN="3" ALIGN="LEFT"><TABLE BORDER="0" CELLSPACING="0" ALIGN="LEFT"><TR ALIGN="LEFT"><TD ALIGN="LEFT" FIXEDSIZE="TRUE" WIDTH="15" HEIGHT="16"><IMG SRC="../../images/primaryKeys.png"/></TD><TD ALIGN="LEFT" FIXEDSIZE="TRUE" WIDTH="213" HEIGHT="16">identifiant_dpe</TD></TR></TABLE></TD></TR>
      <TR><TD PORT="code_departement_insee" COLSPAN="3" BGCOLOR="#ffffff" ALIGN="LEFT"><TABLE BORDER="0" CELLSPACING="0" ALIGN="LEFT"><TR ALIGN="LEFT"><TD ALIGN="LEFT" FIXEDSIZE="TRUE" WIDTH="15" HEIGHT="16"></TD><TD ALIGN="LEFT" FIXEDSIZE="TRUE" WIDTH="213" HEIGHT="16">code_departement_insee</TD></TR></TABLE></TD></TR>
      <TR><TD PORT="cle_interop_adr" COLSPAN="3" BGCOLOR="#ffffff" ALIGN="LEFT"><TABLE BORDER="0" CELLSPACING="0" ALIGN="LEFT"><TR ALIGN="LEFT"><TD ALIGN="LEFT" FIXEDSIZE="TRUE" WIDTH="15" HEIGHT="16"><IMG SRC="../../images/foreignKeys.png"/></TD><TD ALIGN="LEFT" FIXEDSIZE="TRUE" WIDTH="213" HEIGHT="16">cle_interop_adr</TD></TR></TABLE></TD></TR>
      <TR><TD PORT="elipses" COLSPAN="3" ALIGN="LEFT">...</TD></TR>
      <TR><TD ALIGN="LEFT" BGCOLOR="#ffffff">&lt; 2</TD><TD ALIGN="RIGHT" BGCOLOR="#ffffff">8,830,877 rows</TD><TD ALIGN="RIGHT" BGCOLOR="#ffffff">  </TD></TR>
    </TABLE>>
    URL="rel_batiment_groupe_dpe_logement.html"
    target="_top"
    tooltip="rel_batiment_groupe_dpe_logement"
  ];
}
