digraph "twoDegreesRelationshipsDiagramImplied" {
  graph [    rankdir="RL"    bgcolor="#ffffff"    label="\nGenerated by SchemaSpy"    labeljust="l"    nodesep="0.18"    ranksep="0.46"    fontname="Helvetica"    fontsize="11"    ration="compress"  ];  node [    fontname="Helvetica"    fontsize="11"    shape="plaintext"  ];  edge [    arrowsize="0.8"  ];
  "batiment":"elipses":w -> "batiment_groupe":"batiment_groupe_id":e [arrowhead=none dir=back arrowtail=crowodot];
  "batiment_construction":"elipses":w -> "batiment_groupe":"batiment_groupe_id":e [arrowhead=none dir=back arrowtail=crowodot];
  "batiment_groupe":"parcelle_unifiee_id":w -> "parcelle_unifiee":"parcelle_unifiee_id.type":e [arrowhead=none dir=back arrowtail=crowodot];
  "batiment_groupe_adresse":"elipses":w -> "batiment_groupe":"batiment_groupe_id":e [arrowhead=none dir=back arrowtail=teeodot];
  "batiment_groupe_argiles":"elipses":w -> "batiment_groupe":"batiment_groupe_id":e [arrowhead=none dir=back arrowtail=teeodot];
  "batiment_groupe_bdtopo_bat":"elipses":w -> "batiment_groupe":"batiment_groupe_id":e [arrowhead=none dir=back arrowtail=teeodot];
  "batiment_groupe_bdtopo_equ":"elipses":w -> "batiment_groupe":"batiment_groupe_id":e [arrowhead=none dir=back arrowtail=teeodot];
  "batiment_groupe_bdtopo_zoac":"elipses":w -> "batiment_groupe":"batiment_groupe_id":e [arrowhead=none dir=back arrowtail=teeodot];
  "batiment_groupe_bpe":"elipses":w -> "batiment_groupe":"batiment_groupe_id":e [arrowhead=none dir=back arrowtail=teeodot];
  "batiment_groupe_dle_elec_2020":"elipses":w -> "batiment_groupe":"batiment_groupe_id":e [arrowhead=none dir=back arrowtail=teeodot];
  "batiment_groupe_dle_gaz_2020":"elipses":w -> "batiment_groupe":"batiment_groupe_id":e [arrowhead=none dir=back arrowtail=teeodot];
  "batiment_groupe_dle_reseaux_2020":"elipses":w -> "batiment_groupe":"batiment_groupe_id":e [arrowhead=none dir=back arrowtail=teeodot];
  "batiment_groupe_dpe":"elipses":w -> "batiment_groupe":"batiment_groupe_id":e [arrowhead=none dir=back arrowtail=teeodot];
  "batiment_groupe_dpe_logtype":"elipses":w -> "batiment_groupe":"batiment_groupe_id":e [arrowhead=none dir=back arrowtail=teeodot];
  "batiment_groupe_dpe_representatif_logement":"elipses":w -> "batiment_groupe":"batiment_groupe_id":e [arrowhead=none dir=back arrowtail=teeodot];
  "batiment_groupe_dpe_statistique_logement":"elipses":w -> "batiment_groupe":"batiment_groupe_id":e [arrowhead=none dir=back arrowtail=teeodot];
  "batiment_groupe_dvf":"elipses":w -> "batiment_groupe":"batiment_groupe_id":e [arrowhead=none dir=back arrowtail=teeodot];
  "batiment_groupe_dvf_logtype":"elipses":w -> "batiment_groupe":"batiment_groupe_id":e [arrowhead=none dir=back arrowtail=teeodot];
  "batiment_groupe_enepdl":"elipses":w -> "batiment_groupe":"batiment_groupe_id":e [arrowhead=none dir=back arrowtail=teeodot];
  "batiment_groupe_energie":"elipses":w -> "batiment_groupe":"batiment_groupe_id":e [arrowhead=none dir=back arrowtail=teeodot];
  "batiment_groupe_enethermo":"elipses":w -> "batiment_groupe":"batiment_groupe_id":e [arrowhead=none dir=back arrowtail=teeodot];
  "batiment_groupe_ffo_bat":"elipses":w -> "batiment_groupe":"batiment_groupe_id":e [arrowhead=none dir=back arrowtail=teeodot];
  "batiment_groupe_ffo_loc":"elipses":w -> "batiment_groupe":"batiment_groupe_id":e [arrowhead=none dir=back arrowtail=teeodot];
  "batiment_groupe_geofabrik":"elipses":w -> "batiment_groupe":"batiment_groupe_id":e [arrowhead=none dir=back arrowtail=teeodot];
  "batiment_groupe_geospx":"elipses":w -> "batiment_groupe":"batiment_groupe_id":e [arrowhead=none dir=back arrowtail=teeodot];
  "batiment_groupe_hthd":"elipses":w -> "batiment_groupe":"batiment_groupe_id":e [arrowhead=none dir=back arrowtail=teeodot];
  "batiment_groupe_merimee":"elipses":w -> "batiment_groupe":"batiment_groupe_id":e [arrowhead=none dir=back arrowtail=teeodot];
  "batiment_groupe_proprietaire":"elipses":w -> "batiment_groupe":"batiment_groupe_id":e [arrowhead=none dir=back arrowtail=teeodot];
  "batiment_groupe_qpv":"elipses":w -> "batiment_groupe":"batiment_groupe_id":e [arrowhead=none dir=back arrowtail=teeodot];
  "batiment_groupe_radon":"elipses":w -> "batiment_groupe":"batiment_groupe_id":e [arrowhead=none dir=back arrowtail=teeodot];
  "batiment_groupe_rnc":"elipses":w -> "batiment_groupe":"batiment_groupe_id":e [arrowhead=none dir=back arrowtail=teeodot];
  "batiment_groupe_rpls":"elipses":w -> "batiment_groupe":"batiment_groupe_id":e [arrowhead=none dir=back arrowtail=teeodot];
  "batiment_groupe_simulations_dpe":"elipses":w -> "batiment_groupe":"batiment_groupe_id":e [arrowhead=none dir=back arrowtail=teeodot];
  "batiment_groupe_simulations_dvf":"elipses":w -> "batiment_groupe":"batiment_groupe_id":e [arrowhead=none dir=back arrowtail=teeodot];
  "batiment_groupe_simulations_valeur_verte":"elipses":w -> "batiment_groupe":"batiment_groupe_id":e [arrowhead=none dir=back arrowtail=teeodot];
  "batiment_groupe_synthese_enveloppe":"elipses":w -> "batiment_groupe":"batiment_groupe_id":e [arrowhead=none dir=back arrowtail=teeodot];
  "batiment_groupe_synthese_systeme_energetique_logement":"elipses":w -> "batiment_groupe":"batiment_groupe_id":e [arrowhead=none dir=back arrowtail=teeodot];
  "local":"elipses":w -> "batiment":"elipses":e [arrowhead=none dir=back arrowtail=crowodot];
  "local":"elipses":w -> "parcelle":"parcelle_id":e [arrowhead=none dir=back arrowtail=crowodot style=dashed];
  "local_simulations_dpe":"elipses":w -> "batiment_groupe":"batiment_groupe_id":e [arrowhead=none dir=back arrowtail=crowodot];
  "local_simulations_dpe":"elipses":w -> "local":"elipses":e [arrowhead=none dir=back arrowtail=crowodot];
  "parcelle":"parcelle_unifiee_id":w -> "parcelle_unifiee":"parcelle_unifiee_id.type":e [arrowhead=none dir=back arrowtail=crowodot];
  "parcelle_unifiee_metrique":"parcelle_unifiee_id":w -> "parcelle_unifiee":"parcelle_unifiee_id.type":e [arrowhead=none dir=back arrowtail=teeodot];
  "rel_batiment_groupe_adresse":"elipses":w -> "batiment_groupe":"batiment_groupe_id":e [arrowhead=none dir=back arrowtail=crowodot];
  "rel_batiment_groupe_parcelle":"elipses":w -> "batiment_groupe":"batiment_groupe_id":e [arrowhead=none dir=back arrowtail=crowodot];
  "rel_batiment_groupe_parcelle":"elipses":w -> "parcelle":"parcelle_id":e [arrowhead=none dir=back arrowtail=crowodot];
  "rel_batiment_groupe_proprietaire":"elipses":w -> "batiment_groupe":"batiment_groupe_id":e [arrowhead=none dir=back arrowtail=crowodot];
  "batiment" [
   label=<
    <TABLE BORDER="0" CELLBORDER="1" CELLSPACING="0" BGCOLOR="#ffffff">
      <TR><TD COLSPAN="3"  BGCOLOR="#f5f5f5"><TABLE BORDER="0" CELLSPACING="0"><TR><TD ALIGN="LEFT" FIXEDSIZE="TRUE" WIDTH="55" HEIGHT="16"><B>batiment</B></TD><TD ALIGN="RIGHT">[table]</TD></TR></TABLE></TD></TR>
      <TR><TD PORT="elipses" COLSPAN="3" ALIGN="LEFT">...</TD></TR>
      <TR><TD ALIGN="LEFT" BGCOLOR="#ffffff">&lt; 1</TD><TD ALIGN="RIGHT" BGCOLOR="#ffffff">26,289,828 rows</TD><TD ALIGN="RIGHT" BGCOLOR="#ffffff">2 &gt;</TD></TR>
    </TABLE>>
    URL="batiment.html"
    target="_top"
    tooltip="batiment"
  ];
  "batiment_construction" [
   label=<
    <TABLE BORDER="0" CELLBORDER="1" CELLSPACING="0" BGCOLOR="#ffffff">
      <TR><TD COLSPAN="3"  BGCOLOR="#f5f5f5"><TABLE BORDER="0" CELLSPACING="0"><TR><TD ALIGN="LEFT" FIXEDSIZE="TRUE" WIDTH="136" HEIGHT="16"><B>batiment_construction</B></TD><TD ALIGN="RIGHT">[table]</TD></TR></TABLE></TD></TR>
      <TR><TD PORT="elipses" COLSPAN="3" ALIGN="LEFT">...</TD></TR>
      <TR><TD ALIGN="LEFT" BGCOLOR="#ffffff">&lt; 1</TD><TD ALIGN="RIGHT" BGCOLOR="#ffffff">27,051,588 rows</TD><TD ALIGN="RIGHT" BGCOLOR="#ffffff">9 &gt;</TD></TR>
    </TABLE>>
    URL="batiment_construction.html"
    target="_top"
    tooltip="batiment_construction"
  ];
  "batiment_groupe" [
   label=<
    <TABLE BORDER="0" CELLBORDER="1" CELLSPACING="0" BGCOLOR="#ffffff">
      <TR><TD COLSPAN="3"  BGCOLOR="#f5f5f5"><TABLE BORDER="0" CELLSPACING="0"><TR><TD ALIGN="LEFT" FIXEDSIZE="TRUE" WIDTH="102" HEIGHT="16"><B>batiment_groupe</B></TD><TD ALIGN="RIGHT">[table]</TD></TR></TABLE></TD></TR>
      <TR><TD PORT="batiment_groupe_id" COLSPAN="3" ALIGN="LEFT"><TABLE BORDER="0" CELLSPACING="0" ALIGN="LEFT"><TR ALIGN="LEFT"><TD ALIGN="LEFT" FIXEDSIZE="TRUE" WIDTH="15" HEIGHT="16"><IMG SRC="../../images/primaryKeys.png"/></TD><TD ALIGN="LEFT" FIXEDSIZE="TRUE" WIDTH="177" HEIGHT="16">batiment_groupe_id</TD></TR></TABLE></TD></TR>
      <TR><TD PORT="parcelle_unifiee_id" COLSPAN="3" BGCOLOR="#ffffff" ALIGN="LEFT"><TABLE BORDER="0" CELLSPACING="0" ALIGN="LEFT"><TR ALIGN="LEFT"><TD ALIGN="LEFT" FIXEDSIZE="TRUE" WIDTH="15" HEIGHT="16"><IMG SRC="../../images/foreignKeys.png"/></TD><TD ALIGN="LEFT" FIXEDSIZE="TRUE" WIDTH="177" HEIGHT="16">parcelle_unifiee_id</TD></TR></TABLE></TD></TR>
      <TR><TD PORT="code_departement_insee" COLSPAN="3" BGCOLOR="#ffffff" ALIGN="LEFT"><TABLE BORDER="0" CELLSPACING="0" ALIGN="LEFT"><TR ALIGN="LEFT"><TD ALIGN="LEFT" FIXEDSIZE="TRUE" WIDTH="15" HEIGHT="16"></TD><TD ALIGN="LEFT" FIXEDSIZE="TRUE" WIDTH="177" HEIGHT="16">code_departement_insee</TD></TR></TABLE></TD></TR>
      <TR><TD PORT="code_iris" COLSPAN="3" BGCOLOR="#ffffff" ALIGN="LEFT"><TABLE BORDER="0" CELLSPACING="0" ALIGN="LEFT"><TR ALIGN="LEFT"><TD ALIGN="LEFT" FIXEDSIZE="TRUE" WIDTH="15" HEIGHT="16"></TD><TD ALIGN="LEFT" FIXEDSIZE="TRUE" WIDTH="177" HEIGHT="16">code_iris</TD></TR></TABLE></TD></TR>
      <TR><TD PORT="code_commune_insee" COLSPAN="3" BGCOLOR="#ffffff" ALIGN="LEFT"><TABLE BORDER="0" CELLSPACING="0" ALIGN="LEFT"><TR ALIGN="LEFT"><TD ALIGN="LEFT" FIXEDSIZE="TRUE" WIDTH="15" HEIGHT="16"></TD><TD ALIGN="LEFT" FIXEDSIZE="TRUE" WIDTH="177" HEIGHT="16">code_commune_insee</TD></TR></TABLE></TD></TR>
      <TR><TD PORT="code_epci_insee" COLSPAN="3" BGCOLOR="#ffffff" ALIGN="LEFT"><TABLE BORDER="0" CELLSPACING="0" ALIGN="LEFT"><TR ALIGN="LEFT"><TD ALIGN="LEFT" FIXEDSIZE="TRUE" WIDTH="15" HEIGHT="16"></TD><TD ALIGN="LEFT" FIXEDSIZE="TRUE" WIDTH="177" HEIGHT="16">code_epci_insee</TD></TR></TABLE></TD></TR>
      <TR><TD PORT="geom_groupe" COLSPAN="3" BGCOLOR="#ffffff" ALIGN="LEFT"><TABLE BORDER="0" CELLSPACING="0" ALIGN="LEFT"><TR ALIGN="LEFT"><TD ALIGN="LEFT" FIXEDSIZE="TRUE" WIDTH="15" HEIGHT="16"></TD><TD ALIGN="LEFT" FIXEDSIZE="TRUE" WIDTH="177" HEIGHT="16">geom_groupe</TD></TR></TABLE></TD></TR>
      <TR><TD PORT="elipses" COLSPAN="3" ALIGN="LEFT">...</TD></TR>
      <TR><TD ALIGN="LEFT" BGCOLOR="#ffffff">&lt; 1</TD><TD ALIGN="RIGHT" BGCOLOR="#ffffff">23,439,072 rows</TD><TD ALIGN="RIGHT" BGCOLOR="#ffffff">40 &gt;</TD></TR>
    </TABLE>>
    URL="batiment_groupe.html"
    target="_top"
    tooltip="batiment_groupe"
  ];
  "batiment_groupe_adresse" [
   label=<
    <TABLE BORDER="0" CELLBORDER="1" CELLSPACING="0" BGCOLOR="#ffffff">
      <TR><TD COLSPAN="3"  BGCOLOR="#f5f5f5"><TABLE BORDER="0" CELLSPACING="0"><TR><TD ALIGN="LEFT" FIXEDSIZE="TRUE" WIDTH="154" HEIGHT="16"><B>batiment_groupe_adresse</B></TD><TD ALIGN="RIGHT">[table]</TD></TR></TABLE></TD></TR>
      <TR><TD PORT="elipses" COLSPAN="3" ALIGN="LEFT">...</TD></TR>
      <TR><TD ALIGN="LEFT" BGCOLOR="#ffffff">&lt; 1</TD><TD ALIGN="RIGHT" BGCOLOR="#ffffff">21,222,036 rows</TD><TD ALIGN="RIGHT" BGCOLOR="#ffffff">  </TD></TR>
    </TABLE>>
    URL="batiment_groupe_adresse.html"
    target="_top"
    tooltip="batiment_groupe_adresse"
  ];
  "batiment_groupe_argiles" [
   label=<
    <TABLE BORDER="0" CELLBORDER="1" CELLSPACING="0" BGCOLOR="#ffffff">
      <TR><TD COLSPAN="3"  BGCOLOR="#f5f5f5"><TABLE BORDER="0" CELLSPACING="0"><TR><TD ALIGN="LEFT" FIXEDSIZE="TRUE" WIDTH="147" HEIGHT="16"><B>batiment_groupe_argiles</B></TD><TD ALIGN="RIGHT">[table]</TD></TR></TABLE></TD></TR>
      <TR><TD PORT="elipses" COLSPAN="3" ALIGN="LEFT">...</TD></TR>
      <TR><TD ALIGN="LEFT" BGCOLOR="#ffffff">&lt; 1</TD><TD ALIGN="RIGHT" BGCOLOR="#ffffff">17,621,420 rows</TD><TD ALIGN="RIGHT" BGCOLOR="#ffffff">  </TD></TR>
    </TABLE>>
    URL="batiment_groupe_argiles.html"
    target="_top"
    tooltip="batiment_groupe_argiles"
  ];
  "batiment_groupe_bdtopo_bat" [
   label=<
    <TABLE BORDER="0" CELLBORDER="1" CELLSPACING="0" BGCOLOR="#ffffff">
      <TR><TD COLSPAN="3"  BGCOLOR="#f5f5f5"><TABLE BORDER="0" CELLSPACING="0"><TR><TD ALIGN="LEFT" FIXEDSIZE="TRUE" WIDTH="175" HEIGHT="16"><B>batiment_groupe_bdtopo_bat</B></TD><TD ALIGN="RIGHT">[table]</TD></TR></TABLE></TD></TR>
      <TR><TD PORT="elipses" COLSPAN="3" ALIGN="LEFT">...</TD></TR>
      <TR><TD ALIGN="LEFT" BGCOLOR="#ffffff">&lt; 1</TD><TD ALIGN="RIGHT" BGCOLOR="#ffffff">23,436,776 rows</TD><TD ALIGN="RIGHT" BGCOLOR="#ffffff">  </TD></TR>
    </TABLE>>
    URL="batiment_groupe_bdtopo_bat.html"
    target="_top"
    tooltip="batiment_groupe_bdtopo_bat"
  ];
  "batiment_groupe_bdtopo_equ" [
   label=<
    <TABLE BORDER="0" CELLBORDER="1" CELLSPACING="0" BGCOLOR="#ffffff">
      <TR><TD COLSPAN="3"  BGCOLOR="#f5f5f5"><TABLE BORDER="0" CELLSPACING="0"><TR><TD ALIGN="LEFT" FIXEDSIZE="TRUE" WIDTH="178" HEIGHT="16"><B>batiment_groupe_bdtopo_equ</B></TD><TD ALIGN="RIGHT">[table]</TD></TR></TABLE></TD></TR>
      <TR><TD PORT="elipses" COLSPAN="3" ALIGN="LEFT">...</TD></TR>
      <TR><TD ALIGN="LEFT" BGCOLOR="#ffffff">&lt; 1</TD><TD ALIGN="RIGHT" BGCOLOR="#ffffff">6,926 rows</TD><TD ALIGN="RIGHT" BGCOLOR="#ffffff">  </TD></TR>
    </TABLE>>
    URL="batiment_groupe_bdtopo_equ.html"
    target="_top"
    tooltip="batiment_groupe_bdtopo_equ"
  ];
  "batiment_groupe_bdtopo_zoac" [
   label=<
    <TABLE BORDER="0" CELLBORDER="1" CELLSPACING="0" BGCOLOR="#ffffff">
      <TR><TD COLSPAN="3"  BGCOLOR="#f5f5f5"><TABLE BORDER="0" CELLSPACING="0"><TR><TD ALIGN="LEFT" FIXEDSIZE="TRUE" WIDTH="182" HEIGHT="16"><B>batiment_groupe_bdtopo_zoac</B></TD><TD ALIGN="RIGHT">[table]</TD></TR></TABLE></TD></TR>
      <TR><TD PORT="elipses" COLSPAN="3" ALIGN="LEFT">...</TD></TR>
      <TR><TD ALIGN="LEFT" BGCOLOR="#ffffff">&lt; 1</TD><TD ALIGN="RIGHT" BGCOLOR="#ffffff">531,046 rows</TD><TD ALIGN="RIGHT" BGCOLOR="#ffffff">  </TD></TR>
    </TABLE>>
    URL="batiment_groupe_bdtopo_zoac.html"
    target="_top"
    tooltip="batiment_groupe_bdtopo_zoac"
  ];
  "batiment_groupe_bpe" [
   label=<
    <TABLE BORDER="0" CELLBORDER="1" CELLSPACING="0" BGCOLOR="#ffffff">
      <TR><TD COLSPAN="3"  BGCOLOR="#f5f5f5"><TABLE BORDER="0" CELLSPACING="0"><TR><TD ALIGN="LEFT" FIXEDSIZE="TRUE" WIDTH="130" HEIGHT="16"><B>batiment_groupe_bpe</B></TD><TD ALIGN="RIGHT">[table]</TD></TR></TABLE></TD></TR>
      <TR><TD PORT="elipses" COLSPAN="3" ALIGN="LEFT">...</TD></TR>
      <TR><TD ALIGN="LEFT" BGCOLOR="#ffffff">&lt; 1</TD><TD ALIGN="RIGHT" BGCOLOR="#ffffff">460,732 rows</TD><TD ALIGN="RIGHT" BGCOLOR="#ffffff">  </TD></TR>
    </TABLE>>
    URL="batiment_groupe_bpe.html"
    target="_top"
    tooltip="batiment_groupe_bpe"
  ];
  "batiment_groupe_dle_elec_2020" [
   label=<
    <TABLE BORDER="0" CELLBORDER="1" CELLSPACING="0" BGCOLOR="#ffffff">
      <TR><TD COLSPAN="3"  BGCOLOR="#f5f5f5"><TABLE BORDER="0" CELLSPACING="0"><TR><TD ALIGN="LEFT" FIXEDSIZE="TRUE" WIDTH="187" HEIGHT="16"><B>batiment_groupe_dle_elec_2020</B></TD><TD ALIGN="RIGHT">[table]</TD></TR></TABLE></TD></TR>
      <TR><TD PORT="elipses" COLSPAN="3" ALIGN="LEFT">...</TD></TR>
      <TR><TD ALIGN="LEFT" BGCOLOR="#ffffff">&lt; 1</TD><TD ALIGN="RIGHT" BGCOLOR="#ffffff">482,723 rows</TD><TD ALIGN="RIGHT" BGCOLOR="#ffffff">  </TD></TR>
    </TABLE>>
    URL="batiment_groupe_dle_elec_2020.html"
    target="_top"
    tooltip="batiment_groupe_dle_elec_2020"
  ];
  "batiment_groupe_dle_gaz_2020" [
   label=<
    <TABLE BORDER="0" CELLBORDER="1" CELLSPACING="0" BGCOLOR="#ffffff">
      <TR><TD COLSPAN="3"  BGCOLOR="#f5f5f5"><TABLE BORDER="0" CELLSPACING="0"><TR><TD ALIGN="LEFT" FIXEDSIZE="TRUE" WIDTH="183" HEIGHT="16"><B>batiment_groupe_dle_gaz_2020</B></TD><TD ALIGN="RIGHT">[table]</TD></TR></TABLE></TD></TR>
      <TR><TD PORT="elipses" COLSPAN="3" ALIGN="LEFT">...</TD></TR>
      <TR><TD ALIGN="LEFT" BGCOLOR="#ffffff">&lt; 1</TD><TD ALIGN="RIGHT" BGCOLOR="#ffffff">145,543 rows</TD><TD ALIGN="RIGHT" BGCOLOR="#ffffff">  </TD></TR>
    </TABLE>>
    URL="batiment_groupe_dle_gaz_2020.html"
    target="_top"
    tooltip="batiment_groupe_dle_gaz_2020"
  ];
  "batiment_groupe_dle_reseaux_2020" [
   label=<
    <TABLE BORDER="0" CELLBORDER="1" CELLSPACING="0" BGCOLOR="#ffffff">
      <TR><TD COLSPAN="3"  BGCOLOR="#f5f5f5"><TABLE BORDER="0" CELLSPACING="0"><TR><TD ALIGN="LEFT" FIXEDSIZE="TRUE" WIDTH="211" HEIGHT="16"><B>batiment_groupe_dle_reseaux_2020</B></TD><TD ALIGN="RIGHT">[table]</TD></TR></TABLE></TD></TR>
      <TR><TD PORT="elipses" COLSPAN="3" ALIGN="LEFT">...</TD></TR>
      <TR><TD ALIGN="LEFT" BGCOLOR="#ffffff">&lt; 1</TD><TD ALIGN="RIGHT" BGCOLOR="#ffffff">4,716 rows</TD><TD ALIGN="RIGHT" BGCOLOR="#ffffff">  </TD></TR>
    </TABLE>>
    URL="batiment_groupe_dle_reseaux_2020.html"
    target="_top"
    tooltip="batiment_groupe_dle_reseaux_2020"
  ];
  "batiment_groupe_dpe" [
   label=<
    <TABLE BORDER="0" CELLBORDER="1" CELLSPACING="0" BGCOLOR="#ffffff">
      <TR><TD COLSPAN="3"  BGCOLOR="#f5f5f5"><TABLE BORDER="0" CELLSPACING="0"><TR><TD ALIGN="LEFT" FIXEDSIZE="TRUE" WIDTH="130" HEIGHT="16"><B>batiment_groupe_dpe</B></TD><TD ALIGN="RIGHT">[table]</TD></TR></TABLE></TD></TR>
      <TR><TD PORT="elipses" COLSPAN="3" ALIGN="LEFT">...</TD></TR>
      <TR><TD ALIGN="LEFT" BGCOLOR="#ffffff">&lt; 1</TD><TD ALIGN="RIGHT" BGCOLOR="#ffffff">2,957,634 rows</TD><TD ALIGN="RIGHT" BGCOLOR="#ffffff">  </TD></TR>
    </TABLE>>
    URL="batiment_groupe_dpe.html"
    target="_top"
    tooltip="batiment_groupe_dpe"
  ];
  "batiment_groupe_dpe_logtype" [
   label=<
    <TABLE BORDER="0" CELLBORDER="1" CELLSPACING="0" BGCOLOR="#ffffff">
      <TR><TD COLSPAN="3"  BGCOLOR="#f5f5f5"><TABLE BORDER="0" CELLSPACING="0"><TR><TD ALIGN="LEFT" FIXEDSIZE="TRUE" WIDTH="179" HEIGHT="16"><B>batiment_groupe_dpe_logtype</B></TD><TD ALIGN="RIGHT">[table]</TD></TR></TABLE></TD></TR>
      <TR><TD PORT="elipses" COLSPAN="3" ALIGN="LEFT">...</TD></TR>
      <TR><TD ALIGN="LEFT" BGCOLOR="#ffffff">&lt; 1</TD><TD ALIGN="RIGHT" BGCOLOR="#ffffff">2,949,150 rows</TD><TD ALIGN="RIGHT" BGCOLOR="#ffffff">  </TD></TR>
    </TABLE>>
    URL="batiment_groupe_dpe_logtype.html"
    target="_top"
    tooltip="batiment_groupe_dpe_logtype"
  ];
  "batiment_groupe_dpe_representatif_logement" [
   label=<
    <TABLE BORDER="0" CELLBORDER="1" CELLSPACING="0" BGCOLOR="#ffffff">
      <TR><TD COLSPAN="3"  BGCOLOR="#f5f5f5"><TABLE BORDER="0" CELLSPACING="0"><TR><TD ALIGN="LEFT" FIXEDSIZE="TRUE" WIDTH="276" HEIGHT="16"><B>batiment_groupe_dpe_representatif_logement</B></TD><TD ALIGN="RIGHT">[table]</TD></TR></TABLE></TD></TR>
      <TR><TD PORT="elipses" COLSPAN="3" ALIGN="LEFT">...</TD></TR>
      <TR><TD ALIGN="LEFT" BGCOLOR="#ffffff">&lt; 1</TD><TD ALIGN="RIGHT" BGCOLOR="#ffffff">3,571,473 rows</TD><TD ALIGN="RIGHT" BGCOLOR="#ffffff">  </TD></TR>
    </TABLE>>
    URL="batiment_groupe_dpe_representat_4557f038.html"
    target="_top"
    tooltip="batiment_groupe_dpe_representatif_logement"
  ];
  "batiment_groupe_dpe_statistique_logement" [
   label=<
    <TABLE BORDER="0" CELLBORDER="1" CELLSPACING="0" BGCOLOR="#ffffff">
      <TR><TD COLSPAN="3"  BGCOLOR="#f5f5f5"><TABLE BORDER="0" CELLSPACING="0"><TR><TD ALIGN="LEFT" FIXEDSIZE="TRUE" WIDTH="261" HEIGHT="16"><B>batiment_groupe_dpe_statistique_logement</B></TD><TD ALIGN="RIGHT">[table]</TD></TR></TABLE></TD></TR>
      <TR><TD PORT="elipses" COLSPAN="3" ALIGN="LEFT">...</TD></TR>
      <TR><TD ALIGN="LEFT" BGCOLOR="#ffffff">&lt; 1</TD><TD ALIGN="RIGHT" BGCOLOR="#ffffff">3,570,761 rows</TD><TD ALIGN="RIGHT" BGCOLOR="#ffffff">  </TD></TR>
    </TABLE>>
    URL="batiment_groupe_dpe_statistique_logement.html"
    target="_top"
    tooltip="batiment_groupe_dpe_statistique_logement"
  ];
  "batiment_groupe_dvf" [
   label=<
    <TABLE BORDER="0" CELLBORDER="1" CELLSPACING="0" BGCOLOR="#ffffff">
      <TR><TD COLSPAN="3"  BGCOLOR="#f5f5f5"><TABLE BORDER="0" CELLSPACING="0"><TR><TD ALIGN="LEFT" FIXEDSIZE="TRUE" WIDTH="126" HEIGHT="16"><B>batiment_groupe_dvf</B></TD><TD ALIGN="RIGHT">[table]</TD></TR></TABLE></TD></TR>
      <TR><TD PORT="elipses" COLSPAN="3" ALIGN="LEFT">...</TD></TR>
      <TR><TD ALIGN="LEFT" BGCOLOR="#ffffff">&lt; 1</TD><TD ALIGN="RIGHT" BGCOLOR="#ffffff">4,680,834 rows</TD><TD ALIGN="RIGHT" BGCOLOR="#ffffff">  </TD></TR>
    </TABLE>>
    URL="batiment_groupe_dvf.html"
    target="_top"
    tooltip="batiment_groupe_dvf"
  ];
  "batiment_groupe_dvf_logtype" [
   label=<
    <TABLE BORDER="0" CELLBORDER="1" CELLSPACING="0" BGCOLOR="#ffffff">
      <TR><TD COLSPAN="3"  BGCOLOR="#f5f5f5"><TABLE BORDER="0" CELLSPACING="0"><TR><TD ALIGN="LEFT" FIXEDSIZE="TRUE" WIDTH="176" HEIGHT="16"><B>batiment_groupe_dvf_logtype</B></TD><TD ALIGN="RIGHT">[table]</TD></TR></TABLE></TD></TR>
      <TR><TD PORT="elipses" COLSPAN="3" ALIGN="LEFT">...</TD></TR>
      <TR><TD ALIGN="LEFT" BGCOLOR="#ffffff">&lt; 1</TD><TD ALIGN="RIGHT" BGCOLOR="#ffffff">4,680,754 rows</TD><TD ALIGN="RIGHT" BGCOLOR="#ffffff">  </TD></TR>
    </TABLE>>
    URL="batiment_groupe_dvf_logtype.html"
    target="_top"
    tooltip="batiment_groupe_dvf_logtype"
  ];
  "batiment_groupe_enepdl" [
   label=<
    <TABLE BORDER="0" CELLBORDER="1" CELLSPACING="0" BGCOLOR="#ffffff">
      <TR><TD COLSPAN="3"  BGCOLOR="#f5f5f5"><TABLE BORDER="0" CELLSPACING="0"><TR><TD ALIGN="LEFT" FIXEDSIZE="TRUE" WIDTH="148" HEIGHT="16"><B>batiment_groupe_enepdl</B></TD><TD ALIGN="RIGHT">[table]</TD></TR></TABLE></TD></TR>
      <TR><TD PORT="elipses" COLSPAN="3" ALIGN="LEFT">...</TD></TR>
      <TR><TD ALIGN="LEFT" BGCOLOR="#ffffff">&lt; 1</TD><TD ALIGN="RIGHT" BGCOLOR="#ffffff">12,840,538 rows</TD><TD ALIGN="RIGHT" BGCOLOR="#ffffff">  </TD></TR>
    </TABLE>>
    URL="batiment_groupe_enepdl.html"
    target="_top"
    tooltip="batiment_groupe_enepdl"
  ];
  "batiment_groupe_energie" [
   label=<
    <TABLE BORDER="0" CELLBORDER="1" CELLSPACING="0" BGCOLOR="#ffffff">
      <TR><TD COLSPAN="3"  BGCOLOR="#f5f5f5"><TABLE BORDER="0" CELLSPACING="0"><TR><TD ALIGN="LEFT" FIXEDSIZE="TRUE" WIDTH="152" HEIGHT="16"><B>batiment_groupe_energie</B></TD><TD ALIGN="RIGHT">[table]</TD></TR></TABLE></TD></TR>
      <TR><TD PORT="elipses" COLSPAN="3" ALIGN="LEFT">...</TD></TR>
      <TR><TD ALIGN="LEFT" BGCOLOR="#ffffff">&lt; 1</TD><TD ALIGN="RIGHT" BGCOLOR="#ffffff">21,220,068 rows</TD><TD ALIGN="RIGHT" BGCOLOR="#ffffff">  </TD></TR>
    </TABLE>>
    URL="batiment_groupe_energie.html"
    target="_top"
    tooltip="batiment_groupe_energie"
  ];
  "batiment_groupe_enethermo" [
   label=<
    <TABLE BORDER="0" CELLBORDER="1" CELLSPACING="0" BGCOLOR="#ffffff">
      <TR><TD COLSPAN="3"  BGCOLOR="#f5f5f5"><TABLE BORDER="0" CELLSPACING="0"><TR><TD ALIGN="LEFT" FIXEDSIZE="TRUE" WIDTH="174" HEIGHT="16"><B>batiment_groupe_enethermo</B></TD><TD ALIGN="RIGHT">[table]</TD></TR></TABLE></TD></TR>
      <TR><TD PORT="elipses" COLSPAN="3" ALIGN="LEFT">...</TD></TR>
      <TR><TD ALIGN="LEFT" BGCOLOR="#ffffff">&lt; 1</TD><TD ALIGN="RIGHT" BGCOLOR="#ffffff">163,427 rows</TD><TD ALIGN="RIGHT" BGCOLOR="#ffffff">  </TD></TR>
    </TABLE>>
    URL="batiment_groupe_enethermo.html"
    target="_top"
    tooltip="batiment_groupe_enethermo"
  ];
  "batiment_groupe_ffo_bat" [
   label=<
    <TABLE BORDER="0" CELLBORDER="1" CELLSPACING="0" BGCOLOR="#ffffff">
      <TR><TD COLSPAN="3"  BGCOLOR="#f5f5f5"><TABLE BORDER="0" CELLSPACING="0"><TR><TD ALIGN="LEFT" FIXEDSIZE="TRUE" WIDTH="149" HEIGHT="16"><B>batiment_groupe_ffo_bat</B></TD><TD ALIGN="RIGHT">[table]</TD></TR></TABLE></TD></TR>
      <TR><TD PORT="elipses" COLSPAN="3" ALIGN="LEFT">...</TD></TR>
      <TR><TD ALIGN="LEFT" BGCOLOR="#ffffff">&lt; 1</TD><TD ALIGN="RIGHT" BGCOLOR="#ffffff">21,219,500 rows</TD><TD ALIGN="RIGHT" BGCOLOR="#ffffff">  </TD></TR>
    </TABLE>>
    URL="batiment_groupe_ffo_bat.html"
    target="_top"
    tooltip="batiment_groupe_ffo_bat"
  ];
  "batiment_groupe_ffo_loc" [
   label=<
    <TABLE BORDER="0" CELLBORDER="1" CELLSPACING="0" BGCOLOR="#ffffff">
      <TR><TD COLSPAN="3"  BGCOLOR="#f5f5f5"><TABLE BORDER="0" CELLSPACING="0"><TR><TD ALIGN="LEFT" FIXEDSIZE="TRUE" WIDTH="146" HEIGHT="16"><B>batiment_groupe_ffo_loc</B></TD><TD ALIGN="RIGHT">[table]</TD></TR></TABLE></TD></TR>
      <TR><TD PORT="elipses" COLSPAN="3" ALIGN="LEFT">...</TD></TR>
      <TR><TD ALIGN="LEFT" BGCOLOR="#ffffff">&lt; 1</TD><TD ALIGN="RIGHT" BGCOLOR="#ffffff">1,537,866 rows</TD><TD ALIGN="RIGHT" BGCOLOR="#ffffff">  </TD></TR>
    </TABLE>>
    URL="batiment_groupe_ffo_loc.html"
    target="_top"
    tooltip="batiment_groupe_ffo_loc"
  ];
  "batiment_groupe_geofabrik" [
   label=<
    <TABLE BORDER="0" CELLBORDER="1" CELLSPACING="0" BGCOLOR="#ffffff">
      <TR><TD COLSPAN="3"  BGCOLOR="#f5f5f5"><TABLE BORDER="0" CELLSPACING="0"><TR><TD ALIGN="LEFT" FIXEDSIZE="TRUE" WIDTH="165" HEIGHT="16"><B>batiment_groupe_geofabrik</B></TD><TD ALIGN="RIGHT">[table]</TD></TR></TABLE></TD></TR>
      <TR><TD PORT="elipses" COLSPAN="3" ALIGN="LEFT">...</TD></TR>
      <TR><TD ALIGN="LEFT" BGCOLOR="#ffffff">&lt; 1</TD><TD ALIGN="RIGHT" BGCOLOR="#ffffff">18,903,648 rows</TD><TD ALIGN="RIGHT" BGCOLOR="#ffffff">  </TD></TR>
    </TABLE>>
    URL="batiment_groupe_geofabrik.html"
    target="_top"
    tooltip="batiment_groupe_geofabrik"
  ];
  "batiment_groupe_geospx" [
   label=<
    <TABLE BORDER="0" CELLBORDER="1" CELLSPACING="0" BGCOLOR="#ffffff">
      <TR><TD COLSPAN="3"  BGCOLOR="#f5f5f5"><TABLE BORDER="0" CELLSPACING="0"><TR><TD ALIGN="LEFT" FIXEDSIZE="TRUE" WIDTH="149" HEIGHT="16"><B>batiment_groupe_geospx</B></TD><TD ALIGN="RIGHT">[table]</TD></TR></TABLE></TD></TR>
      <TR><TD PORT="elipses" COLSPAN="3" ALIGN="LEFT">...</TD></TR>
      <TR><TD ALIGN="LEFT" BGCOLOR="#ffffff">&lt; 1</TD><TD ALIGN="RIGHT" BGCOLOR="#ffffff">23,437,118 rows</TD><TD ALIGN="RIGHT" BGCOLOR="#ffffff">  </TD></TR>
    </TABLE>>
    URL="batiment_groupe_geospx.html"
    target="_top"
    tooltip="batiment_groupe_geospx"
  ];
  "batiment_groupe_hthd" [
   label=<
    <TABLE BORDER="0" CELLBORDER="1" CELLSPACING="0" BGCOLOR="#ffffff">
      <TR><TD COLSPAN="3"  BGCOLOR="#f5f5f5"><TABLE BORDER="0" CELLSPACING="0"><TR><TD ALIGN="LEFT" FIXEDSIZE="TRUE" WIDTH="136" HEIGHT="16"><B>batiment_groupe_hthd</B></TD><TD ALIGN="RIGHT">[table]</TD></TR></TABLE></TD></TR>
      <TR><TD PORT="elipses" COLSPAN="3" ALIGN="LEFT">...</TD></TR>
      <TR><TD ALIGN="LEFT" BGCOLOR="#ffffff">&lt; 1</TD><TD ALIGN="RIGHT" BGCOLOR="#ffffff">11,965,257 rows</TD><TD ALIGN="RIGHT" BGCOLOR="#ffffff">  </TD></TR>
    </TABLE>>
    URL="batiment_groupe_hthd.html"
    target="_top"
    tooltip="batiment_groupe_hthd"
  ];
  "batiment_groupe_merimee" [
   label=<
    <TABLE BORDER="0" CELLBORDER="1" CELLSPACING="0" BGCOLOR="#ffffff">
      <TR><TD COLSPAN="3"  BGCOLOR="#f5f5f5"><TABLE BORDER="0" CELLSPACING="0"><TR><TD ALIGN="LEFT" FIXEDSIZE="TRUE" WIDTH="161" HEIGHT="16"><B>batiment_groupe_merimee</B></TD><TD ALIGN="RIGHT">[table]</TD></TR></TABLE></TD></TR>
      <TR><TD PORT="elipses" COLSPAN="3" ALIGN="LEFT">...</TD></TR>
      <TR><TD ALIGN="LEFT" BGCOLOR="#ffffff">&lt; 1</TD><TD ALIGN="RIGHT" BGCOLOR="#ffffff">4,008,398 rows</TD><TD ALIGN="RIGHT" BGCOLOR="#ffffff">  </TD></TR>
    </TABLE>>
    URL="batiment_groupe_merimee.html"
    target="_top"
    tooltip="batiment_groupe_merimee"
  ];
  "batiment_groupe_proprietaire" [
   label=<
    <TABLE BORDER="0" CELLBORDER="1" CELLSPACING="0" BGCOLOR="#ffffff">
      <TR><TD COLSPAN="3"  BGCOLOR="#f5f5f5"><TABLE BORDER="0" CELLSPACING="0"><TR><TD ALIGN="LEFT" FIXEDSIZE="TRUE" WIDTH="180" HEIGHT="16"><B>batiment_groupe_proprietaire</B></TD><TD ALIGN="RIGHT">[table]</TD></TR></TABLE></TD></TR>
      <TR><TD PORT="elipses" COLSPAN="3" ALIGN="LEFT">...</TD></TR>
      <TR><TD ALIGN="LEFT" BGCOLOR="#ffffff">&lt; 1</TD><TD ALIGN="RIGHT" BGCOLOR="#ffffff">21,221,722 rows</TD><TD ALIGN="RIGHT" BGCOLOR="#ffffff">  </TD></TR>
    </TABLE>>
    URL="batiment_groupe_proprietaire.html"
    target="_top"
    tooltip="batiment_groupe_proprietaire"
  ];
  "batiment_groupe_qpv" [
   label=<
    <TABLE BORDER="0" CELLBORDER="1" CELLSPACING="0" BGCOLOR="#ffffff">
      <TR><TD COLSPAN="3"  BGCOLOR="#f5f5f5"><TABLE BORDER="0" CELLSPACING="0"><TR><TD ALIGN="LEFT" FIXEDSIZE="TRUE" WIDTH="129" HEIGHT="16"><B>batiment_groupe_qpv</B></TD><TD ALIGN="RIGHT">[table]</TD></TR></TABLE></TD></TR>
      <TR><TD PORT="elipses" COLSPAN="3" ALIGN="LEFT">...</TD></TR>
      <TR><TD ALIGN="LEFT" BGCOLOR="#ffffff">&lt; 1</TD><TD ALIGN="RIGHT" BGCOLOR="#ffffff">276,245 rows</TD><TD ALIGN="RIGHT" BGCOLOR="#ffffff">  </TD></TR>
    </TABLE>>
    URL="batiment_groupe_qpv.html"
    target="_top"
    tooltip="batiment_groupe_qpv"
  ];
  "batiment_groupe_radon" [
   label=<
    <TABLE BORDER="0" CELLBORDER="1" CELLSPACING="0" BGCOLOR="#ffffff">
      <TR><TD COLSPAN="3"  BGCOLOR="#f5f5f5"><TABLE BORDER="0" CELLSPACING="0"><TR><TD ALIGN="LEFT" FIXEDSIZE="TRUE" WIDTH="143" HEIGHT="16"><B>batiment_groupe_radon</B></TD><TD ALIGN="RIGHT">[table]</TD></TR></TABLE></TD></TR>
      <TR><TD PORT="elipses" COLSPAN="3" ALIGN="LEFT">...</TD></TR>
      <TR><TD ALIGN="LEFT" BGCOLOR="#ffffff">&lt; 1</TD><TD ALIGN="RIGHT" BGCOLOR="#ffffff">23,427,552 rows</TD><TD ALIGN="RIGHT" BGCOLOR="#ffffff">  </TD></TR>
    </TABLE>>
    URL="batiment_groupe_radon.html"
    target="_top"
    tooltip="batiment_groupe_radon"
  ];
  "batiment_groupe_rnc" [
   label=<
    <TABLE BORDER="0" CELLBORDER="1" CELLSPACING="0" BGCOLOR="#ffffff">
      <TR><TD COLSPAN="3"  BGCOLOR="#f5f5f5"><TABLE BORDER="0" CELLSPACING="0"><TR><TD ALIGN="LEFT" FIXEDSIZE="TRUE" WIDTH="127" HEIGHT="16"><B>batiment_groupe_rnc</B></TD><TD ALIGN="RIGHT">[table]</TD></TR></TABLE></TD></TR>
      <TR><TD PORT="elipses" COLSPAN="3" ALIGN="LEFT">...</TD></TR>
      <TR><TD ALIGN="LEFT" BGCOLOR="#ffffff">&lt; 1</TD><TD ALIGN="RIGHT" BGCOLOR="#ffffff">458,986 rows</TD><TD ALIGN="RIGHT" BGCOLOR="#ffffff">  </TD></TR>
    </TABLE>>
    URL="batiment_groupe_rnc.html"
    target="_top"
    tooltip="batiment_groupe_rnc"
  ];
  "batiment_groupe_rpls" [
   label=<
    <TABLE BORDER="0" CELLBORDER="1" CELLSPACING="0" BGCOLOR="#ffffff">
      <TR><TD COLSPAN="3"  BGCOLOR="#f5f5f5"><TABLE BORDER="0" CELLSPACING="0"><TR><TD ALIGN="LEFT" FIXEDSIZE="TRUE" WIDTH="130" HEIGHT="16"><B>batiment_groupe_rpls</B></TD><TD ALIGN="RIGHT">[table]</TD></TR></TABLE></TD></TR>
      <TR><TD PORT="elipses" COLSPAN="3" ALIGN="LEFT">...</TD></TR>
      <TR><TD ALIGN="LEFT" BGCOLOR="#ffffff">&lt; 1</TD><TD ALIGN="RIGHT" BGCOLOR="#ffffff">316,449 rows</TD><TD ALIGN="RIGHT" BGCOLOR="#ffffff">  </TD></TR>
    </TABLE>>
    URL="batiment_groupe_rpls.html"
    target="_top"
    tooltip="batiment_groupe_rpls"
  ];
  "batiment_groupe_simulations_dpe" [
   label=<
    <TABLE BORDER="0" CELLBORDER="1" CELLSPACING="0" BGCOLOR="#ffffff">
      <TR><TD COLSPAN="3"  BGCOLOR="#f5f5f5"><TABLE BORDER="0" CELLSPACING="0"><TR><TD ALIGN="LEFT" FIXEDSIZE="TRUE" WIDTH="205" HEIGHT="16"><B>batiment_groupe_simulations_dpe</B></TD><TD ALIGN="RIGHT">[table]</TD></TR></TABLE></TD></TR>
      <TR><TD PORT="elipses" COLSPAN="3" ALIGN="LEFT">...</TD></TR>
      <TR><TD ALIGN="LEFT" BGCOLOR="#ffffff">&lt; 1</TD><TD ALIGN="RIGHT" BGCOLOR="#ffffff">19,135,578 rows</TD><TD ALIGN="RIGHT" BGCOLOR="#ffffff">  </TD></TR>
    </TABLE>>
    URL="batiment_groupe_simulations_dpe.html"
    target="_top"
    tooltip="batiment_groupe_simulations_dpe"
  ];
  "batiment_groupe_simulations_dvf" [
   label=<
    <TABLE BORDER="0" CELLBORDER="1" CELLSPACING="0" BGCOLOR="#ffffff">
      <TR><TD COLSPAN="3"  BGCOLOR="#f5f5f5"><TABLE BORDER="0" CELLSPACING="0"><TR><TD ALIGN="LEFT" FIXEDSIZE="TRUE" WIDTH="202" HEIGHT="16"><B>batiment_groupe_simulations_dvf</B></TD><TD ALIGN="RIGHT">[table]</TD></TR></TABLE></TD></TR>
      <TR><TD PORT="elipses" COLSPAN="3" ALIGN="LEFT">...</TD></TR>
      <TR><TD ALIGN="LEFT" BGCOLOR="#ffffff">&lt; 1</TD><TD ALIGN="RIGHT" BGCOLOR="#ffffff">14,262,028 rows</TD><TD ALIGN="RIGHT" BGCOLOR="#ffffff">  </TD></TR>
    </TABLE>>
    URL="batiment_groupe_simulations_dvf.html"
    target="_top"
    tooltip="batiment_groupe_simulations_dvf"
  ];
  "batiment_groupe_simulations_valeur_verte" [
   label=<
    <TABLE BORDER="0" CELLBORDER="1" CELLSPACING="0" BGCOLOR="#ffffff">
      <TR><TD COLSPAN="3"  BGCOLOR="#f5f5f5"><TABLE BORDER="0" CELLSPACING="0"><TR><TD ALIGN="LEFT" FIXEDSIZE="TRUE" WIDTH="257" HEIGHT="16"><B>batiment_groupe_simulations_valeur_verte</B></TD><TD ALIGN="RIGHT">[table]</TD></TR></TABLE></TD></TR>
      <TR><TD PORT="elipses" COLSPAN="3" ALIGN="LEFT">...</TD></TR>
      <TR><TD ALIGN="LEFT" BGCOLOR="#ffffff">&lt; 1</TD><TD ALIGN="RIGHT" BGCOLOR="#ffffff">15,382,342 rows</TD><TD ALIGN="RIGHT" BGCOLOR="#ffffff">  </TD></TR>
    </TABLE>>
    URL="batiment_groupe_simulations_valeur_verte.html"
    target="_top"
    tooltip="batiment_groupe_simulations_valeur_verte"
  ];
  "batiment_groupe_synthese_enveloppe" [
   label=<
    <TABLE BORDER="0" CELLBORDER="1" CELLSPACING="0" BGCOLOR="#ffffff">
      <TR><TD COLSPAN="3"  BGCOLOR="#f5f5f5"><TABLE BORDER="0" CELLSPACING="0"><TR><TD ALIGN="LEFT" FIXEDSIZE="TRUE" WIDTH="228" HEIGHT="16"><B>batiment_groupe_synthese_enveloppe</B></TD><TD ALIGN="RIGHT">[table]</TD></TR></TABLE></TD></TR>
      <TR><TD PORT="elipses" COLSPAN="3" ALIGN="LEFT">...</TD></TR>
      <TR><TD ALIGN="LEFT" BGCOLOR="#ffffff">&lt; 1</TD><TD ALIGN="RIGHT" BGCOLOR="#ffffff">21,215,292 rows</TD><TD ALIGN="RIGHT" BGCOLOR="#ffffff">  </TD></TR>
    </TABLE>>
    URL="batiment_groupe_synthese_enveloppe.html"
    target="_top"
    tooltip="batiment_groupe_synthese_enveloppe"
  ];
  "batiment_groupe_synthese_systeme_energetique_logement" [
   label=<
    <TABLE BORDER="0" CELLBORDER="1" CELLSPACING="0" BGCOLOR="#ffffff">
      <TR><TD COLSPAN="3"  BGCOLOR="#f5f5f5"><TABLE BORDER="0" CELLSPACING="0"><TR><TD ALIGN="LEFT" FIXEDSIZE="TRUE" WIDTH="356" HEIGHT="16"><B>batiment_groupe_synthese_systeme_energetique_logement</B></TD><TD ALIGN="RIGHT">[table]</TD></TR></TABLE></TD></TR>
      <TR><TD PORT="elipses" COLSPAN="3" ALIGN="LEFT">...</TD></TR>
      <TR><TD ALIGN="LEFT" BGCOLOR="#ffffff">&lt; 1</TD><TD ALIGN="RIGHT" BGCOLOR="#ffffff">3,660,370 rows</TD><TD ALIGN="RIGHT" BGCOLOR="#ffffff">  </TD></TR>
    </TABLE>>
    URL="batiment_groupe_synthese_system_62b20747.html"
    target="_top"
    tooltip="batiment_groupe_synthese_systeme_energetique_logement"
  ];
  "local" [
   label=<
    <TABLE BORDER="0" CELLBORDER="1" CELLSPACING="0" BGCOLOR="#ffffff">
      <TR><TD COLSPAN="3"  BGCOLOR="#f5f5f5"><TABLE BORDER="0" CELLSPACING="0"><TR><TD ALIGN="LEFT" FIXEDSIZE="TRUE" WIDTH="28" HEIGHT="16"><B>local</B></TD><TD ALIGN="RIGHT">[table]</TD></TR></TABLE></TD></TR>
      <TR><TD PORT="elipses" COLSPAN="3" ALIGN="LEFT">...</TD></TR>
      <TR><TD ALIGN="LEFT" BGCOLOR="#ffffff">&lt; 2</TD><TD ALIGN="RIGHT" BGCOLOR="#ffffff">51,101,820 rows</TD><TD ALIGN="RIGHT" BGCOLOR="#ffffff">1 &gt;</TD></TR>
    </TABLE>>
    URL="local.html"
    target="_top"
    tooltip="local"
  ];
  "local_simulations_dpe" [
   label=<
    <TABLE BORDER="0" CELLBORDER="1" CELLSPACING="0" BGCOLOR="#ffffff">
      <TR><TD COLSPAN="3"  BGCOLOR="#f5f5f5"><TABLE BORDER="0" CELLSPACING="0"><TR><TD ALIGN="LEFT" FIXEDSIZE="TRUE" WIDTH="130" HEIGHT="16"><B>local_simulations_dpe</B></TD><TD ALIGN="RIGHT">[table]</TD></TR></TABLE></TD></TR>
      <TR><TD PORT="elipses" COLSPAN="3" ALIGN="LEFT">...</TD></TR>
      <TR><TD ALIGN="LEFT" BGCOLOR="#ffffff">&lt; 2</TD><TD ALIGN="RIGHT" BGCOLOR="#ffffff">16,110,420 rows</TD><TD ALIGN="RIGHT" BGCOLOR="#ffffff">  </TD></TR>
    </TABLE>>
    URL="local_simulations_dpe.html"
    target="_top"
    tooltip="local_simulations_dpe"
  ];
  "parcelle" [
   label=<
    <TABLE BORDER="0" CELLBORDER="1" CELLSPACING="0" BGCOLOR="#ffffff">
      <TR><TD COLSPAN="3"  BGCOLOR="#f5f5f5"><TABLE BORDER="0" CELLSPACING="0"><TR><TD ALIGN="LEFT" FIXEDSIZE="TRUE" WIDTH="47" HEIGHT="16"><B>parcelle</B></TD><TD ALIGN="RIGHT">[table]</TD></TR></TABLE></TD></TR>
      <TR><TD PORT="parcelle_id" COLSPAN="3" ALIGN="LEFT"><TABLE BORDER="0" CELLSPACING="0" ALIGN="LEFT"><TR ALIGN="LEFT"><TD ALIGN="LEFT" FIXEDSIZE="TRUE" WIDTH="15" HEIGHT="16"><IMG SRC="../../images/primaryKeys.png"/></TD><TD ALIGN="LEFT" FIXEDSIZE="TRUE" WIDTH="149" HEIGHT="16">parcelle_id</TD></TR></TABLE></TD></TR>
      <TR><TD PORT="code_departement_insee" COLSPAN="3" BGCOLOR="#ffffff" ALIGN="LEFT"><TABLE BORDER="0" CELLSPACING="0" ALIGN="LEFT"><TR ALIGN="LEFT"><TD ALIGN="LEFT" FIXEDSIZE="TRUE" WIDTH="15" HEIGHT="16"></TD><TD ALIGN="LEFT" FIXEDSIZE="TRUE" WIDTH="149" HEIGHT="16">code_departement_insee</TD></TR></TABLE></TD></TR>
      <TR><TD PORT="parcelle_unifiee_id" COLSPAN="3" BGCOLOR="#ffffff" ALIGN="LEFT"><TABLE BORDER="0" CELLSPACING="0" ALIGN="LEFT"><TR ALIGN="LEFT"><TD ALIGN="LEFT" FIXEDSIZE="TRUE" WIDTH="15" HEIGHT="16"><IMG SRC="../../images/foreignKeys.png"/></TD><TD ALIGN="LEFT" FIXEDSIZE="TRUE" WIDTH="149" HEIGHT="16">parcelle_unifiee_id</TD></TR></TABLE></TD></TR>
      <TR><TD PORT="geom_parcelle" COLSPAN="3" BGCOLOR="#ffffff" ALIGN="LEFT"><TABLE BORDER="0" CELLSPACING="0" ALIGN="LEFT"><TR ALIGN="LEFT"><TD ALIGN="LEFT" FIXEDSIZE="TRUE" WIDTH="15" HEIGHT="16"></TD><TD ALIGN="LEFT" FIXEDSIZE="TRUE" WIDTH="149" HEIGHT="16">geom_parcelle</TD></TR></TABLE></TD></TR>
      <TR><TD PORT="elipses" COLSPAN="3" ALIGN="LEFT">...</TD></TR>
      <TR><TD ALIGN="LEFT" BGCOLOR="#ffffff">&lt; 1</TD><TD ALIGN="RIGHT" BGCOLOR="#ffffff">92,057,400 rows</TD><TD ALIGN="RIGHT" BGCOLOR="#ffffff">2 &gt;</TD></TR>
    </TABLE>>
    URL="parcelle.html"
    target="_top"
    tooltip="parcelle"
  ];
  "parcelle_unifiee" [
   label=<
    <TABLE BORDER="2" CELLBORDER="1" CELLSPACING="0" BGCOLOR="#ffffff">
      <TR><TD COLSPAN="4"  BGCOLOR="#f5f5f5"><TABLE BORDER="0" CELLSPACING="0"><TR><TD ALIGN="LEFT" FIXEDSIZE="TRUE" WIDTH="94" HEIGHT="16"><B>parcelle_unifiee</B></TD><TD ALIGN="RIGHT">[table]</TD></TR></TABLE></TD></TR>
      <TR><TD PORT="parcelle_unifiee_id" COLSPAN="2" ALIGN="LEFT"><TABLE BORDER="0" CELLSPACING="0" ALIGN="LEFT"><TR ALIGN="LEFT"><TD ALIGN="LEFT" FIXEDSIZE="TRUE" WIDTH="15" HEIGHT="16"><IMG SRC="../../images/primaryKeys.png"/></TD><TD ALIGN="LEFT" FIXEDSIZE="TRUE" WIDTH="175" HEIGHT="16">parcelle_unifiee_id</TD></TR></TABLE></TD><TD PORT="parcelle_unifiee_id.type" ALIGN="LEFT">varchar[14]</TD></TR>
      <TR><TD PORT="code_departement_insee" COLSPAN="2" BGCOLOR="#ffffff" ALIGN="LEFT"><TABLE BORDER="0" CELLSPACING="0" ALIGN="LEFT"><TR ALIGN="LEFT"><TD ALIGN="LEFT" FIXEDSIZE="TRUE" WIDTH="15" HEIGHT="16"></TD><TD ALIGN="LEFT" FIXEDSIZE="TRUE" WIDTH="175" HEIGHT="16">code_departement_insee</TD></TR></TABLE></TD><TD PORT="code_departement_insee.type" ALIGN="LEFT">varchar[2]</TD></TR>
      <TR><TD PORT="code_commune_insee" COLSPAN="2" ALIGN="LEFT"><TABLE BORDER="0" CELLSPACING="0" ALIGN="LEFT"><TR ALIGN="LEFT"><TD ALIGN="LEFT" FIXEDSIZE="TRUE" WIDTH="15" HEIGHT="16"></TD><TD ALIGN="LEFT" FIXEDSIZE="TRUE" WIDTH="175" HEIGHT="16">code_commune_insee</TD></TR></TABLE></TD><TD PORT="code_commune_insee.type" ALIGN="LEFT">varchar[5]</TD></TR>
      <TR><TD PORT="code_iris" COLSPAN="2" ALIGN="LEFT"><TABLE BORDER="0" CELLSPACING="0" ALIGN="LEFT"><TR ALIGN="LEFT"><TD ALIGN="LEFT" FIXEDSIZE="TRUE" WIDTH="15" HEIGHT="16"></TD><TD ALIGN="LEFT" FIXEDSIZE="TRUE" WIDTH="175" HEIGHT="16">code_iris</TD></TR></TABLE></TD><TD PORT="code_iris.type" ALIGN="LEFT">varchar[9]</TD></TR>
      <TR><TD PORT="origine" COLSPAN="2" ALIGN="LEFT"><TABLE BORDER="0" CELLSPACING="0" ALIGN="LEFT"><TR ALIGN="LEFT"><TD ALIGN="LEFT" FIXEDSIZE="TRUE" WIDTH="15" HEIGHT="16"></TD><TD ALIGN="LEFT" FIXEDSIZE="TRUE" WIDTH="175" HEIGHT="16">origine</TD></TR></TABLE></TD><TD PORT="origine.type" ALIGN="LEFT">varchar[2147483647]</TD></TR>
      <TR><TD PORT="categorie" COLSPAN="2" ALIGN="LEFT"><TABLE BORDER="0" CELLSPACING="0" ALIGN="LEFT"><TR ALIGN="LEFT"><TD ALIGN="LEFT" FIXEDSIZE="TRUE" WIDTH="15" HEIGHT="16"></TD><TD ALIGN="LEFT" FIXEDSIZE="TRUE" WIDTH="175" HEIGHT="16">categorie</TD></TR></TABLE></TD><TD PORT="categorie.type" ALIGN="LEFT">varchar[2147483647]</TD></TR>
      <TR><TD PORT="fictive_geom_parcelle_unifiee" COLSPAN="2" ALIGN="LEFT"><TABLE BORDER="0" CELLSPACING="0" ALIGN="LEFT"><TR ALIGN="LEFT"><TD ALIGN="LEFT" FIXEDSIZE="TRUE" WIDTH="15" HEIGHT="16"></TD><TD ALIGN="LEFT" FIXEDSIZE="TRUE" WIDTH="175" HEIGHT="16">fictive_geom_parcelle_unifiee</TD></TR></TABLE></TD><TD PORT="fictive_geom_parcelle_unifiee.type" ALIGN="LEFT">varchar[2147483647]</TD></TR>
      <TR><TD PORT="s_geom_parcelle_unifiee" COLSPAN="2" ALIGN="LEFT"><TABLE BORDER="0" CELLSPACING="0" ALIGN="LEFT"><TR ALIGN="LEFT"><TD ALIGN="LEFT" FIXEDSIZE="TRUE" WIDTH="15" HEIGHT="16"></TD><TD ALIGN="LEFT" FIXEDSIZE="TRUE" WIDTH="175" HEIGHT="16">s_geom_parcelle_unifiee</TD></TR></TABLE></TD><TD PORT="s_geom_parcelle_unifiee.type" ALIGN="LEFT">int4[10]</TD></TR>
      <TR><TD PORT="geom_parcelle_unifiee" COLSPAN="2" BGCOLOR="#ffffff" ALIGN="LEFT"><TABLE BORDER="0" CELLSPACING="0" ALIGN="LEFT"><TR ALIGN="LEFT"><TD ALIGN="LEFT" FIXEDSIZE="TRUE" WIDTH="15" HEIGHT="16"></TD><TD ALIGN="LEFT" FIXEDSIZE="TRUE" WIDTH="175" HEIGHT="16">geom_parcelle_unifiee</TD></TR></TABLE></TD><TD PORT="geom_parcelle_unifiee.type" ALIGN="LEFT">geometry[2147483647]</TD></TR>
      <TR><TD ALIGN="LEFT" BGCOLOR="#ffffff">&lt; 0</TD><TD ALIGN="RIGHT" BGCOLOR="#ffffff">22,648,552 rows</TD><TD ALIGN="RIGHT" BGCOLOR="#ffffff">3 &gt;</TD></TR>
    </TABLE>>
    URL="parcelle_unifiee.html"
    target="_top"
    tooltip="parcelle_unifiee"
  ];
  "parcelle_unifiee_metrique" [
   label=<
    <TABLE BORDER="0" CELLBORDER="1" CELLSPACING="0" BGCOLOR="#ffffff">
      <TR><TD COLSPAN="3"  BGCOLOR="#f5f5f5"><TABLE BORDER="0" CELLSPACING="0"><TR><TD ALIGN="LEFT" FIXEDSIZE="TRUE" WIDTH="155" HEIGHT="16"><B>parcelle_unifiee_metrique</B></TD><TD ALIGN="RIGHT">[table]</TD></TR></TABLE></TD></TR>
      <TR><TD PORT="parcelle_unifiee_id" COLSPAN="3" ALIGN="LEFT"><TABLE BORDER="0" CELLSPACING="0" ALIGN="LEFT"><TR ALIGN="LEFT"><TD ALIGN="LEFT" FIXEDSIZE="TRUE" WIDTH="15" HEIGHT="16"><IMG SRC="../../images/primaryKeys.png"/></TD><TD ALIGN="LEFT" FIXEDSIZE="TRUE" WIDTH="157" HEIGHT="16">parcelle_unifiee_id</TD></TR></TABLE></TD></TR>
      <TR><TD PORT="code_departement_insee" COLSPAN="3" BGCOLOR="#ffffff" ALIGN="LEFT"><TABLE BORDER="0" CELLSPACING="0" ALIGN="LEFT"><TR ALIGN="LEFT"><TD ALIGN="LEFT" FIXEDSIZE="TRUE" WIDTH="15" HEIGHT="16"></TD><TD ALIGN="LEFT" FIXEDSIZE="TRUE" WIDTH="157" HEIGHT="16">code_departement_insee</TD></TR></TABLE></TD></TR>
      <TR><TD PORT="cle_interop_adr_principale" COLSPAN="3" BGCOLOR="#ffffff" ALIGN="LEFT"><TABLE BORDER="0" CELLSPACING="0" ALIGN="LEFT"><TR ALIGN="LEFT"><TD ALIGN="LEFT" FIXEDSIZE="TRUE" WIDTH="15" HEIGHT="16"></TD><TD ALIGN="LEFT" FIXEDSIZE="TRUE" WIDTH="157" HEIGHT="16">cle_interop_adr_principale</TD></TR></TABLE></TD></TR>
      <TR><TD PORT="elipses" COLSPAN="3" ALIGN="LEFT">...</TD></TR>
      <TR><TD ALIGN="LEFT" BGCOLOR="#ffffff">&lt; 1</TD><TD ALIGN="RIGHT" BGCOLOR="#ffffff">22,662,300 rows</TD><TD ALIGN="RIGHT" BGCOLOR="#ffffff">  </TD></TR>
    </TABLE>>
    URL="parcelle_unifiee_metrique.html"
    target="_top"
    tooltip="parcelle_unifiee_metrique"
  ];
  "rel_batiment_groupe_adresse" [
   label=<
    <TABLE BORDER="0" CELLBORDER="1" CELLSPACING="0" BGCOLOR="#ffffff">
      <TR><TD COLSPAN="3"  BGCOLOR="#f5f5f5"><TABLE BORDER="0" CELLSPACING="0"><TR><TD ALIGN="LEFT" FIXEDSIZE="TRUE" WIDTH="175" HEIGHT="16"><B>rel_batiment_groupe_adresse</B></TD><TD ALIGN="RIGHT">[table]</TD></TR></TABLE></TD></TR>
      <TR><TD PORT="elipses" COLSPAN="3" ALIGN="LEFT">...</TD></TR>
      <TR><TD ALIGN="LEFT" BGCOLOR="#ffffff">&lt; 2</TD><TD ALIGN="RIGHT" BGCOLOR="#ffffff">46,076,560 rows</TD><TD ALIGN="RIGHT" BGCOLOR="#ffffff">  </TD></TR>
    </TABLE>>
    URL="rel_batiment_groupe_adresse.html"
    target="_top"
    tooltip="rel_batiment_groupe_adresse"
  ];
  "rel_batiment_groupe_parcelle" [
   label=<
    <TABLE BORDER="0" CELLBORDER="1" CELLSPACING="0" BGCOLOR="#ffffff">
      <TR><TD COLSPAN="3"  BGCOLOR="#f5f5f5"><TABLE BORDER="0" CELLSPACING="0"><TR><TD ALIGN="LEFT" FIXEDSIZE="TRUE" WIDTH="176" HEIGHT="16"><B>rel_batiment_groupe_parcelle</B></TD><TD ALIGN="RIGHT">[table]</TD></TR></TABLE></TD></TR>
      <TR><TD PORT="elipses" COLSPAN="3" ALIGN="LEFT">...</TD></TR>
      <TR><TD ALIGN="LEFT" BGCOLOR="#ffffff">&lt; 2</TD><TD ALIGN="RIGHT" BGCOLOR="#ffffff">27,607,848 rows</TD><TD ALIGN="RIGHT" BGCOLOR="#ffffff">  </TD></TR>
    </TABLE>>
    URL="rel_batiment_groupe_parcelle.html"
    target="_top"
    tooltip="rel_batiment_groupe_parcelle"
  ];
  "rel_batiment_groupe_proprietaire" [
   label=<
    <TABLE BORDER="0" CELLBORDER="1" CELLSPACING="0" BGCOLOR="#ffffff">
      <TR><TD COLSPAN="3"  BGCOLOR="#f5f5f5"><TABLE BORDER="0" CELLSPACING="0"><TR><TD ALIGN="LEFT" FIXEDSIZE="TRUE" WIDTH="201" HEIGHT="16"><B>rel_batiment_groupe_proprietaire</B></TD><TD ALIGN="RIGHT">[table]</TD></TR></TABLE></TD></TR>
      <TR><TD PORT="elipses" COLSPAN="3" ALIGN="LEFT">...</TD></TR>
      <TR><TD ALIGN="LEFT" BGCOLOR="#ffffff">&lt; 2</TD><TD ALIGN="RIGHT" BGCOLOR="#ffffff">52,782,680 rows</TD><TD ALIGN="RIGHT" BGCOLOR="#ffffff">  </TD></TR>
    </TABLE>>
    URL="rel_batiment_groupe_proprietaire.html"
    target="_top"
    tooltip="rel_batiment_groupe_proprietaire"
  ];
}
