{
	"pages": [ //pages数组中第一项表示应用启动页，参考：https://uniapp.dcloud.io/collocation/pages
		{
			"path": "pages/index/index",
			"style": {
				"navigationStyle": "custom",
				"enablePullDownRefresh": true
			}
		}, {
			"path": "pages/feeds/feeds",
			"style": {
				"navigationBarTitleText": "动态",
				"enablePullDownRefresh": true
			}

		}, {
			"path": "pages/me/me",
			"style": {
				"navigationBarTitleText": "个人中心",
				"enablePullDownRefresh": false
			}

		}
	    ,{
            "path" : "pages/webview/webview",
            "style" :                                                                                    
            {
                "navigationBarTitleText": "",
                "enablePullDownRefresh": false
            }
            
        }
    ],
	
	"tabBar":{
		"color":"#000",
		"selectedColor":"#0050FF",
		"list":[{
			"iconPath":"static/logo.png",
			"selectedIconPath":"static/logo.png",
			"text":"首页",
			"pagePath":"pages/index/index"
		},
		{
			"iconPath":"static/logo.png",
			"selectedIconPath":"static/logo.png",
			"text":"动态",
			"pagePath":"pages/feeds/feeds"
		},
		{
			"iconPath":"static/logo.png",
			"selectedIconPath":"static/logo.png",
			"text":"我的",
			"pagePath":"pages/me/me"
		}]
	},
	
	"globalStyle": {
		"navigationBarTextStyle": "black",
		"navigationBarTitleText": "uni-app",
		"navigationBarBackgroundColor": "#F8F8F8",
		"backgroundColor": "#F8F8F8"
	},
	
	"easycom":{
		// uView按需引入
		// 下载安装的方式需要前面的"@/",npm安装的方式不用
		// "^u-(.*)":"@/uview-ui/components/u-$1/u-$1.vue"
		"^u-(.*)":"uview-ui/components/u-$1/u-$1.vue"
	}
}
