{
  "Cincinnati": "NippertStadium-Cincinnati-OH",
  "Connecticut": "RentschlerField-EastHartford-CT",
  "Houston": "NRGStadium-Houston-TX",
  "Louisville": "PapaJohnsCardinalStadium-Louisville-KY",
  "Memphis": "LibertyBowlMemorialStadium-Memphis-TN",
  "Rutgers": "HighPointSolutionsStadium-Piscataway-NJ",
  "SouthernMethodist": "GeraldJFordStadium-Dallas-TX",
  "SouthFlorida": "RaymondJamesStadium-Tampa-FL",
  "Temple": "LincolnFinancialField-Philadelphia-PA",
  "UCF": "BrightHouseNetworksStadium-Orlando-FL",
  "BostonCollege": "AlumniStadium-ChestnutHill-MA",
  "Clemson": "MemorialStadium-Clemson-SC",
  "FloridaState": "DoakCampbellStadium-Tallahassee-FL",
  "Maryland": "ByrdStadium-CollegePark-MD",
  "NorthCarolinaState": "CarterFinleyStadium-Raleigh-NC",
  "Syracuse": "CarrierDome-Syracuse-NY",
  "WakeForest": "BBTField-WinstonSalem-NC",
  "Duke": "WallaceWadeStadium-Durham-NC",
  "GeorgiaTech": "BobbyDoddStadium-Atlanta-GA",
  "MiamiFL": "SunLifeStadium-MiamiGardens-FL",
  "NorthCarolina": "KenanMemorialStadium-ChapelHill-NC",
  "Pittsburgh": "HeinzField-Pittsburgh-PA",
  "Virginia": "ScottStadium-Charlottesville-VA",
  "VirginiaTech": "LaneStadium-Blacksburg-VA",
  "Illinois": "MemorialStadium-Champaign-IL",
  "Indiana": "MemorialStadium-Bloomington-IN",
  "OhioState": "OhioStadium-Columbus-OH",
  "PennState": "BeaverStadium-UniversityPark-PA",
  "Purdue": "RossAdeStadium-WestLafayette-IN",
  "Wisconsin": "CampRandallStadium-Madison-WI",
  "Iowa": "KinnickStadium-IowaCity-IA",
  "Michigan": "MichiganStadium-AnnArbor-MI",
  "MichiganState": "SpartanStadium-EastLansing-MI",
  "Minnesota": "TCFBankStadium-Minneapolis-MN",
  "Nebraska": "MemorialStadium-Lincoln-NE",
  "Northwestern": "RyanField-Evanston-IL",
  "Baylor": "FloydCaseyStadium-Waco-TX",
  "IowaState": "JackTriceStadium-Ames-IA",
  "Kansas": "MemorialStadium-Lawrence-KS",
  "KansasState": "BillSnyderFamilyFootballStadium-Manhattan-KS",
  "Oklahoma": "GaylordFamilyOklahomaMemorialStadium-Norman-OK",
  "OklahomaState": "BoonePickensStadium-Stillwater-OK",
  "TCU": "AmonGCarterStadium-FortWorth-TX",
  "Texas": "DarrellKRoyalTeasMemorialStadium-Austin-TX",
  "TexasTech": "JonesATTStadium-Lubbock-TX",
  "WestVirginia": "MountaineerFieldatMilanPuskarStadium-Morgantown-WV",
  "EastCarolina": "DowdyFicklenStadium-Greenville-NC",
  "FloridaAtlantic": "FAUStadium-BocaRaton-FL",
  "FloridaInternational": "FIUStadium-Miami-FL",
  "Marshall": "JoanCEdwardsStadium-Huntington-WV",
  "MiddleTennessee": "Johnny\"Red\"FloydStadium-Murfreesboro-TN",
  "SouthernMiss": "MMRobertsStadium-Hattiesburg-MS",
  "UAB": "LegionField-Birmingham-AL",
  "LouisianaTech": "JoeAilletStadium-Ruston-LA",
  "NorthTexas": "ApogeeStadium-Denton-TX",
  "Rice": "RiceStadium-Houston-TX",
  "Tulane": "MercedesBenzSuperdome-NewOrleans-LA",
  "Tulsa": "SkellyFieldatHAChapmanStadium-Tulsa-OK",
  "UTEP": "SunBowlStadium-ElPaso-TX",
  "UTSA": "Alamodome-SanAntonio-TX",
  "Army": "MichieStadium-WestPoint-NY",
  "BrighamYoung": "LaVellEdwardsStadium-Provo-UT",
  "Idaho": "KibbieDome-Moscow-ID",
  "Navy": "NavyMarineCorpsMemorialStadium-Annapolis-MD",
  "NewMexicoState": "AggieMemorialStadium-LasCruces-NM",
  "NotreDame": "NotreDameStadium-SouthBend-IN",
  "Akron": "InfoCisionStadiumSummaField-Akron-OH",
  "BowlingGreen": "DoytPerryStadium-BowlingGreen-OH",
  "Buffalo": "UniversityatBuffaloStadium-Amherst-NY",
  "KentState": "DiStadium-Kent-OH",
  "Massachusetts": "GilletteStadium-Foxborough-MA",
  "MiamiOH": "YagerStadium-Oxford-OH",
  "Ohio": "PedenStadium-Athens-OH",
  "BallState": "ScheumannStadium-Muncie-IN",
  "CentralMichigan": "KellyShortsStadium-MountPleasant-MI",
  "EasternMichigan": "RynearsonStadium-Ypsilianti-MI",
  "NorthernIllinois": "BrighamFieldatHuskieStadium-DeKalb-IL",
  "Toledo": "GlassBowl-Toledo-OH",
  "WesternMichigan": "WaldoStadium-Kalamazoo-MI",
  "AirForce": "FalconStadium-USAirForceAcademy-CO",
  "BoiseState": "AlbertsonsStadium-Boise-ID",
  "ColoradoState": "SonnyLubickFieldatHughesStadium-FortCollins-CO",
  "NewMexico": "UniversityStadium-Albuquerque-NM",
  "UtahState": "RomneyStadium-Logan-UT",
  "Wyoming": "WarMemorialStadium-Laramie-WY",
  "FresnoState": "BulldogStadium-Fresno-CA",
  "Hawaii": "AlohaStadium-Honolulu-HI",
  "Nevada": "MackayStadium-Reno-NV",
  "SanDiegoState": "QualcommStadium-SanDiego-CA",
  "SanJoseState": "SpartanStadium-SanJose-CA",
  "UNLV": "SamBoydStadium-LasVegas-NV",
  "California": "CaliforniaMemorialStadium-Berkeley-CA",
  "Oregon": "AutzenStadium-Eugene-OR",
  "OregonState": "ReserStadium-Corvallis-OR",
  "Stanford": "StanfordStadium-Stanford-CA",
  "Washington": "HuskyStadium-Seattle-WA",
  "WashingtonState": "MartinStadium-Pullman-WA",
  "Arizona": "ArizonaStadium-Tucson-AZ",
  "ArizonaState": "SunDevilStadium-Tempe-AZ",
  "Colorado": "FolsomField-Boulder-CO",
  "UCLA": "RoseBowl-Pasadena-CA",
  "USC": "LosAngelesMemorialColiseum-LosAngeles-CA",
  "Utah": "RiceEcclesStadium-SaltLakeCity-UT",
  "Florida": "BenHillGriffinStadium-Gainesville-FL",
  "Georgia": "SanfordStadium-Athens-GA",
  "Kentucky": "CommonwealthStadium-Lexington-KY",
  "Missouri": "FaurotField-Columbia-MO",
  "SouthCarolina": "WilliamsBriceStadium-Columbia-SC",
  "Tennessee": "NeylandStadium-Knoxville-TN",
  "Vanderbilt": "VanderbiltStadium-Nashville-TN",
  "Alabama": "BryantDennyStadium-Tuscaloosa-AL",
  "Arkansas": "DonaldWReynoldsRazorbackStadium-Fayetteville-AR",
  "Auburn": "JordanHareStadium-Auburn-AL",
  "LSU": "TigerStadium-BatonRouge-LA",
  "MississippiState": "DavisWadeStadium-MississippiState-MS",
  "OleMiss": "VaughtHemingwayStadium-University-MS",
  "TexasAM": "KyleField-CollegeStation-TX",
  "ArkansasState": "CentennialBankStadium-Jonesboro-AR",
  "GeorgiaState": "GeorgiaDome-Atlanta-GA",
  "LouisianaLafayette": "CajunField-Lafayette-LA",
  "LouisianaMonroe": "MaloneStadium-Monroe-LA",
  "SouthAlabama": "LaddPeeblesStadium-Mobile-AL",
  "TexasState": "JimWackerFieldatBobcatStadium-SanMarcos-TX",
  "Troy": "VeteransMemorialStadium-Troy-AL",
  "WesternKentucky": "HouchensIndustriesLTSmithStadium-BowlingGreen-KY",
  "FCS": "FCS-FCS-FCS"
}