{
  "ArkansasState vs AppalachianState": {
    "stadium": "KiddBrewerStadium-Boone-NC",
    "ArkansasState": {
      "points": 17,
      "1st downs": 24,
      "rushing 1st downs": 6,
      "passing 1st downs": 14,
      "penalty 1st downs": 4,
      "rushing yards": 73,
      "rushing attempts": 35,
      "passing yards": 295,
      "passing attempts": 42,
      "passing completions": 22,
      "passing interceptions": 2,
      "total yards": 368,
      "total plays": 77,
      "fumbles": 2,
      "fumbles lost": 0,
      "penalties": 10,
      "penalty yards": 74,
      "punts": 6,
      "punt yards": 234,
      "punt returns": 2,
      "punt return yards": -10,
      "kickoff returns": 6,
      "kickoff return yards": 165,
      "interception returns": 1,
      "interception return yards": 0,
      "3rd down conversions": 4,
      "3rd down attempts": 16,
      "4th down conversions": 1,
      "4th down attempts": 3
    },
    "AppalachianState": {
      "points": 45,
      "1st downs": 22,
      "rushing 1st downs": 10,
      "passing 1st downs": 11,
      "penalty 1st downs": 1,
      "rushing yards": 305,
      "rushing attempts": 44,
      "passing yards": 216,
      "passing attempts": 23,
      "passing completions": 16,
      "passing interceptions": 1,
      "total yards": 521,
      "total plays": 67,
      "fumbles": 3,
      "fumbles lost": 1,
      "penalties": 8,
      "penalty yards": 98,
      "punts": 3,
      "punt yards": 122,
      "punt returns": 1,
      "punt return yards": 3,
      "kickoff returns": 0,
      "kickoff return yards": 0,
      "interception returns": 2,
      "interception return yards": 44,
      "3rd down conversions": 10,
      "3rd down attempts": 15,
      "4th down conversions": 1,
      "4th down attempts": 1
    }
  },
  "FCS vs FloridaInternational": {
    "stadium": "RiccardoSilvaStadium-Miami-FL",
    "FCS": {
      "points": 19,
      "1st downs": 26,
      "rushing 1st downs": 14,
      "passing 1st downs": 9,
      "penalty 1st downs": 3,
      "rushing yards": 285,
      "rushing attempts": 56,
      "passing yards": 159,
      "passing attempts": 25,
      "passing completions": 17,
      "passing interceptions": 0,
      "total yards": 444,
      "total plays": 81,
      "fumbles": 2,
      "fumbles lost": 0,
      "penalties": 3,
      "penalty yards": 30,
      "punts": 3,
      "punt yards": 109,
      "punt returns": 2,
      "punt return yards": -11,
      "kickoff returns": 0,
      "kickoff return yards": 0,
      "interception returns": 0,
      "interception return yards": 0,
      "3rd down conversions": 6,
      "3rd down attempts": 16,
      "4th down conversions": 0,
      "4th down attempts": 0
    },
    "FloridaInternational": {
      "points": 10,
      "1st downs": 6,
      "rushing 1st downs": 3,
      "passing 1st downs": 3,
      "penalty 1st downs": 0,
      "rushing yards": 72,
      "rushing attempts": 24,
      "passing yards": 84,
      "passing attempts": 19,
      "passing completions": 7,
      "passing interceptions": 0,
      "total yards": 156,
      "total plays": 43,
      "fumbles": 1,
      "fumbles lost": 1,
      "penalties": 4,
      "penalty yards": 26,
      "punts": 5,
      "punt yards": 245,
      "punt returns": 2,
      "punt return yards": 53,
      "kickoff returns": 1,
      "kickoff return yards": 15,
      "interception returns": 0,
      "interception return yards": 0,
      "3rd down conversions": 2,
      "3rd down attempts": 11,
      "4th down conversions": 0,
      "4th down attempts": 1
    }
  },
  "Tulsa vs SouthFlorida": {
    "stadium": "RaymondJamesStadium-Tampa-FL",
    "Tulsa": {
      "points": 42,
      "1st downs": 21,
      "rushing 1st downs": 10,
      "passing 1st downs": 11,
      "penalty 1st downs": 0,
      "rushing yards": 227,
      "rushing attempts": 37,
      "passing yards": 235,
      "passing attempts": 25,
      "passing completions": 17,
      "passing interceptions": 1,
      "total yards": 462,
      "total plays": 62,
      "fumbles": 0,
      "fumbles lost": 0,
      "penalties": 5,
      "penalty yards": 40,
      "punts": 5,
      "punt yards": 197,
      "punt returns": 2,
      "punt return yards": 14,
      "kickoff returns": 2,
      "kickoff return yards": 28,
      "interception returns": 1,
      "interception return yards": 38,
      "3rd down conversions": 7,
      "3rd down attempts": 12,
      "4th down conversions": 0,
      "4th down attempts": 0
    },
    "SouthFlorida": {
      "points": 13,
      "1st downs": 17,
      "rushing 1st downs": 5,
      "passing 1st downs": 10,
      "penalty 1st downs": 2,
      "rushing yards": 122,
      "rushing attempts": 34,
      "passing yards": 183,
      "passing attempts": 36,
      "passing completions": 22,
      "passing interceptions": 1,
      "total yards": 305,
      "total plays": 70,
      "fumbles": 2,
      "fumbles lost": 2,
      "penalties": 6,
      "penalty yards": 30,
      "punts": 4,
      "punt yards": 184,
      "punt returns": 2,
      "punt return yards": 64,
      "kickoff returns": 5,
      "kickoff return yards": 84,
      "interception returns": 1,
      "interception return yards": 31,
      "3rd down conversions": 2,
      "3rd down attempts": 15,
      "4th down conversions": 3,
      "4th down attempts": 4
    }
  },
  "LouisianaLafayette vs UAB": {
    "stadium": "LegionField-Birmingham-AL",
    "LouisianaLafayette": {
      "points": 24,
      "1st downs": 17,
      "rushing 1st downs": 9,
      "passing 1st downs": 5,
      "penalty 1st downs": 3,
      "rushing yards": 134,
      "rushing attempts": 42,
      "passing yards": 152,
      "passing attempts": 20,
      "passing completions": 12,
      "passing interceptions": 0,
      "total yards": 286,
      "total plays": 62,
      "fumbles": 0,
      "fumbles lost": 0,
      "penalties": 6,
      "penalty yards": 52,
      "punts": 3,
      "punt yards": 144,
      "punt returns": 1,
      "punt return yards": -1,
      "kickoff returns": 4,
      "kickoff return yards": 160,
      "interception returns": 2,
      "interception return yards": 18,
      "3rd down conversions": 7,
      "3rd down attempts": 15,
      "4th down conversions": 1,
      "4th down attempts": 3
    },
    "UAB": {
      "points": 20,
      "1st downs": 17,
      "rushing 1st downs": 9,
      "passing 1st downs": 7,
      "penalty 1st downs": 1,
      "rushing yards": 175,
      "rushing attempts": 40,
      "passing yards": 110,
      "passing attempts": 23,
      "passing completions": 10,
      "passing interceptions": 2,
      "total yards": 285,
      "total plays": 63,
      "fumbles": 0,
      "fumbles lost": 0,
      "penalties": 10,
      "penalty yards": 90,
      "punts": 3,
      "punt yards": 123,
      "punt returns": 1,
      "punt return yards": 7,
      "kickoff returns": 0,
      "kickoff return yards": 0,
      "interception returns": 0,
      "interception return yards": 0,
      "3rd down conversions": 8,
      "3rd down attempts": 15,
      "4th down conversions": 1,
      "4th down attempts": 1
    }
  },
  "Illinois vs Wisconsin": {
    "stadium": "CampRandallStadium-Madison-WI",
    "Illinois": {
      "points": 7,
      "1st downs": 8,
      "rushing 1st downs": 4,
      "passing 1st downs": 4,
      "penalty 1st downs": 0,
      "rushing yards": 131,
      "rushing attempts": 25,
      "passing yards": 87,
      "passing attempts": 22,
      "passing completions": 8,
      "passing interceptions": 1,
      "total yards": 218,
      "total plays": 47,
      "fumbles": 1,
      "fumbles lost": 1,
      "penalties": 5,
      "penalty yards": 60,
      "punts": 5,
      "punt yards": 216,
      "punt returns": 1,
      "punt return yards": 8,
      "kickoff returns": 6,
      "kickoff return yards": 89,
      "interception returns": 0,
      "interception return yards": 0,
      "3rd down conversions": 2,
      "3rd down attempts": 10,
      "4th down conversions": 0,
      "4th down attempts": 3
    },
    "Wisconsin": {
      "points": 45,
      "1st downs": 23,
      "rushing 1st downs": 11,
      "passing 1st downs": 9,
      "penalty 1st downs": 3,
      "rushing yards": 182,
      "rushing attempts": 54,
      "passing yards": 248,
      "passing attempts": 21,
      "passing completions": 20,
      "passing interceptions": 0,
      "total yards": 430,
      "total plays": 75,
      "fumbles": 1,
      "fumbles lost": 1,
      "penalties": 3,
      "penalty yards": 15,
      "punts": 4,
      "punt yards": 184,
      "punt returns": 1,
      "punt return yards": 0,
      "kickoff returns": 2,
      "kickoff return yards": 28,
      "interception returns": 1,
      "interception return yards": 10,
      "3rd down conversions": 8,
      "3rd down attempts": 14,
      "4th down conversions": 1,
      "4th down attempts": 1
    }
  },
  "Kansas vs KansasState": {
    "stadium": "BillSnyderFamilyFootballStadium-Manhattan-KS",
    "Kansas": {
      "points": 14,
      "1st downs": 18,
      "rushing 1st downs": 5,
      "passing 1st downs": 11,
      "penalty 1st downs": 2,
      "rushing yards": 113,
      "rushing attempts": 39,
      "passing yards": 207,
      "passing attempts": 39,
      "passing completions": 22,
      "passing interceptions": 1,
      "total yards": 320,
      "total plays": 78,
      "fumbles": 1,
      "fumbles lost": 1,
      "penalties": 3,
      "penalty yards": 29,
      "punts": 9,
      "punt yards": 317,
      "punt returns": 2,
      "punt return yards": -2,
      "kickoff returns": 2,
      "kickoff return yards": 39,
      "interception returns": 0,
      "interception return yards": 0,
      "3rd down conversions": 4,
      "3rd down attempts": 18,
      "4th down conversions": 1,
      "4th down attempts": 3
    },
    "KansasState": {
      "points": 55,
      "1st downs": 17,
      "rushing 1st downs": 6,
      "passing 1st downs": 10,
      "penalty 1st downs": 1,
      "rushing yards": 129,
      "rushing attempts": 33,
      "passing yards": 252,
      "passing attempts": 28,
      "passing completions": 18,
      "passing interceptions": 0,
      "total yards": 381,
      "total plays": 61,
      "fumbles": 2,
      "fumbles lost": 1,
      "penalties": 10,
      "penalty yards": 81,
      "punts": 6,
      "punt yards": 230,
      "punt returns": 4,
      "punt return yards": 189,
      "kickoff returns": 1,
      "kickoff return yards": 5,
      "interception returns": 1,
      "interception return yards": 24,
      "3rd down conversions": 4,
      "3rd down attempts": 12,
      "4th down conversions": 0,
      "4th down attempts": 0
    }
  },
  "UTEP vs Charlotte": {
    "stadium": "JerryRichardsonStadium-Charlotte-NC",
    "UTEP": {
      "points": 28,
      "1st downs": 24,
      "rushing 1st downs": 9,
      "passing 1st downs": 11,
      "penalty 1st downs": 4,
      "rushing yards": 170,
      "rushing attempts": 38,
      "passing yards": 204,
      "passing attempts": 35,
      "passing completions": 19,
      "passing interceptions": 2,
      "total yards": 374,
      "total plays": 73,
      "fumbles": 1,
      "fumbles lost": 1,
      "penalties": 5,
      "penalty yards": 40,
      "punts": 2,
      "punt yards": 59,
      "punt returns": 0,
      "punt return yards": 0,
      "kickoff returns": 5,
      "kickoff return yards": 130,
      "interception returns": 0,
      "interception return yards": 0,
      "3rd down conversions": 8,
      "3rd down attempts": 13,
      "4th down conversions": 2,
      "4th down attempts": 3
    },
    "Charlotte": {
      "points": 38,
      "1st downs": 17,
      "rushing 1st downs": 9,
      "passing 1st downs": 8,
      "penalty 1st downs": 0,
      "rushing yards": 144,
      "rushing attempts": 35,
      "passing yards": 185,
      "passing attempts": 23,
      "passing completions": 14,
      "passing interceptions": 0,
      "total yards": 329,
      "total plays": 58,
      "fumbles": 1,
      "fumbles lost": 0,
      "penalties": 11,
      "penalty yards": 122,
      "punts": 4,
      "punt yards": 189,
      "punt returns": 0,
      "punt return yards": 0,
      "kickoff returns": 2,
      "kickoff return yards": 34,
      "interception returns": 2,
      "interception return yards": 48,
      "3rd down conversions": 8,
      "3rd down attempts": 13,
      "4th down conversions": 0,
      "4th down attempts": 0
    }
  },
  "FloridaState vs Louisville": {
    "stadium": "CardinalStadium-Louisville-KY",
    "FloridaState": {
      "points": 16,
      "1st downs": 19,
      "rushing 1st downs": 12,
      "passing 1st downs": 6,
      "penalty 1st downs": 1,
      "rushing yards": 265,
      "rushing attempts": 40,
      "passing yards": 141,
      "passing attempts": 41,
      "passing completions": 14,
      "passing interceptions": 1,
      "total yards": 406,
      "total plays": 81,
      "fumbles": 1,
      "fumbles lost": 0,
      "penalties": 11,
      "penalty yards": 104,
      "punts": 5,
      "punt yards": 203,
      "punt returns": 1,
      "punt return yards": 8,
      "kickoff returns": 8,
      "kickoff return yards": 158,
      "interception returns": 0,
      "interception return yards": 0,
      "3rd down conversions": 7,
      "3rd down attempts": 18,
      "4th down conversions": 1,
      "4th down attempts": 5
    },
    "Louisville": {
      "points": 48,
      "1st downs": 22,
      "rushing 1st downs": 8,
      "passing 1st downs": 10,
      "penalty 1st downs": 4,
      "rushing yards": 291,
      "rushing attempts": 37,
      "passing yards": 278,
      "passing attempts": 24,
      "passing completions": 16,
      "passing interceptions": 0,
      "total yards": 569,
      "total plays": 61,
      "fumbles": 2,
      "fumbles lost": 1,
      "penalties": 7,
      "penalty yards": 67,
      "punts": 2,
      "punt yards": 69,
      "punt returns": 1,
      "punt return yards": -15,
      "kickoff returns": 2,
      "kickoff return yards": 45,
      "interception returns": 1,
      "interception return yards": 17,
      "3rd down conversions": 5,
      "3rd down attempts": 9,
      "4th down conversions": 0,
      "4th down attempts": 0
    }
  },
  "Temple vs Memphis": {
    "stadium": "LibertyBowlMemorialStadium-Memphis-TN",
    "Temple": {
      "points": 29,
      "1st downs": 30,
      "rushing 1st downs": 7,
      "passing 1st downs": 19,
      "penalty 1st downs": 4,
      "rushing yards": 113,
      "rushing attempts": 33,
      "passing yards": 387,
      "passing attempts": 63,
      "passing completions": 41,
      "passing interceptions": 3,
      "total yards": 500,
      "total plays": 96,
      "fumbles": 3,
      "fumbles lost": 1,
      "penalties": 6,
      "penalty yards": 75,
      "punts": 3,
      "punt yards": 121,
      "punt returns": 0,
      "punt return yards": 0,
      "kickoff returns": 2,
      "kickoff return yards": 44,
      "interception returns": 1,
      "interception return yards": 0,
      "3rd down conversions": 8,
      "3rd down attempts": 19,
      "4th down conversions": 2,
      "4th down attempts": 4
    },
    "Memphis": {
      "points": 41,
      "1st downs": 24,
      "rushing 1st downs": 10,
      "passing 1st downs": 10,
      "penalty 1st downs": 4,
      "rushing yards": 176,
      "rushing attempts": 41,
      "passing yards": 313,
      "passing attempts": 36,
      "passing completions": 17,
      "passing interceptions": 1,
      "total yards": 489,
      "total plays": 77,
      "fumbles": 4,
      "fumbles lost": 2,
      "penalties": 7,
      "penalty yards": 71,
      "punts": 3,
      "punt yards": 124,
      "punt returns": 1,
      "punt return yards": 9,
      "kickoff returns": 2,
      "kickoff return yards": 36,
      "interception returns": 3,
      "interception return yards": 20,
      "3rd down conversions": 9,
      "3rd down attempts": 18,
      "4th down conversions": 2,
      "4th down attempts": 2
    }
  },
  "NorthCarolinaState vs NorthCarolina": {
    "stadium": "KenanMemorialStadium-ChapelHill-NC",
    "NorthCarolinaState": {
      "points": 21,
      "1st downs": 23,
      "rushing 1st downs": 3,
      "passing 1st downs": 16,
      "penalty 1st downs": 4,
      "rushing yards": 34,
      "rushing attempts": 19,
      "passing yards": 358,
      "passing attempts": 44,
      "passing completions": 27,
      "passing interceptions": 3,
      "total yards": 392,
      "total plays": 63,
      "fumbles": 1,
      "fumbles lost": 1,
      "penalties": 5,
      "penalty yards": 41,
      "punts": 4,
      "punt yards": 219,
      "punt returns": 1,
      "punt return yards": 11,
      "kickoff returns": 0,
      "kickoff return yards": 0,
      "interception returns": 0,
      "interception return yards": 0,
      "3rd down conversions": 4,
      "3rd down attempts": 10,
      "4th down conversions": 1,
      "4th down attempts": 2
    },
    "NorthCarolina": {
      "points": 48,
      "1st downs": 34,
      "rushing 1st downs": 19,
      "passing 1st downs": 13,
      "penalty 1st downs": 2,
      "rushing yards": 326,
      "rushing attempts": 55,
      "passing yards": 252,
      "passing attempts": 29,
      "passing completions": 18,
      "passing interceptions": 0,
      "total yards": 578,
      "total plays": 84,
      "fumbles": 2,
      "fumbles lost": 0,
      "penalties": 9,
      "penalty yards": 70,
      "punts": 3,
      "punt yards": 116,
      "punt returns": 1,
      "punt return yards": 8,
      "kickoff returns": 1,
      "kickoff return yards": 24,
      "interception returns": 3,
      "interception return yards": 13,
      "3rd down conversions": 7,
      "3rd down attempts": 12,
      "4th down conversions": 0,
      "4th down attempts": 0
    }
  },
  "Oklahoma vs TCU": {
    "stadium": "AmonGCarterStadium-FortWorth-TX",
    "Oklahoma": {
      "points": 33,
      "1st downs": 23,
      "rushing 1st downs": 11,
      "passing 1st downs": 10,
      "penalty 1st downs": 2,
      "rushing yards": 166,
      "rushing attempts": 45,
      "passing yards": 332,
      "passing attempts": 22,
      "passing completions": 13,
      "passing interceptions": 0,
      "total yards": 498,
      "total plays": 67,
      "fumbles": 1,
      "fumbles lost": 0,
      "penalties": 7,
      "penalty yards": 65,
      "punts": 3,
      "punt yards": 116,
      "punt returns": 2,
      "punt return yards": 42,
      "kickoff returns": 3,
      "kickoff return yards": 40,
      "interception returns": 0,
      "interception return yards": 0,
      "3rd down conversions": 5,
      "3rd down attempts": 13,
      "4th down conversions": 0,
      "4th down attempts": 0
    },
    "TCU": {
      "points": 14,
      "1st downs": 18,
      "rushing 1st downs": 5,
      "passing 1st downs": 9,
      "penalty 1st downs": 4,
      "rushing yards": 75,
      "rushing attempts": 25,
      "passing yards": 276,
      "passing attempts": 35,
      "passing completions": 25,
      "passing interceptions": 0,
      "total yards": 351,
      "total plays": 60,
      "fumbles": 0,
      "fumbles lost": 0,
      "penalties": 10,
      "penalty yards": 94,
      "punts": 8,
      "punt yards": 328,
      "punt returns": 0,
      "punt return yards": 0,
      "kickoff returns": 5,
      "kickoff return yards": 107,
      "interception returns": 0,
      "interception return yards": 0,
      "3rd down conversions": 5,
      "3rd down attempts": 14,
      "4th down conversions": 1,
      "4th down attempts": 1
    }
  },
  "GeorgiaSouthern vs CoastalCarolina": {
    "stadium": "BrooksStadium-Conway-SC",
    "GeorgiaSouthern": {
      "points": 14,
      "1st downs": 12,
      "rushing 1st downs": 6,
      "passing 1st downs": 5,
      "penalty 1st downs": 1,
      "rushing yards": 119,
      "rushing attempts": 37,
      "passing yards": 99,
      "passing attempts": 22,
      "passing completions": 8,
      "passing interceptions": 2,
      "total yards": 218,
      "total plays": 59,
      "fumbles": 1,
      "fumbles lost": 0,
      "penalties": 5,
      "penalty yards": 31,
      "punts": 8,
      "punt yards": 335,
      "punt returns": 2,
      "punt return yards": 46,
      "kickoff returns": 2,
      "kickoff return yards": 39,
      "interception returns": 2,
      "interception return yards": 0,
      "3rd down conversions": 2,
      "3rd down attempts": 12,
      "4th down conversions": 0,
      "4th down attempts": 1
    },
    "CoastalCarolina": {
      "points": 28,
      "1st downs": 20,
      "rushing 1st downs": 10,
      "passing 1st downs": 9,
      "penalty 1st downs": 1,
      "rushing yards": 130,
      "rushing attempts": 41,
      "passing yards": 252,
      "passing attempts": 28,
      "passing completions": 15,
      "passing interceptions": 2,
      "total yards": 382,
      "total plays": 69,
      "fumbles": 1,
      "fumbles lost": 0,
      "penalties": 5,
      "penalty yards": 49,
      "punts": 5,
      "punt yards": 206,
      "punt returns": 2,
      "punt return yards": 47,
      "kickoff returns": 2,
      "kickoff return yards": 40,
      "interception returns": 2,
      "interception return yards": 30,
      "3rd down conversions": 5,
      "3rd down attempts": 13,
      "4th down conversions": 1,
      "4th down attempts": 2
    }
  },
  "Syracuse vs Clemson": {
    "stadium": "MemorialStadium-Clemson-SC",
    "Syracuse": {
      "points": 21,
      "1st downs": 11,
      "rushing 1st downs": 4,
      "passing 1st downs": 7,
      "penalty 1st downs": 0,
      "rushing yards": 150,
      "rushing attempts": 32,
      "passing yards": 175,
      "passing attempts": 26,
      "passing completions": 10,
      "passing interceptions": 3,
      "total yards": 325,
      "total plays": 58,
      "fumbles": 1,
      "fumbles lost": 1,
      "penalties": 5,
      "penalty yards": 35,
      "punts": 7,
      "punt yards": 282,
      "punt returns": 3,
      "punt return yards": 28,
      "kickoff returns": 1,
      "kickoff return yards": 24,
      "interception returns": 1,
      "interception return yards": 39,
      "3rd down conversions": 4,
      "3rd down attempts": 13,
      "4th down conversions": 0,
      "4th down attempts": 1
    },
    "Clemson": {
      "points": 47,
      "1st downs": 27,
      "rushing 1st downs": 10,
      "passing 1st downs": 16,
      "penalty 1st downs": 1,
      "rushing yards": 147,
      "rushing attempts": 37,
      "passing yards": 308,
      "passing attempts": 47,
      "passing completions": 29,
      "passing interceptions": 1,
      "total yards": 455,
      "total plays": 84,
      "fumbles": 1,
      "fumbles lost": 0,
      "penalties": 4,
      "penalty yards": 25,
      "punts": 5,
      "punt yards": 268,
      "punt returns": 0,
      "punt return yards": 0,
      "kickoff returns": 2,
      "kickoff return yards": 73,
      "interception returns": 3,
      "interception return yards": 66,
      "3rd down conversions": 8,
      "3rd down attempts": 17,
      "4th down conversions": 1,
      "4th down attempts": 1
    }
  },
  "Auburn vs OleMiss": {
    "stadium": "VaughtHemingwayStadium-Oxford-MS",
    "Auburn": {
      "points": 35,
      "1st downs": 26,
      "rushing 1st downs": 17,
      "passing 1st downs": 9,
      "penalty 1st downs": 0,
      "rushing yards": 224,
      "rushing attempts": 47,
      "passing yards": 238,
      "passing attempts": 30,
      "passing completions": 23,
      "passing interceptions": 0,
      "total yards": 462,
      "total plays": 77,
      "fumbles": 0,
      "fumbles lost": 0,
      "penalties": 3,
      "penalty yards": 35,
      "punts": 4,
      "punt yards": 167,
      "punt returns": 1,
      "punt return yards": 7,
      "kickoff returns": 4,
      "kickoff return yards": 71,
      "interception returns": 2,
      "interception return yards": 40,
      "3rd down conversions": 11,
      "3rd down attempts": 16,
      "4th down conversions": 0,
      "4th down attempts": 1
    },
    "OleMiss": {
      "points": 28,
      "1st downs": 25,
      "rushing 1st downs": 16,
      "passing 1st downs": 8,
      "penalty 1st downs": 1,
      "rushing yards": 283,
      "rushing attempts": 51,
      "passing yards": 161,
      "passing attempts": 28,
      "passing completions": 17,
      "passing interceptions": 2,
      "total yards": 444,
      "total plays": 79,
      "fumbles": 1,
      "fumbles lost": 0,
      "penalties": 1,
      "penalty yards": 5,
      "punts": 3,
      "punt yards": 144,
      "punt returns": 1,
      "punt return yards": -7,
      "kickoff returns": 2,
      "kickoff return yards": 37,
      "interception returns": 0,
      "interception return yards": 0,
      "3rd down conversions": 10,
      "3rd down attempts": 16,
      "4th down conversions": 1,
      "4th down attempts": 2
    }
  },
  "FCS vs Army": {
    "stadium": "MichieStadium-WestPoint-NY",
    "FCS": {
      "points": 3,
      "1st downs": 14,
      "rushing 1st downs": 6,
      "passing 1st downs": 8,
      "penalty 1st downs": 0,
      "rushing yards": 113,
      "rushing attempts": 33,
      "passing yards": 108,
      "passing attempts": 24,
      "passing completions": 16,
      "passing interceptions": 3,
      "total yards": 221,
      "total plays": 57,
      "fumbles": 0,
      "fumbles lost": 0,
      "penalties": 3,
      "penalty yards": 40,
      "punts": 3,
      "punt yards": 127,
      "punt returns": 1,
      "punt return yards": 9,
      "kickoff returns": 3,
      "kickoff return yards": 46,
      "interception returns": 0,
      "interception return yards": 0,
      "3rd down conversions": 6,
      "3rd down attempts": 13,
      "4th down conversions": 0,
      "4th down attempts": 0
    },
    "Army": {
      "points": 49,
      "1st downs": 21,
      "rushing 1st downs": 19,
      "passing 1st downs": 2,
      "penalty 1st downs": 0,
      "rushing yards": 297,
      "rushing attempts": 63,
      "passing yards": 63,
      "passing attempts": 3,
      "passing completions": 2,
      "passing interceptions": 0,
      "total yards": 360,
      "total plays": 66,
      "fumbles": 2,
      "fumbles lost": 0,
      "penalties": 4,
      "penalty yards": 29,
      "punts": 1,
      "punt yards": 56,
      "punt returns": 2,
      "punt return yards": 22,
      "kickoff returns": 1,
      "kickoff return yards": 39,
      "interception returns": 3,
      "interception return yards": 79,
      "3rd down conversions": 8,
      "3rd down attempts": 14,
      "4th down conversions": 4,
      "4th down attempts": 4
    }
  },
  "Nebraska vs OhioState": {
    "stadium": "OhioStadium-Columbus-OH",
    "Nebraska": {
      "points": 17,
      "1st downs": 17,
      "rushing 1st downs": 11,
      "passing 1st downs": 6,
      "penalty 1st downs": 0,
      "rushing yards": 217,
      "rushing attempts": 36,
      "passing yards": 160,
      "passing attempts": 20,
      "passing completions": 16,
      "passing interceptions": 0,
      "total yards": 377,
      "total plays": 56,
      "fumbles": 3,
      "fumbles lost": 2,
      "penalties": 8,
      "penalty yards": 90,
      "punts": 5,
      "punt yards": 223,
      "punt returns": 0,
      "punt return yards": 0,
      "kickoff returns": 3,
      "kickoff return yards": 54,
      "interception returns": 0,
      "interception return yards": 0,
      "3rd down conversions": 4,
      "3rd down attempts": 10,
      "4th down conversions": 0,
      "4th down attempts": 0
    },
    "OhioState": {
      "points": 52,
      "1st downs": 28,
      "rushing 1st downs": 13,
      "passing 1st downs": 12,
      "penalty 1st downs": 3,
      "rushing yards": 222,
      "rushing attempts": 48,
      "passing yards": 276,
      "passing attempts": 21,
      "passing completions": 20,
      "passing interceptions": 0,
      "total yards": 498,
      "total plays": 69,
      "fumbles": 2,
      "fumbles lost": 1,
      "penalties": 3,
      "penalty yards": 14,
      "punts": 2,
      "punt yards": 98,
      "punt returns": 2,
      "punt return yards": 23,
      "kickoff returns": 2,
      "kickoff return yards": 14,
      "interception returns": 0,
      "interception return yards": 0,
      "3rd down conversions": 8,
      "3rd down attempts": 13,
      "4th down conversions": 2,
      "4th down attempts": 2
    }
  },
  "Rutgers vs MichiganState": {
    "stadium": "SpartanStadium-EastLansing-MI",
    "Rutgers": {
      "points": 38,
      "1st downs": 16,
      "rushing 1st downs": 6,
      "passing 1st downs": 9,
      "penalty 1st downs": 1,
      "rushing yards": 106,
      "rushing attempts": 41,
      "passing yards": 170,
      "passing attempts": 30,
      "passing completions": 19,
      "passing interceptions": 1,
      "total yards": 276,
      "total plays": 71,
      "fumbles": 2,
      "fumbles lost": 2,
      "penalties": 9,
      "penalty yards": 66,
      "punts": 6,
      "punt yards": 233,
      "punt returns": 2,
      "punt return yards": 12,
      "kickoff returns": 3,
      "kickoff return yards": 94,
      "interception returns": 2,
      "interception return yards": 32,
      "3rd down conversions": 6,
      "3rd down attempts": 15,
      "4th down conversions": 1,
      "4th down attempts": 1
    },
    "MichiganState": {
      "points": 27,
      "1st downs": 23,
      "rushing 1st downs": 5,
      "passing 1st downs": 15,
      "penalty 1st downs": 3,
      "rushing yards": 60,
      "rushing attempts": 38,
      "passing yards": 319,
      "passing attempts": 44,
      "passing completions": 31,
      "passing interceptions": 2,
      "total yards": 379,
      "total plays": 82,
      "fumbles": 6,
      "fumbles lost": 5,
      "penalties": 7,
      "penalty yards": 62,
      "punts": 2,
      "punt yards": 101,
      "punt returns": 2,
      "punt return yards": 18,
      "kickoff returns": 4,
      "kickoff return yards": 65,
      "interception returns": 1,
      "interception return yards": 23,
      "3rd down conversions": 7,
      "3rd down attempts": 17,
      "4th down conversions": 2,
      "4th down attempts": 4
    }
  },
  "SouthernMiss vs Liberty": {
    "stadium": "WilliamsStadium-Lynchburg-VA",
    "SouthernMiss": {
      "points": 35,
      "1st downs": 19,
      "rushing 1st downs": 9,
      "passing 1st downs": 9,
      "penalty 1st downs": 1,
      "rushing yards": 215,
      "rushing attempts": 41,
      "passing yards": 201,
      "passing attempts": 27,
      "passing completions": 16,
      "passing interceptions": 1,
      "total yards": 416,
      "total plays": 68,
      "fumbles": 1,
      "fumbles lost": 0,
      "penalties": 5,
      "penalty yards": 42,
      "punts": 4,
      "punt yards": 149,
      "punt returns": 0,
      "punt return yards": 0,
      "kickoff returns": 7,
      "kickoff return yards": 93,
      "interception returns": 0,
      "interception return yards": 0,
      "3rd down conversions": 6,
      "3rd down attempts": 14,
      "4th down conversions": 0,
      "4th down attempts": 3
    },
    "Liberty": {
      "points": 56,
      "1st downs": 25,
      "rushing 1st downs": 11,
      "passing 1st downs": 13,
      "penalty 1st downs": 1,
      "rushing yards": 192,
      "rushing attempts": 37,
      "passing yards": 345,
      "passing attempts": 32,
      "passing completions": 24,
      "passing interceptions": 0,
      "total yards": 537,
      "total plays": 69,
      "fumbles": 1,
      "fumbles lost": 1,
      "penalties": 4,
      "penalty yards": 50,
      "punts": 2,
      "punt yards": 71,
      "punt returns": 1,
      "punt return yards": 0,
      "kickoff returns": 1,
      "kickoff return yards": 10,
      "interception returns": 1,
      "interception return yards": 7,
      "3rd down conversions": 4,
      "3rd down attempts": 9,
      "4th down conversions": 2,
      "4th down attempts": 2
    }
  },
  "Tulane vs UCF": {
    "stadium": "BounceHouse-Orlando-FL",
    "Tulane": {
      "points": 34,
      "1st downs": 21,
      "rushing 1st downs": 8,
      "passing 1st downs": 13,
      "penalty 1st downs": 0,
      "rushing yards": 125,
      "rushing attempts": 38,
      "passing yards": 215,
      "passing attempts": 24,
      "passing completions": 14,
      "passing interceptions": 1,
      "total yards": 340,
      "total plays": 62,
      "fumbles": 2,
      "fumbles lost": 0,
      "penalties": 2,
      "penalty yards": 10,
      "punts": 5,
      "punt yards": 238,
      "punt returns": 1,
      "punt return yards": 54,
      "kickoff returns": 3,
      "kickoff return yards": 67,
      "interception returns": 0,
      "interception return yards": 0,
      "3rd down conversions": 3,
      "3rd down attempts": 9,
      "4th down conversions": 1,
      "4th down attempts": 1
    },
    "UCF": {
      "points": 51,
      "1st downs": 36,
      "rushing 1st downs": 19,
      "passing 1st downs": 17,
      "penalty 1st downs": 0,
      "rushing yards": 267,
      "rushing attempts": 59,
      "passing yards": 422,
      "passing attempts": 40,
      "passing completions": 26,
      "passing interceptions": 0,
      "total yards": 689,
      "total plays": 99,
      "fumbles": 0,
      "fumbles lost": 0,
      "penalties": 4,
      "penalty yards": 20,
      "punts": 1,
      "punt yards": 56,
      "punt returns": 1,
      "punt return yards": 0,
      "kickoff returns": 4,
      "kickoff return yards": 21,
      "interception returns": 1,
      "interception return yards": 0,
      "3rd down conversions": 10,
      "3rd down attempts": 17,
      "4th down conversions": 3,
      "4th down attempts": 4
    }
  },
  "FloridaAtlantic vs Marshall": {
    "stadium": "JoanCEdwardsStadium-Huntington-WV",
    "FloridaAtlantic": {
      "points": 9,
      "1st downs": 17,
      "rushing 1st downs": 7,
      "passing 1st downs": 9,
      "penalty 1st downs": 1,
      "rushing yards": 86,
      "rushing attempts": 37,
      "passing yards": 148,
      "passing attempts": 30,
      "passing completions": 18,
      "passing interceptions": 1,
      "total yards": 234,
      "total plays": 67,
      "fumbles": 0,
      "fumbles lost": 0,
      "penalties": 11,
      "penalty yards": 126,
      "punts": 7,
      "punt yards": 286,
      "punt returns": 4,
      "punt return yards": 34,
      "kickoff returns": 4,
      "kickoff return yards": 83,
      "interception returns": 2,
      "interception return yards": 0,
      "3rd down conversions": 7,
      "3rd down attempts": 17,
      "4th down conversions": 1,
      "4th down attempts": 2
    },
    "Marshall": {
      "points": 20,
      "1st downs": 19,
      "rushing 1st downs": 4,
      "passing 1st downs": 9,
      "penalty 1st downs": 6,
      "rushing yards": 134,
      "rushing attempts": 30,
      "passing yards": 251,
      "passing attempts": 31,
      "passing completions": 18,
      "passing interceptions": 2,
      "total yards": 385,
      "total plays": 61,
      "fumbles": 1,
      "fumbles lost": 0,
      "penalties": 7,
      "penalty yards": 65,
      "punts": 4,
      "punt yards": 162,
      "punt returns": 0,
      "punt return yards": 0,
      "kickoff returns": 1,
      "kickoff return yards": 15,
      "interception returns": 1,
      "interception return yards": 0,
      "3rd down conversions": 5,
      "3rd down attempts": 13,
      "4th down conversions": 0,
      "4th down attempts": 1
    }
  },
  "MiddleTennessee vs Rice": {
    "stadium": "RiceStadium-Houston-TX",
    "MiddleTennessee": {
      "points": 40,
      "1st downs": 22,
      "rushing 1st downs": 9,
      "passing 1st downs": 12,
      "penalty 1st downs": 1,
      "rushing yards": 118,
      "rushing attempts": 39,
      "passing yards": 333,
      "passing attempts": 33,
      "passing completions": 24,
      "passing interceptions": 0,
      "total yards": 451,
      "total plays": 72,
      "fumbles": 1,
      "fumbles lost": 1,
      "penalties": 9,
      "penalty yards": 79,
      "punts": 5,
      "punt yards": 210,
      "punt returns": 2,
      "punt return yards": 8,
      "kickoff returns": 5,
      "kickoff return yards": 100,
      "interception returns": 1,
      "interception return yards": 21,
      "3rd down conversions": 6,
      "3rd down attempts": 14,
      "4th down conversions": 0,
      "4th down attempts": 0
    },
    "Rice": {
      "points": 34,
      "1st downs": 26,
      "rushing 1st downs": 12,
      "passing 1st downs": 12,
      "penalty 1st downs": 2,
      "rushing yards": 183,
      "rushing attempts": 45,
      "passing yards": 242,
      "passing attempts": 35,
      "passing completions": 18,
      "passing interceptions": 1,
      "total yards": 425,
      "total plays": 80,
      "fumbles": 2,
      "fumbles lost": 2,
      "penalties": 5,
      "penalty yards": 30,
      "punts": 3,
      "punt yards": 136,
      "punt returns": 2,
      "punt return yards": 0,
      "kickoff returns": 5,
      "kickoff return yards": 109,
      "interception returns": 0,
      "interception return yards": 0,
      "3rd down conversions": 7,
      "3rd down attempts": 17,
      "4th down conversions": 1,
      "4th down attempts": 2
    }
  },
  "VirginiaTech vs WakeForest": {
    "stadium": "TruistField-WinstonSalem-NC",
    "VirginiaTech": {
      "points": 16,
      "1st downs": 28,
      "rushing 1st downs": 15,
      "passing 1st downs": 9,
      "penalty 1st downs": 4,
      "rushing yards": 210,
      "rushing attempts": 43,
      "passing yards": 223,
      "passing attempts": 35,
      "passing completions": 17,
      "passing interceptions": 3,
      "total yards": 433,
      "total plays": 78,
      "fumbles": 3,
      "fumbles lost": 0,
      "penalties": 10,
      "penalty yards": 112,
      "punts": 2,
      "punt yards": 86,
      "punt returns": 1,
      "punt return yards": -4,
      "kickoff returns": 2,
      "kickoff return yards": 41,
      "interception returns": 0,
      "interception return yards": 0,
      "3rd down conversions": 5,
      "3rd down attempts": 16,
      "4th down conversions": 2,
      "4th down attempts": 2
    },
    "WakeForest": {
      "points": 23,
      "1st downs": 18,
      "rushing 1st downs": 9,
      "passing 1st downs": 5,
      "penalty 1st downs": 4,
      "rushing yards": 236,
      "rushing attempts": 49,
      "passing yards": 110,
      "passing attempts": 17,
      "passing completions": 12,
      "passing interceptions": 0,
      "total yards": 346,
      "total plays": 66,
      "fumbles": 0,
      "fumbles lost": 0,
      "penalties": 6,
      "penalty yards": 79,
      "punts": 5,
      "punt yards": 206,
      "punt returns": 0,
      "punt return yards": 0,
      "kickoff returns": 1,
      "kickoff return yards": 25,
      "interception returns": 3,
      "interception return yards": 0,
      "3rd down conversions": 3,
      "3rd down attempts": 15,
      "4th down conversions": 3,
      "4th down attempts": 3
    }
  },
  "NotreDame vs Pittsburgh": {
    "stadium": "HeinzField-Pittsburgh-PA",
    "NotreDame": {
      "points": 45,
      "1st downs": 28,
      "rushing 1st downs": 11,
      "passing 1st downs": 11,
      "penalty 1st downs": 6,
      "rushing yards": 115,
      "rushing attempts": 50,
      "passing yards": 319,
      "passing attempts": 33,
      "passing completions": 17,
      "passing interceptions": 0,
      "total yards": 434,
      "total plays": 83,
      "fumbles": 1,
      "fumbles lost": 0,
      "penalties": 7,
      "penalty yards": 63,
      "punts": 5,
      "punt yards": 212,
      "punt returns": 3,
      "punt return yards": 32,
      "kickoff returns": 1,
      "kickoff return yards": 17,
      "interception returns": 3,
      "interception return yards": 16,
      "3rd down conversions": 11,
      "3rd down attempts": 18,
      "4th down conversions": 1,
      "4th down attempts": 1
    },
    "Pittsburgh": {
      "points": 3,
      "1st downs": 11,
      "rushing 1st downs": 3,
      "passing 1st downs": 5,
      "penalty 1st downs": 3,
      "rushing yards": 44,
      "rushing attempts": 20,
      "passing yards": 118,
      "passing attempts": 33,
      "passing completions": 12,
      "passing interceptions": 3,
      "total yards": 162,
      "total plays": 53,
      "fumbles": 3,
      "fumbles lost": 0,
      "penalties": 12,
      "penalty yards": 93,
      "punts": 7,
      "punt yards": 267,
      "punt returns": 2,
      "punt return yards": -8,
      "kickoff returns": 4,
      "kickoff return yards": 81,
      "interception returns": 0,
      "interception return yards": 0,
      "3rd down conversions": 3,
      "3rd down attempts": 13,
      "4th down conversions": 0,
      "4th down attempts": 0
    }
  },
  "Baylor vs Texas": {
    "stadium": "DarrellKRoyalTexasMemorialStadium-Austin-TX",
    "Baylor": {
      "points": 16,
      "1st downs": 22,
      "rushing 1st downs": 5,
      "passing 1st downs": 15,
      "penalty 1st downs": 2,
      "rushing yards": 64,
      "rushing attempts": 21,
      "passing yards": 252,
      "passing attempts": 44,
      "passing completions": 31,
      "passing interceptions": 0,
      "total yards": 316,
      "total plays": 65,
      "fumbles": 0,
      "fumbles lost": 0,
      "penalties": 4,
      "penalty yards": 26,
      "punts": 6,
      "punt yards": 249,
      "punt returns": 2,
      "punt return yards": 12,
      "kickoff returns": 2,
      "kickoff return yards": 35,
      "interception returns": 1,
      "interception return yards": 32,
      "3rd down conversions": 5,
      "3rd down attempts": 14,
      "4th down conversions": 0,
      "4th down attempts": 1
    },
    "Texas": {
      "points": 27,
      "1st downs": 19,
      "rushing 1st downs": 9,
      "passing 1st downs": 9,
      "penalty 1st downs": 1,
      "rushing yards": 159,
      "rushing attempts": 47,
      "passing yards": 270,
      "passing attempts": 23,
      "passing completions": 15,
      "passing interceptions": 1,
      "total yards": 429,
      "total plays": 70,
      "fumbles": 0,
      "fumbles lost": 0,
      "penalties": 5,
      "penalty yards": 50,
      "punts": 4,
      "punt yards": 150,
      "punt returns": 0,
      "punt return yards": 0,
      "kickoff returns": 0,
      "kickoff return yards": 0,
      "interception returns": 0,
      "interception return yards": 0,
      "3rd down conversions": 8,
      "3rd down attempts": 16,
      "4th down conversions": 1,
      "4th down attempts": 1
    }
  },
  "IowaState vs OklahomaState": {
    "stadium": "BoonePickensStadium-Stillwater-OK",
    "IowaState": {
      "points": 21,
      "1st downs": 19,
      "rushing 1st downs": 8,
      "passing 1st downs": 10,
      "penalty 1st downs": 1,
      "rushing yards": 227,
      "rushing attempts": 33,
      "passing yards": 162,
      "passing attempts": 34,
      "passing completions": 19,
      "passing interceptions": 1,
      "total yards": 389,
      "total plays": 67,
      "fumbles": 0,
      "fumbles lost": 0,
      "penalties": 9,
      "penalty yards": 70,
      "punts": 8,
      "punt yards": 340,
      "punt returns": 1,
      "punt return yards": 13,
      "kickoff returns": 2,
      "kickoff return yards": 53,
      "interception returns": 2,
      "interception return yards": 0,
      "3rd down conversions": 3,
      "3rd down attempts": 13,
      "4th down conversions": 0,
      "4th down attempts": 0
    },
    "OklahomaState": {
      "points": 24,
      "1st downs": 24,
      "rushing 1st downs": 10,
      "passing 1st downs": 13,
      "penalty 1st downs": 1,
      "rushing yards": 226,
      "rushing attempts": 51,
      "passing yards": 235,
      "passing attempts": 29,
      "passing completions": 20,
      "passing interceptions": 2,
      "total yards": 461,
      "total plays": 80,
      "fumbles": 0,
      "fumbles lost": 0,
      "penalties": 10,
      "penalty yards": 73,
      "punts": 6,
      "punt yards": 235,
      "punt returns": 2,
      "punt return yards": 22,
      "kickoff returns": 1,
      "kickoff return yards": 16,
      "interception returns": 1,
      "interception return yards": 0,
      "3rd down conversions": 6,
      "3rd down attempts": 16,
      "4th down conversions": 1,
      "4th down attempts": 1
    }
  },
  "Houston vs Navy": {
    "stadium": "NavyMarineCorpsMemorialStadium-Annapolis-MD",
    "Houston": {
      "points": 37,
      "1st downs": 23,
      "rushing 1st downs": 8,
      "passing 1st downs": 13,
      "penalty 1st downs": 2,
      "rushing yards": 86,
      "rushing attempts": 31,
      "passing yards": 334,
      "passing attempts": 37,
      "passing completions": 26,
      "passing interceptions": 0,
      "total yards": 420,
      "total plays": 68,
      "fumbles": 1,
      "fumbles lost": 1,
      "penalties": 9,
      "penalty yards": 77,
      "punts": 2,
      "punt yards": 103,
      "punt returns": 1,
      "punt return yards": 20,
      "kickoff returns": 1,
      "kickoff return yards": 14,
      "interception returns": 1,
      "interception return yards": 0,
      "3rd down conversions": 6,
      "3rd down attempts": 13,
      "4th down conversions": 2,
      "4th down attempts": 2
    },
    "Navy": {
      "points": 21,
      "1st downs": 16,
      "rushing 1st downs": 10,
      "passing 1st downs": 5,
      "penalty 1st downs": 1,
      "rushing yards": 166,
      "rushing attempts": 50,
      "passing yards": 206,
      "passing attempts": 18,
      "passing completions": 10,
      "passing interceptions": 1,
      "total yards": 372,
      "total plays": 68,
      "fumbles": 0,
      "fumbles lost": 0,
      "penalties": 6,
      "penalty yards": 55,
      "punts": 4,
      "punt yards": 139,
      "punt returns": 0,
      "punt return yards": 0,
      "kickoff returns": 0,
      "kickoff return yards": 0,
      "interception returns": 0,
      "interception return yards": 0,
      "3rd down conversions": 8,
      "3rd down attempts": 17,
      "4th down conversions": 3,
      "4th down attempts": 3
    }
  },
  "Alabama vs Tennessee": {
    "stadium": "NeylandStadium-Knoxville-TN",
    "Alabama": {
      "points": 48,
      "1st downs": 31,
      "rushing 1st downs": 9,
      "passing 1st downs": 20,
      "penalty 1st downs": 2,
      "rushing yards": 170,
      "rushing attempts": 40,
      "passing yards": 417,
      "passing attempts": 36,
      "passing completions": 28,
      "passing interceptions": 0,
      "total yards": 587,
      "total plays": 76,
      "fumbles": 1,
      "fumbles lost": 1,
      "penalties": 7,
      "penalty yards": 45,
      "punts": 2,
      "punt yards": 69,
      "punt returns": 1,
      "punt return yards": 4,
      "kickoff returns": 1,
      "kickoff return yards": 15,
      "interception returns": 0,
      "interception return yards": 0,
      "3rd down conversions": 7,
      "3rd down attempts": 12,
      "4th down conversions": 0,
      "4th down attempts": 0
    },
    "Tennessee": {
      "points": 17,
      "1st downs": 16,
      "rushing 1st downs": 7,
      "passing 1st downs": 7,
      "penalty 1st downs": 2,
      "rushing yards": 139,
      "rushing attempts": 38,
      "passing yards": 163,
      "passing attempts": 25,
      "passing completions": 14,
      "passing interceptions": 0,
      "total yards": 302,
      "total plays": 63,
      "fumbles": 1,
      "fumbles lost": 1,
      "penalties": 8,
      "penalty yards": 33,
      "punts": 6,
      "punt yards": 275,
      "punt returns": 0,
      "punt return yards": 0,
      "kickoff returns": 2,
      "kickoff return yards": 33,
      "interception returns": 0,
      "interception return yards": 0,
      "3rd down conversions": 4,
      "3rd down attempts": 16,
      "4th down conversions": 2,
      "4th down attempts": 4
    }
  },
  "Iowa vs Purdue": {
    "stadium": "RossAdeStadium-WestLafayette-IN",
    "Iowa": {
      "points": 20,
      "1st downs": 19,
      "rushing 1st downs": 9,
      "passing 1st downs": 10,
      "penalty 1st downs": 0,
      "rushing yards": 195,
      "rushing attempts": 36,
      "passing yards": 265,
      "passing attempts": 39,
      "passing completions": 22,
      "passing interceptions": 0,
      "total yards": 460,
      "total plays": 75,
      "fumbles": 3,
      "fumbles lost": 2,
      "penalties": 10,
      "penalty yards": 100,
      "punts": 6,
      "punt yards": 265,
      "punt returns": 3,
      "punt return yards": 37,
      "kickoff returns": 3,
      "kickoff return yards": 65,
      "interception returns": 2,
      "interception return yards": 16,
      "3rd down conversions": 4,
      "3rd down attempts": 13,
      "4th down conversions": 1,
      "4th down attempts": 2
    },
    "Purdue": {
      "points": 24,
      "1st downs": 24,
      "rushing 1st downs": 7,
      "passing 1st downs": 14,
      "penalty 1st downs": 3,
      "rushing yards": 104,
      "rushing attempts": 27,
      "passing yards": 282,
      "passing attempts": 50,
      "passing completions": 31,
      "passing interceptions": 2,
      "total yards": 386,
      "total plays": 77,
      "fumbles": 0,
      "fumbles lost": 0,
      "penalties": 3,
      "penalty yards": 21,
      "punts": 6,
      "punt yards": 285,
      "punt returns": 0,
      "punt return yards": 0,
      "kickoff returns": 2,
      "kickoff return yards": 33,
      "interception returns": 0,
      "interception return yards": 0,
      "3rd down conversions": 6,
      "3rd down attempts": 16,
      "4th down conversions": 1,
      "4th down attempts": 1
    }
  },
  "PennState vs Indiana": {
    "stadium": "MemorialStadiumBloomington-IN-Bloomington",
    "PennState": {
      "points": 35,
      "1st downs": 27,
      "rushing 1st downs": 13,
      "passing 1st downs": 12,
      "penalty 1st downs": 2,
      "rushing yards": 250,
      "rushing attempts": 52,
      "passing yards": 238,
      "passing attempts": 35,
      "passing completions": 24,
      "passing interceptions": 2,
      "total yards": 488,
      "total plays": 87,
      "fumbles": 1,
      "fumbles lost": 1,
      "penalties": 10,
      "penalty yards": 100,
      "punts": 3,
      "punt yards": 119,
      "punt returns": 0,
      "punt return yards": 0,
      "kickoff returns": 3,
      "kickoff return yards": 33,
      "interception returns": 1,
      "interception return yards": 0,
      "3rd down conversions": 9,
      "3rd down attempts": 17,
      "4th down conversions": 1,
      "4th down attempts": 2
    },
    "Indiana": {
      "points": 36,
      "1st downs": 16,
      "rushing 1st downs": 5,
      "passing 1st downs": 9,
      "penalty 1st downs": 2,
      "rushing yards": 41,
      "rushing attempts": 26,
      "passing yards": 170,
      "passing attempts": 36,
      "passing completions": 19,
      "passing interceptions": 1,
      "total yards": 211,
      "total plays": 62,
      "fumbles": 1,
      "fumbles lost": 1,
      "penalties": 4,
      "penalty yards": 36,
      "punts": 5,
      "punt yards": 214,
      "punt returns": 1,
      "punt return yards": 21,
      "kickoff returns": 0,
      "kickoff return yards": 0,
      "interception returns": 2,
      "interception return yards": 31,
      "3rd down conversions": 4,
      "3rd down attempts": 12,
      "4th down conversions": 0,
      "4th down attempts": 1
    }
  },
  "GeorgiaState vs Troy": {
    "stadium": "VeteransMemorialStadium-Troy-AL",
    "GeorgiaState": {
      "points": 36,
      "1st downs": 23,
      "rushing 1st downs": 10,
      "passing 1st downs": 10,
      "penalty 1st downs": 3,
      "rushing yards": 210,
      "rushing attempts": 56,
      "passing yards": 169,
      "passing attempts": 30,
      "passing completions": 20,
      "passing interceptions": 1,
      "total yards": 379,
      "total plays": 86,
      "fumbles": 2,
      "fumbles lost": 2,
      "penalties": 6,
      "penalty yards": 76,
      "punts": 4,
      "punt yards": 148,
      "punt returns": 0,
      "punt return yards": 0,
      "kickoff returns": 0,
      "kickoff return yards": 0,
      "interception returns": 2,
      "interception return yards": 59,
      "3rd down conversions": 8,
      "3rd down attempts": 19,
      "4th down conversions": 2,
      "4th down attempts": 2
    },
    "Troy": {
      "points": 34,
      "1st downs": 23,
      "rushing 1st downs": 3,
      "passing 1st downs": 17,
      "penalty 1st downs": 3,
      "rushing yards": 40,
      "rushing attempts": 19,
      "passing yards": 407,
      "passing attempts": 48,
      "passing completions": 32,
      "passing interceptions": 2,
      "total yards": 447,
      "total plays": 67,
      "fumbles": 2,
      "fumbles lost": 2,
      "penalties": 7,
      "penalty yards": 61,
      "punts": 4,
      "punt yards": 163,
      "punt returns": 1,
      "punt return yards": 5,
      "kickoff returns": 7,
      "kickoff return yards": 142,
      "interception returns": 1,
      "interception return yards": 35,
      "3rd down conversions": 3,
      "3rd down attempts": 10,
      "4th down conversions": 1,
      "4th down attempts": 2
    }
  },
  "GeorgiaTech vs BostonCollege": {
    "stadium": "AlumniStadium-ChestnutHill-MA",
    "GeorgiaTech": {
      "points": 27,
      "1st downs": 19,
      "rushing 1st downs": 3,
      "passing 1st downs": 11,
      "penalty 1st downs": 5,
      "rushing yards": 106,
      "rushing attempts": 33,
      "passing yards": 256,
      "passing attempts": 32,
      "passing completions": 18,
      "passing interceptions": 1,
      "total yards": 362,
      "total plays": 65,
      "fumbles": 2,
      "fumbles lost": 2,
      "penalties": 10,
      "penalty yards": 62,
      "punts": 4,
      "punt yards": 204,
      "punt returns": 0,
      "punt return yards": 0,
      "kickoff returns": 5,
      "kickoff return yards": 102,
      "interception returns": 0,
      "interception return yards": 0,
      "3rd down conversions": 2,
      "3rd down attempts": 12,
      "4th down conversions": 2,
      "4th down attempts": 4
    },
    "BostonCollege": {
      "points": 48,
      "1st downs": 23,
      "rushing 1st downs": 13,
      "passing 1st downs": 7,
      "penalty 1st downs": 3,
      "rushing yards": 264,
      "rushing attempts": 44,
      "passing yards": 145,
      "passing attempts": 21,
      "passing completions": 13,
      "passing interceptions": 0,
      "total yards": 409,
      "total plays": 65,
      "fumbles": 0,
      "fumbles lost": 0,
      "penalties": 10,
      "penalty yards": 102,
      "punts": 3,
      "punt yards": 128,
      "punt returns": 0,
      "punt return yards": 0,
      "kickoff returns": 1,
      "kickoff return yards": 0,
      "interception returns": 1,
      "interception return yards": 0,
      "3rd down conversions": 3,
      "3rd down attempts": 9,
      "4th down conversions": 0,
      "4th down attempts": 0
    }
  },
  "FCS vs WesternKentucky": {
    "stadium": "HouchensIndustriesLTSmithStadium-BowlingGreen-KY",
    "FCS": {
      "points": 10,
      "1st downs": 13,
      "rushing 1st downs": 10,
      "passing 1st downs": 3,
      "penalty 1st downs": 0,
      "rushing yards": 135,
      "rushing attempts": 42,
      "passing yards": 90,
      "passing attempts": 23,
      "passing completions": 9,
      "passing interceptions": 0,
      "total yards": 225,
      "total plays": 65,
      "fumbles": 1,
      "fumbles lost": 0,
      "penalties": 4,
      "penalty yards": 34,
      "punts": 4,
      "punt yards": 152,
      "punt returns": 0,
      "punt return yards": 0,
      "kickoff returns": 0,
      "kickoff return yards": 0,
      "interception returns": 0,
      "interception return yards": 0,
      "3rd down conversions": 5,
      "3rd down attempts": 15,
      "4th down conversions": 2,
      "4th down attempts": 5
    },
    "WesternKentucky": {
      "points": 13,
      "1st downs": 14,
      "rushing 1st downs": 6,
      "passing 1st downs": 7,
      "penalty 1st downs": 1,
      "rushing yards": 122,
      "rushing attempts": 33,
      "passing yards": 132,
      "passing attempts": 25,
      "passing completions": 16,
      "passing interceptions": 0,
      "total yards": 254,
      "total plays": 58,
      "fumbles": 2,
      "fumbles lost": 2,
      "penalties": 3,
      "penalty yards": 25,
      "punts": 3,
      "punt yards": 141,
      "punt returns": 1,
      "punt return yards": -3,
      "kickoff returns": 3,
      "kickoff return yards": 34,
      "interception returns": 0,
      "interception return yards": 0,
      "3rd down conversions": 3,
      "3rd down attempts": 12,
      "4th down conversions": 3,
      "4th down attempts": 4
    }
  },
  "Kentucky vs Missouri": {
    "stadium": "FaurotFieldatMemorialStadium-Columbia-MO",
    "Kentucky": {
      "points": 10,
      "1st downs": 8,
      "rushing 1st downs": 5,
      "passing 1st downs": 1,
      "penalty 1st downs": 2,
      "rushing yards": 98,
      "rushing attempts": 23,
      "passing yards": 47,
      "passing attempts": 13,
      "passing completions": 4,
      "passing interceptions": 0,
      "total yards": 145,
      "total plays": 36,
      "fumbles": 2,
      "fumbles lost": 1,
      "penalties": 1,
      "penalty yards": 10,
      "punts": 6,
      "punt yards": 264,
      "punt returns": 0,
      "punt return yards": 0,
      "kickoff returns": 0,
      "kickoff return yards": 0,
      "interception returns": 0,
      "interception return yards": 0,
      "3rd down conversions": 2,
      "3rd down attempts": 9,
      "4th down conversions": 0,
      "4th down attempts": 0
    },
    "Missouri": {
      "points": 20,
      "1st downs": 26,
      "rushing 1st downs": 13,
      "passing 1st downs": 12,
      "penalty 1st downs": 1,
      "rushing yards": 220,
      "rushing attempts": 62,
      "passing yards": 201,
      "passing attempts": 30,
      "passing completions": 21,
      "passing interceptions": 0,
      "total yards": 421,
      "total plays": 92,
      "fumbles": 0,
      "fumbles lost": 0,
      "penalties": 6,
      "penalty yards": 54,
      "punts": 4,
      "punt yards": 154,
      "punt returns": 0,
      "punt return yards": 0,
      "kickoff returns": 0,
      "kickoff return yards": 0,
      "interception returns": 0,
      "interception return yards": 0,
      "3rd down conversions": 10,
      "3rd down attempts": 20,
      "4th down conversions": 4,
      "4th down attempts": 5
    }
  },
  "WestVirginia vs TexasTech": {
    "stadium": "JonesATTStadium-Lubbock-TX",
    "WestVirginia": {
      "points": 27,
      "1st downs": 22,
      "rushing 1st downs": 7,
      "passing 1st downs": 14,
      "penalty 1st downs": 1,
      "rushing yards": 91,
      "rushing attempts": 29,
      "passing yards": 347,
      "passing attempts": 50,
      "passing completions": 32,
      "passing interceptions": 0,
      "total yards": 438,
      "total plays": 79,
      "fumbles": 1,
      "fumbles lost": 1,
      "penalties": 7,
      "penalty yards": 69,
      "punts": 5,
      "punt yards": 210,
      "punt returns": 0,
      "punt return yards": 0,
      "kickoff returns": 1,
      "kickoff return yards": 24,
      "interception returns": 0,
      "interception return yards": 0,
      "3rd down conversions": 4,
      "3rd down attempts": 16,
      "4th down conversions": 4,
      "4th down attempts": 5
    },
    "TexasTech": {
      "points": 34,
      "1st downs": 18,
      "rushing 1st downs": 7,
      "passing 1st downs": 8,
      "penalty 1st downs": 3,
      "rushing yards": 179,
      "rushing attempts": 39,
      "passing yards": 169,
      "passing attempts": 28,
      "passing completions": 22,
      "passing interceptions": 0,
      "total yards": 348,
      "total plays": 67,
      "fumbles": 1,
      "fumbles lost": 1,
      "penalties": 3,
      "penalty yards": 19,
      "punts": 5,
      "punt yards": 267,
      "punt returns": 2,
      "punt return yards": 9,
      "kickoff returns": 4,
      "kickoff return yards": 59,
      "interception returns": 0,
      "interception return yards": 0,
      "3rd down conversions": 8,
      "3rd down attempts": 16,
      "4th down conversions": 2,
      "4th down attempts": 3
    }
  },
  "FCS vs SouthAlabama": {
    "stadium": "HancockWhitneyStadium-Mobile-AL",
    "FCS": {
      "points": 14,
      "1st downs": 20,
      "rushing 1st downs": 5,
      "passing 1st downs": 13,
      "penalty 1st downs": 2,
      "rushing yards": 98,
      "rushing attempts": 28,
      "passing yards": 282,
      "passing attempts": 33,
      "passing completions": 22,
      "passing interceptions": 1,
      "total yards": 380,
      "total plays": 61,
      "fumbles": 2,
      "fumbles lost": 1,
      "penalties": 2,
      "penalty yards": 30,
      "punts": 3,
      "punt yards": 141,
      "punt returns": 0,
      "punt return yards": 0,
      "kickoff returns": 1,
      "kickoff return yards": 25,
      "interception returns": 1,
      "interception return yards": 5,
      "3rd down conversions": 3,
      "3rd down attempts": 10,
      "4th down conversions": 1,
      "4th down attempts": 3
    },
    "SouthAlabama": {
      "points": 38,
      "1st downs": 20,
      "rushing 1st downs": 11,
      "passing 1st downs": 7,
      "penalty 1st downs": 2,
      "rushing yards": 169,
      "rushing attempts": 44,
      "passing yards": 246,
      "passing attempts": 17,
      "passing completions": 11,
      "passing interceptions": 1,
      "total yards": 415,
      "total plays": 61,
      "fumbles": 0,
      "fumbles lost": 0,
      "penalties": 4,
      "penalty yards": 37,
      "punts": 2,
      "punt yards": 89,
      "punt returns": 1,
      "punt return yards": 0,
      "kickoff returns": 2,
      "kickoff return yards": 30,
      "interception returns": 1,
      "interception return yards": 95,
      "3rd down conversions": 8,
      "3rd down attempts": 14,
      "4th down conversions": 3,
      "4th down attempts": 3
    }
  },
  "SouthCarolina vs LSU": {
    "stadium": "TigerStadium-BatonRouge-LA",
    "SouthCarolina": {
      "points": 24,
      "1st downs": 17,
      "rushing 1st downs": 6,
      "passing 1st downs": 9,
      "penalty 1st downs": 2,
      "rushing yards": 169,
      "rushing attempts": 29,
      "passing yards": 234,
      "passing attempts": 22,
      "passing completions": 12,
      "passing interceptions": 1,
      "total yards": 403,
      "total plays": 51,
      "fumbles": 0,
      "fumbles lost": 0,
      "penalties": 7,
      "penalty yards": 55,
      "punts": 1,
      "punt yards": 50,
      "punt returns": 0,
      "punt return yards": 0,
      "kickoff returns": 1,
      "kickoff return yards": 17,
      "interception returns": 1,
      "interception return yards": 56,
      "3rd down conversions": 3,
      "3rd down attempts": 10,
      "4th down conversions": 1,
      "4th down attempts": 2
    },
    "LSU": {
      "points": 52,
      "1st downs": 29,
      "rushing 1st downs": 14,
      "passing 1st downs": 13,
      "penalty 1st downs": 2,
      "rushing yards": 276,
      "rushing attempts": 54,
      "passing yards": 265,
      "passing attempts": 21,
      "passing completions": 17,
      "passing interceptions": 1,
      "total yards": 541,
      "total plays": 75,
      "fumbles": 1,
      "fumbles lost": 0,
      "penalties": 10,
      "penalty yards": 79,
      "punts": 0,
      "punt yards": 0,
      "punt returns": 0,
      "punt return yards": 0,
      "kickoff returns": 2,
      "kickoff return yards": 118,
      "interception returns": 1,
      "interception return yards": 45,
      "3rd down conversions": 8,
      "3rd down attempts": 10,
      "4th down conversions": 1,
      "4th down attempts": 1
    }
  },
  "UtahState vs BoiseState": {
    "stadium": "AlbertsonsStadium-Boise-ID",
    "UtahState": {
      "points": 13,
      "1st downs": 12,
      "rushing 1st downs": 6,
      "passing 1st downs": 6,
      "penalty 1st downs": 0,
      "rushing yards": 111,
      "rushing attempts": 43,
      "passing yards": 92,
      "passing attempts": 27,
      "passing completions": 14,
      "passing interceptions": 1,
      "total yards": 203,
      "total plays": 70,
      "fumbles": 2,
      "fumbles lost": 0,
      "penalties": 3,
      "penalty yards": 20,
      "punts": 7,
      "punt yards": 240,
      "punt returns": 0,
      "punt return yards": 0,
      "kickoff returns": 3,
      "kickoff return yards": 60,
      "interception returns": 0,
      "interception return yards": 0,
      "3rd down conversions": 8,
      "3rd down attempts": 20,
      "4th down conversions": 3,
      "4th down attempts": 4
    },
    "BoiseState": {
      "points": 42,
      "1st downs": 25,
      "rushing 1st downs": 10,
      "passing 1st downs": 15,
      "penalty 1st downs": 0,
      "rushing yards": 171,
      "rushing attempts": 35,
      "passing yards": 279,
      "passing attempts": 32,
      "passing completions": 22,
      "passing interceptions": 0,
      "total yards": 450,
      "total plays": 67,
      "fumbles": 0,
      "fumbles lost": 0,
      "penalties": 2,
      "penalty yards": 14,
      "punts": 5,
      "punt yards": 138,
      "punt returns": 1,
      "punt return yards": 2,
      "kickoff returns": 3,
      "kickoff return yards": 49,
      "interception returns": 1,
      "interception return yards": 12,
      "3rd down conversions": 5,
      "3rd down attempts": 11,
      "4th down conversions": 1,
      "4th down attempts": 1
    }
  },
  "Wyoming vs Nevada": {
    "stadium": "MackayStadium-Reno-NV",
    "Wyoming": {
      "points": 34,
      "1st downs": 19,
      "rushing 1st downs": 8,
      "passing 1st downs": 8,
      "penalty 1st downs": 3,
      "rushing yards": 128,
      "rushing attempts": 35,
      "passing yards": 233,
      "passing attempts": 32,
      "passing completions": 17,
      "passing interceptions": 1,
      "total yards": 361,
      "total plays": 67,
      "fumbles": 0,
      "fumbles lost": 0,
      "penalties": 2,
      "penalty yards": 6,
      "punts": 6,
      "punt yards": 244,
      "punt returns": 1,
      "punt return yards": 14,
      "kickoff returns": 2,
      "kickoff return yards": 36,
      "interception returns": 0,
      "interception return yards": 0,
      "3rd down conversions": 3,
      "3rd down attempts": 16,
      "4th down conversions": 1,
      "4th down attempts": 1
    },
    "Nevada": {
      "points": 37,
      "1st downs": 25,
      "rushing 1st downs": 6,
      "passing 1st downs": 18,
      "penalty 1st downs": 1,
      "rushing yards": 76,
      "rushing attempts": 27,
      "passing yards": 420,
      "passing attempts": 52,
      "passing completions": 39,
      "passing interceptions": 0,
      "total yards": 496,
      "total plays": 79,
      "fumbles": 2,
      "fumbles lost": 2,
      "penalties": 12,
      "penalty yards": 101,
      "punts": 5,
      "punt yards": 277,
      "punt returns": 0,
      "punt return yards": 0,
      "kickoff returns": 6,
      "kickoff return yards": 116,
      "interception returns": 1,
      "interception return yards": 0,
      "3rd down conversions": 5,
      "3rd down attempts": 13,
      "4th down conversions": 0,
      "4th down attempts": 1
    }
  },
  "Michigan vs Minnesota": {
    "stadium": "TCFBankStadium-Minneapolis-MN",
    "Michigan": {
      "points": 49,
      "1st downs": 18,
      "rushing 1st downs": 6,
      "passing 1st downs": 11,
      "penalty 1st downs": 1,
      "rushing yards": 256,
      "rushing attempts": 31,
      "passing yards": 225,
      "passing attempts": 25,
      "passing completions": 15,
      "passing interceptions": 0,
      "total yards": 481,
      "total plays": 56,
      "fumbles": 1,
      "fumbles lost": 0,
      "penalties": 7,
      "penalty yards": 80,
      "punts": 0,
      "punt yards": 0,
      "punt returns": 0,
      "punt return yards": 0,
      "kickoff returns": 4,
      "kickoff return yards": 66,
      "interception returns": 1,
      "interception return yards": 18,
      "3rd down conversions": 4,
      "3rd down attempts": 8,
      "4th down conversions": 0,
      "4th down attempts": 1
    },
    "Minnesota": {
      "points": 24,
      "1st downs": 21,
      "rushing 1st downs": 11,
      "passing 1st downs": 8,
      "penalty 1st downs": 2,
      "rushing yards": 129,
      "rushing attempts": 41,
      "passing yards": 197,
      "passing attempts": 31,
      "passing completions": 18,
      "passing interceptions": 1,
      "total yards": 326,
      "total plays": 72,
      "fumbles": 1,
      "fumbles lost": 1,
      "penalties": 5,
      "penalty yards": 39,
      "punts": 4,
      "punt yards": 140,
      "punt returns": 1,
      "punt return yards": 17,
      "kickoff returns": 3,
      "kickoff return yards": 58,
      "interception returns": 0,
      "interception return yards": 0,
      "3rd down conversions": 6,
      "3rd down attempts": 14,
      "4th down conversions": 1,
      "4th down attempts": 3
    }
  },
  "Maryland vs Northwestern": {
    "stadium": "RyanField-Evanston-IL",
    "Maryland": {
      "points": 3,
      "1st downs": 14,
      "rushing 1st downs": 4,
      "passing 1st downs": 9,
      "penalty 1st downs": 1,
      "rushing yards": 64,
      "rushing attempts": 20,
      "passing yards": 143,
      "passing attempts": 29,
      "passing completions": 18,
      "passing interceptions": 3,
      "total yards": 207,
      "total plays": 49,
      "fumbles": 1,
      "fumbles lost": 1,
      "penalties": 6,
      "penalty yards": 60,
      "punts": 5,
      "punt yards": 198,
      "punt returns": 1,
      "punt return yards": 5,
      "kickoff returns": 8,
      "kickoff return yards": 149,
      "interception returns": 0,
      "interception return yards": 0,
      "3rd down conversions": 4,
      "3rd down attempts": 11,
      "4th down conversions": 0,
      "4th down attempts": 0
    },
    "Northwestern": {
      "points": 43,
      "1st downs": 31,
      "rushing 1st downs": 17,
      "passing 1st downs": 13,
      "penalty 1st downs": 1,
      "rushing yards": 325,
      "rushing attempts": 53,
      "passing yards": 212,
      "passing attempts": 30,
      "passing completions": 23,
      "passing interceptions": 0,
      "total yards": 537,
      "total plays": 83,
      "fumbles": 0,
      "fumbles lost": 0,
      "penalties": 5,
      "penalty yards": 48,
      "punts": 3,
      "punt yards": 125,
      "punt returns": 1,
      "punt return yards": 1,
      "kickoff returns": 0,
      "kickoff return yards": 0,
      "interception returns": 3,
      "interception return yards": 0,
      "3rd down conversions": 8,
      "3rd down attempts": 16,
      "4th down conversions": 3,
      "4th down attempts": 3
    }
  },
  "Hawaii vs FresnoState": {
    "stadium": "BulldogStadiumatJimSweeneyField-Fresno-CA",
    "Hawaii": {
      "points": 34,
      "1st downs": 27,
      "rushing 1st downs": 16,
      "passing 1st downs": 10,
      "penalty 1st downs": 1,
      "rushing yards": 323,
      "rushing attempts": 53,
      "passing yards": 229,
      "passing attempts": 30,
      "passing completions": 20,
      "passing interceptions": 0,
      "total yards": 552,
      "total plays": 83,
      "fumbles": 3,
      "fumbles lost": 1,
      "penalties": 7,
      "penalty yards": 44,
      "punts": 2,
      "punt yards": 99,
      "punt returns": 0,
      "punt return yards": 0,
      "kickoff returns": 5,
      "kickoff return yards": 92,
      "interception returns": 3,
      "interception return yards": 5,
      "3rd down conversions": 11,
      "3rd down attempts": 16,
      "4th down conversions": 0,
      "4th down attempts": 0
    },
    "FresnoState": {
      "points": 19,
      "1st downs": 22,
      "rushing 1st downs": 9,
      "passing 1st downs": 11,
      "penalty 1st downs": 2,
      "rushing yards": 120,
      "rushing attempts": 37,
      "passing yards": 289,
      "passing attempts": 31,
      "passing completions": 17,
      "passing interceptions": 3,
      "total yards": 409,
      "total plays": 68,
      "fumbles": 1,
      "fumbles lost": 1,
      "penalties": 7,
      "penalty yards": 50,
      "punts": 2,
      "punt yards": 63,
      "punt returns": 2,
      "punt return yards": 37,
      "kickoff returns": 1,
      "kickoff return yards": 14,
      "interception returns": 0,
      "interception return yards": 0,
      "3rd down conversions": 5,
      "3rd down attempts": 12,
      "4th down conversions": 0,
      "4th down attempts": 1
    }
  },
  "LouisianaTech vs UTSA": {
    "stadium": "Alamodome-SanAntonio-TX",
    "LouisianaTech": {
      "points": 26,
      "1st downs": 15,
      "rushing 1st downs": 5,
      "passing 1st downs": 8,
      "penalty 1st downs": 2,
      "rushing yards": 78,
      "rushing attempts": 27,
      "passing yards": 169,
      "passing attempts": 39,
      "passing completions": 25,
      "passing interceptions": 1,
      "total yards": 247,
      "total plays": 66,
      "fumbles": 3,
      "fumbles lost": 1,
      "penalties": 4,
      "penalty yards": 55,
      "punts": 5,
      "punt yards": 181,
      "punt returns": 2,
      "punt return yards": 38,
      "kickoff returns": 5,
      "kickoff return yards": 121,
      "interception returns": 2,
      "interception return yards": 70,
      "3rd down conversions": 6,
      "3rd down attempts": 16,
      "4th down conversions": 1,
      "4th down attempts": 1
    },
    "UTSA": {
      "points": 27,
      "1st downs": 25,
      "rushing 1st downs": 11,
      "passing 1st downs": 10,
      "penalty 1st downs": 4,
      "rushing yards": 188,
      "rushing attempts": 53,
      "passing yards": 197,
      "passing attempts": 34,
      "passing completions": 19,
      "passing interceptions": 2,
      "total yards": 385,
      "total plays": 87,
      "fumbles": 1,
      "fumbles lost": 0,
      "penalties": 6,
      "penalty yards": 44,
      "punts": 4,
      "punt yards": 186,
      "punt returns": 4,
      "punt return yards": -1,
      "kickoff returns": 2,
      "kickoff return yards": 9,
      "interception returns": 1,
      "interception return yards": 3,
      "3rd down conversions": 6,
      "3rd down attempts": 18,
      "4th down conversions": 4,
      "4th down attempts": 4
    }
  },
  "Virginia vs MiamiFL": {
    "stadium": "HardRockStadium-MiamiGardens-FL",
    "Virginia": {
      "points": 14,
      "1st downs": 18,
      "rushing 1st downs": 11,
      "passing 1st downs": 6,
      "penalty 1st downs": 1,
      "rushing yards": 185,
      "rushing attempts": 35,
      "passing yards": 181,
      "passing attempts": 32,
      "passing completions": 16,
      "passing interceptions": 0,
      "total yards": 366,
      "total plays": 67,
      "fumbles": 1,
      "fumbles lost": 1,
      "penalties": 6,
      "penalty yards": 48,
      "punts": 5,
      "punt yards": 231,
      "punt returns": 1,
      "punt return yards": 19,
      "kickoff returns": 3,
      "kickoff return yards": 76,
      "interception returns": 0,
      "interception return yards": 0,
      "3rd down conversions": 7,
      "3rd down attempts": 16,
      "4th down conversions": 2,
      "4th down attempts": 3
    },
    "MiamiFL": {
      "points": 19,
      "1st downs": 23,
      "rushing 1st downs": 8,
      "passing 1st downs": 13,
      "penalty 1st downs": 2,
      "rushing yards": 122,
      "rushing attempts": 48,
      "passing yards": 322,
      "passing attempts": 30,
      "passing completions": 21,
      "passing interceptions": 0,
      "total yards": 444,
      "total plays": 78,
      "fumbles": 1,
      "fumbles lost": 0,
      "penalties": 6,
      "penalty yards": 38,
      "punts": 5,
      "punt yards": 216,
      "punt returns": 0,
      "punt return yards": 0,
      "kickoff returns": 2,
      "kickoff return yards": 26,
      "interception returns": 0,
      "interception return yards": 0,
      "3rd down conversions": 8,
      "3rd down attempts": 17,
      "4th down conversions": 1,
      "4th down attempts": 1
    }
  },
  "Cincinnati vs SouthernMethodist": {
    "stadium": "GeraldJFordStadium-Dallas-TX",
    "Cincinnati": {
      "points": 42,
      "1st downs": 17,
      "rushing 1st downs": 10,
      "passing 1st downs": 7,
      "penalty 1st downs": 0,
      "rushing yards": 313,
      "rushing attempts": 35,
      "passing yards": 126,
      "passing attempts": 21,
      "passing completions": 13,
      "passing interceptions": 0,
      "total yards": 439,
      "total plays": 56,
      "fumbles": 3,
      "fumbles lost": 2,
      "penalties": 12,
      "penalty yards": 126,
      "punts": 5,
      "punt yards": 229,
      "punt returns": 0,
      "punt return yards": 0,
      "kickoff returns": 2,
      "kickoff return yards": 43,
      "interception returns": 1,
      "interception return yards": -2,
      "3rd down conversions": 7,
      "3rd down attempts": 13,
      "4th down conversions": 1,
      "4th down attempts": 1
    },
    "SouthernMethodist": {
      "points": 13,
      "1st downs": 22,
      "rushing 1st downs": 5,
      "passing 1st downs": 11,
      "penalty 1st downs": 6,
      "rushing yards": 75,
      "rushing attempts": 39,
      "passing yards": 215,
      "passing attempts": 46,
      "passing completions": 24,
      "passing interceptions": 1,
      "total yards": 290,
      "total plays": 85,
      "fumbles": 1,
      "fumbles lost": 0,
      "penalties": 6,
      "penalty yards": 60,
      "punts": 5,
      "punt yards": 196,
      "punt returns": 2,
      "punt return yards": 18,
      "kickoff returns": 4,
      "kickoff return yards": 85,
      "interception returns": 0,
      "interception return yards": 0,
      "3rd down conversions": 7,
      "3rd down attempts": 20,
      "4th down conversions": 1,
      "4th down attempts": 5
    }
  },
  "TexasState vs BrighamYoung": {
    "stadium": "LaVellEdwardsStadium-Provo-UT",
    "TexasState": {
      "points": 14,
      "1st downs": 15,
      "rushing 1st downs": 5,
      "passing 1st downs": 8,
      "penalty 1st downs": 2,
      "rushing yards": 117,
      "rushing attempts": 26,
      "passing yards": 150,
      "passing attempts": 31,
      "passing completions": 17,
      "passing interceptions": 2,
      "total yards": 267,
      "total plays": 57,
      "fumbles": 0,
      "fumbles lost": 0,
      "penalties": 6,
      "penalty yards": 55,
      "punts": 6,
      "punt yards": 237,
      "punt returns": 1,
      "punt return yards": 4,
      "kickoff returns": 1,
      "kickoff return yards": 1,
      "interception returns": 1,
      "interception return yards": 5,
      "3rd down conversions": 2,
      "3rd down attempts": 11,
      "4th down conversions": 0,
      "4th down attempts": 1
    },
    "BrighamYoung": {
      "points": 52,
      "1st downs": 30,
      "rushing 1st downs": 11,
      "passing 1st downs": 17,
      "penalty 1st downs": 2,
      "rushing yards": 227,
      "rushing attempts": 40,
      "passing yards": 352,
      "passing attempts": 36,
      "passing completions": 25,
      "passing interceptions": 1,
      "total yards": 579,
      "total plays": 76,
      "fumbles": 1,
      "fumbles lost": 1,
      "penalties": 3,
      "penalty yards": 33,
      "punts": 2,
      "punt yards": 99,
      "punt returns": 1,
      "punt return yards": 11,
      "kickoff returns": 1,
      "kickoff return yards": 14,
      "interception returns": 2,
      "interception return yards": 37,
      "3rd down conversions": 9,
      "3rd down attempts": 15,
      "4th down conversions": 2,
      "4th down attempts": 2
    }
  },
  "AirForce vs SanJoseState": {
    "stadium": "CEFCUStadium-SanJose-CA",
    "AirForce": {
      "points": 6,
      "1st downs": 17,
      "rushing 1st downs": 14,
      "passing 1st downs": 3,
      "penalty 1st downs": 0,
      "rushing yards": 206,
      "rushing attempts": 49,
      "passing yards": 92,
      "passing attempts": 17,
      "passing completions": 9,
      "passing interceptions": 0,
      "total yards": 298,
      "total plays": 66,
      "fumbles": 2,
      "fumbles lost": 2,
      "penalties": 4,
      "penalty yards": 55,
      "punts": 5,
      "punt yards": 185,
      "punt returns": 0,
      "punt return yards": 0,
      "kickoff returns": 1,
      "kickoff return yards": 32,
      "interception returns": 1,
      "interception return yards": 0,
      "3rd down conversions": 9,
      "3rd down attempts": 16,
      "4th down conversions": 1,
      "4th down attempts": 2
    },
    "SanJoseState": {
      "points": 17,
      "1st downs": 19,
      "rushing 1st downs": 2,
      "passing 1st downs": 13,
      "penalty 1st downs": 4,
      "rushing yards": 68,
      "rushing attempts": 30,
      "passing yards": 226,
      "passing attempts": 29,
      "passing completions": 22,
      "passing interceptions": 1,
      "total yards": 294,
      "total plays": 59,
      "fumbles": 0,
      "fumbles lost": 0,
      "penalties": 6,
      "penalty yards": 45,
      "punts": 4,
      "punt yards": 147,
      "punt returns": 1,
      "punt return yards": 2,
      "kickoff returns": 2,
      "kickoff return yards": 35,
      "interception returns": 0,
      "interception return yards": 0,
      "3rd down conversions": 5,
      "3rd down attempts": 12,
      "4th down conversions": 0,
      "4th down attempts": 1
    }
  },
  "UNLV vs SanDiegoState": {
    "stadium": "SanDiegoCountyCreditUnionStadium-SanDiego-CA",
    "UNLV": {
      "points": 6,
      "1st downs": 11,
      "rushing 1st downs": 7,
      "passing 1st downs": 4,
      "penalty 1st downs": 0,
      "rushing yards": 80,
      "rushing attempts": 35,
      "passing yards": 106,
      "passing attempts": 29,
      "passing completions": 17,
      "passing interceptions": 0,
      "total yards": 186,
      "total plays": 64,
      "fumbles": 1,
      "fumbles lost": 1,
      "penalties": 6,
      "penalty yards": 40,
      "punts": 8,
      "punt yards": 349,
      "punt returns": 2,
      "punt return yards": 14,
      "kickoff returns": 3,
      "kickoff return yards": 83,
      "interception returns": 0,
      "interception return yards": 0,
      "3rd down conversions": 1,
      "3rd down attempts": 15,
      "4th down conversions": 3,
      "4th down attempts": 4
    },
    "SanDiegoState": {
      "points": 34,
      "1st downs": 21,
      "rushing 1st downs": 13,
      "passing 1st downs": 6,
      "penalty 1st downs": 2,
      "rushing yards": 287,
      "rushing attempts": 46,
      "passing yards": 137,
      "passing attempts": 25,
      "passing completions": 12,
      "passing interceptions": 0,
      "total yards": 424,
      "total plays": 71,
      "fumbles": 1,
      "fumbles lost": 1,
      "penalties": 6,
      "penalty yards": 40,
      "punts": 5,
      "punt yards": 249,
      "punt returns": 5,
      "punt return yards": 38,
      "kickoff returns": 2,
      "kickoff return yards": 51,
      "interception returns": 0,
      "interception return yards": 0,
      "3rd down conversions": 6,
      "3rd down attempts": 15,
      "4th down conversions": 1,
      "4th down attempts": 2
    }
  }
}