{
  "games": [
    {
      "game": {
        "away": {
          "names": {
            "short": "ArkansasState",
            "standard": "ArkansasState"
          },
          "score": "34"
        },
        "gameState": "final",
        "home": {
          "names": {
            "short": "FloridaInternational",
            "standard": "FloridaInternational"
          },
          "score": "20"
        },
        "startDate": "10-04-2012",
        "startTime": "12:00PM ET",
        "url": "/fbs/2012/10/04/arkansas-st-fiu",
        "location": "FIUStadiumMiamiFlorida"
      }
    },
    {
      "game": {
        "away": {
          "names": {
            "short": "EastCarolina",
            "standard": "EastCarolina"
          },
          "score": "20"
        },
        "gameState": "final",
        "home": {
          "names": {
            "short": "UCF",
            "standard": "UCF"
          },
          "score": "40"
        },
        "startDate": "10-04-2012",
        "startTime": "12:00PM ET",
        "url": "/fbs/2012/10/04/east-carolina-ucf",
        "location": "BrightHouseNetworksStadiumOrlandoFlorida"
      }
    },
    {
      "game": {
        "away": {
          "names": {
            "short": "USC",
            "standard": "USC"
          },
          "score": "38"
        },
        "gameState": "final",
        "home": {
          "names": {
            "short": "Utah",
            "standard": "Utah"
          },
          "score": "28"
        },
        "startDate": "10-04-2012",
        "startTime": "12:00PM ET",
        "url": "/fbs/2012/10/04/southern-california-utah",
        "location": "RiceEcclesStadiumSaltLakeCityUtah"
      }
    },
    {
      "game": {
        "away": {
          "names": {
            "short": "Pittsburgh",
            "standard": "Pittsburgh"
          },
          "score": "13"
        },
        "gameState": "final",
        "home": {
          "names": {
            "short": "Syracuse",
            "standard": "Syracuse"
          },
          "score": "14"
        },
        "startDate": "10-05-2012",
        "startTime": "12:00PM ET",
        "url": "/fbs/2012/10/05/pittsburgh-syracuse",
        "location": "CarrierDomeSyracuseNewYork"
      }
    },
    {
      "game": {
        "away": {
          "names": {
            "short": "UtahState",
            "standard": "UtahState"
          },
          "score": "3"
        },
        "gameState": "final",
        "home": {
          "names": {
            "short": "BrighamYoung",
            "standard": "BrighamYoung"
          },
          "score": "6"
        },
        "startDate": "10-05-2012",
        "startTime": "12:00PM ET",
        "url": "/fbs/2012/10/05/utah-st-byu",
        "location": "LaVellEdwardsStadiumProvoUtah"
      }
    },
    {
      "game": {
        "away": {
          "names": {
            "short": "Navy",
            "standard": "Navy"
          },
          "score": "28"
        },
        "gameState": "final",
        "home": {
          "names": {
            "short": "AirForce",
            "standard": "AirForce"
          },
          "score": "21"
        },
        "startDate": "10-06-2012",
        "startTime": "12:00PM ET",
        "url": "/fbs/2012/10/06/navy-air-force",
        "location": "FalconStadiumUSAFAColorado"
      }
    },
    {
      "game": {
        "away": {
          "names": {
            "short": "MichiganState",
            "standard": "MichiganState"
          },
          "score": "31"
        },
        "gameState": "final",
        "home": {
          "names": {
            "short": "Indiana",
            "standard": "Indiana"
          },
          "score": "27"
        },
        "startDate": "10-06-2012",
        "startTime": "12:00PM ET",
        "url": "/fbs/2012/10/06/michigan-st-indiana",
        "location": "MemorialStadiumBloomingtonIndiana"
      }
    },
    {
      "game": {
        "away": {
          "names": {
            "short": "Buffalo",
            "standard": "Buffalo"
          },
          "score": "31"
        },
        "gameState": "final",
        "home": {
          "names": {
            "short": "Ohio",
            "standard": "Ohio"
          },
          "score": "38"
        },
        "startDate": "10-06-2012",
        "startTime": "12:00PM ET",
        "url": "/fbs/2012/10/06/buffalo-ohio",
        "location": "PedenStadiumAthensOhio"
      }
    },
    {
      "game": {
        "away": {
          "names": {
            "short": "Connecticut",
            "standard": "Connecticut"
          },
          "score": "3"
        },
        "gameState": "final",
        "home": {
          "names": {
            "short": "Rutgers",
            "standard": "Rutgers"
          },
          "score": "19"
        },
        "startDate": "10-06-2012",
        "startTime": "12:00PM ET",
        "url": "/fbs/2012/10/06/connecticut-rutgers",
        "location": "HighPointSolutionsStadiumPiscatawayNewJersey"
      }
    },
    {
      "game": {
        "away": {
          "names": {
            "short": "SouthFlorida",
            "standard": "SouthFlorida"
          },
          "score": "28"
        },
        "gameState": "final",
        "home": {
          "names": {
            "short": "Temple",
            "standard": "Temple"
          },
          "score": "37"
        },
        "startDate": "10-06-2012",
        "startTime": "12:00PM ET",
        "url": "/fbs/2012/10/06/south-fla-temple",
        "location": "LincolnFinancialFieldPhiladelphiaPennsylvania"
      }
    },
    {
      "game": {
        "away": {
          "names": {
            "short": "BoiseState",
            "standard": "BoiseState"
          },
          "score": "40"
        },
        "gameState": "final",
        "home": {
          "names": {
            "short": "SouthernMiss",
            "standard": "SouthernMiss"
          },
          "score": "14"
        },
        "startDate": "10-06-2012",
        "startTime": "12:00PM ET",
        "url": "/fbs/2012/10/06/boise-st-southern-miss",
        "location": "CarlisleFaulknerFieldatMMRobertsStadiumHattiesburgMississippi"
      }
    },
    {
      "game": {
        "away": {
          "names": {
            "short": "BostonCollege",
            "standard": "BostonCollege"
          },
          "score": "31"
        },
        "gameState": "final",
        "home": {
          "names": {
            "short": "Army",
            "standard": "Army"
          },
          "score": "34"
        },
        "startDate": "10-06-2012",
        "startTime": "12:00PM ET",
        "url": "/fbs/2012/10/06/boston-college-army",
        "location": "BlaikFieldatMichieStadiumWestPointNewYork"
      }
    },
    {
      "game": {
        "away": {
          "names": {
            "short": "Northwestern",
            "standard": "Northwestern"
          },
          "score": "28"
        },
        "gameState": "final",
        "home": {
          "names": {
            "short": "PennState",
            "standard": "PennState"
          },
          "score": "39"
        },
        "startDate": "10-06-2012",
        "startTime": "12:00PM ET",
        "url": "/fbs/2012/10/06/northwestern-penn-st",
        "location": "BeaverStadiumUniversityParkPennsylvania"
      }
    },
    {
      "game": {
        "away": {
          "names": {
            "short": "Arkansas",
            "standard": "Arkansas"
          },
          "score": "24"
        },
        "gameState": "final",
        "home": {
          "names": {
            "short": "Auburn",
            "standard": "Auburn"
          },
          "score": "7"
        },
        "startDate": "10-06-2012",
        "startTime": "12:00PM ET",
        "url": "/fbs/2012/10/06/arkansas-auburn",
        "location": "JordanHareStadiumAuburnAlabama"
      }
    },
    {
      "game": {
        "away": {
          "names": {
            "short": "Kansas",
            "standard": "Kansas"
          },
          "score": "16"
        },
        "gameState": "final",
        "home": {
          "names": {
            "short": "KansasState",
            "standard": "KansasState"
          },
          "score": "56"
        },
        "startDate": "10-06-2012",
        "startTime": "12:00PM ET",
        "url": "/fbs/2012/10/06/kansas-kansas-st",
        "location": "BillSnyderFamilyStadiumManhattanKansas"
      }
    },
    {
      "game": {
        "away": {
          "names": {
            "short": "MississippiState",
            "standard": "MississippiState"
          },
          "score": "27"
        },
        "gameState": "final",
        "home": {
          "names": {
            "short": "Kentucky",
            "standard": "Kentucky"
          },
          "score": "14"
        },
        "startDate": "10-06-2012",
        "startTime": "12:00PM ET",
        "url": "/fbs/2012/10/06/mississippi-st-kentucky",
        "location": "CommonwealthStadiumLexingtonKentucky"
      }
    },
    {
      "game": {
        "away": {
          "names": {
            "short": "VirginiaTech",
            "standard": "VirginiaTech"
          },
          "score": "34"
        },
        "gameState": "final",
        "home": {
          "names": {
            "short": "NorthCarolina",
            "standard": "NorthCarolina"
          },
          "score": "48"
        },
        "startDate": "10-06-2012",
        "startTime": "12:00PM ET",
        "url": "/fbs/2012/10/06/virginia-tech-north-carolina",
        "location": "KenanMemorialStadiumChapelHillNorthCarolina"
      }
    },
    {
      "game": {
        "away": {
          "names": {
            "short": "KentState",
            "standard": "KentState"
          },
          "score": "41"
        },
        "gameState": "final",
        "home": {
          "names": {
            "short": "EasternMichigan",
            "standard": "EasternMichigan"
          },
          "score": "14"
        },
        "startDate": "10-06-2012",
        "startTime": "12:00PM ET",
        "url": "/fbs/2012/10/06/kent-st-eastern-mich",
        "location": "RynearsonStadiumYpsilantiMichigan"
      }
    },
    {
      "game": {
        "away": {
          "names": {
            "short": "BowlingGreen",
            "standard": "BowlingGreen"
          },
          "score": "24"
        },
        "gameState": "final",
        "home": {
          "names": {
            "short": "Akron",
            "standard": "Akron"
          },
          "score": "10"
        },
        "startDate": "10-06-2012",
        "startTime": "12:00PM ET",
        "url": "/fbs/2012/10/06/bowling-green-akron",
        "location": "SummaFieldatInfoCisionStadiumAkronOhio"
      }
    },
    {
      "game": {
        "away": {
          "names": {
            "short": "Massachusetts",
            "standard": "Massachusetts"
          },
          "score": "14"
        },
        "gameState": "final",
        "home": {
          "names": {
            "short": "WesternMichigan",
            "standard": "WesternMichigan"
          },
          "score": "52"
        },
        "startDate": "10-06-2012",
        "startTime": "12:00PM ET",
        "url": "/fbs/2012/10/06/massachusetts-western-mich",
        "location": "WaldoStadiumKalamazooMichigan"
      }
    },
    {
      "game": {
        "away": {
          "names": {
            "short": "Virginia",
            "standard": "Virginia"
          },
          "score": "17"
        },
        "gameState": "final",
        "home": {
          "names": {
            "short": "Duke",
            "standard": "Duke"
          },
          "score": "42"
        },
        "startDate": "10-06-2012",
        "startTime": "12:00PM ET",
        "url": "/fbs/2012/10/06/virginia-duke",
        "location": "WallaceWadeStadiumDurhamNorthCarolina"
      }
    },
    {
      "game": {
        "away": {
          "names": {
            "short": "NorthernIllinois",
            "standard": "NorthernIllinois"
          },
          "score": "35"
        },
        "gameState": "final",
        "home": {
          "names": {
            "short": "BallState",
            "standard": "BallState"
          },
          "score": "23"
        },
        "startDate": "10-06-2012",
        "startTime": "12:00PM ET",
        "url": "/fbs/2012/10/06/northern-ill-ball-st",
        "location": "ScheumannStadiumMuncieIndiana"
      }
    },
    {
      "game": {
        "away": {
          "names": {
            "short": "CentralMichigan",
            "standard": "CentralMichigan"
          },
          "score": "35"
        },
        "gameState": "final",
        "home": {
          "names": {
            "short": "Toledo",
            "standard": "Toledo"
          },
          "score": "50"
        },
        "startDate": "10-06-2012",
        "startTime": "12:00PM ET",
        "url": "/fbs/2012/10/06/central-mich-toledo",
        "location": "GlassBowlToledoOhio"
      }
    },
    {
      "game": {
        "away": {
          "names": {
            "short": "Arizona",
            "standard": "Arizona"
          },
          "score": "48"
        },
        "gameState": "final",
        "home": {
          "names": {
            "short": "Stanford",
            "standard": "Stanford"
          },
          "score": "54"
        },
        "startDate": "10-06-2012",
        "startTime": "12:00PM ET",
        "url": "/fbs/2012/10/06/arizona-stanford",
        "location": "StanfordStadiumStanfordCalifornia"
      }
    },
    {
      "game": {
        "away": {
          "names": {
            "short": "SoutheasternLa",
            "standard": "SoutheasternLa"
          },
          "score": "3"
        },
        "gameState": "final",
        "home": {
          "names": {
            "short": "UAB",
            "standard": "UAB"
          },
          "score": "52"
        },
        "startDate": "10-06-2012",
        "startTime": "12:00PM ET",
        "url": "/fbs/2012/10/06/southeastern-la-uab",
        "location": "LegionFieldBirminghamAlabama"
      }
    },
    {
      "game": {
        "away": {
          "names": {
            "short": "GeorgiaTech",
            "standard": "GeorgiaTech"
          },
          "score": "31"
        },
        "gameState": "final",
        "home": {
          "names": {
            "short": "Clemson",
            "standard": "Clemson"
          },
          "score": "47"
        },
        "startDate": "10-06-2012",
        "startTime": "12:00PM ET",
        "url": "/fbs/2012/10/06/georgia-tech-clemson",
        "location": "MemorialStadiumClemsonSouthCarolina"
      }
    },
    {
      "game": {
        "away": {
          "names": {
            "short": "Illinois",
            "standard": "Illinois"
          },
          "score": "14"
        },
        "gameState": "final",
        "home": {
          "names": {
            "short": "Wisconsin",
            "standard": "Wisconsin"
          },
          "score": "31"
        },
        "startDate": "10-06-2012",
        "startTime": "12:00PM ET",
        "url": "/fbs/2012/10/06/illinois-wisconsin",
        "location": "CampRandallStadiumMadisonWisconsin"
      }
    },
    {
      "game": {
        "away": {
          "names": {
            "short": "IowaState",
            "standard": "IowaState"
          },
          "score": "37"
        },
        "gameState": "final",
        "home": {
          "names": {
            "short": "TCU",
            "standard": "TCU"
          },
          "score": "23"
        },
        "startDate": "10-06-2012",
        "startTime": "12:00PM ET",
        "url": "/fbs/2012/10/06/iowa-st-tcu",
        "location": "AmonGCarterStadiumFortWorthTexas"
      }
    },
    {
      "game": {
        "away": {
          "names": {
            "short": "LSU",
            "standard": "LSU"
          },
          "score": "6"
        },
        "gameState": "final",
        "home": {
          "names": {
            "short": "Florida",
            "standard": "Florida"
          },
          "score": "14"
        },
        "startDate": "10-06-2012",
        "startTime": "12:00PM ET",
        "url": "/fbs/2012/10/06/lsu-florida",
        "location": "BenHillGriffinStadiumatFloridaFieldGainesvilleFlorida"
      }
    },
    {
      "game": {
        "away": {
          "names": {
            "short": "LouisianaMonroe",
            "standard": "LouisianaMonroe"
          },
          "score": "31"
        },
        "gameState": "final",
        "home": {
          "names": {
            "short": "MiddleTennessee",
            "standard": "MiddleTennessee"
          },
          "score": "17"
        },
        "startDate": "10-06-2012",
        "startTime": "12:00PM ET",
        "url": "/fbs/2012/10/06/la-monroe-middle-tenn",
        "location": "JohnnyRedFloydStadiumMurfreesboroTennessee"
      }
    },
    {
      "game": {
        "away": {
          "names": {
            "short": "Oklahoma",
            "standard": "Oklahoma"
          },
          "score": "41"
        },
        "gameState": "final",
        "home": {
          "names": {
            "short": "TexasTech",
            "standard": "TexasTech"
          },
          "score": "20"
        },
        "startDate": "10-06-2012",
        "startTime": "12:00PM ET",
        "url": "/fbs/2012/10/06/oklahoma-texas-tech",
        "location": "JonesATTStadiumLubbockTexas"
      }
    },
    {
      "game": {
        "away": {
          "names": {
            "short": "Tulsa",
            "standard": "Tulsa"
          },
          "score": "45"
        },
        "gameState": "final",
        "home": {
          "names": {
            "short": "Marshall",
            "standard": "Marshall"
          },
          "score": "38"
        },
        "startDate": "10-06-2012",
        "startTime": "12:00PM ET",
        "url": "/fbs/2012/10/06/tulsa-marshall",
        "location": "JoanCEdwardsStadiumHuntingtonWestVirginia"
      }
    },
    {
      "game": {
        "away": {
          "names": {
            "short": "WakeForest",
            "standard": "WakeForest"
          },
          "score": "14"
        },
        "gameState": "final",
        "home": {
          "names": {
            "short": "Maryland",
            "standard": "Maryland"
          },
          "score": "19"
        },
        "startDate": "10-06-2012",
        "startTime": "12:00PM ET",
        "url": "/fbs/2012/10/06/wake-forest-maryland",
        "location": "CapitalOneFieldatByrdStadiumCollegeParkMaryland"
      }
    },
    {
      "game": {
        "away": {
          "names": {
            "short": "Michigan",
            "standard": "Michigan"
          },
          "score": "44"
        },
        "gameState": "final",
        "home": {
          "names": {
            "short": "Purdue",
            "standard": "Purdue"
          },
          "score": "13"
        },
        "startDate": "10-06-2012",
        "startTime": "12:00PM ET",
        "url": "/fbs/2012/10/06/michigan-purdue",
        "location": "RossAdeStadiumWestLafayetteIndiana"
      }
    },
    {
      "game": {
        "away": {
          "names": {
            "short": "NewMexicoState",
            "standard": "NewMexicoState"
          },
          "score": "18"
        },
        "gameState": "final",
        "home": {
          "names": {
            "short": "Idaho",
            "standard": "Idaho"
          },
          "score": "26"
        },
        "startDate": "10-06-2012",
        "startTime": "12:00PM ET",
        "url": "/fbs/2012/10/06/new-mexico-st-idaho",
        "location": "ASUIKibbieDomeMoscowIdaho"
      }
    },
    {
      "game": {
        "away": {
          "names": {
            "short": "Tulane",
            "standard": "Tulane"
          },
          "score": "13"
        },
        "gameState": "final",
        "home": {
          "names": {
            "short": "LouisianaLafayette",
            "standard": "LouisianaLafayette"
          },
          "score": "41"
        },
        "startDate": "10-06-2012",
        "startTime": "12:00PM ET",
        "url": "/fbs/2012/10/06/tulane-la-lafayette",
        "location": "CajunFieldLafayetteLouisiana"
      }
    },
    {
      "game": {
        "away": {
          "names": {
            "short": "TexasState",
            "standard": "TexasState"
          },
          "score": "14"
        },
        "gameState": "final",
        "home": {
          "names": {
            "short": "NewMexico",
            "standard": "NewMexico"
          },
          "score": "35"
        },
        "startDate": "10-06-2012",
        "startTime": "12:00PM ET",
        "url": "/fbs/2012/10/06/texas-st-new-mexico",
        "location": "UniversityStadiumAlbuquerqueNewMexico"
      }
    },
    {
      "game": {
        "away": {
          "names": {
            "short": "WashingtonState",
            "standard": "WashingtonState"
          },
          "score": "6"
        },
        "gameState": "final",
        "home": {
          "names": {
            "short": "OregonState",
            "standard": "OregonState"
          },
          "score": "19"
        },
        "startDate": "10-06-2012",
        "startTime": "12:00PM ET",
        "url": "/fbs/2012/10/06/washington-st-oregon-st",
        "location": "ReserStadiumCorvallisOregon"
      }
    },
    {
      "game": {
        "away": {
          "names": {
            "short": "NorthTexas",
            "standard": "NorthTexas"
          },
          "score": "21"
        },
        "gameState": "final",
        "home": {
          "names": {
            "short": "Houston",
            "standard": "Houston"
          },
          "score": "44"
        },
        "startDate": "10-06-2012",
        "startTime": "12:00PM ET",
        "url": "/fbs/2012/10/06/north-texas-houston",
        "location": "OQuinnFieldatRobertsonStadiumHoustonTexas"
      }
    },
    {
      "game": {
        "away": {
          "names": {
            "short": "Georgia",
            "standard": "Georgia"
          },
          "score": "7"
        },
        "gameState": "final",
        "home": {
          "names": {
            "short": "SouthCarolina",
            "standard": "SouthCarolina"
          },
          "score": "35"
        },
        "startDate": "10-06-2012",
        "startTime": "12:00PM ET",
        "url": "/fbs/2012/10/06/georgia-south-carolina",
        "location": "WilliamsBriceStadiumColumbiaSouthCarolina"
      }
    },
    {
      "game": {
        "away": {
          "names": {
            "short": "Vanderbilt",
            "standard": "Vanderbilt"
          },
          "score": "19"
        },
        "gameState": "final",
        "home": {
          "names": {
            "short": "Missouri",
            "standard": "Missouri"
          },
          "score": "15"
        },
        "startDate": "10-06-2012",
        "startTime": "12:00PM ET",
        "url": "/fbs/2012/10/06/vanderbilt-missouri",
        "location": "MemorialStadiumatFaurotFieldColumbiaMissouri"
      }
    },
    {
      "game": {
        "away": {
          "names": {
            "short": "UNLV",
            "standard": "UNLV"
          },
          "score": "31"
        },
        "gameState": "final",
        "home": {
          "names": {
            "short": "LouisianaTech",
            "standard": "LouisianaTech"
          },
          "score": "58"
        },
        "startDate": "10-06-2012",
        "startTime": "12:00PM ET",
        "url": "/fbs/2012/10/06/unlv-louisiana-tech",
        "location": "JoeAilletStadiumRustonLouisiana"
      }
    },
    {
      "game": {
        "away": {
          "names": {
            "short": "FresnoState",
            "standard": "FresnoState"
          },
          "score": "28"
        },
        "gameState": "final",
        "home": {
          "names": {
            "short": "ColoradoState",
            "standard": "ColoradoState"
          },
          "score": "7"
        },
        "startDate": "10-06-2012",
        "startTime": "12:00PM ET",
        "url": "/fbs/2012/10/06/fresno-st-colorado-st",
        "location": "HughesStadiumFortCollinsColorado"
      }
    },
    {
      "game": {
        "away": {
          "names": {
            "short": "WestVirginia",
            "standard": "WestVirginia"
          },
          "score": "48"
        },
        "gameState": "final",
        "home": {
          "names": {
            "short": "Texas",
            "standard": "Texas"
          },
          "score": "45"
        },
        "startDate": "10-06-2012",
        "startTime": "12:00PM ET",
        "url": "/fbs/2012/10/06/west-virginia-texas",
        "location": "DarrellKRoyalTexasMemorialStadiumAustinTexas"
      }
    },
    {
      "game": {
        "away": {
          "names": {
            "short": "MiamiOH",
            "standard": "MiamiOH"
          },
          "score": "14"
        },
        "gameState": "final",
        "home": {
          "names": {
            "short": "Cincinnati",
            "standard": "Cincinnati"
          },
          "score": "52"
        },
        "startDate": "10-06-2012",
        "startTime": "12:00PM ET",
        "url": "/fbs/2012/10/06/miami-oh-cincinnati",
        "location": "NippertStadiumCincinnatiOhio"
      }
    },
    {
      "game": {
        "away": {
          "names": {
            "short": "Rice",
            "standard": "Rice"
          },
          "score": "10"
        },
        "gameState": "final",
        "home": {
          "names": {
            "short": "Memphis",
            "standard": "Memphis"
          },
          "score": "14"
        },
        "startDate": "10-06-2012",
        "startTime": "12:00PM ET",
        "url": "/fbs/2012/10/06/rice-memphis",
        "location": "LibertyBowlMemorialMemphisTennessee"
      }
    },
    {
      "game": {
        "away": {
          "names": {
            "short": "TexasAM",
            "standard": "TexasAM"
          },
          "score": "30"
        },
        "gameState": "final",
        "home": {
          "names": {
            "short": "OleMiss",
            "standard": "OleMiss"
          },
          "score": "27"
        },
        "startDate": "10-06-2012",
        "startTime": "12:00PM ET",
        "url": "/fbs/2012/10/06/texas-am-ole-miss",
        "location": "VaughtHemingwayStadiumatHollingsworthFieldOxfordMississippi"
      }
    },
    {
      "game": {
        "away": {
          "names": {
            "short": "Wyoming",
            "standard": "Wyoming"
          },
          "score": "28"
        },
        "gameState": "final",
        "home": {
          "names": {
            "short": "Nevada",
            "standard": "Nevada"
          },
          "score": "35"
        },
        "startDate": "10-06-2012",
        "startTime": "12:00PM ET",
        "url": "/fbs/2012/10/06/wyoming-nevada",
        "location": "ClarenceMackayStadiumRenoNevada"
      }
    },
    {
      "game": {
        "away": {
          "names": {
            "short": "MiamiFL",
            "standard": "MiamiFL"
          },
          "score": "3"
        },
        "gameState": "final",
        "home": {
          "names": {
            "short": "NotreDame",
            "standard": "NotreDame"
          },
          "score": "41"
        },
        "startDate": "10-06-2012",
        "startTime": "12:00PM ET",
        "url": "/fbs/2012/10/06/miami-fl-notre-dame",
        "location": "SoldierFieldChicagoIllinois"
      }
    },
    {
      "game": {
        "away": {
          "names": {
            "short": "FloridaState",
            "standard": "FloridaState"
          },
          "score": "16"
        },
        "gameState": "final",
        "home": {
          "names": {
            "short": "NorthCarolinaState",
            "standard": "NorthCarolinaState"
          },
          "score": "17"
        },
        "startDate": "10-06-2012",
        "startTime": "12:00PM ET",
        "url": "/fbs/2012/10/06/florida-st-north-carolina-st",
        "location": "CarterFinleyStadiumRaleighNorthCarolina"
      }
    },
    {
      "game": {
        "away": {
          "names": {
            "short": "Hawaii",
            "standard": "Hawaii"
          },
          "score": "14"
        },
        "gameState": "final",
        "home": {
          "names": {
            "short": "SanDiegoState",
            "standard": "SanDiegoState"
          },
          "score": "52"
        },
        "startDate": "10-06-2012",
        "startTime": "12:00PM ET",
        "url": "/fbs/2012/10/06/hawaii-san-diego-st",
        "location": "QualcommStadiumSanDiegoCalifornia"
      }
    },
    {
      "game": {
        "away": {
          "names": {
            "short": "Nebraska",
            "standard": "Nebraska"
          },
          "score": "38"
        },
        "gameState": "final",
        "home": {
          "names": {
            "short": "OhioState",
            "standard": "OhioState"
          },
          "score": "63"
        },
        "startDate": "10-06-2012",
        "startTime": "12:00PM ET",
        "url": "/fbs/2012/10/06/nebraska-ohio-st",
        "location": "OhioStadiumColumbusOhio"
      }
    },
    {
      "game": {
        "away": {
          "names": {
            "short": "SouthernMethodist",
            "standard": "SouthernMethodist"
          },
          "score": "17"
        },
        "gameState": "final",
        "home": {
          "names": {
            "short": "UTEP",
            "standard": "UTEP"
          },
          "score": "0"
        },
        "startDate": "10-06-2012",
        "startTime": "12:00PM ET",
        "url": "/fbs/2012/10/06/smu-utep",
        "location": "SunBowlElPasoTexas"
      }
    },
    {
      "game": {
        "away": {
          "names": {
            "short": "UCLA",
            "standard": "UCLA"
          },
          "score": "17"
        },
        "gameState": "final",
        "home": {
          "names": {
            "short": "California",
            "standard": "California"
          },
          "score": "43"
        },
        "startDate": "10-06-2012",
        "startTime": "12:00PM ET",
        "url": "/fbs/2012/10/06/ucla-california",
        "location": "MemorialStadiumBerkeleyCalifornia"
      }
    },
    {
      "game": {
        "away": {
          "names": {
            "short": "Washington",
            "standard": "Washington"
          },
          "score": "21"
        },
        "gameState": "final",
        "home": {
          "names": {
            "short": "Oregon",
            "standard": "Oregon"
          },
          "score": "52"
        },
        "startDate": "10-06-2012",
        "startTime": "12:00PM ET",
        "url": "/fbs/2012/10/06/washington-oregon",
        "location": "AutzenStadiumEugeneOregon"
      }
    }
  ]
}