{
  "inputMD5Sum": "7933f6a71322cb108df89425bf5b98ae",
  "updated_at": "10-18-2020 11:03:12",
  "games": [
    {"game": {
      "gameID": "dc334637-0fc3-45ee-8d1a-9e0ff50a35e4",
      "away": {
        "score": "",
        "names": {
          "char6": "APP ST",
          "short": "App State",
          "seo": "appalachian-st",
          "full": "Appalachian State University"
        },
        "winner": false,
        "seed": "",
        "description": "(2-1)",
        "rank": "",
        "conferences": [{
          "conferenceName": "Sun Belt",
          "conferenceSeo": "sun-belt"
        }]
      },
      "finalMessage": "",
      "bracketRound": "",
      "title": "Ga. Southern App State",
      "url": "/game/4060651",
      "network": "",
      "home": {
        "score": "",
        "names": {
          "char6": "GA SOU",
          "short": "Ga. Southern",
          "seo": "ga-southern",
          "full": "Georgia Southern University"
        },
        "winner": false,
        "seed": "",
        "description": "(2-1)",
        "rank": "",
        "conferences": [{
          "conferenceName": "Sun Belt",
          "conferenceSeo": "sun-belt"
        }]
      },
      "liveVideoEnabled": false,
      "startTime": "07:30PM ET",
      "startTimeEpoch": "1602718200",
      "bracketId": "",
      "gameState": "postponed",
      "startDate": "10-14-2020",
      "currentPeriod": "",
      "videoState": "",
      "bracketRegion": "",
      "contestClock": ""
    }},
    {"game": {
      "gameID": "307bb618-8559-460d-8c83-d548b1c4348e",
      "away": {
        "score": "30",
        "names": {
          "char6": "CO CAR",
          "short": "Coastal Carolina",
          "seo": "coastal-caro",
          "full": "Coastal Carolina University"
        },
        "winner": true,
        "seed": "",
        "description": "(4-0)",
        "rank": "",
        "conferences": [{
          "conferenceName": "Sun Belt",
          "conferenceSeo": "sun-belt"
        }]
      },
      "finalMessage": "FINAL",
      "bracketRound": "",
      "title": "Louisiana Coastal Carolina",
      "url": "/game/5006518",
      "network": "",
      "home": {
        "score": "27",
        "names": {
          "char6": "ULL",
          "short": "Louisiana",
          "seo": "la-lafayette",
          "full": "University of Louisiana at Lafayette"
        },
        "winner": false,
        "seed": "",
        "description": "(3-1)",
        "rank": "21",
        "conferences": [
          {
            "conferenceName": "Sun Belt",
            "conferenceSeo": "sun-belt"
          },
          {
            "conferenceName": "Top 25",
            "conferenceSeo": "top-25"
          }
        ]
      },
      "liveVideoEnabled": false,
      "startTime": "07:30PM ET",
      "startTimeEpoch": "1602718200",
      "bracketId": "",
      "gameState": "final",
      "startDate": "10-14-2020",
      "currentPeriod": "FINAL",
      "videoState": "",
      "bracketRegion": "",
      "contestClock": "0:00"
    }},
    {"game": {
      "gameID": "b4423495-ec8a-441e-a6c2-26a864fe2a4c",
      "away": {
        "score": "52",
        "names": {
          "char6": "GA ST",
          "short": "Georgia St.",
          "seo": "georgia-st",
          "full": "Georgia State University"
        },
        "winner": false,
        "seed": "",
        "description": "(1-2)",
        "rank": "",
        "conferences": [{
          "conferenceName": "Sun Belt",
          "conferenceSeo": "sun-belt"
        }]
      },
      "finalMessage": "FINAL",
      "bracketRound": "",
      "title": "Arkansas St. Georgia St.",
      "url": "/game/4060652",
      "network": "",
      "home": {
        "score": "59",
        "names": {
          "char6": "ARK ST",
          "short": "Arkansas St.",
          "seo": "arkansas-st",
          "full": "Arkansas State University"
        },
        "winner": true,
        "seed": "",
        "description": "(3-2)",
        "rank": "",
        "conferences": [{
          "conferenceName": "Sun Belt",
          "conferenceSeo": "sun-belt"
        }]
      },
      "liveVideoEnabled": false,
      "startTime": "07:30PM ET",
      "startTimeEpoch": "1602804600",
      "bracketId": "",
      "gameState": "final",
      "startDate": "10-15-2020",
      "currentPeriod": "FINAL",
      "videoState": "",
      "bracketRegion": "",
      "contestClock": "0:00"
    }},
    {"game": {
      "gameID": "3e0b88d5-37e2-4e73-a4cc-89add7199643",
      "away": {
        "score": "37",
        "names": {
          "char6": "SMU",
          "short": "SMU",
          "seo": "smu",
          "full": "Southern Methodist University"
        },
        "winner": true,
        "seed": "",
        "description": "(5-0)",
        "rank": "17",
        "conferences": [
          {
            "conferenceName": "AAC",
            "conferenceSeo": "aac"
          },
          {
            "conferenceName": "Top 25",
            "conferenceSeo": "top-25"
          }
        ]
      },
      "finalMessage": "FINAL (OT)",
      "bracketRound": "",
      "title": "Tulane SMU",
      "url": "/game/4060662",
      "network": "",
      "home": {
        "score": "34",
        "names": {
          "char6": "TULANE",
          "short": "Tulane",
          "seo": "tulane",
          "full": "Tulane University"
        },
        "winner": false,
        "seed": "",
        "description": "(2-3)",
        "rank": "",
        "conferences": [{
          "conferenceName": "AAC",
          "conferenceSeo": "aac"
        }]
      },
      "liveVideoEnabled": false,
      "startTime": "06:00PM ET",
      "startTimeEpoch": "1602885600",
      "bracketId": "",
      "gameState": "final",
      "startDate": "10-16-2020",
      "currentPeriod": "FINAL (OT)",
      "videoState": "",
      "bracketRegion": "",
      "contestClock": ""
    }},
    {"game": {
      "gameID": "428e807d-e1dc-4e69-b7de-3c9a9175f40f",
      "away": {
        "score": "43",
        "names": {
          "char6": "BYU",
          "short": "BYU",
          "seo": "byu",
          "full": "Brigham Young University"
        },
        "winner": true,
        "seed": "",
        "description": "(5-0)",
        "rank": "14",
        "conferences": [
          {
            "conferenceName": "FBS Independent",
            "conferenceSeo": "fbs-independent"
          },
          {
            "conferenceName": "Top 25",
            "conferenceSeo": "top-25"
          }
        ]
      },
      "finalMessage": "FINAL",
      "bracketRound": "",
      "title": "Houston BYU",
      "url": "/game/4060653",
      "network": "",
      "home": {
        "score": "26",
        "names": {
          "char6": "HOU",
          "short": "Houston",
          "seo": "houston",
          "full": "University of Houston"
        },
        "winner": false,
        "seed": "",
        "description": "(1-1)",
        "rank": "",
        "conferences": [{
          "conferenceName": "AAC",
          "conferenceSeo": "aac"
        }]
      },
      "liveVideoEnabled": false,
      "startTime": "09:30PM ET",
      "startTimeEpoch": "1602898200",
      "bracketId": "",
      "gameState": "final",
      "startDate": "10-16-2020",
      "currentPeriod": "FINAL",
      "videoState": "",
      "bracketRegion": "",
      "contestClock": "0:00"
    }},
    {"game": {
      "gameID": "43441abe-cfef-483c-884e-5bf2a38609a6",
      "away": {
        "score": "19",
        "names": {
          "char6": "PITT",
          "short": "Pittsburgh",
          "seo": "pittsburgh",
          "full": "University of Pittsburgh"
        },
        "winner": false,
        "seed": "",
        "description": "(3-3)",
        "rank": "",
        "conferences": [{
          "conferenceName": "ACC",
          "conferenceSeo": "acc"
        }]
      },
      "finalMessage": "FINAL",
      "bracketRound": "",
      "title": "Miami (FL) Pittsburgh",
      "url": "/game/4060655",
      "network": "",
      "home": {
        "score": "31",
        "names": {
          "char6": "MIAMI",
          "short": "Miami (FL)",
          "seo": "miami-fl",
          "full": "University of Miami (Florida)"
        },
        "winner": true,
        "seed": "",
        "description": "(4-1)",
        "rank": "13",
        "conferences": [
          {
            "conferenceName": "ACC",
            "conferenceSeo": "acc"
          },
          {
            "conferenceName": "Top 25",
            "conferenceSeo": "top-25"
          }
        ]
      },
      "liveVideoEnabled": false,
      "startTime": "12:00PM ET",
      "startTimeEpoch": "1602950400",
      "bracketId": "",
      "gameState": "final",
      "startDate": "10-17-2020",
      "currentPeriod": "FINAL",
      "videoState": "",
      "bracketRegion": "",
      "contestClock": "0:00"
    }},
    {"game": {
      "gameID": "32aa3fbf-2d4c-45b2-9a28-ab8b73dac599",
      "away": {
        "score": "",
        "names": {
          "char6": "CINCY",
          "short": "Cincinnati",
          "seo": "cincinnati",
          "full": "University of Cincinnati"
        },
        "winner": false,
        "seed": "",
        "description": "(3-0)",
        "rank": "8",
        "conferences": [
          {
            "conferenceName": "AAC",
            "conferenceSeo": "aac"
          },
          {
            "conferenceName": "Top 25",
            "conferenceSeo": "top-25"
          }
        ]
      },
      "finalMessage": "",
      "bracketRound": "",
      "title": "Tulsa Cincinnati",
      "url": "/game/4060656",
      "network": "",
      "home": {
        "score": "",
        "names": {
          "char6": "TULSA",
          "short": "Tulsa",
          "seo": "tulsa",
          "full": "The University of Tulsa"
        },
        "winner": false,
        "seed": "",
        "description": "(1-1)",
        "rank": "",
        "conferences": [{
          "conferenceName": "AAC",
          "conferenceSeo": "aac"
        }]
      },
      "liveVideoEnabled": false,
      "startTime": "12:00PM ET",
      "startTimeEpoch": "1602950400",
      "bracketId": "",
      "gameState": "postponed",
      "startDate": "10-17-2020",
      "currentPeriod": "",
      "videoState": "",
      "bracketRegion": "",
      "contestClock": ""
    }},
    {"game": {
      "gameID": "91e8ec8e-188f-48db-a1c5-b4eaa7a685f6",
      "away": {
        "score": "20",
        "names": {
          "char6": "TX ST",
          "short": "Texas St.",
          "seo": "texas-st",
          "full": "Texas State University"
        },
        "winner": false,
        "seed": "",
        "description": "(1-5)",
        "rank": "",
        "conferences": [{
          "conferenceName": "Sun Belt",
          "conferenceSeo": "sun-belt"
        }]
      },
      "finalMessage": "FINAL",
      "bracketRound": "",
      "title": "South Alabama Texas St.",
      "url": "/game/4060657",
      "network": "",
      "home": {
        "score": "30",
        "names": {
          "char6": "S ALA",
          "short": "South Alabama",
          "seo": "south-ala",
          "full": "University of South Alabama"
        },
        "winner": true,
        "seed": "",
        "description": "(2-2)",
        "rank": "",
        "conferences": [{
          "conferenceName": "Sun Belt",
          "conferenceSeo": "sun-belt"
        }]
      },
      "liveVideoEnabled": false,
      "startTime": "12:00PM ET",
      "startTimeEpoch": "1602950400",
      "bracketId": "",
      "gameState": "final",
      "startDate": "10-17-2020",
      "currentPeriod": "FINAL",
      "videoState": "",
      "bracketRegion": "",
      "contestClock": "0:00"
    }},
    {"game": {
      "gameID": "12795823-6685-4b71-b4af-17359fd82082",
      "away": {
        "score": "17",
        "names": {
          "char6": "KANSAS",
          "short": "Kansas",
          "seo": "kansas",
          "full": "University of Kansas"
        },
        "winner": false,
        "seed": "",
        "description": "(0-4)",
        "rank": "",
        "conferences": [{
          "conferenceName": "Big 12",
          "conferenceSeo": "big-12"
        }]
      },
      "finalMessage": "FINAL",
      "bracketRound": "",
      "title": "West Virginia Kansas",
      "url": "/game/4060665",
      "network": "",
      "home": {
        "score": "38",
        "names": {
          "char6": "WVU",
          "short": "West Virginia",
          "seo": "west-virginia",
          "full": "West Virginia University"
        },
        "winner": true,
        "seed": "",
        "description": "(3-1)",
        "rank": "",
        "conferences": [{
          "conferenceName": "Big 12",
          "conferenceSeo": "big-12"
        }]
      },
      "liveVideoEnabled": false,
      "startTime": "12:00PM ET",
      "startTimeEpoch": "1602950400",
      "bracketId": "",
      "gameState": "final",
      "startDate": "10-17-2020",
      "currentPeriod": "FINAL",
      "videoState": "",
      "bracketRegion": "",
      "contestClock": "0:00"
    }},
    {"game": {
      "gameID": "8347a017-7930-4e09-ad06-52e2b3d7222e",
      "away": {
        "score": "22",
        "names": {
          "char6": "AUBURN",
          "short": "Auburn",
          "seo": "auburn",
          "full": "Auburn University"
        },
        "winner": false,
        "seed": "",
        "description": "(2-2)",
        "rank": "15",
        "conferences": [
          {
            "conferenceName": "SEC",
            "conferenceSeo": "sec"
          },
          {
            "conferenceName": "Top 25",
            "conferenceSeo": "top-25"
          }
        ]
      },
      "finalMessage": "FINAL",
      "bracketRound": "",
      "title": "South Carolina Auburn",
      "url": "/game/4060669",
      "network": "",
      "home": {
        "score": "30",
        "names": {
          "char6": "S CAR",
          "short": "South Carolina",
          "seo": "south-carolina",
          "full": "University of South Carolina, Columbia"
        },
        "winner": true,
        "seed": "",
        "description": "(2-2)",
        "rank": "",
        "conferences": [{
          "conferenceName": "SEC",
          "conferenceSeo": "sec"
        }]
      },
      "liveVideoEnabled": false,
      "startTime": "12:00PM ET",
      "startTimeEpoch": "1602950400",
      "bracketId": "",
      "gameState": "final",
      "startDate": "10-17-2020",
      "currentPeriod": "FINAL",
      "videoState": "",
      "bracketRegion": "",
      "contestClock": "0:00"
    }},
    {"game": {
      "gameID": "21b8a13d-1778-40bc-b612-d2a9c84071e5",
      "away": {
        "score": "73",
        "names": {
          "char6": "CLEM",
          "short": "Clemson",
          "seo": "clemson",
          "full": "Clemson University"
        },
        "winner": true,
        "seed": "",
        "description": "(5-0)",
        "rank": "1",
        "conferences": [
          {
            "conferenceName": "ACC",
            "conferenceSeo": "acc"
          },
          {
            "conferenceName": "Top 25",
            "conferenceSeo": "top-25"
          }
        ]
      },
      "finalMessage": "FINAL",
      "bracketRound": "",
      "title": "Georgia Tech Clemson",
      "url": "/game/4060673",
      "network": "",
      "home": {
        "score": "7",
        "names": {
          "char6": "GATECH",
          "short": "Georgia Tech",
          "seo": "georgia-tech",
          "full": "Georgia Institute of Technology"
        },
        "winner": false,
        "seed": "",
        "description": "(2-3)",
        "rank": "",
        "conferences": [{
          "conferenceName": "ACC",
          "conferenceSeo": "acc"
        }]
      },
      "liveVideoEnabled": false,
      "startTime": "12:00PM ET",
      "startTimeEpoch": "1602950400",
      "bracketId": "",
      "gameState": "final",
      "startDate": "10-17-2020",
      "currentPeriod": "FINAL",
      "videoState": "",
      "bracketRegion": "",
      "contestClock": "0:00"
    }},
    {"game": {
      "gameID": "19596af8-daf3-4857-8750-5171c116c680",
      "away": {
        "score": "38",
        "names": {
          "char6": "LIBRTY",
          "short": "Liberty",
          "seo": "liberty",
          "full": "Liberty University"
        },
        "winner": true,
        "seed": "",
        "description": "(5-0)",
        "rank": "",
        "conferences": [{
          "conferenceName": "FBS Independent",
          "conferenceSeo": "fbs-independent"
        }]
      },
      "finalMessage": "FINAL",
      "bracketRound": "",
      "title": "Syracuse Liberty",
      "url": "/game/4060674",
      "network": "",
      "home": {
        "score": "21",
        "names": {
          "char6": "SYR",
          "short": "Syracuse",
          "seo": "syracuse",
          "full": "Syracuse University"
        },
        "winner": false,
        "seed": "",
        "description": "(1-4)",
        "rank": "",
        "conferences": [{
          "conferenceName": "ACC",
          "conferenceSeo": "acc"
        }]
      },
      "liveVideoEnabled": false,
      "startTime": "12:00PM ET",
      "startTimeEpoch": "1602950400",
      "bracketId": "",
      "gameState": "final",
      "startDate": "10-17-2020",
      "currentPeriod": "FINAL",
      "videoState": "",
      "bracketRegion": "",
      "contestClock": "0:00"
    }},
    {"game": {
      "gameID": "8a4224d0-e5c5-4a8f-92e4-dc5ad33ecfe2",
      "away": {
        "score": "34",
        "names": {
          "char6": "UK",
          "short": "Kentucky",
          "seo": "kentucky",
          "full": "University of Kentucky"
        },
        "winner": true,
        "seed": "",
        "description": "(2-2)",
        "rank": "",
        "conferences": [{
          "conferenceName": "SEC",
          "conferenceSeo": "sec"
        }]
      },
      "finalMessage": "FINAL",
      "bracketRound": "",
      "title": "Tennessee Kentucky",
      "url": "/game/4060675",
      "network": "",
      "home": {
        "score": "7",
        "names": {
          "char6": "TENN",
          "short": "Tennessee",
          "seo": "tennessee",
          "full": "University of Tennessee, Knoxville"
        },
        "winner": false,
        "seed": "",
        "description": "(2-2)",
        "rank": "18",
        "conferences": [
          {
            "conferenceName": "SEC",
            "conferenceSeo": "sec"
          },
          {
            "conferenceName": "Top 25",
            "conferenceSeo": "top-25"
          }
        ]
      },
      "liveVideoEnabled": false,
      "startTime": "12:00PM ET",
      "startTimeEpoch": "1602950400",
      "bracketId": "",
      "gameState": "final",
      "startDate": "10-17-2020",
      "currentPeriod": "FINAL",
      "videoState": "",
      "bracketRegion": "",
      "contestClock": "0:00"
    }},
    {"game": {
      "gameID": "51ddba52-aa2e-4b30-bbd0-731da04bdfd6",
      "away": {
        "score": "37",
        "names": {
          "char6": "USF",
          "short": "South Fla.",
          "seo": "south-fla",
          "full": "University of South Florida"
        },
        "winner": false,
        "seed": "",
        "description": "(1-4)",
        "rank": "",
        "conferences": [{
          "conferenceName": "AAC",
          "conferenceSeo": "aac"
        }]
      },
      "finalMessage": "FINAL",
      "bracketRound": "",
      "title": "Temple South Fla.",
      "url": "/game/4060677",
      "network": "",
      "home": {
        "score": "39",
        "names": {
          "char6": "TEMPLE",
          "short": "Temple",
          "seo": "temple",
          "full": "Temple University"
        },
        "winner": true,
        "seed": "",
        "description": "(1-1)",
        "rank": "",
        "conferences": [{
          "conferenceName": "AAC",
          "conferenceSeo": "aac"
        }]
      },
      "liveVideoEnabled": false,
      "startTime": "12:00PM ET",
      "startTimeEpoch": "1602950400",
      "bracketId": "",
      "gameState": "final",
      "startDate": "10-17-2020",
      "currentPeriod": "FINAL",
      "videoState": "",
      "bracketRegion": "",
      "contestClock": "0:00"
    }},
    {"game": {
      "gameID": "a27e69d3-3b7d-463e-95e8-42885cf8ca7b",
      "away": {
        "score": "27",
        "names": {
          "char6": "NAVY",
          "short": "Navy",
          "seo": "navy",
          "full": "U.S. Naval Academy"
        },
        "winner": true,
        "seed": "",
        "description": "(3-2)",
        "rank": "",
        "conferences": [{
          "conferenceName": "AAC",
          "conferenceSeo": "aac"
        }]
      },
      "finalMessage": "FINAL",
      "bracketRound": "",
      "title": "East Carolina Navy",
      "url": "/game/4060683",
      "network": "",
      "home": {
        "score": "23",
        "names": {
          "char6": "E CAR",
          "short": "East Carolina",
          "seo": "east-carolina",
          "full": "East Carolina University"
        },
        "winner": false,
        "seed": "",
        "description": "(1-3)",
        "rank": "",
        "conferences": [{
          "conferenceName": "AAC",
          "conferenceSeo": "aac"
        }]
      },
      "liveVideoEnabled": false,
      "startTime": "12:00PM ET",
      "startTimeEpoch": "1602950400",
      "bracketId": "",
      "gameState": "final",
      "startDate": "10-17-2020",
      "currentPeriod": "FINAL",
      "videoState": "",
      "bracketRegion": "",
      "contestClock": "0:00"
    }},
    {"game": {
      "gameID": "ea3114b1-d24a-491f-af62-3ad592b0885c",
      "away": {
        "score": "",
        "names": {
          "char6": "CO CAR",
          "short": "Coastal Carolina",
          "seo": "coastal-caro",
          "full": "Coastal Carolina University"
        },
        "winner": false,
        "seed": "",
        "description": "(4-0)",
        "rank": "",
        "conferences": [{
          "conferenceName": "Sun Belt",
          "conferenceSeo": "sun-belt"
        }]
      },
      "finalMessage": "",
      "bracketRound": "",
      "title": "Louisiana Coastal Carolina",
      "url": "/game/4060670",
      "network": "",
      "home": {
        "score": "",
        "names": {
          "char6": "ULL",
          "short": "Louisiana",
          "seo": "la-lafayette",
          "full": "University of Louisiana at Lafayette"
        },
        "winner": false,
        "seed": "",
        "description": "(3-1)",
        "rank": "21",
        "conferences": [
          {
            "conferenceName": "Sun Belt",
            "conferenceSeo": "sun-belt"
          },
          {
            "conferenceName": "Top 25",
            "conferenceSeo": "top-25"
          }
        ]
      },
      "liveVideoEnabled": false,
      "startTime": "01:00PM ET",
      "startTimeEpoch": "1602954000",
      "bracketId": "",
      "gameState": "postponed",
      "startDate": "10-17-2020",
      "currentPeriod": "",
      "videoState": "",
      "bracketRegion": "",
      "contestClock": ""
    }},
    {"game": {
      "gameID": "2bfe3913-f44e-4db8-b841-0ac8f9f1c163",
      "away": {
        "score": "14",
        "names": {
          "char6": "W KY",
          "short": "Western Ky.",
          "seo": "western-ky",
          "full": "Western Kentucky University"
        },
        "winner": false,
        "seed": "",
        "description": "(1-4)",
        "rank": "",
        "conferences": [{
          "conferenceName": "C-USA",
          "conferenceSeo": "c-usa"
        }]
      },
      "finalMessage": "FINAL",
      "bracketRound": "",
      "title": "UAB Western Ky.",
      "url": "/game/4060660",
      "network": "",
      "home": {
        "score": "37",
        "names": {
          "char6": "UAB",
          "short": "UAB",
          "seo": "uab",
          "full": "University of Alabama at Birmingham"
        },
        "winner": true,
        "seed": "",
        "description": "(4-1)",
        "rank": "",
        "conferences": [{
          "conferenceName": "C-USA",
          "conferenceSeo": "c-usa"
        }]
      },
      "liveVideoEnabled": false,
      "startTime": "01:30PM ET",
      "startTimeEpoch": "1602955800",
      "bracketId": "",
      "gameState": "final",
      "startDate": "10-17-2020",
      "currentPeriod": "FINAL",
      "videoState": "",
      "bracketRegion": "",
      "contestClock": "0:00"
    }},
    {"game": {
      "gameID": "5ea8a4ba-5ee4-41ff-89be-6ac33fa97263",
      "away": {
        "score": "28",
        "names": {
          "char6": "ARMY",
          "short": "Army West Point",
          "seo": "army",
          "full": "U.S. Military Academy"
        },
        "winner": true,
        "seed": "",
        "description": "(5-1)",
        "rank": "",
        "conferences": [{
          "conferenceName": "FBS Independent",
          "conferenceSeo": "fbs-independent"
        }]
      },
      "finalMessage": "FINAL",
      "bracketRound": "",
      "title": "UTSA Army West Point",
      "url": "/game/4060934",
      "network": "",
      "home": {
        "score": "16",
        "names": {
          "char6": "UTSA",
          "short": "UTSA",
          "seo": "utsa",
          "full": "University of Texas at San Antonio"
        },
        "winner": false,
        "seed": "",
        "description": "(3-3)",
        "rank": "",
        "conferences": [{
          "conferenceName": "C-USA",
          "conferenceSeo": "c-usa"
        }]
      },
      "liveVideoEnabled": false,
      "startTime": "01:30PM ET",
      "startTimeEpoch": "1602955800",
      "bracketId": "",
      "gameState": "final",
      "startDate": "10-17-2020",
      "currentPeriod": "FINAL",
      "videoState": "",
      "bracketRegion": "",
      "contestClock": "0:00"
    }},
    {"game": {
      "gameID": "dd686626-cbca-4493-a5f3-18231c92aa10",
      "away": {
        "score": "7",
        "names": {
          "char6": "LOUIS",
          "short": "Louisville",
          "seo": "louisville",
          "full": "University of Louisville"
        },
        "winner": false,
        "seed": "",
        "description": "(1-4)",
        "rank": "",
        "conferences": [{
          "conferenceName": "ACC",
          "conferenceSeo": "acc"
        }]
      },
      "finalMessage": "FINAL",
      "bracketRound": "",
      "title": "Notre Dame Louisville",
      "url": "/game/4060668",
      "network": "",
      "home": {
        "score": "12",
        "names": {
          "char6": "N DAME",
          "short": "Notre Dame",
          "seo": "notre-dame",
          "full": "University of Notre Dame"
        },
        "winner": true,
        "seed": "",
        "description": "(4-0)",
        "rank": "4",
        "conferences": [
          {
            "conferenceName": "ACC",
            "conferenceSeo": "acc"
          },
          {
            "conferenceName": "Top 25",
            "conferenceSeo": "top-25"
          }
        ]
      },
      "liveVideoEnabled": false,
      "startTime": "02:30PM ET",
      "startTimeEpoch": "1602959400",
      "bracketId": "",
      "gameState": "final",
      "startDate": "10-17-2020",
      "currentPeriod": "FINAL",
      "videoState": "",
      "bracketRegion": "",
      "contestClock": "0:00"
    }},
    {"game": {
      "gameID": "48d4ad61-93fc-4958-8c80-3efaf22ef45b",
      "away": {
        "score": "49",
        "names": {
          "char6": "UCF",
          "short": "UCF",
          "seo": "ucf",
          "full": "University of Central Florida"
        },
        "winner": false,
        "seed": "",
        "description": "(2-2)",
        "rank": "",
        "conferences": [{
          "conferenceName": "AAC",
          "conferenceSeo": "aac"
        }]
      },
      "finalMessage": "FINAL",
      "bracketRound": "",
      "title": "Memphis UCF",
      "url": "/game/4060654",
      "network": "",
      "home": {
        "score": "50",
        "names": {
          "char6": "MEM",
          "short": "Memphis",
          "seo": "memphis",
          "full": "University of Memphis"
        },
        "winner": true,
        "seed": "",
        "description": "(2-1)",
        "rank": "",
        "conferences": [{
          "conferenceName": "AAC",
          "conferenceSeo": "aac"
        }]
      },
      "liveVideoEnabled": false,
      "startTime": "03:30PM ET",
      "startTimeEpoch": "1602963000",
      "bracketId": "",
      "gameState": "final",
      "startDate": "10-17-2020",
      "currentPeriod": "FINAL",
      "videoState": "",
      "bracketRegion": "",
      "contestClock": "0:00"
    }},
    {"game": {
      "gameID": "3dc3575e-096a-4a2f-aef0-9dd73543b621",
      "away": {
        "score": "21",
        "names": {
          "char6": "MISS",
          "short": "Ole Miss",
          "seo": "ole-miss",
          "full": "University of Mississippi"
        },
        "winner": false,
        "seed": "",
        "description": "(1-3)",
        "rank": "",
        "conferences": [{
          "conferenceName": "SEC",
          "conferenceSeo": "sec"
        }]
      },
      "finalMessage": "FINAL",
      "bracketRound": "",
      "title": "Arkansas Ole Miss",
      "url": "/game/4060666",
      "network": "",
      "home": {
        "score": "33",
        "names": {
          "char6": "ARK",
          "short": "Arkansas",
          "seo": "arkansas",
          "full": "University of Arkansas, Fayetteville"
        },
        "winner": true,
        "seed": "",
        "description": "(2-2)",
        "rank": "",
        "conferences": [{
          "conferenceName": "SEC",
          "conferenceSeo": "sec"
        }]
      },
      "liveVideoEnabled": false,
      "startTime": "03:30PM ET",
      "startTimeEpoch": "1602963000",
      "bracketId": "",
      "gameState": "final",
      "startDate": "10-17-2020",
      "currentPeriod": "FINAL",
      "videoState": "",
      "bracketRegion": "",
      "contestClock": "0:00"
    }},
    {"game": {
      "gameID": "9fa9a694-7836-4a54-ac24-fb5b1d140d65",
      "away": {
        "score": "20",
        "names": {
          "char6": "DUKE",
          "short": "Duke",
          "seo": "duke",
          "full": "Duke University"
        },
        "winner": false,
        "seed": "",
        "description": "(1-5)",
        "rank": "",
        "conferences": [{
          "conferenceName": "ACC",
          "conferenceSeo": "acc"
        }]
      },
      "finalMessage": "FINAL",
      "bracketRound": "",
      "title": "NC State Duke",
      "url": "/game/4060682",
      "network": "",
      "home": {
        "score": "31",
        "names": {
          "char6": "NC ST",
          "short": "NC State",
          "seo": "north-carolina-st",
          "full": "North Carolina State University"
        },
        "winner": true,
        "seed": "",
        "description": "(4-1)",
        "rank": "",
        "conferences": [{
          "conferenceName": "ACC",
          "conferenceSeo": "acc"
        }]
      },
      "liveVideoEnabled": false,
      "startTime": "03:30PM ET",
      "startTimeEpoch": "1602963000",
      "bracketId": "",
      "gameState": "final",
      "startDate": "10-17-2020",
      "currentPeriod": "FINAL",
      "videoState": "",
      "bracketRegion": "",
      "contestClock": "0:00"
    }},
    {"game": {
      "gameID": "1c5b6f8e-c6fc-433c-80bc-63ca816922be",
      "away": {
        "score": "29",
        "names": {
          "char6": "E KY",
          "short": "Eastern Ky.",
          "seo": "eastern-ky",
          "full": "Eastern Kentucky University"
        },
        "winner": false,
        "seed": "",
        "description": "(1-4)",
        "rank": "",
        "conferences": [{
          "conferenceName": "OVC",
          "conferenceSeo": "ovc"
        }]
      },
      "finalMessage": "FINAL",
      "bracketRound": "",
      "title": "Troy Eastern Ky.",
      "url": "/game/4060920",
      "network": "",
      "home": {
        "score": "31",
        "names": {
          "char6": "TROY",
          "short": "Troy",
          "seo": "troy",
          "full": "Troy University"
        },
        "winner": true,
        "seed": "",
        "description": "(3-1)",
        "rank": "",
        "conferences": [{
          "conferenceName": "Sun Belt",
          "conferenceSeo": "sun-belt"
        }]
      },
      "liveVideoEnabled": false,
      "startTime": "03:30PM ET",
      "startTimeEpoch": "1602963000",
      "bracketId": "",
      "gameState": "final",
      "startDate": "10-17-2020",
      "currentPeriod": "FINAL",
      "videoState": "",
      "bracketRegion": "",
      "contestClock": "0:00"
    }},
    {"game": {
      "gameID": "ac6fa1ee-42d2-415b-b8c1-49d0e5ac2cc9",
      "away": {
        "score": "28",
        "names": {
          "char6": "TX A&M",
          "short": "Texas A&M",
          "seo": "texas-am",
          "full": "Texas A&M University, College Station"
        },
        "winner": true,
        "seed": "",
        "description": "(3-1)",
        "rank": "11",
        "conferences": [
          {
            "conferenceName": "SEC",
            "conferenceSeo": "sec"
          },
          {
            "conferenceName": "Top 25",
            "conferenceSeo": "top-25"
          }
        ]
      },
      "finalMessage": "FINAL",
      "bracketRound": "",
      "title": "Mississippi St. Texas A&M",
      "url": "/game/4060671",
      "network": "",
      "home": {
        "score": "14",
        "names": {
          "char6": "MISSST",
          "short": "Mississippi St.",
          "seo": "mississippi-st",
          "full": "Mississippi State University"
        },
        "winner": false,
        "seed": "",
        "description": "(1-3)",
        "rank": "",
        "conferences": [{
          "conferenceName": "SEC",
          "conferenceSeo": "sec"
        }]
      },
      "liveVideoEnabled": false,
      "startTime": "04:00PM ET",
      "startTimeEpoch": "1602964800",
      "bracketId": "",
      "gameState": "final",
      "startDate": "10-17-2020",
      "currentPeriod": "FINAL",
      "videoState": "",
      "bracketRegion": "",
      "contestClock": "0:00"
    }},
    {"game": {
      "gameID": "bd91d137-b197-4e53-9ae0-85ddf58fd30e",
      "away": {
        "score": "",
        "names": {
          "char6": "LSU",
          "short": "LSU",
          "seo": "lsu",
          "full": "Louisiana State University"
        },
        "winner": false,
        "seed": "",
        "description": "(1-2)",
        "rank": "",
        "conferences": [{
          "conferenceName": "SEC",
          "conferenceSeo": "sec"
        }]
      },
      "finalMessage": "",
      "bracketRound": "",
      "title": "Florida LSU",
      "url": "/game/4060676",
      "network": "",
      "home": {
        "score": "",
        "names": {
          "char6": "FLA",
          "short": "Florida",
          "seo": "florida",
          "full": "University of Florida"
        },
        "winner": false,
        "seed": "",
        "description": "(2-1)",
        "rank": "10",
        "conferences": [
          {
            "conferenceName": "SEC",
            "conferenceSeo": "sec"
          },
          {
            "conferenceName": "Top 25",
            "conferenceSeo": "top-25"
          }
        ]
      },
      "liveVideoEnabled": false,
      "startTime": "04:00PM ET",
      "startTimeEpoch": "1602964800",
      "bracketId": "",
      "gameState": "postponed",
      "startDate": "10-17-2020",
      "currentPeriod": "",
      "videoState": "",
      "bracketRegion": "",
      "contestClock": ""
    }},
    {"game": {
      "gameID": "6d49be1f-651c-48d3-bc6b-ec43cb4831cb",
      "away": {
        "score": "23",
        "names": {
          "char6": "UVA",
          "short": "Virginia",
          "seo": "virginia",
          "full": "University of Virginia"
        },
        "winner": false,
        "seed": "",
        "description": "(1-3)",
        "rank": "",
        "conferences": [{
          "conferenceName": "ACC",
          "conferenceSeo": "acc"
        }]
      },
      "finalMessage": "FINAL",
      "bracketRound": "",
      "title": "Wake Forest Virginia",
      "url": "/game/4060679",
      "network": "",
      "home": {
        "score": "40",
        "names": {
          "char6": "WAKE",
          "short": "Wake Forest",
          "seo": "wake-forest",
          "full": "Wake Forest University"
        },
        "winner": true,
        "seed": "",
        "description": "(2-2)",
        "rank": "",
        "conferences": [{
          "conferenceName": "ACC",
          "conferenceSeo": "acc"
        }]
      },
      "liveVideoEnabled": false,
      "startTime": "04:00PM ET",
      "startTimeEpoch": "1602964800",
      "bracketId": "",
      "gameState": "final",
      "startDate": "10-17-2020",
      "currentPeriod": "FINAL",
      "videoState": "",
      "bracketRegion": "",
      "contestClock": "0:00"
    }},
    {"game": {
      "gameID": "4d504790-b382-4bd8-8444-11191274e075",
      "away": {
        "score": "0",
        "names": {
          "char6": "UMASS",
          "short": "Massachusetts",
          "seo": "massachusetts",
          "full": "University of Massachusetts, Amherst"
        },
        "winner": false,
        "seed": "",
        "description": "(0-1)",
        "rank": "",
        "conferences": [{
          "conferenceName": "FBS Independent",
          "conferenceSeo": "fbs-independent"
        }]
      },
      "finalMessage": "FINAL",
      "bracketRound": "",
      "title": "Ga. Southern Massachusetts",
      "url": "/game/5025477",
      "network": "",
      "home": {
        "score": "41",
        "names": {
          "char6": "GA SOU",
          "short": "Ga. Southern",
          "seo": "ga-southern",
          "full": "Georgia Southern University"
        },
        "winner": true,
        "seed": "",
        "description": "(3-1)",
        "rank": "",
        "conferences": [{
          "conferenceName": "Sun Belt",
          "conferenceSeo": "sun-belt"
        }]
      },
      "liveVideoEnabled": false,
      "startTime": "04:00PM ET",
      "startTimeEpoch": "1602964800",
      "bracketId": "",
      "gameState": "final",
      "startDate": "10-17-2020",
      "currentPeriod": "FINAL",
      "videoState": "",
      "bracketRegion": "",
      "contestClock": "0:00"
    }},
    {"game": {
      "gameID": "32918acf-0afb-483e-ba50-a861fa346d10",
      "away": {
        "score": "52",
        "names": {
          "char6": "NO TEX",
          "short": "North Texas",
          "seo": "north-texas",
          "full": "University of North Texas"
        },
        "winner": true,
        "seed": "",
        "description": "(2-3)",
        "rank": "",
        "conferences": [{
          "conferenceName": "C-USA",
          "conferenceSeo": "c-usa"
        }]
      },
      "finalMessage": "FINAL",
      "bracketRound": "",
      "title": "Middle Tenn. North Texas",
      "url": "/game/4060664",
      "network": "",
      "home": {
        "score": "35",
        "names": {
          "char6": "MIDTEN",
          "short": "Middle Tenn.",
          "seo": "middle-tenn",
          "full": "Middle Tennessee State University"
        },
        "winner": false,
        "seed": "",
        "description": "(1-5)",
        "rank": "",
        "conferences": [{
          "conferenceName": "C-USA",
          "conferenceSeo": "c-usa"
        }]
      },
      "liveVideoEnabled": false,
      "startTime": "05:00PM ET",
      "startTimeEpoch": "1602968400",
      "bracketId": "",
      "gameState": "final",
      "startDate": "10-17-2020",
      "currentPeriod": "FINAL",
      "videoState": "",
      "bracketRegion": "",
      "contestClock": "0:00"
    }},
    {"game": {
      "gameID": "3ee8910f-a406-40da-beeb-909567eea03b",
      "away": {
        "score": "35",
        "names": {
          "char6": "MARSH",
          "short": "Marshall",
          "seo": "marshall",
          "full": "Marshall University"
        },
        "winner": true,
        "seed": "",
        "description": "(4-0)",
        "rank": "",
        "conferences": [{
          "conferenceName": "C-USA",
          "conferenceSeo": "c-usa"
        }]
      },
      "finalMessage": "FINAL",
      "bracketRound": "",
      "title": "Louisiana Tech Marshall",
      "url": "/game/4060681",
      "network": "",
      "home": {
        "score": "17",
        "names": {
          "char6": "LATECH",
          "short": "Louisiana Tech",
          "seo": "louisiana-tech",
          "full": "Louisiana Tech University"
        },
        "winner": false,
        "seed": "",
        "description": "(3-2)",
        "rank": "",
        "conferences": [{
          "conferenceName": "C-USA",
          "conferenceSeo": "c-usa"
        }]
      },
      "liveVideoEnabled": false,
      "startTime": "06:00PM ET",
      "startTimeEpoch": "1602972000",
      "bracketId": "",
      "gameState": "final",
      "startDate": "10-17-2020",
      "currentPeriod": "FINAL",
      "videoState": "",
      "bracketRegion": "",
      "contestClock": "0:00"
    }},
    {"game": {
      "gameID": "c55de000-24a6-432a-b2f4-2658e2254330",
      "away": {
        "score": "28",
        "names": {
          "char6": "UNC",
          "short": "North Carolina",
          "seo": "north-carolina",
          "full": "University of North Carolina, Chapel Hill"
        },
        "winner": false,
        "seed": "",
        "description": "(3-1)",
        "rank": "5",
        "conferences": [
          {
            "conferenceName": "ACC",
            "conferenceSeo": "acc"
          },
          {
            "conferenceName": "Top 25",
            "conferenceSeo": "top-25"
          }
        ]
      },
      "finalMessage": "FINAL",
      "bracketRound": "",
      "title": "Florida St. North Carolina",
      "url": "/game/4060659",
      "network": "",
      "home": {
        "score": "31",
        "names": {
          "char6": "FSU",
          "short": "Florida St.",
          "seo": "florida-st",
          "full": "Florida State University"
        },
        "winner": true,
        "seed": "",
        "description": "(2-3)",
        "rank": "",
        "conferences": [{
          "conferenceName": "ACC",
          "conferenceSeo": "acc"
        }]
      },
      "liveVideoEnabled": false,
      "startTime": "07:30PM ET",
      "startTimeEpoch": "1602977400",
      "bracketId": "",
      "gameState": "final",
      "startDate": "10-17-2020",
      "currentPeriod": "FINAL",
      "videoState": "",
      "bracketRegion": "",
      "contestClock": "0:00"
    }},
    {"game": {
      "gameID": "cb5ddcb1-8a80-47b3-a232-88573789fa41",
      "away": {
        "score": "",
        "names": {
          "char6": "OKLAST",
          "short": "Oklahoma St.",
          "seo": "oklahoma-st",
          "full": "Oklahoma State University"
        },
        "winner": false,
        "seed": "",
        "description": "(3-0)",
        "rank": "7",
        "conferences": [
          {
            "conferenceName": "Big 12",
            "conferenceSeo": "big-12"
          },
          {
            "conferenceName": "Top 25",
            "conferenceSeo": "top-25"
          }
        ]
      },
      "finalMessage": "",
      "bracketRound": "",
      "title": "Baylor Oklahoma St.",
      "url": "/game/4060667",
      "network": "",
      "home": {
        "score": "",
        "names": {
          "char6": "BAYLOR",
          "short": "Baylor",
          "seo": "baylor",
          "full": "Baylor University"
        },
        "winner": false,
        "seed": "",
        "description": "(1-1)",
        "rank": "",
        "conferences": [{
          "conferenceName": "Big 12",
          "conferenceSeo": "big-12"
        }]
      },
      "liveVideoEnabled": false,
      "startTime": "07:30PM ET",
      "startTimeEpoch": "1602977400",
      "bracketId": "",
      "gameState": "postponed",
      "startDate": "10-17-2020",
      "currentPeriod": "",
      "videoState": "",
      "bracketRegion": "",
      "contestClock": ""
    }},
    {"game": {
      "gameID": "f65b283a-ed8f-406c-b630-79fc67525745",
      "away": {
        "score": "",
        "names": {
          "char6": "VANDY",
          "short": "Vanderbilt",
          "seo": "vanderbilt",
          "full": "Vanderbilt University"
        },
        "winner": false,
        "seed": "",
        "description": "(0-3)",
        "rank": "",
        "conferences": [{
          "conferenceName": "SEC",
          "conferenceSeo": "sec"
        }]
      },
      "finalMessage": "",
      "bracketRound": "",
      "title": "Missouri Vanderbilt",
      "url": "/game/4060680",
      "network": "",
      "home": {
        "score": "",
        "names": {
          "char6": "MIZZOU",
          "short": "Missouri",
          "seo": "missouri",
          "full": "University of Missouri, Columbia"
        },
        "winner": false,
        "seed": "",
        "description": "(1-2)",
        "rank": "",
        "conferences": [{
          "conferenceName": "SEC",
          "conferenceSeo": "sec"
        }]
      },
      "liveVideoEnabled": false,
      "startTime": "07:30PM ET",
      "startTimeEpoch": "1602977400",
      "bracketId": "",
      "gameState": "postponed",
      "startDate": "10-17-2020",
      "currentPeriod": "",
      "videoState": "",
      "bracketRegion": "",
      "contestClock": ""
    }},
    {"game": {
      "gameID": "a6cf5ba9-5952-40f5-a9a5-2a387e4fe455",
      "away": {
        "score": "",
        "names": {
          "char6": "S MISS",
          "short": "Southern Miss.",
          "seo": "southern-miss",
          "full": "The University of Southern Mississippi"
        },
        "winner": false,
        "seed": "",
        "description": "(1-3)",
        "rank": "",
        "conferences": [{
          "conferenceName": "C-USA",
          "conferenceSeo": "c-usa"
        }]
      },
      "finalMessage": "",
      "bracketRound": "",
      "title": "UTEP Southern Miss.",
      "url": "/game/4060684",
      "network": "",
      "home": {
        "score": "",
        "names": {
          "char6": "UTEP",
          "short": "UTEP",
          "seo": "utep",
          "full": "University of Texas at El Paso"
        },
        "winner": false,
        "seed": "",
        "description": "(3-2)",
        "rank": "",
        "conferences": [{
          "conferenceName": "C-USA",
          "conferenceSeo": "c-usa"
        }]
      },
      "liveVideoEnabled": false,
      "startTime": "07:30PM ET",
      "startTimeEpoch": "1602977400",
      "bracketId": "",
      "gameState": "postponed",
      "startDate": "10-17-2020",
      "currentPeriod": "",
      "videoState": "",
      "bracketRegion": "",
      "contestClock": ""
    }},
    {"game": {
      "gameID": "1510ea2b-f19f-41e6-82b4-8f3f81cd795a",
      "away": {
        "score": "14",
        "names": {
          "char6": "BC",
          "short": "Boston College",
          "seo": "boston-college",
          "full": "Boston College"
        },
        "winner": false,
        "seed": "",
        "description": "(3-2)",
        "rank": "",
        "conferences": [{
          "conferenceName": "ACC",
          "conferenceSeo": "acc"
        }]
      },
      "finalMessage": "FINAL",
      "bracketRound": "",
      "title": "Virginia Tech Boston College",
      "url": "/game/4060661",
      "network": "",
      "home": {
        "score": "40",
        "names": {
          "char6": "VT",
          "short": "Virginia Tech",
          "seo": "virginia-tech",
          "full": "Virginia Polytechnic Institute and State University"
        },
        "winner": true,
        "seed": "",
        "description": "(3-1)",
        "rank": "23",
        "conferences": [
          {
            "conferenceName": "ACC",
            "conferenceSeo": "acc"
          },
          {
            "conferenceName": "Top 25",
            "conferenceSeo": "top-25"
          }
        ]
      },
      "liveVideoEnabled": false,
      "startTime": "08:00PM ET",
      "startTimeEpoch": "1602979200",
      "bracketId": "",
      "gameState": "final",
      "startDate": "10-17-2020",
      "currentPeriod": "FINAL",
      "videoState": "",
      "bracketRegion": "",
      "contestClock": "0:00"
    }},
    {"game": {
      "gameID": "4057dd28-5ba9-419a-a161-e98e1f6af0dd",
      "away": {
        "score": "",
        "names": {
          "char6": "FIU",
          "short": "FIU",
          "seo": "fiu",
          "full": "Florida International University"
        },
        "winner": false,
        "seed": "",
        "description": "(0-2)",
        "rank": "",
        "conferences": [{
          "conferenceName": "C-USA",
          "conferenceSeo": "c-usa"
        }]
      },
      "finalMessage": "",
      "bracketRound": "",
      "title": "Charlotte FIU",
      "url": "/game/4060663",
      "network": "",
      "home": {
        "score": "",
        "names": {
          "char6": "CHAR",
          "short": "Charlotte",
          "seo": "charlotte",
          "full": "The University of North Carolina at Charlotte"
        },
        "winner": false,
        "seed": "",
        "description": "(1-2)",
        "rank": "",
        "conferences": [{
          "conferenceName": "C-USA",
          "conferenceSeo": "c-usa"
        }]
      },
      "liveVideoEnabled": false,
      "startTime": "08:00PM ET",
      "startTimeEpoch": "1602979200",
      "bracketId": "",
      "gameState": "postponed",
      "startDate": "10-17-2020",
      "currentPeriod": "",
      "videoState": "",
      "bracketRegion": "",
      "contestClock": ""
    }},
    {"game": {
      "gameID": "0729c32d-883e-4c28-a3c2-cac79ef7be5f",
      "away": {
        "score": "24",
        "names": {
          "char6": "UGA",
          "short": "Georgia",
          "seo": "georgia",
          "full": "University of Georgia"
        },
        "winner": false,
        "seed": "",
        "description": "(3-1)",
        "rank": "3",
        "conferences": [
          {
            "conferenceName": "SEC",
            "conferenceSeo": "sec"
          },
          {
            "conferenceName": "Top 25",
            "conferenceSeo": "top-25"
          }
        ]
      },
      "finalMessage": "FINAL",
      "bracketRound": "",
      "title": "Alabama Georgia",
      "url": "/game/4060672",
      "network": "",
      "home": {
        "score": "41",
        "names": {
          "char6": "ALA",
          "short": "Alabama",
          "seo": "alabama",
          "full": "University of Alabama"
        },
        "winner": true,
        "seed": "",
        "description": "(4-0)",
        "rank": "2",
        "conferences": [
          {
            "conferenceName": "SEC",
            "conferenceSeo": "sec"
          },
          {
            "conferenceName": "Top 25",
            "conferenceSeo": "top-25"
          }
        ]
      },
      "liveVideoEnabled": false,
      "startTime": "08:00PM ET",
      "startTimeEpoch": "1602979200",
      "bracketId": "",
      "gameState": "final",
      "startDate": "10-17-2020",
      "currentPeriod": "FINAL",
      "videoState": "",
      "bracketRegion": "",
      "contestClock": "0:00"
    }}
  ]
}