{
  "inputMD5Sum": "8712e1e424a4287c6ea2a40bc3f8d79f",
  "updated_at": "12-13-2020 14:02:56",
  "games": [
    {"game": {
      "gameID": "789dd743-eb83-46b9-9ad0-2d8a31f5b781",
      "away": {
        "score": "31",
        "names": {
          "char6": "FAU",
          "short": "Fla. Atlantic",
          "seo": "fla-atlantic",
          "full": "Florida Atlantic University"
        },
        "winner": false,
        "seed": "",
        "description": "(5-3)",
        "rank": "",
        "conferences": [{
          "conferenceName": "C-USA",
          "conferenceSeo": "c-usa"
        }]
      },
      "finalMessage": "FINAL",
      "bracketRound": "",
      "title": "Southern Miss. Fla. Atlantic",
      "url": "/game/5603406",
      "network": "",
      "home": {
        "score": "45",
        "names": {
          "char6": "S MISS",
          "short": "Southern Miss.",
          "seo": "southern-miss",
          "full": "The University of Southern Mississippi"
        },
        "winner": true,
        "seed": "",
        "description": "(3-7)",
        "rank": "",
        "conferences": [{
          "conferenceName": "C-USA",
          "conferenceSeo": "c-usa"
        }]
      },
      "liveVideoEnabled": false,
      "startTime": "06:30PM ET",
      "startTimeEpoch": "1607643000",
      "bracketId": "",
      "gameState": "final",
      "startDate": "12-10-2020",
      "currentPeriod": "FINAL",
      "videoState": "",
      "bracketRegion": "",
      "contestClock": "0:00"
    }},
    {"game": {
      "gameID": "ddbb8f3e-cb90-4051-8103-2a4ea557ab99",
      "away": {
        "score": "34",
        "names": {
          "char6": "PITT",
          "short": "Pittsburgh",
          "seo": "pittsburgh",
          "full": "University of Pittsburgh"
        },
        "winner": true,
        "seed": "",
        "description": "(6-5)",
        "rank": "",
        "conferences": [{
          "conferenceName": "ACC",
          "conferenceSeo": "acc"
        }]
      },
      "finalMessage": "FINAL",
      "bracketRound": "",
      "title": "Georgia Tech Pittsburgh",
      "url": "/game/5760401",
      "network": "",
      "home": {
        "score": "20",
        "names": {
          "char6": "GATECH",
          "short": "Georgia Tech",
          "seo": "georgia-tech",
          "full": "Georgia Institute of Technology"
        },
        "winner": false,
        "seed": "",
        "description": "(3-7)",
        "rank": "",
        "conferences": [{
          "conferenceName": "ACC",
          "conferenceSeo": "acc"
        }]
      },
      "liveVideoEnabled": false,
      "startTime": "07:00PM ET",
      "startTimeEpoch": "1607644800",
      "bracketId": "",
      "gameState": "final",
      "startDate": "12-10-2020",
      "currentPeriod": "FINAL",
      "videoState": "",
      "bracketRegion": "",
      "contestClock": "0:00"
    }},
    {"game": {
      "gameID": "2356b1d7-0c86-414f-a95c-158b24ead25a",
      "away": {
        "score": "",
        "names": {
          "char6": "W CAR",
          "short": "Western Caro.",
          "seo": "western-caro",
          "full": "Western Carolina University"
        },
        "winner": false,
        "seed": "",
        "description": "(0-3)",
        "rank": "",
        "conferences": [{
          "conferenceName": "SoCon",
          "conferenceSeo": "socon"
        }]
      },
      "finalMessage": "",
      "bracketRound": "",
      "title": "North Carolina Western Caro.",
      "url": "/game/4809508",
      "network": "",
      "home": {
        "score": "",
        "names": {
          "char6": "UNC",
          "short": "North Carolina",
          "seo": "north-carolina",
          "full": "University of North Carolina, Chapel Hill"
        },
        "winner": false,
        "seed": "",
        "description": "(7-3)",
        "rank": "17",
        "conferences": [
          {
            "conferenceName": "ACC",
            "conferenceSeo": "acc"
          },
          {
            "conferenceName": "Top 25",
            "conferenceSeo": "top-25"
          }
        ]
      },
      "liveVideoEnabled": false,
      "startTime": "01:00PM ET",
      "startTimeEpoch": "1607709600",
      "bracketId": "",
      "gameState": "postponed",
      "startDate": "12-11-2020",
      "currentPeriod": "",
      "videoState": "",
      "bracketRegion": "",
      "contestClock": ""
    }},
    {"game": {
      "gameID": "f73ad19d-87cd-475e-8391-44511e922946",
      "away": {
        "score": "45",
        "names": {
          "char6": "NO TEX",
          "short": "North Texas",
          "seo": "north-texas",
          "full": "University of North Texas"
        },
        "winner": true,
        "seed": "",
        "description": "(4-5)",
        "rank": "",
        "conferences": [{
          "conferenceName": "C-USA",
          "conferenceSeo": "c-usa"
        }]
      },
      "finalMessage": "FINAL",
      "bracketRound": "",
      "title": "UTEP North Texas",
      "url": "/game/5603408",
      "network": "",
      "home": {
        "score": "43",
        "names": {
          "char6": "UTEP",
          "short": "UTEP",
          "seo": "utep",
          "full": "University of Texas at El Paso"
        },
        "winner": false,
        "seed": "",
        "description": "(3-5)",
        "rank": "",
        "conferences": [{
          "conferenceName": "C-USA",
          "conferenceSeo": "c-usa"
        }]
      },
      "liveVideoEnabled": false,
      "startTime": "06:00PM ET",
      "startTimeEpoch": "1607727600",
      "bracketId": "",
      "gameState": "final",
      "startDate": "12-11-2020",
      "currentPeriod": "FINAL",
      "videoState": "",
      "bracketRegion": "",
      "contestClock": "0:00"
    }},
    {"game": {
      "gameID": "6656fd0d-7a47-4b5f-8e9f-47913accbdf0",
      "away": {
        "score": "70",
        "names": {
          "char6": "AZ ST",
          "short": "Arizona St.",
          "seo": "arizona-st",
          "full": "Arizona State University"
        },
        "winner": true,
        "seed": "",
        "description": "(1-2)",
        "rank": "",
        "conferences": [{
          "conferenceName": "Pac-12",
          "conferenceSeo": "pac-12"
        }]
      },
      "finalMessage": "FINAL",
      "bracketRound": "",
      "title": "Arizona Arizona St.",
      "url": "/game/4915148",
      "network": "",
      "home": {
        "score": "7",
        "names": {
          "char6": "ARIZ",
          "short": "Arizona",
          "seo": "arizona",
          "full": "University of Arizona"
        },
        "winner": false,
        "seed": "",
        "description": "(0-5)",
        "rank": "",
        "conferences": [{
          "conferenceName": "Pac-12",
          "conferenceSeo": "pac-12"
        }]
      },
      "liveVideoEnabled": false,
      "startTime": "07:00PM ET",
      "startTimeEpoch": "1607731200",
      "bracketId": "",
      "gameState": "final",
      "startDate": "12-11-2020",
      "currentPeriod": "FINAL",
      "videoState": "",
      "bracketRegion": "",
      "contestClock": "0:00"
    }},
    {"game": {
      "gameID": "0dc08841-9b6f-411e-8d83-9f49603d237f",
      "away": {
        "score": "20",
        "names": {
          "char6": "NEVADA",
          "short": "Nevada",
          "seo": "nevada",
          "full": "University of Nevada, Reno"
        },
        "winner": false,
        "seed": "",
        "description": "(6-2)",
        "rank": "",
        "conferences": [{
          "conferenceName": "Mountain West",
          "conferenceSeo": "mountain-west"
        }]
      },
      "finalMessage": "FINAL",
      "bracketRound": "",
      "title": "San Jose St. Nevada",
      "url": "/game/4877540",
      "network": "",
      "home": {
        "score": "30",
        "names": {
          "char6": "SJSU",
          "short": "San Jose St.",
          "seo": "san-jose-st",
          "full": "San Jose State University"
        },
        "winner": true,
        "seed": "",
        "description": "(6-0)",
        "rank": "",
        "conferences": [{
          "conferenceName": "Mountain West",
          "conferenceSeo": "mountain-west"
        }]
      },
      "liveVideoEnabled": false,
      "startTime": "10:00PM ET",
      "startTimeEpoch": "1607742000",
      "bracketId": "",
      "gameState": "final",
      "startDate": "12-11-2020",
      "currentPeriod": "FINAL",
      "videoState": "",
      "bracketRegion": "",
      "contestClock": "0:00"
    }},
    {"game": {
      "gameID": "021ea87e-054a-48f7-9c3d-879e9164dbea",
      "away": {
        "score": "24",
        "names": {
          "char6": "MICHST",
          "short": "Michigan St.",
          "seo": "michigan-st",
          "full": "Michigan State University"
        },
        "winner": false,
        "seed": "",
        "description": "(2-5)",
        "rank": "",
        "conferences": [{
          "conferenceName": "Big Ten",
          "conferenceSeo": "big-ten"
        }]
      },
      "finalMessage": "FINAL",
      "bracketRound": "",
      "title": "Penn St. Michigan St.",
      "url": "/game/4616397",
      "network": "",
      "home": {
        "score": "39",
        "names": {
          "char6": "PENNST",
          "short": "Penn St.",
          "seo": "penn-st",
          "full": "Pennsylvania State University"
        },
        "winner": true,
        "seed": "",
        "description": "(3-5)",
        "rank": "",
        "conferences": [{
          "conferenceName": "Big Ten",
          "conferenceSeo": "big-ten"
        }]
      },
      "liveVideoEnabled": false,
      "startTime": "12:00PM ET",
      "startTimeEpoch": "1607792400",
      "bracketId": "",
      "gameState": "final",
      "startDate": "12-12-2020",
      "currentPeriod": "FINAL",
      "videoState": "",
      "bracketRegion": "",
      "contestClock": "0:00"
    }},
    {"game": {
      "gameID": "26645f8a-ff9a-48dd-bde7-26c722098721",
      "away": {
        "score": "27",
        "names": {
          "char6": "RUTGER",
          "short": "Rutgers",
          "seo": "rutgers",
          "full": "Rutgers, The State University of New Jersey, New Brunswick"
        },
        "winner": true,
        "seed": "",
        "description": "(3-5)",
        "rank": "",
        "conferences": [{
          "conferenceName": "Big Ten",
          "conferenceSeo": "big-ten"
        }]
      },
      "finalMessage": "FINAL (OT)",
      "bracketRound": "",
      "title": "Maryland Rutgers",
      "url": "/game/4616398",
      "network": "",
      "home": {
        "score": "24",
        "names": {
          "char6": "MD",
          "short": "Maryland",
          "seo": "maryland",
          "full": "University of Maryland, College Park"
        },
        "winner": false,
        "seed": "",
        "description": "(2-3)",
        "rank": "",
        "conferences": [{
          "conferenceName": "Big Ten",
          "conferenceSeo": "big-ten"
        }]
      },
      "liveVideoEnabled": false,
      "startTime": "12:00PM ET",
      "startTimeEpoch": "1607792400",
      "bracketId": "",
      "gameState": "final",
      "startDate": "12-12-2020",
      "currentPeriod": "FINAL (OT)",
      "videoState": "",
      "bracketRegion": "",
      "contestClock": ""
    }},
    {"game": {
      "gameID": "70413d96-1bac-451b-a4c6-82607fcd9f2c",
      "away": {
        "score": "10",
        "names": {
          "char6": "ILL",
          "short": "Illinois",
          "seo": "illinois",
          "full": "University of Illinois Urbana-Champaign"
        },
        "winner": false,
        "seed": "",
        "description": "(2-5)",
        "rank": "",
        "conferences": [{
          "conferenceName": "Big Ten",
          "conferenceSeo": "big-ten"
        }]
      },
      "finalMessage": "FINAL",
      "bracketRound": "",
      "title": "Northwestern Illinois",
      "url": "/game/4616399",
      "network": "",
      "home": {
        "score": "28",
        "names": {
          "char6": "NWSTRN",
          "short": "Northwestern",
          "seo": "northwestern",
          "full": "Northwestern University"
        },
        "winner": true,
        "seed": "",
        "description": "(6-1)",
        "rank": "14",
        "conferences": [
          {
            "conferenceName": "Big Ten",
            "conferenceSeo": "big-ten"
          },
          {
            "conferenceName": "Top 25",
            "conferenceSeo": "top-25"
          }
        ]
      },
      "liveVideoEnabled": false,
      "startTime": "12:00PM ET",
      "startTimeEpoch": "1607792400",
      "bracketId": "",
      "gameState": "final",
      "startDate": "12-12-2020",
      "currentPeriod": "FINAL",
      "videoState": "",
      "bracketRegion": "",
      "contestClock": "0:00"
    }},
    {"game": {
      "gameID": "3b6286d2-df1c-498f-a8f2-309ed318a1c0",
      "away": {
        "score": "24",
        "names": {
          "char6": "MINN",
          "short": "Minnesota",
          "seo": "minnesota",
          "full": "University of Minnesota, Twin Cities"
        },
        "winner": true,
        "seed": "",
        "description": "(3-3)",
        "rank": "",
        "conferences": [{
          "conferenceName": "Big Ten",
          "conferenceSeo": "big-ten"
        }]
      },
      "finalMessage": "FINAL",
      "bracketRound": "",
      "title": "Nebraska Minnesota",
      "url": "/game/4616401",
      "network": "",
      "home": {
        "score": "17",
        "names": {
          "char6": "NEB",
          "short": "Nebraska",
          "seo": "nebraska",
          "full": "University of Nebraska, Lincoln"
        },
        "winner": false,
        "seed": "",
        "description": "(2-5)",
        "rank": "",
        "conferences": [{
          "conferenceName": "Big Ten",
          "conferenceSeo": "big-ten"
        }]
      },
      "liveVideoEnabled": false,
      "startTime": "12:00PM ET",
      "startTimeEpoch": "1607792400",
      "bracketId": "",
      "gameState": "final",
      "startDate": "12-12-2020",
      "currentPeriod": "FINAL",
      "videoState": "",
      "bracketRegion": "",
      "contestClock": "0:00"
    }},
    {"game": {
      "gameID": "17718b62-0d28-4eda-b04b-333f5f1f1fe7",
      "away": {
        "score": "38",
        "names": {
          "char6": "UTAH",
          "short": "Utah",
          "seo": "utah",
          "full": "University of Utah"
        },
        "winner": true,
        "seed": "",
        "description": "(2-2)",
        "rank": "",
        "conferences": [{
          "conferenceName": "Pac-12",
          "conferenceSeo": "pac-12"
        }]
      },
      "finalMessage": "FINAL",
      "bracketRound": "",
      "title": "Colorado Utah",
      "url": "/game/4915149",
      "network": "",
      "home": {
        "score": "21",
        "names": {
          "char6": "COLO",
          "short": "Colorado",
          "seo": "colorado",
          "full": "University of Colorado, Boulder"
        },
        "winner": false,
        "seed": "",
        "description": "(4-1)",
        "rank": "21",
        "conferences": [
          {
            "conferenceName": "Pac-12",
            "conferenceSeo": "pac-12"
          },
          {
            "conferenceName": "Top 25",
            "conferenceSeo": "top-25"
          }
        ]
      },
      "liveVideoEnabled": false,
      "startTime": "12:00PM ET",
      "startTimeEpoch": "1607792400",
      "bracketId": "",
      "gameState": "final",
      "startDate": "12-12-2020",
      "currentPeriod": "FINAL",
      "videoState": "",
      "bracketRegion": "",
      "contestClock": "0:00"
    }},
    {"game": {
      "gameID": "211ab9fb-e623-4bea-8d8d-e980dd0e25e6",
      "away": {
        "score": "33",
        "names": {
          "char6": "NIU",
          "short": "Northern Ill.",
          "seo": "northern-ill",
          "full": "Northern Illinois University"
        },
        "winner": false,
        "seed": "",
        "description": "(0-6)",
        "rank": "",
        "conferences": [{
          "conferenceName": "MAC",
          "conferenceSeo": "mac"
        }]
      },
      "finalMessage": "FINAL",
      "bracketRound": "",
      "title": "Eastern Mich. Northern Ill.",
      "url": "/game/5004727",
      "network": "",
      "home": {
        "score": "41",
        "names": {
          "char6": "E MICH",
          "short": "Eastern Mich.",
          "seo": "eastern-mich",
          "full": "Eastern Michigan University"
        },
        "winner": true,
        "seed": "",
        "description": "(2-4)",
        "rank": "",
        "conferences": [{
          "conferenceName": "MAC",
          "conferenceSeo": "mac"
        }]
      },
      "liveVideoEnabled": false,
      "startTime": "12:00PM ET",
      "startTimeEpoch": "1607792400",
      "bracketId": "",
      "gameState": "final",
      "startDate": "12-12-2020",
      "currentPeriod": "FINAL",
      "videoState": "",
      "bracketRegion": "",
      "contestClock": "0:00"
    }},
    {"game": {
      "gameID": "44ff04dd-4b58-4510-a906-40927c819afc",
      "away": {
        "score": "27",
        "names": {
          "char6": "W MICH",
          "short": "Western Mich.",
          "seo": "western-mich",
          "full": "Western Michigan University"
        },
        "winner": false,
        "seed": "",
        "description": "(4-2)",
        "rank": "",
        "conferences": [{
          "conferenceName": "MAC",
          "conferenceSeo": "mac"
        }]
      },
      "finalMessage": "FINAL",
      "bracketRound": "",
      "title": "Ball St. Western Mich.",
      "url": "/game/5004728",
      "network": "",
      "home": {
        "score": "30",
        "names": {
          "char6": "BALLST",
          "short": "Ball St.",
          "seo": "ball-st",
          "full": "Ball State University"
        },
        "winner": true,
        "seed": "",
        "description": "(5-1)",
        "rank": "",
        "conferences": [{
          "conferenceName": "MAC",
          "conferenceSeo": "mac"
        }]
      },
      "liveVideoEnabled": false,
      "startTime": "12:00PM ET",
      "startTimeEpoch": "1607792400",
      "bracketId": "",
      "gameState": "final",
      "startDate": "12-12-2020",
      "currentPeriod": "FINAL",
      "videoState": "",
      "bracketRegion": "",
      "contestClock": "0:00"
    }},
    {"game": {
      "gameID": "beafecdc-9942-42b6-8202-4e874780f6cf",
      "away": {
        "score": "21",
        "names": {
          "char6": "WAKE",
          "short": "Wake Forest",
          "seo": "wake-forest",
          "full": "Wake Forest University"
        },
        "winner": false,
        "seed": "",
        "description": "(4-3)",
        "rank": "",
        "conferences": [{
          "conferenceName": "ACC",
          "conferenceSeo": "acc"
        }]
      },
      "finalMessage": "FINAL",
      "bracketRound": "",
      "title": "Louisville Wake Forest",
      "url": "/game/5770597",
      "network": "",
      "home": {
        "score": "45",
        "names": {
          "char6": "LOUIS",
          "short": "Louisville",
          "seo": "louisville",
          "full": "University of Louisville"
        },
        "winner": true,
        "seed": "",
        "description": "(3-7)",
        "rank": "",
        "conferences": [{
          "conferenceName": "ACC",
          "conferenceSeo": "acc"
        }]
      },
      "liveVideoEnabled": false,
      "startTime": "12:00PM ET",
      "startTimeEpoch": "1607792400",
      "bracketId": "",
      "gameState": "final",
      "startDate": "12-12-2020",
      "currentPeriod": "FINAL",
      "videoState": "",
      "bracketRegion": "",
      "contestClock": "0:00"
    }},
    {"game": {
      "gameID": "3e174f84-242f-436d-8624-ee4282410fdb",
      "away": {
        "score": "49",
        "names": {
          "char6": "UGA",
          "short": "Georgia",
          "seo": "georgia",
          "full": "University of Georgia"
        },
        "winner": true,
        "seed": "",
        "description": "(7-2)",
        "rank": "9",
        "conferences": [
          {
            "conferenceName": "SEC",
            "conferenceSeo": "sec"
          },
          {
            "conferenceName": "Top 25",
            "conferenceSeo": "top-25"
          }
        ]
      },
      "finalMessage": "FINAL",
      "bracketRound": "",
      "title": "Missouri Georgia",
      "url": "/game/5771035",
      "network": "",
      "home": {
        "score": "14",
        "names": {
          "char6": "MIZZOU",
          "short": "Missouri",
          "seo": "missouri",
          "full": "University of Missouri, Columbia"
        },
        "winner": false,
        "seed": "",
        "description": "(5-3)",
        "rank": "25",
        "conferences": [
          {
            "conferenceName": "SEC",
            "conferenceSeo": "sec"
          },
          {
            "conferenceName": "Top 25",
            "conferenceSeo": "top-25"
          }
        ]
      },
      "liveVideoEnabled": false,
      "startTime": "12:00PM ET",
      "startTimeEpoch": "1607792400",
      "bracketId": "",
      "gameState": "final",
      "startDate": "12-12-2020",
      "currentPeriod": "FINAL",
      "videoState": "",
      "bracketRegion": "",
      "contestClock": "0:00"
    }},
    {"game": {
      "gameID": "158a7724-a2eb-4cd6-bc96-537ee2db4cf8",
      "away": {
        "score": "52",
        "names": {
          "char6": "ALA",
          "short": "Alabama",
          "seo": "alabama",
          "full": "University of Alabama"
        },
        "winner": true,
        "seed": "",
        "description": "(10-0)",
        "rank": "1",
        "conferences": [
          {
            "conferenceName": "SEC",
            "conferenceSeo": "sec"
          },
          {
            "conferenceName": "Top 25",
            "conferenceSeo": "top-25"
          }
        ]
      },
      "finalMessage": "FINAL",
      "bracketRound": "",
      "title": "Arkansas Alabama",
      "url": "/game/5771036",
      "network": "",
      "home": {
        "score": "3",
        "names": {
          "char6": "ARK",
          "short": "Arkansas",
          "seo": "arkansas",
          "full": "University of Arkansas, Fayetteville"
        },
        "winner": false,
        "seed": "",
        "description": "(3-7)",
        "rank": "",
        "conferences": [{
          "conferenceName": "SEC",
          "conferenceSeo": "sec"
        }]
      },
      "liveVideoEnabled": false,
      "startTime": "12:00PM ET",
      "startTimeEpoch": "1607792400",
      "bracketId": "",
      "gameState": "final",
      "startDate": "12-12-2020",
      "currentPeriod": "FINAL",
      "videoState": "",
      "bracketRegion": "",
      "contestClock": "0:00"
    }},
    {"game": {
      "gameID": "b2c6ea26-b456-4a53-bf17-64e59973efab",
      "away": {
        "score": "",
        "names": {
          "char6": "TROY",
          "short": "Troy",
          "seo": "troy",
          "full": "Troy University"
        },
        "winner": false,
        "seed": "",
        "description": "(5-5)",
        "rank": "",
        "conferences": [{
          "conferenceName": "Sun Belt",
          "conferenceSeo": "sun-belt"
        }]
      },
      "finalMessage": "",
      "bracketRound": "",
      "title": "South Alabama Troy",
      "url": "/game/4961677",
      "network": "",
      "home": {
        "score": "",
        "names": {
          "char6": "S ALA",
          "short": "South Alabama",
          "seo": "south-ala",
          "full": "University of South Alabama"
        },
        "winner": false,
        "seed": "",
        "description": "(4-7)",
        "rank": "",
        "conferences": [{
          "conferenceName": "Sun Belt",
          "conferenceSeo": "sun-belt"
        }]
      },
      "liveVideoEnabled": false,
      "startTime": "01:00PM ET",
      "startTimeEpoch": "1607796000",
      "bracketId": "",
      "gameState": "postponed",
      "startDate": "12-12-2020",
      "currentPeriod": "",
      "videoState": "",
      "bracketRegion": "",
      "contestClock": ""
    }},
    {"game": {
      "gameID": "f803097a-b841-4257-a764-b0fc2b488167",
      "away": {
        "score": "",
        "names": {
          "char6": "VANDY",
          "short": "Vanderbilt",
          "seo": "vanderbilt",
          "full": "Vanderbilt University"
        },
        "winner": false,
        "seed": "",
        "description": "(0-8)",
        "rank": "",
        "conferences": [{
          "conferenceName": "SEC",
          "conferenceSeo": "sec"
        }]
      },
      "finalMessage": "",
      "bracketRound": "",
      "title": "Missouri Vanderbilt",
      "url": "/game/5206186",
      "network": "",
      "home": {
        "score": "",
        "names": {
          "char6": "MIZZOU",
          "short": "Missouri",
          "seo": "missouri",
          "full": "University of Missouri, Columbia"
        },
        "winner": false,
        "seed": "",
        "description": "(5-4)",
        "rank": "25",
        "conferences": [
          {
            "conferenceName": "SEC",
            "conferenceSeo": "sec"
          },
          {
            "conferenceName": "Top 25",
            "conferenceSeo": "top-25"
          }
        ]
      },
      "liveVideoEnabled": false,
      "startTime": "01:00PM ET",
      "startTimeEpoch": "1607796000",
      "bracketId": "",
      "gameState": "postponed",
      "startDate": "12-12-2020",
      "currentPeriod": "",
      "videoState": "",
      "bracketRegion": "",
      "contestClock": ""
    }},
    {"game": {
      "gameID": "97e6c20b-f25a-46c7-afcf-478224f3c1d1",
      "away": {
        "score": "21",
        "names": {
          "char6": "UAB",
          "short": "UAB",
          "seo": "uab",
          "full": "University of Alabama at Birmingham"
        },
        "winner": true,
        "seed": "",
        "description": "(5-3)",
        "rank": "",
        "conferences": [{
          "conferenceName": "C-USA",
          "conferenceSeo": "c-usa"
        }]
      },
      "finalMessage": "FINAL",
      "bracketRound": "",
      "title": "Rice UAB",
      "url": "/game/5603409",
      "network": "",
      "home": {
        "score": "16",
        "names": {
          "char6": "RICE",
          "short": "Rice",
          "seo": "rice",
          "full": "Rice University"
        },
        "winner": false,
        "seed": "",
        "description": "(2-3)",
        "rank": "",
        "conferences": [{
          "conferenceName": "C-USA",
          "conferenceSeo": "c-usa"
        }]
      },
      "liveVideoEnabled": false,
      "startTime": "01:00PM ET",
      "startTimeEpoch": "1607796000",
      "bracketId": "",
      "gameState": "final",
      "startDate": "12-12-2020",
      "currentPeriod": "FINAL",
      "videoState": "",
      "bracketRegion": "",
      "contestClock": "0:00"
    }},
    {"game": {
      "gameID": "2439d220-efa8-47a5-bf5b-bc4af4a89f13",
      "away": {
        "score": "",
        "names": {
          "char6": "LA MON",
          "short": "ULM",
          "seo": "la-monroe",
          "full": "University of Louisiana Monroe"
        },
        "winner": false,
        "seed": "",
        "description": "(0-10)",
        "rank": "",
        "conferences": [{
          "conferenceName": "Sun Belt",
          "conferenceSeo": "sun-belt"
        }]
      },
      "finalMessage": "",
      "bracketRound": "",
      "title": "Arkansas St. ULM",
      "url": "/game/5739397",
      "network": "",
      "home": {
        "score": "",
        "names": {
          "char6": "ARK ST",
          "short": "Arkansas St.",
          "seo": "arkansas-st",
          "full": "Arkansas State University"
        },
        "winner": false,
        "seed": "",
        "description": "(4-7)",
        "rank": "",
        "conferences": [{
          "conferenceName": "Sun Belt",
          "conferenceSeo": "sun-belt"
        }]
      },
      "liveVideoEnabled": false,
      "startTime": "01:00PM ET",
      "startTimeEpoch": "1607796000",
      "bracketId": "",
      "gameState": "postponed",
      "startDate": "12-12-2020",
      "currentPeriod": "",
      "videoState": "",
      "bracketRegion": "",
      "contestClock": ""
    }},
    {"game": {
      "gameID": "e0e089ac-27c7-480f-ae98-730cbf281716",
      "away": {
        "score": "",
        "names": {
          "char6": "LOUIS",
          "short": "Louisville",
          "seo": "louisville",
          "full": "University of Louisville"
        },
        "winner": false,
        "seed": "",
        "description": "(4-7)",
        "rank": "",
        "conferences": [{
          "conferenceName": "ACC",
          "conferenceSeo": "acc"
        }]
      },
      "finalMessage": "",
      "bracketRound": "",
      "title": "Boston College Louisville",
      "url": "/game/5760527",
      "network": "",
      "home": {
        "score": "",
        "names": {
          "char6": "BC",
          "short": "Boston College",
          "seo": "boston-college",
          "full": "Boston College"
        },
        "winner": false,
        "seed": "",
        "description": "(6-5)",
        "rank": "",
        "conferences": [{
          "conferenceName": "ACC",
          "conferenceSeo": "acc"
        }]
      },
      "liveVideoEnabled": false,
      "startTime": "01:00PM ET",
      "startTimeEpoch": "1607796000",
      "bracketId": "",
      "gameState": "postponed",
      "startDate": "12-12-2020",
      "currentPeriod": "",
      "videoState": "",
      "bracketRegion": "",
      "contestClock": ""
    }},
    {"game": {
      "gameID": "153e2017-3997-4529-ab81-86ab7e9850cf",
      "away": {
        "score": "",
        "names": {
          "char6": "TX A&M",
          "short": "Texas A&M",
          "seo": "texas-am",
          "full": "Texas A&M University, College Station"
        },
        "winner": false,
        "seed": "",
        "description": "(7-1)",
        "rank": "5",
        "conferences": [
          {
            "conferenceName": "SEC",
            "conferenceSeo": "sec"
          },
          {
            "conferenceName": "Top 25",
            "conferenceSeo": "top-25"
          }
        ]
      },
      "finalMessage": "",
      "bracketRound": "",
      "title": "Tennessee Texas A&M",
      "url": "/game/5770860",
      "network": "",
      "home": {
        "score": "",
        "names": {
          "char6": "TENN",
          "short": "Tennessee",
          "seo": "tennessee",
          "full": "University of Tennessee, Knoxville"
        },
        "winner": false,
        "seed": "",
        "description": "(2-6)",
        "rank": "",
        "conferences": [{
          "conferenceName": "SEC",
          "conferenceSeo": "sec"
        }]
      },
      "liveVideoEnabled": false,
      "startTime": "01:00PM ET",
      "startTimeEpoch": "1607796000",
      "bracketId": "",
      "gameState": "postponed",
      "startDate": "12-12-2020",
      "currentPeriod": "",
      "videoState": "",
      "bracketRegion": "",
      "contestClock": ""
    }},
    {"game": {
      "gameID": "36b8cd9f-3289-4c5d-b13f-36e4d9dee462",
      "away": {
        "score": "7",
        "names": {
          "char6": "AKRON",
          "short": "Akron",
          "seo": "akron",
          "full": "University of Akron"
        },
        "winner": false,
        "seed": "",
        "description": "(1-5)",
        "rank": "",
        "conferences": [{
          "conferenceName": "MAC",
          "conferenceSeo": "mac"
        }]
      },
      "finalMessage": "FINAL",
      "bracketRound": "",
      "title": "Buffalo Akron",
      "url": "/game/5004726",
      "network": "",
      "home": {
        "score": "56",
        "names": {
          "char6": "BUFF",
          "short": "Buffalo",
          "seo": "buffalo",
          "full": "University at Buffalo, the State University of New York"
        },
        "winner": true,
        "seed": "",
        "description": "(5-0)",
        "rank": "",
        "conferences": [{
          "conferenceName": "MAC",
          "conferenceSeo": "mac"
        }]
      },
      "liveVideoEnabled": false,
      "startTime": "02:30PM ET",
      "startTimeEpoch": "1607801400",
      "bracketId": "",
      "gameState": "final",
      "startDate": "12-12-2020",
      "currentPeriod": "FINAL",
      "videoState": "",
      "bracketRegion": "",
      "contestClock": "0:00"
    }},
    {"game": {
      "gameID": "12782452-e902-4c5a-808c-9c9db076a49e",
      "away": {
        "score": "0",
        "names": {
          "char6": "NAVY",
          "short": "Navy",
          "seo": "navy",
          "full": "U.S. Naval Academy"
        },
        "winner": false,
        "seed": "",
        "description": "(3-7)",
        "rank": "",
        "conferences": [{
          "conferenceName": "AAC",
          "conferenceSeo": "aac"
        }]
      },
      "finalMessage": "FINAL",
      "bracketRound": "",
      "title": "Army West Point Navy",
      "url": "/game/4060900",
      "network": "",
      "home": {
        "score": "15",
        "names": {
          "char6": "ARMY",
          "short": "Army West Point",
          "seo": "army",
          "full": "U.S. Military Academy"
        },
        "winner": true,
        "seed": "",
        "description": "(8-2)",
        "rank": "",
        "conferences": [{
          "conferenceName": "FBS Independent",
          "conferenceSeo": "fbs-independent"
        }]
      },
      "liveVideoEnabled": false,
      "startTime": "03:00PM ET",
      "startTimeEpoch": "1607803200",
      "bracketId": "",
      "gameState": "final",
      "startDate": "12-12-2020",
      "currentPeriod": "FINAL",
      "videoState": "",
      "bracketRegion": "",
      "contestClock": "0:00"
    }},
    {"game": {
      "gameID": "cdabda85-a938-48fc-a4dc-8c85dc701855",
      "away": {
        "score": "23",
        "names": {
          "char6": "C MICH",
          "short": "Central Mich.",
          "seo": "central-mich",
          "full": "Central Michigan University"
        },
        "winner": false,
        "seed": "",
        "description": "(3-3)",
        "rank": "",
        "conferences": [{
          "conferenceName": "MAC",
          "conferenceSeo": "mac"
        }]
      },
      "finalMessage": "FINAL",
      "bracketRound": "",
      "title": "Toledo Central Mich.",
      "url": "/game/5004725",
      "network": "",
      "home": {
        "score": "24",
        "names": {
          "char6": "TOLEDO",
          "short": "Toledo",
          "seo": "toledo",
          "full": "University of Toledo"
        },
        "winner": true,
        "seed": "",
        "description": "(4-2)",
        "rank": "",
        "conferences": [{
          "conferenceName": "MAC",
          "conferenceSeo": "mac"
        }]
      },
      "liveVideoEnabled": false,
      "startTime": "03:00PM ET",
      "startTimeEpoch": "1607803200",
      "bracketId": "",
      "gameState": "final",
      "startDate": "12-12-2020",
      "currentPeriod": "FINAL",
      "videoState": "",
      "bracketRegion": "",
      "contestClock": "0:00"
    }},
    {"game": {
      "gameID": "57a87920-87ec-48b0-b63b-2c792bce5ce4",
      "away": {
        "score": "42",
        "names": {
          "char6": "CO CAR",
          "short": "Coastal Carolina",
          "seo": "coastal-caro",
          "full": "Coastal Carolina University"
        },
        "winner": true,
        "seed": "",
        "description": "(11-0)",
        "rank": "13",
        "conferences": [
          {
            "conferenceName": "Sun Belt",
            "conferenceSeo": "sun-belt"
          },
          {
            "conferenceName": "Top 25",
            "conferenceSeo": "top-25"
          }
        ]
      },
      "finalMessage": "FINAL",
      "bracketRound": "",
      "title": "Troy Coastal Carolina",
      "url": "/game/5760548",
      "network": "",
      "home": {
        "score": "38",
        "names": {
          "char6": "TROY",
          "short": "Troy",
          "seo": "troy",
          "full": "Troy University"
        },
        "winner": false,
        "seed": "",
        "description": "(5-6)",
        "rank": "",
        "conferences": [{
          "conferenceName": "Sun Belt",
          "conferenceSeo": "sun-belt"
        }]
      },
      "liveVideoEnabled": false,
      "startTime": "03:00PM ET",
      "startTimeEpoch": "1607803200",
      "bracketId": "",
      "gameState": "final",
      "startDate": "12-12-2020",
      "currentPeriod": "FINAL",
      "videoState": "",
      "bracketRegion": "",
      "contestClock": "0:00"
    }},
    {"game": {
      "gameID": "e40c7e9e-b397-4af2-bff0-8842a9bcb763",
      "away": {
        "score": "7",
        "names": {
          "char6": "WISC",
          "short": "Wisconsin",
          "seo": "wisconsin",
          "full": "University of Wisconsin-Madison"
        },
        "winner": false,
        "seed": "",
        "description": "(2-3)",
        "rank": "",
        "conferences": [{
          "conferenceName": "Big Ten",
          "conferenceSeo": "big-ten"
        }]
      },
      "finalMessage": "FINAL",
      "bracketRound": "",
      "title": "Iowa Wisconsin",
      "url": "/game/4616400",
      "network": "",
      "home": {
        "score": "28",
        "names": {
          "char6": "IOWA",
          "short": "Iowa",
          "seo": "iowa",
          "full": "University of Iowa"
        },
        "winner": true,
        "seed": "",
        "description": "(6-2)",
        "rank": "16",
        "conferences": [
          {
            "conferenceName": "Big Ten",
            "conferenceSeo": "big-ten"
          },
          {
            "conferenceName": "Top 25",
            "conferenceSeo": "top-25"
          }
        ]
      },
      "liveVideoEnabled": false,
      "startTime": "03:30PM ET",
      "startTimeEpoch": "1607805000",
      "bracketId": "",
      "gameState": "final",
      "startDate": "12-12-2020",
      "currentPeriod": "FINAL",
      "videoState": "",
      "bracketRegion": "",
      "contestClock": "0:00"
    }},
    {"game": {
      "gameID": "d988161f-a1a0-4661-8a29-34081cc8a95b",
      "away": {
        "score": "42",
        "names": {
          "char6": "OKLAST",
          "short": "Oklahoma St.",
          "seo": "oklahoma-st",
          "full": "Oklahoma State University"
        },
        "winner": true,
        "seed": "",
        "description": "(7-3)",
        "rank": "22",
        "conferences": [
          {
            "conferenceName": "Big 12",
            "conferenceSeo": "big-12"
          },
          {
            "conferenceName": "Top 25",
            "conferenceSeo": "top-25"
          }
        ]
      },
      "finalMessage": "FINAL",
      "bracketRound": "",
      "title": "Baylor Oklahoma St.",
      "url": "/game/5097044",
      "network": "",
      "home": {
        "score": "3",
        "names": {
          "char6": "BAYLOR",
          "short": "Baylor",
          "seo": "baylor",
          "full": "Baylor University"
        },
        "winner": false,
        "seed": "",
        "description": "(2-7)",
        "rank": "",
        "conferences": [{
          "conferenceName": "Big 12",
          "conferenceSeo": "big-12"
        }]
      },
      "liveVideoEnabled": false,
      "startTime": "03:30PM ET",
      "startTimeEpoch": "1607805000",
      "bracketId": "",
      "gameState": "final",
      "startDate": "12-12-2020",
      "currentPeriod": "FINAL",
      "videoState": "",
      "bracketRegion": "",
      "contestClock": "0:00"
    }},
    {"game": {
      "gameID": "84bc06e8-0a8f-4714-93a1-f855642a2429",
      "away": {
        "score": "62",
        "names": {
          "char6": "UNC",
          "short": "North Carolina",
          "seo": "north-carolina",
          "full": "University of North Carolina, Chapel Hill"
        },
        "winner": true,
        "seed": "",
        "description": "(8-3)",
        "rank": "17",
        "conferences": [
          {
            "conferenceName": "ACC",
            "conferenceSeo": "acc"
          },
          {
            "conferenceName": "Top 25",
            "conferenceSeo": "top-25"
          }
        ]
      },
      "finalMessage": "FINAL",
      "bracketRound": "",
      "title": "Miami (FL) North Carolina",
      "url": "/game/5760528",
      "network": "",
      "home": {
        "score": "26",
        "names": {
          "char6": "MIAMI",
          "short": "Miami (FL)",
          "seo": "miami-fl",
          "full": "University of Miami (Florida)"
        },
        "winner": false,
        "seed": "",
        "description": "(8-2)",
        "rank": "10",
        "conferences": [
          {
            "conferenceName": "ACC",
            "conferenceSeo": "acc"
          },
          {
            "conferenceName": "Top 25",
            "conferenceSeo": "top-25"
          }
        ]
      },
      "liveVideoEnabled": false,
      "startTime": "03:30PM ET",
      "startTimeEpoch": "1607805000",
      "bracketId": "",
      "gameState": "final",
      "startDate": "12-12-2020",
      "currentPeriod": "FINAL",
      "videoState": "",
      "bracketRegion": "",
      "contestClock": "0:00"
    }},
    {"game": {
      "gameID": "64e7972c-e1b2-46a1-b734-98af89b20e6b",
      "away": {
        "score": "27",
        "names": {
          "char6": "HOU",
          "short": "Houston",
          "seo": "houston",
          "full": "University of Houston"
        },
        "winner": false,
        "seed": "",
        "description": "(3-4)",
        "rank": "",
        "conferences": [{
          "conferenceName": "AAC",
          "conferenceSeo": "aac"
        }]
      },
      "finalMessage": "FINAL",
      "bracketRound": "",
      "title": "Memphis Houston",
      "url": "/game/5764825",
      "network": "",
      "home": {
        "score": "30",
        "names": {
          "char6": "MEM",
          "short": "Memphis",
          "seo": "memphis",
          "full": "University of Memphis"
        },
        "winner": true,
        "seed": "",
        "description": "(7-3)",
        "rank": "",
        "conferences": [{
          "conferenceName": "AAC",
          "conferenceSeo": "aac"
        }]
      },
      "liveVideoEnabled": false,
      "startTime": "03:45PM ET",
      "startTimeEpoch": "1607805900",
      "bracketId": "",
      "gameState": "final",
      "startDate": "12-12-2020",
      "currentPeriod": "FINAL",
      "videoState": "",
      "bracketRegion": "",
      "contestClock": "0:00"
    }},
    {"game": {
      "gameID": "4637e9f7-b8a2-44cd-9950-dab97be930dd",
      "away": {
        "score": "35",
        "names": {
          "char6": "DUKE",
          "short": "Duke",
          "seo": "duke",
          "full": "Duke University"
        },
        "winner": false,
        "seed": "",
        "description": "(2-9)",
        "rank": "",
        "conferences": [{
          "conferenceName": "ACC",
          "conferenceSeo": "acc"
        }]
      },
      "finalMessage": "FINAL",
      "bracketRound": "",
      "title": "Florida St. Duke",
      "url": "/game/5770596",
      "network": "",
      "home": {
        "score": "56",
        "names": {
          "char6": "FSU",
          "short": "Florida St.",
          "seo": "florida-st",
          "full": "Florida State University"
        },
        "winner": true,
        "seed": "",
        "description": "(3-6)",
        "rank": "",
        "conferences": [{
          "conferenceName": "ACC",
          "conferenceSeo": "acc"
        }]
      },
      "liveVideoEnabled": false,
      "startTime": "04:00PM ET",
      "startTimeEpoch": "1607806800",
      "bracketId": "",
      "gameState": "final",
      "startDate": "12-12-2020",
      "currentPeriod": "FINAL",
      "videoState": "",
      "bracketRegion": "",
      "contestClock": "0:00"
    }},
    {"game": {
      "gameID": "ecb8bb72-720e-48b6-ae64-82b6c1af95c8",
      "away": {
        "score": "42",
        "names": {
          "char6": "TENN",
          "short": "Tennessee",
          "seo": "tennessee",
          "full": "University of Tennessee, Knoxville"
        },
        "winner": true,
        "seed": "",
        "description": "(3-6)",
        "rank": "",
        "conferences": [{
          "conferenceName": "SEC",
          "conferenceSeo": "sec"
        }]
      },
      "finalMessage": "FINAL",
      "bracketRound": "",
      "title": "Vanderbilt Tennessee",
      "url": "/game/5771037",
      "network": "",
      "home": {
        "score": "17",
        "names": {
          "char6": "VANDY",
          "short": "Vanderbilt",
          "seo": "vanderbilt",
          "full": "Vanderbilt University"
        },
        "winner": false,
        "seed": "",
        "description": "(0-9)",
        "rank": "",
        "conferences": [{
          "conferenceName": "SEC",
          "conferenceSeo": "sec"
        }]
      },
      "liveVideoEnabled": false,
      "startTime": "04:00PM ET",
      "startTimeEpoch": "1607806800",
      "bracketId": "",
      "gameState": "final",
      "startDate": "12-12-2020",
      "currentPeriod": "FINAL",
      "videoState": "",
      "bracketRegion": "",
      "contestClock": "0:00"
    }},
    {"game": {
      "gameID": "7b3e73b8-415f-4c24-8e19-6f186b501459",
      "away": {
        "score": "17",
        "names": {
          "char6": "BOISE",
          "short": "Boise St.",
          "seo": "boise-st",
          "full": "Boise State University"
        },
        "winner": true,
        "seed": "",
        "description": "(5-1)",
        "rank": "",
        "conferences": [{
          "conferenceName": "Mountain West",
          "conferenceSeo": "mountain-west"
        }]
      },
      "finalMessage": "FINAL",
      "bracketRound": "",
      "title": "Wyoming Boise St.",
      "url": "/game/4877541",
      "network": "",
      "home": {
        "score": "9",
        "names": {
          "char6": "WYO",
          "short": "Wyoming",
          "seo": "wyoming",
          "full": "University of Wyoming"
        },
        "winner": false,
        "seed": "",
        "description": "(2-4)",
        "rank": "",
        "conferences": [{
          "conferenceName": "Mountain West",
          "conferenceSeo": "mountain-west"
        }]
      },
      "liveVideoEnabled": false,
      "startTime": "06:00PM ET",
      "startTimeEpoch": "1607814000",
      "bracketId": "",
      "gameState": "final",
      "startDate": "12-12-2020",
      "currentPeriod": "FINAL",
      "videoState": "",
      "bracketRegion": "",
      "contestClock": "0:00"
    }},
    {"game": {
      "gameID": "a06aa54d-bec9-4e3b-b736-64e5f0009a9a",
      "away": {
        "score": "34",
        "names": {
          "char6": "APP ST",
          "short": "App State",
          "seo": "appalachian-st",
          "full": "Appalachian State University"
        },
        "winner": true,
        "seed": "",
        "description": "(8-3)",
        "rank": "",
        "conferences": [{
          "conferenceName": "Sun Belt",
          "conferenceSeo": "sun-belt"
        }]
      },
      "finalMessage": "FINAL",
      "bracketRound": "",
      "title": "Ga. Southern App State",
      "url": "/game/5001111",
      "network": "",
      "home": {
        "score": "26",
        "names": {
          "char6": "GA SOU",
          "short": "Ga. Southern",
          "seo": "ga-southern",
          "full": "Georgia Southern University"
        },
        "winner": false,
        "seed": "",
        "description": "(7-5)",
        "rank": "",
        "conferences": [{
          "conferenceName": "Sun Belt",
          "conferenceSeo": "sun-belt"
        }]
      },
      "liveVideoEnabled": false,
      "startTime": "06:00PM ET",
      "startTimeEpoch": "1607814000",
      "bracketId": "",
      "gameState": "final",
      "startDate": "12-12-2020",
      "currentPeriod": "FINAL",
      "videoState": "",
      "bracketRegion": "",
      "contestClock": "0:00"
    }},
    {"game": {
      "gameID": "74bf57f9-52a2-49ca-a286-b185f95303c5",
      "away": {
        "score": "37",
        "names": {
          "char6": "LSU",
          "short": "LSU",
          "seo": "lsu",
          "full": "Louisiana State University"
        },
        "winner": true,
        "seed": "",
        "description": "(4-5)",
        "rank": "",
        "conferences": [{
          "conferenceName": "SEC",
          "conferenceSeo": "sec"
        }]
      },
      "finalMessage": "FINAL",
      "bracketRound": "",
      "title": "Florida LSU",
      "url": "/game/5206187",
      "network": "",
      "home": {
        "score": "34",
        "names": {
          "char6": "FLA",
          "short": "Florida",
          "seo": "florida",
          "full": "University of Florida"
        },
        "winner": false,
        "seed": "",
        "description": "(8-2)",
        "rank": "6",
        "conferences": [
          {
            "conferenceName": "SEC",
            "conferenceSeo": "sec"
          },
          {
            "conferenceName": "Top 25",
            "conferenceSeo": "top-25"
          }
        ]
      },
      "liveVideoEnabled": false,
      "startTime": "07:00PM ET",
      "startTimeEpoch": "1607817600",
      "bracketId": "",
      "gameState": "final",
      "startDate": "12-12-2020",
      "currentPeriod": "FINAL",
      "videoState": "",
      "bracketRegion": "",
      "contestClock": "0:00"
    }},
    {"game": {
      "gameID": "8b86c2c1-92b1-4e58-a2ef-240b7ddce633",
      "away": {
        "score": "10",
        "names": {
          "char6": "LATECH",
          "short": "Louisiana Tech",
          "seo": "louisiana-tech",
          "full": "Louisiana Tech University"
        },
        "winner": false,
        "seed": "",
        "description": "(5-4)",
        "rank": "",
        "conferences": [{
          "conferenceName": "C-USA",
          "conferenceSeo": "c-usa"
        }]
      },
      "finalMessage": "FINAL",
      "bracketRound": "",
      "title": "TCU Louisiana Tech",
      "url": "/game/5770566",
      "network": "",
      "home": {
        "score": "52",
        "names": {
          "char6": "TCU",
          "short": "TCU",
          "seo": "tcu",
          "full": "Texas Christian University"
        },
        "winner": true,
        "seed": "",
        "description": "(6-4)",
        "rank": "",
        "conferences": [{
          "conferenceName": "Big 12",
          "conferenceSeo": "big-12"
        }]
      },
      "liveVideoEnabled": false,
      "startTime": "07:00PM ET",
      "startTimeEpoch": "1607817600",
      "bracketId": "",
      "gameState": "final",
      "startDate": "12-12-2020",
      "currentPeriod": "FINAL",
      "videoState": "",
      "bracketRegion": "",
      "contestClock": "0:00"
    }},
    {"game": {
      "gameID": "952c0c94-f63c-40b4-88df-dc56eb29c06f",
      "away": {
        "score": "43",
        "names": {
          "char6": "USC",
          "short": "Southern California",
          "seo": "southern-california",
          "full": "University of Southern California"
        },
        "winner": true,
        "seed": "",
        "description": "(5-0)",
        "rank": "15",
        "conferences": [
          {
            "conferenceName": "Pac-12",
            "conferenceSeo": "pac-12"
          },
          {
            "conferenceName": "Top 25",
            "conferenceSeo": "top-25"
          }
        ]
      },
      "finalMessage": "FINAL",
      "bracketRound": "",
      "title": "UCLA Southern California",
      "url": "/game/4915150",
      "network": "",
      "home": {
        "score": "38",
        "names": {
          "char6": "UCLA",
          "short": "UCLA",
          "seo": "ucla",
          "full": "University of California, Los Angeles"
        },
        "winner": false,
        "seed": "",
        "description": "(3-3)",
        "rank": "",
        "conferences": [{
          "conferenceName": "Pac-12",
          "conferenceSeo": "pac-12"
        }]
      },
      "liveVideoEnabled": false,
      "startTime": "07:30PM ET",
      "startTimeEpoch": "1607819400",
      "bracketId": "",
      "gameState": "final",
      "startDate": "12-12-2020",
      "currentPeriod": "FINAL",
      "videoState": "",
      "bracketRegion": "",
      "contestClock": "0:00"
    }},
    {"game": {
      "gameID": "f9dfa186-69a7-4524-ba68-86d36ff68f6f",
      "away": {
        "score": "24",
        "names": {
          "char6": "AUBURN",
          "short": "Auburn",
          "seo": "auburn",
          "full": "Auburn University"
        },
        "winner": true,
        "seed": "",
        "description": "(6-4)",
        "rank": "",
        "conferences": [{
          "conferenceName": "SEC",
          "conferenceSeo": "sec"
        }]
      },
      "finalMessage": "FINAL",
      "bracketRound": "",
      "title": "Mississippi St. Auburn",
      "url": "/game/5712560",
      "network": "",
      "home": {
        "score": "10",
        "names": {
          "char6": "MISSST",
          "short": "Mississippi St.",
          "seo": "mississippi-st",
          "full": "Mississippi State University"
        },
        "winner": false,
        "seed": "",
        "description": "(2-7)",
        "rank": "",
        "conferences": [{
          "conferenceName": "SEC",
          "conferenceSeo": "sec"
        }]
      },
      "liveVideoEnabled": false,
      "startTime": "07:30PM ET",
      "startTimeEpoch": "1607819400",
      "bracketId": "",
      "gameState": "final",
      "startDate": "12-12-2020",
      "currentPeriod": "FINAL",
      "videoState": "",
      "bracketRegion": "",
      "contestClock": "0:00"
    }},
    {"game": {
      "gameID": "5e12ee30-6c52-4695-95e8-6683c06a0dd8",
      "away": {
        "score": "15",
        "names": {
          "char6": "UVA",
          "short": "Virginia",
          "seo": "virginia",
          "full": "University of Virginia"
        },
        "winner": false,
        "seed": "",
        "description": "(5-5)",
        "rank": "",
        "conferences": [{
          "conferenceName": "ACC",
          "conferenceSeo": "acc"
        }]
      },
      "finalMessage": "FINAL",
      "bracketRound": "",
      "title": "Virginia Tech Virginia",
      "url": "/game/4576987",
      "network": "",
      "home": {
        "score": "33",
        "names": {
          "char6": "VT",
          "short": "Virginia Tech",
          "seo": "virginia-tech",
          "full": "Virginia Polytechnic Institute and State University"
        },
        "winner": true,
        "seed": "",
        "description": "(5-6)",
        "rank": "",
        "conferences": [{
          "conferenceName": "ACC",
          "conferenceSeo": "acc"
        }]
      },
      "liveVideoEnabled": false,
      "startTime": "08:00PM ET",
      "startTimeEpoch": "1607821200",
      "bracketId": "",
      "gameState": "final",
      "startDate": "12-12-2020",
      "currentPeriod": "FINAL",
      "videoState": "",
      "bracketRegion": "",
      "contestClock": "0:00"
    }},
    {"game": {
      "gameID": "ecd028c6-11e4-43c0-a800-22df7e6fb50c",
      "away": {
        "score": "",
        "names": {
          "char6": "MISS",
          "short": "Ole Miss",
          "seo": "ole-miss",
          "full": "University of Mississippi"
        },
        "winner": false,
        "seed": "",
        "description": "(4-4)",
        "rank": "",
        "conferences": [{
          "conferenceName": "SEC",
          "conferenceSeo": "sec"
        }]
      },
      "finalMessage": "",
      "bracketRound": "",
      "title": "Texas A&M Ole Miss",
      "url": "/game/5771038",
      "network": "",
      "home": {
        "score": "",
        "names": {
          "char6": "TX A&M",
          "short": "Texas A&M",
          "seo": "texas-am",
          "full": "Texas A&M University, College Station"
        },
        "winner": false,
        "seed": "",
        "description": "(7-1)",
        "rank": "5",
        "conferences": [
          {
            "conferenceName": "SEC",
            "conferenceSeo": "sec"
          },
          {
            "conferenceName": "Top 25",
            "conferenceSeo": "top-25"
          }
        ]
      },
      "liveVideoEnabled": false,
      "startTime": "08:00PM ET",
      "startTimeEpoch": "1607821200",
      "bracketId": "",
      "gameState": "postponed",
      "startDate": "12-12-2020",
      "currentPeriod": "",
      "videoState": "",
      "bracketRegion": "",
      "contestClock": ""
    }},
    {"game": {
      "gameID": "157ca42a-1f04-47f4-8053-ebd7c087713b",
      "away": {
        "score": "14",
        "names": {
          "char6": "SDSU",
          "short": "San Diego St.",
          "seo": "san-diego-st",
          "full": "San Diego State University"
        },
        "winner": false,
        "seed": "",
        "description": "(4-4)",
        "rank": "",
        "conferences": [{
          "conferenceName": "Mountain West",
          "conferenceSeo": "mountain-west"
        }]
      },
      "finalMessage": "FINAL",
      "bracketRound": "",
      "title": "BYU San Diego St.",
      "url": "/game/4895433",
      "network": "",
      "home": {
        "score": "28",
        "names": {
          "char6": "BYU",
          "short": "BYU",
          "seo": "byu",
          "full": "Brigham Young University"
        },
        "winner": true,
        "seed": "",
        "description": "(10-1)",
        "rank": "18",
        "conferences": [
          {
            "conferenceName": "FBS Independent",
            "conferenceSeo": "fbs-independent"
          },
          {
            "conferenceName": "Top 25",
            "conferenceSeo": "top-25"
          }
        ]
      },
      "liveVideoEnabled": false,
      "startTime": "10:00PM ET",
      "startTimeEpoch": "1607828400",
      "bracketId": "",
      "gameState": "final",
      "startDate": "12-12-2020",
      "currentPeriod": "FINAL",
      "videoState": "",
      "bracketRegion": "",
      "contestClock": "0:00"
    }},
    {"game": {
      "gameID": "0c03ec90-27e6-4e45-a8a0-b379a91b97ea",
      "away": {
        "score": "27",
        "names": {
          "char6": "STAN",
          "short": "Stanford",
          "seo": "stanford",
          "full": "Stanford University"
        },
        "winner": true,
        "seed": "",
        "description": "(3-2)",
        "rank": "",
        "conferences": [{
          "conferenceName": "Pac-12",
          "conferenceSeo": "pac-12"
        }]
      },
      "finalMessage": "FINAL",
      "bracketRound": "",
      "title": "Oregon St. Stanford",
      "url": "/game/5770668",
      "network": "",
      "home": {
        "score": "24",
        "names": {
          "char6": "ORE ST",
          "short": "Oregon St.",
          "seo": "oregon-st",
          "full": "Oregon State University"
        },
        "winner": false,
        "seed": "",
        "description": "(2-4)",
        "rank": "",
        "conferences": [{
          "conferenceName": "Pac-12",
          "conferenceSeo": "pac-12"
        }]
      },
      "liveVideoEnabled": false,
      "startTime": "10:00PM ET",
      "startTimeEpoch": "1607828400",
      "bracketId": "",
      "gameState": "final",
      "startDate": "12-12-2020",
      "currentPeriod": "FINAL",
      "videoState": "",
      "bracketRegion": "",
      "contestClock": "0:00"
    }},
    {"game": {
      "gameID": "d8866ab1-f641-493e-913a-885522414070",
      "away": {
        "score": "39",
        "names": {
          "char6": "FRESNO",
          "short": "Fresno St.",
          "seo": "fresno-st",
          "full": "California State University, Fresno"
        },
        "winner": false,
        "seed": "",
        "description": "(3-3)",
        "rank": "",
        "conferences": [{
          "conferenceName": "Mountain West",
          "conferenceSeo": "mountain-west"
        }]
      },
      "finalMessage": "FINAL",
      "bracketRound": "",
      "title": "New Mexico Fresno St.",
      "url": "/game/4877542",
      "network": "",
      "home": {
        "score": "49",
        "names": {
          "char6": "N MEX",
          "short": "New Mexico",
          "seo": "new-mexico",
          "full": "University of New Mexico"
        },
        "winner": true,
        "seed": "",
        "description": "(2-5)",
        "rank": "",
        "conferences": [{
          "conferenceName": "Mountain West",
          "conferenceSeo": "mountain-west"
        }]
      },
      "liveVideoEnabled": false,
      "startTime": "10:30PM ET",
      "startTimeEpoch": "1607830200",
      "bracketId": "",
      "gameState": "final",
      "startDate": "12-12-2020",
      "currentPeriod": "FINAL",
      "videoState": "",
      "bracketRegion": "",
      "contestClock": "0:00"
    }},
    {"game": {
      "gameID": "9eb20752-b52b-42ce-862f-00a771bd49ff",
      "away": {
        "score": "21",
        "names": {
          "char6": "UNLV",
          "short": "UNLV",
          "seo": "unlv",
          "full": "University of Nevada, Las Vegas"
        },
        "winner": false,
        "seed": "",
        "description": "(0-6)",
        "rank": "",
        "conferences": [{
          "conferenceName": "Mountain West",
          "conferenceSeo": "mountain-west"
        }]
      },
      "finalMessage": "FINAL",
      "bracketRound": "",
      "title": "Hawaii UNLV",
      "url": "/game/4877539",
      "network": "",
      "home": {
        "score": "38",
        "names": {
          "char6": "HAWAII",
          "short": "Hawaii",
          "seo": "hawaii",
          "full": "University of Hawaii, Manoa"
        },
        "winner": true,
        "seed": "",
        "description": "(4-4)",
        "rank": "",
        "conferences": [{
          "conferenceName": "Mountain West",
          "conferenceSeo": "mountain-west"
        }]
      },
      "liveVideoEnabled": false,
      "startTime": "11:00PM ET",
      "startTimeEpoch": "1607832000",
      "bracketId": "",
      "gameState": "final",
      "startDate": "12-12-2020",
      "currentPeriod": "FINAL",
      "videoState": "",
      "bracketRegion": "",
      "contestClock": "0:00"
    }}
  ]
}