{
  "games": [
    {"game": {
      "away": {
        "conferences": [{
          "conferenceName": "MAC",
          "conferenceSeo": "mac"
        }],
        "description": "(2-8)",
        "names": {
          "char6": "KENT",
          "full": "Kent State University",
          "seo": "kent-st",
          "short": "Kent State"
        },
        "rank": "",
        "score": "14",
        "seed": "",
        "winner": false
      },
      "bracketId": "",
      "bracketRegion": "",
      "bracketRound": "",
      "contestClock": "0:00",
      "currentPeriod": "FINAL",
      "finalMessage": "FINAL",
      "gameID": "ff9daefc-7488-45d8-a889-285a7b19513b",
      "gameState": "final",
      "home": {
        "conferences": [{
          "conferenceName": "MAC",
          "conferenceSeo": "mac"
        }],
        "description": "(9-1)",
        "names": {
          "char6": "BUFF",
          "full": "University at Buffalo, the State University of New York",
          "seo": "buffalo",
          "short": "Buffalo"
        },
        "rank": "",
        "score": "48",
        "seed": "",
        "winner": true
      },
      "liveVideoEnabled": false,
      "network": "",
      "startDate": "11-06-2018",
      "startTime": "07:30PM ET",
      "startTimeEpoch": "1541550600",
      "title": "Buffalo Kent St.",
      "url": "/game/football/fbs/2018/11/06/kent-st-buffalo",
      "videoState": ""
    }},
    {"game": {
      "away": {
        "conferences": [{
          "conferenceName": "MAC",
          "conferenceSeo": "mac"
        }],
        "description": "(6-4)",
        "names": {
          "char6": "OHIO",
          "full": "Ohio University",
          "seo": "ohio",
          "short": "Ohio"
        },
        "rank": "",
        "score": "28",
        "seed": "",
        "winner": false
      },
      "bracketId": "",
      "bracketRegion": "",
      "bracketRound": "",
      "contestClock": "0:00",
      "currentPeriod": "FINAL",
      "finalMessage": "FINAL",
      "gameID": "b025b267-9e82-4912-b2b9-d49bef1c4207",
      "gameState": "final",
      "home": {
        "conferences": [{
          "conferenceName": "MAC",
          "conferenceSeo": "mac"
        }],
        "description": "(4-6)",
        "names": {
          "char6": "MIA OH",
          "full": "Miami University (Ohio)",
          "seo": "miami-oh",
          "short": "Miami (Ohio)"
        },
        "rank": "",
        "score": "30",
        "seed": "",
        "winner": true
      },
      "liveVideoEnabled": false,
      "network": "",
      "startDate": "11-07-2018",
      "startTime": "07:00PM ET",
      "startTimeEpoch": "1541635200",
      "title": "Miami (OH) Ohio",
      "url": "/game/football/fbs/2018/11/07/ohio-miami-oh",
      "videoState": ""
    }},
    {"game": {
      "away": {
        "conferences": [{
          "conferenceName": "MAC",
          "conferenceSeo": "mac"
        }],
        "description": "(5-5)",
        "names": {
          "char6": "TOLEDO",
          "full": "University of Toledo",
          "seo": "toledo",
          "short": "Toledo"
        },
        "rank": "",
        "score": "15",
        "seed": "",
        "winner": false
      },
      "bracketId": "",
      "bracketRegion": "",
      "bracketRound": "",
      "contestClock": "0:00",
      "currentPeriod": "FINAL",
      "finalMessage": "FINAL",
      "gameID": "eb4c6b5b-04f5-4f6c-95ef-b5840a02cefb",
      "gameState": "final",
      "home": {
        "conferences": [{
          "conferenceName": "MAC",
          "conferenceSeo": "mac"
        }],
        "description": "(7-3)",
        "names": {
          "char6": "NIU",
          "full": "Northern Illinois University",
          "seo": "northern-ill",
          "short": "Northern Ill."
        },
        "rank": "",
        "score": "38",
        "seed": "",
        "winner": true
      },
      "liveVideoEnabled": false,
      "network": "",
      "startDate": "11-07-2018",
      "startTime": "08:00PM ET",
      "startTimeEpoch": "1541638800",
      "title": "Northern Ill. Toledo",
      "url": "/game/football/fbs/2018/11/07/toledo-northern-ill",
      "videoState": ""
    }},
    {"game": {
      "away": {
        "conferences": [{
          "conferenceName": "ACC",
          "conferenceSeo": "acc"
        }],
        "description": "(5-5)",
        "names": {
          "char6": "WAKE",
          "full": "Wake Forest University",
          "seo": "wake-forest",
          "short": "Wake Forest"
        },
        "rank": "",
        "score": "27",
        "seed": "",
        "winner": true
      },
      "bracketId": "",
      "bracketRegion": "",
      "bracketRound": "",
      "contestClock": "0:00",
      "currentPeriod": "FINAL",
      "finalMessage": "FINAL",
      "gameID": "7ab71295-a37e-4374-877c-3bd5133c57bf",
      "gameState": "final",
      "home": {
        "conferences": [
          {
            "conferenceName": "ACC",
            "conferenceSeo": "acc"
          },
          {
            "conferenceName": "Top 25",
            "conferenceSeo": "top-25"
          }
        ],
        "description": "(6-3)",
        "names": {
          "char6": "NC ST",
          "full": "North Carolina State University",
          "seo": "north-carolina-st",
          "short": "NC State"
        },
        "rank": "14",
        "score": "23",
        "seed": "",
        "winner": false
      },
      "liveVideoEnabled": false,
      "network": "",
      "startDate": "11-08-2018",
      "startTime": "07:30PM ET",
      "startTimeEpoch": "1541723400",
      "title": "NC State Wake Forest",
      "url": "/game/football/fbs/2018/11/08/wake-forest-north-carolina-st",
      "videoState": ""
    }},
    {"game": {
      "away": {
        "conferences": [{
          "conferenceName": "ACC",
          "conferenceSeo": "acc"
        }],
        "description": "(2-8)",
        "names": {
          "char6": "LOUIS",
          "full": "University of Louisville",
          "seo": "louisville",
          "short": "Louisville"
        },
        "rank": "",
        "score": "23",
        "seed": "",
        "winner": false
      },
      "bracketId": "",
      "bracketRegion": "",
      "bracketRound": "",
      "contestClock": "0:00",
      "currentPeriod": "FINAL",
      "finalMessage": "FINAL",
      "gameID": "ecc5a421-d44a-48cf-880f-07f71260671f",
      "gameState": "final",
      "home": {
        "conferences": [
          {
            "conferenceName": "ACC",
            "conferenceSeo": "acc"
          },
          {
            "conferenceName": "Top 25",
            "conferenceSeo": "top-25"
          }
        ],
        "description": "(8-2)",
        "names": {
          "char6": "SYR",
          "full": "Syracuse University",
          "seo": "syracuse",
          "short": "Syracuse"
        },
        "rank": "13",
        "score": "54",
        "seed": "",
        "winner": true
      },
      "liveVideoEnabled": false,
      "network": "",
      "startDate": "11-09-2018",
      "startTime": "07:00PM ET",
      "startTimeEpoch": "1541808000",
      "title": "Syracuse Louisville",
      "url": "/game/football/fbs/2018/11/09/louisville-syracuse",
      "videoState": ""
    }},
    {"game": {
      "away": {
        "conferences": [
          {
            "conferenceName": "MWC",
            "conferenceSeo": "mwc"
          },
          {
            "conferenceName": "Top 25",
            "conferenceSeo": "top-25"
          }
        ],
        "description": "(8-2)",
        "names": {
          "char6": "FRESNO",
          "full": "California State University, Fresno",
          "seo": "fresno-st",
          "short": "Fresno State"
        },
        "rank": "23",
        "score": "17",
        "seed": "",
        "winner": false
      },
      "bracketId": "",
      "bracketRegion": "",
      "bracketRound": "",
      "contestClock": "0:00",
      "currentPeriod": "FINAL",
      "finalMessage": "FINAL",
      "gameID": "08eea7fc-6fb9-4090-a32d-00327798a605",
      "gameState": "final",
      "home": {
        "conferences": [{
          "conferenceName": "MWC",
          "conferenceSeo": "mwc"
        }],
        "description": "(8-2)",
        "names": {
          "char6": "BOISE",
          "full": "Boise State University",
          "seo": "boise-st",
          "short": "Boise State"
        },
        "rank": "",
        "score": "24",
        "seed": "",
        "winner": true
      },
      "liveVideoEnabled": false,
      "network": "",
      "startDate": "11-09-2018",
      "startTime": "10:15PM ET",
      "startTimeEpoch": "1541819700",
      "title": "Boise St. Fresno St.",
      "url": "/game/football/fbs/2018/11/09/fresno-st-boise-st",
      "videoState": ""
    }},
    {"game": {
      "away": {
        "conferences": [{
          "conferenceName": "FBS Independent",
          "conferenceSeo": "fbs-independent"
        }],
        "description": "(5-5)",
        "names": {
          "char6": "BYU",
          "full": "Brigham Young University",
          "seo": "byu",
          "short": "BYU"
        },
        "rank": "",
        "score": "35",
        "seed": "",
        "winner": true
      },
      "bracketId": "",
      "bracketRegion": "",
      "bracketRound": "",
      "contestClock": "0:00",
      "currentPeriod": "FINAL",
      "finalMessage": "FINAL",
      "gameID": "14d07c78-2298-45ce-aa43-38fa8e471bcf",
      "gameState": "final",
      "home": {
        "conferences": [{
          "conferenceName": "FBS Independent",
          "conferenceSeo": "fbs-independent"
        }],
        "description": "(4-7)",
        "names": {
          "char6": "UMASS",
          "full": "University of Massachusetts, Amherst",
          "seo": "massachusetts",
          "short": "Massachusetts"
        },
        "rank": "",
        "score": "16",
        "seed": "",
        "winner": false
      },
      "liveVideoEnabled": false,
      "network": "",
      "startDate": "11-10-2018",
      "startTime": "12:00PM ET",
      "startTimeEpoch": "1541869200",
      "title": "Massachusetts BYU",
      "url": "/game/football/fbs/2018/11/10/byu-massachusetts",
      "videoState": ""
    }},
    {"game": {
      "away": {
        "conferences": [
          {
            "conferenceName": "Big Ten",
            "conferenceSeo": "big-ten"
          },
          {
            "conferenceName": "Top 25",
            "conferenceSeo": "top-25"
          }
        ],
        "description": "(9-1)",
        "names": {
          "char6": "OHIOST",
          "full": "The Ohio State University",
          "seo": "ohio-st",
          "short": "Ohio St. "
        },
        "rank": "10",
        "score": "26",
        "seed": "",
        "winner": true
      },
      "bracketId": "",
      "bracketRegion": "",
      "bracketRound": "",
      "contestClock": "0:00",
      "currentPeriod": "FINAL",
      "finalMessage": "FINAL",
      "gameID": "a2bd88f4-0b01-4b5c-aab5-95d25e808f5a",
      "gameState": "final",
      "home": {
        "conferences": [
          {
            "conferenceName": "Big Ten",
            "conferenceSeo": "big-ten"
          },
          {
            "conferenceName": "Top 25",
            "conferenceSeo": "top-25"
          }
        ],
        "description": "(6-4)",
        "names": {
          "char6": "MICHST",
          "full": "Michigan State University",
          "seo": "michigan-st",
          "short": "Mich. St. "
        },
        "rank": "18",
        "score": "6",
        "seed": "",
        "winner": false
      },
      "liveVideoEnabled": false,
      "network": "",
      "startDate": "11-10-2018",
      "startTime": "12:00PM ET",
      "startTimeEpoch": "1541869200",
      "title": "Michigan St. Ohio St.",
      "url": "/game/football/fbs/2018/11/10/ohio-st-michigan-st",
      "videoState": ""
    }},
    {"game": {
      "away": {
        "conferences": [{
          "conferenceName": "Big Ten",
          "conferenceSeo": "big-ten"
        }],
        "description": "(6-4)",
        "names": {
          "char6": "WISC",
          "full": "University of Wisconsin-Madison",
          "seo": "wisconsin",
          "short": "Wisconsin"
        },
        "rank": "",
        "score": "10",
        "seed": "",
        "winner": false
      },
      "bracketId": "",
      "bracketRegion": "",
      "bracketRound": "",
      "contestClock": "0:00",
      "currentPeriod": "FINAL",
      "finalMessage": "FINAL",
      "gameID": "21f48972-00c8-45f7-a6da-eaec4647c473",
      "gameState": "final",
      "home": {
        "conferences": [
          {
            "conferenceName": "Big Ten",
            "conferenceSeo": "big-ten"
          },
          {
            "conferenceName": "Top 25",
            "conferenceSeo": "top-25"
          }
        ],
        "description": "(7-3)",
        "names": {
          "char6": "PENNST",
          "full": "Pennsylvania State University",
          "seo": "penn-st",
          "short": "Penn St."
        },
        "rank": "20",
        "score": "22",
        "seed": "",
        "winner": true
      },
      "liveVideoEnabled": false,
      "network": "",
      "startDate": "11-10-2018",
      "startTime": "12:00PM ET",
      "startTimeEpoch": "1541869200",
      "title": "Penn St. Wisconsin",
      "url": "/game/football/fbs/2018/11/10/wisconsin-penn-st",
      "videoState": ""
    }},
    {"game": {
      "away": {
        "conferences": [{
          "conferenceName": "Big Ten",
          "conferenceSeo": "big-ten"
        }],
        "description": "(5-5)",
        "names": {
          "char6": "MD",
          "full": "University of Maryland, College Park",
          "seo": "maryland",
          "short": "Maryland"
        },
        "rank": "",
        "score": "32",
        "seed": "",
        "winner": false
      },
      "bracketId": "",
      "bracketRegion": "",
      "bracketRound": "",
      "contestClock": "0:00",
      "currentPeriod": "FINAL",
      "finalMessage": "FINAL",
      "gameID": "2bd04d14-9ae0-4202-83cc-8d6707496c38",
      "gameState": "final",
      "home": {
        "conferences": [{
          "conferenceName": "Big Ten",
          "conferenceSeo": "big-ten"
        }],
        "description": "(5-5)",
        "names": {
          "char6": "IND",
          "full": "Indiana University, Bloomington",
          "seo": "indiana",
          "short": "Indiana"
        },
        "rank": "",
        "score": "34",
        "seed": "",
        "winner": true
      },
      "liveVideoEnabled": false,
      "network": "",
      "startDate": "11-10-2018",
      "startTime": "12:00PM ET",
      "startTimeEpoch": "1541869200",
      "title": "Indiana Maryland",
      "url": "/game/football/fbs/2018/11/10/maryland-indiana",
      "videoState": ""
    }},
    {"game": {
      "away": {
        "conferences": [{
          "conferenceName": "Big Ten",
          "conferenceSeo": "big-ten"
        }],
        "description": "(4-6)",
        "names": {
          "char6": "ILL",
          "full": "University of Illinois Urbana-Champaign",
          "seo": "illinois",
          "short": "Illinois"
        },
        "rank": "",
        "score": "35",
        "seed": "",
        "winner": false
      },
      "bracketId": "",
      "bracketRegion": "",
      "bracketRound": "",
      "contestClock": "0:00",
      "currentPeriod": "FINAL",
      "finalMessage": "FINAL",
      "gameID": "c5f36b03-c7c7-4c87-b216-667a614aafa2",
      "gameState": "final",
      "home": {
        "conferences": [{
          "conferenceName": "Big Ten",
          "conferenceSeo": "big-ten"
        }],
        "description": "(3-7)",
        "names": {
          "char6": "NEB",
          "full": "University of Nebraska, Lincoln",
          "seo": "nebraska",
          "short": "Nebraska"
        },
        "rank": "",
        "score": "54",
        "seed": "",
        "winner": true
      },
      "liveVideoEnabled": false,
      "network": "",
      "startDate": "11-10-2018",
      "startTime": "12:00PM ET",
      "startTimeEpoch": "1541869200",
      "title": "Nebraska Illinois",
      "url": "/game/football/fbs/2018/11/10/illinois-nebraska",
      "videoState": ""
    }},
    {"game": {
      "away": {
        "conferences": [{
          "conferenceName": "SEC",
          "conferenceSeo": "sec"
        }],
        "description": "(5-5)",
        "names": {
          "char6": "MISS",
          "full": "University of Mississippi",
          "seo": "ole-miss",
          "short": "Ole Miss"
        },
        "rank": "",
        "score": "24",
        "seed": "",
        "winner": false
      },
      "bracketId": "",
      "bracketRegion": "",
      "bracketRound": "",
      "contestClock": "0:00",
      "currentPeriod": "FINAL",
      "finalMessage": "FINAL",
      "gameID": "ab4be70f-6ecb-4210-86db-814e7022f917",
      "gameState": "final",
      "home": {
        "conferences": [{
          "conferenceName": "SEC",
          "conferenceSeo": "sec"
        }],
        "description": "(6-4)",
        "names": {
          "char6": "TX A&M",
          "full": "Texas A&M University, College Station",
          "seo": "texas-am",
          "short": "Texas A&M"
        },
        "rank": "",
        "score": "38",
        "seed": "",
        "winner": true
      },
      "liveVideoEnabled": false,
      "network": "",
      "startDate": "11-10-2018",
      "startTime": "12:00PM ET",
      "startTimeEpoch": "1541869200",
      "title": "Texas A&M Ole Miss",
      "url": "/game/football/fbs/2018/11/10/ole-miss-texas-am",
      "videoState": ""
    }},
    {"game": {
      "away": {
        "conferences": [{
          "conferenceName": "SEC",
          "conferenceSeo": "sec"
        }],
        "description": "(5-4)",
        "names": {
          "char6": "S CAR",
          "full": "University of South Carolina, Columbia",
          "seo": "south-carolina",
          "short": "South Carolina"
        },
        "rank": "",
        "score": "31",
        "seed": "",
        "winner": false
      },
      "bracketId": "",
      "bracketRegion": "",
      "bracketRound": "",
      "contestClock": "0:00",
      "currentPeriod": "FINAL",
      "finalMessage": "FINAL",
      "gameID": "0c9ed06c-44c9-4ca0-9c01-3e8f258ed48f",
      "gameState": "final",
      "home": {
        "conferences": [
          {
            "conferenceName": "SEC",
            "conferenceSeo": "sec"
          },
          {
            "conferenceName": "Top 25",
            "conferenceSeo": "top-25"
          }
        ],
        "description": "(7-3)",
        "names": {
          "char6": "FLA",
          "full": "University of Florida",
          "seo": "florida",
          "short": "Florida"
        },
        "rank": "15",
        "score": "35",
        "seed": "",
        "winner": true
      },
      "liveVideoEnabled": false,
      "network": "",
      "startDate": "11-10-2018",
      "startTime": "12:00PM ET",
      "startTimeEpoch": "1541869200",
      "title": "Florida South Carolina",
      "url": "/game/football/fbs/2018/11/10/south-carolina-florida",
      "videoState": ""
    }},
    {"game": {
      "away": {
        "conferences": [{
          "conferenceName": "SEC",
          "conferenceSeo": "sec"
        }],
        "description": "(4-6)",
        "names": {
          "char6": "VANDY",
          "full": "Vanderbilt University",
          "seo": "vanderbilt",
          "short": "Vanderbilt"
        },
        "rank": "",
        "score": "28",
        "seed": "",
        "winner": false
      },
      "bracketId": "",
      "bracketRegion": "",
      "bracketRound": "",
      "contestClock": "0:00",
      "currentPeriod": "FINAL",
      "finalMessage": "FINAL",
      "gameID": "f8ad8a42-dbf4-4891-8634-44bbef75d52d",
      "gameState": "final",
      "home": {
        "conferences": [{
          "conferenceName": "SEC",
          "conferenceSeo": "sec"
        }],
        "description": "(6-4)",
        "names": {
          "char6": "MIZZOU",
          "full": "University of Missouri, Columbia",
          "seo": "missouri",
          "short": "Missouri"
        },
        "rank": "",
        "score": "33",
        "seed": "",
        "winner": true
      },
      "liveVideoEnabled": false,
      "network": "",
      "startDate": "11-10-2018",
      "startTime": "12:00PM ET",
      "startTimeEpoch": "1541869200",
      "title": "Missouri Vanderbilt",
      "url": "/game/football/fbs/2018/11/10/vanderbilt-missouri",
      "videoState": ""
    }},
    {"game": {
      "away": {
        "conferences": [{
          "conferenceName": "AAC",
          "conferenceSeo": "aac"
        }],
        "description": "(2-8)",
        "names": {
          "char6": "NAVY",
          "full": "U.S. Naval Academy",
          "seo": "navy",
          "short": "Navy"
        },
        "rank": "",
        "score": "24",
        "seed": "",
        "winner": false
      },
      "bracketId": "",
      "bracketRegion": "",
      "bracketRound": "",
      "contestClock": "0:00",
      "currentPeriod": "FINAL",
      "finalMessage": "FINAL",
      "gameID": "e34f62fa-f040-4e66-8440-84cc027e5c5c",
      "gameState": "final",
      "home": {
        "conferences": [
          {
            "conferenceName": "AAC",
            "conferenceSeo": "aac"
          },
          {
            "conferenceName": "Top 25",
            "conferenceSeo": "top-25"
          }
        ],
        "description": "(9-0)",
        "names": {
          "char6": "UCF",
          "full": "University of Central Florida",
          "seo": "ucf",
          "short": "UCF"
        },
        "rank": "12",
        "score": "35",
        "seed": "",
        "winner": true
      },
      "liveVideoEnabled": false,
      "network": "",
      "startDate": "11-10-2018",
      "startTime": "12:00PM ET",
      "startTimeEpoch": "1541869200",
      "title": "UCF Navy",
      "url": "/game/football/fbs/2018/11/10/navy-ucf",
      "videoState": ""
    }},
    {"game": {
      "away": {
        "conferences": [{
          "conferenceName": "AAC",
          "conferenceSeo": "aac"
        }],
        "description": "(5-5)",
        "names": {
          "char6": "SMU",
          "full": "Southern Methodist University",
          "seo": "smu",
          "short": "SMU"
        },
        "rank": "",
        "score": "62",
        "seed": "",
        "winner": true
      },
      "bracketId": "",
      "bracketRegion": "",
      "bracketRound": "",
      "contestClock": "0:00",
      "currentPeriod": "FINAL",
      "finalMessage": "FINAL",
      "gameID": "7a150d45-4a8b-4c31-a122-ecd37186cd9a",
      "gameState": "final",
      "home": {
        "conferences": [{
          "conferenceName": "AAC",
          "conferenceSeo": "aac"
        }],
        "description": "(1-9)",
        "names": {
          "char6": "UCONN",
          "full": "University of Connecticut",
          "seo": "uconn",
          "short": "UConn"
        },
        "rank": "",
        "score": "50",
        "seed": "",
        "winner": false
      },
      "liveVideoEnabled": false,
      "network": "",
      "startDate": "11-10-2018",
      "startTime": "12:00PM ET",
      "startTimeEpoch": "1541869200",
      "title": "UConn SMU",
      "url": "/game/football/fbs/2018/11/10/smu-uconn",
      "videoState": ""
    }},
    {"game": {
      "away": {
        "conferences": [{
          "conferenceName": "AAC",
          "conferenceSeo": "aac"
        }],
        "description": "(2-8)",
        "names": {
          "char6": "TULSA",
          "full": "The University of Tulsa",
          "seo": "tulsa",
          "short": "Tulsa"
        },
        "rank": "",
        "score": "21",
        "seed": "",
        "winner": false
      },
      "bracketId": "",
      "bracketRegion": "",
      "bracketRound": "",
      "contestClock": "0:00",
      "currentPeriod": "FINAL",
      "finalMessage": "FINAL",
      "gameID": "d52b1c2f-be7f-4fcf-9236-f1afc167583a",
      "gameState": "final",
      "home": {
        "conferences": [{
          "conferenceName": "AAC",
          "conferenceSeo": "aac"
        }],
        "description": "(6-4)",
        "names": {
          "char6": "MEM",
          "full": "University of Memphis",
          "seo": "memphis",
          "short": "Memphis"
        },
        "rank": "",
        "score": "47",
        "seed": "",
        "winner": true
      },
      "liveVideoEnabled": false,
      "network": "",
      "startDate": "11-10-2018",
      "startTime": "12:00PM ET",
      "startTimeEpoch": "1541869200",
      "title": "Memphis Tulsa",
      "url": "/game/football/fbs/2018/11/10/tulsa-memphis",
      "videoState": ""
    }},
    {"game": {
      "away": {
        "conferences": [{
          "conferenceName": "MAC",
          "conferenceSeo": "mac"
        }],
        "description": "(4-5)",
        "names": {
          "char6": "AKRON",
          "full": "University of Akron",
          "seo": "akron",
          "short": "Akron"
        },
        "rank": "",
        "score": "7",
        "seed": "",
        "winner": false
      },
      "bracketId": "",
      "bracketRegion": "",
      "bracketRound": "",
      "contestClock": "0:00",
      "currentPeriod": "FINAL",
      "finalMessage": "FINAL",
      "gameID": "2ad09a81-7d2c-4f9e-8bbc-c1192328ccd2",
      "gameState": "final",
      "home": {
        "conferences": [{
          "conferenceName": "MAC",
          "conferenceSeo": "mac"
        }],
        "description": "(6-5)",
        "names": {
          "char6": "E MICH",
          "full": "Eastern Michigan University",
          "seo": "eastern-mich",
          "short": "Eastern Mich."
        },
        "rank": "",
        "score": "27",
        "seed": "",
        "winner": true
      },
      "liveVideoEnabled": false,
      "network": "",
      "startDate": "11-10-2018",
      "startTime": "12:00PM ET",
      "startTimeEpoch": "1541869200",
      "title": "Eastern Mich. Akron",
      "url": "/game/football/fbs/2018/11/10/akron-eastern-mich",
      "videoState": ""
    }},
    {"game": {
      "away": {
        "conferences": [{
          "conferenceName": "Big 12",
          "conferenceSeo": "big-12"
        }],
        "description": "(4-6)",
        "names": {
          "char6": "TCU",
          "full": "Texas Christian University",
          "seo": "tcu",
          "short": "TCU"
        },
        "rank": "",
        "score": "10",
        "seed": "",
        "winner": false
      },
      "bracketId": "",
      "bracketRegion": "",
      "bracketRound": "",
      "contestClock": "0:00",
      "currentPeriod": "FINAL",
      "finalMessage": "FINAL",
      "gameID": "e40d60f8-69d0-48fd-839f-547394766f0d",
      "gameState": "final",
      "home": {
        "conferences": [
          {
            "conferenceName": "Big 12",
            "conferenceSeo": "big-12"
          },
          {
            "conferenceName": "Top 25",
            "conferenceSeo": "top-25"
          }
        ],
        "description": "(8-1)",
        "names": {
          "char6": "WVU",
          "full": "West Virginia University",
          "seo": "west-virginia",
          "short": "West Virginia"
        },
        "rank": "9",
        "score": "47",
        "seed": "",
        "winner": true
      },
      "liveVideoEnabled": false,
      "network": "",
      "startDate": "11-10-2018",
      "startTime": "12:00PM ET",
      "startTimeEpoch": "1541869200",
      "title": "West Virginia TCU",
      "url": "/game/football/fbs/2018/11/10/tcu-west-virginia",
      "videoState": ""
    }},
    {"game": {
      "away": {
        "conferences": [{
          "conferenceName": "Big 12",
          "conferenceSeo": "big-12"
        }],
        "description": "(3-7)",
        "names": {
          "char6": "KANSAS",
          "full": "University of Kansas",
          "seo": "kansas",
          "short": "Kansas"
        },
        "rank": "",
        "score": "17",
        "seed": "",
        "winner": false
      },
      "bracketId": "",
      "bracketRegion": "",
      "bracketRound": "",
      "contestClock": "0:00",
      "currentPeriod": "FINAL",
      "finalMessage": "FINAL",
      "gameID": "458fec08-e1bf-430e-abb7-cd7458a10748",
      "gameState": "final",
      "home": {
        "conferences": [{
          "conferenceName": "Big 12",
          "conferenceSeo": "big-12"
        }],
        "description": "(4-6)",
        "names": {
          "char6": "KAN ST",
          "full": "Kansas State University",
          "seo": "kansas-st",
          "short": "Kansas St."
        },
        "rank": "",
        "score": "21",
        "seed": "",
        "winner": true
      },
      "liveVideoEnabled": false,
      "network": "",
      "startDate": "11-10-2018",
      "startTime": "12:00PM ET",
      "startTimeEpoch": "1541869200",
      "title": "Kansas St. Kansas",
      "url": "/game/football/fbs/2018/11/10/kansas-kansas-st",
      "videoState": ""
    }},
    {"game": {
      "away": {
        "conferences": [{
          "conferenceName": "Patriot",
          "conferenceSeo": "patriot"
        }],
        "description": "(3-7)",
        "names": {
          "char6": "LAFAYE",
          "full": "Lafayette College",
          "seo": "lafayette",
          "short": "Lafayette"
        },
        "rank": "",
        "score": "13",
        "seed": "",
        "winner": false
      },
      "bracketId": "",
      "bracketRegion": "",
      "bracketRound": "",
      "contestClock": "0:00",
      "currentPeriod": "FINAL",
      "finalMessage": "FINAL",
      "gameID": "34c3b5f7-e8dc-49f4-9425-e608e7acb245",
      "gameState": "final",
      "home": {
        "conferences": [{
          "conferenceName": "FBS Independent",
          "conferenceSeo": "fbs-independent"
        }],
        "description": "(8-2)",
        "names": {
          "char6": "ARMY",
          "full": "U.S. Military Academy",
          "seo": "army",
          "short": "Army West Point"
        },
        "rank": "",
        "score": "31",
        "seed": "",
        "winner": true
      },
      "liveVideoEnabled": false,
      "network": "",
      "startDate": "11-10-2018",
      "startTime": "12:00PM ET",
      "startTimeEpoch": "1541869200",
      "title": "Army West Point Lafayette",
      "url": "/game/football/fbs/2018/11/10/lafayette-army",
      "videoState": ""
    }},
    {"game": {
      "away": {
        "conferences": [{
          "conferenceName": "ACC",
          "conferenceSeo": "acc"
        }],
        "description": "(1-8)",
        "names": {
          "char6": "UNC",
          "full": "University of North Carolina, Chapel Hill",
          "seo": "north-carolina",
          "short": "North Carolina"
        },
        "rank": "",
        "score": "35",
        "seed": "",
        "winner": false
      },
      "bracketId": "",
      "bracketRegion": "",
      "bracketRound": "",
      "contestClock": "0:00",
      "currentPeriod": "FINAL",
      "finalMessage": "FINAL",
      "gameID": "f484a73b-0ec5-49a7-a2cf-9cd74a7932a2",
      "gameState": "final",
      "home": {
        "conferences": [{
          "conferenceName": "ACC",
          "conferenceSeo": "acc"
        }],
        "description": "(7-3)",
        "names": {
          "char6": "DUKE",
          "full": "Duke University",
          "seo": "duke",
          "short": "Duke"
        },
        "rank": "",
        "score": "42",
        "seed": "",
        "winner": true
      },
      "liveVideoEnabled": false,
      "network": "",
      "startDate": "11-10-2018",
      "startTime": "12:20PM ET",
      "startTimeEpoch": "1541870400",
      "title": "Duke North Carolina",
      "url": "/game/football/fbs/2018/11/10/north-carolina-duke",
      "videoState": ""
    }},
    {"game": {
      "away": {
        "conferences": [{
          "conferenceName": "Sun Belt",
          "conferenceSeo": "sun-belt"
        }],
        "description": "(8-2)",
        "names": {
          "char6": "TROY",
          "full": "Troy University",
          "seo": "troy",
          "short": "Troy"
        },
        "rank": "",
        "score": "35",
        "seed": "",
        "winner": true
      },
      "bracketId": "",
      "bracketRegion": "",
      "bracketRound": "",
      "contestClock": "0:00",
      "currentPeriod": "FINAL",
      "finalMessage": "FINAL",
      "gameID": "aefc4800-af20-4b0b-b3f1-df4fc7de29dd",
      "gameState": "final",
      "home": {
        "conferences": [{
          "conferenceName": "Sun Belt",
          "conferenceSeo": "sun-belt"
        }],
        "description": "(7-3)",
        "names": {
          "char6": "GA SOU",
          "full": "Georgia Southern University",
          "seo": "ga-southern",
          "short": "Ga. Southern"
        },
        "rank": "",
        "score": "21",
        "seed": "",
        "winner": false
      },
      "liveVideoEnabled": false,
      "network": "",
      "startDate": "11-10-2018",
      "startTime": "01:00PM ET",
      "startTimeEpoch": "1541872800",
      "title": "Ga. Southern Troy",
      "url": "/game/football/fbs/2018/11/10/troy-ga-southern",
      "videoState": ""
    }},
    {"game": {
      "away": {
        "conferences": [{
          "conferenceName": "Pac-12",
          "conferenceSeo": "pac-12"
        }],
        "description": "(2-8)",
        "names": {
          "char6": "UCLA",
          "full": "University of California, Los Angeles",
          "seo": "ucla",
          "short": "UCLA"
        },
        "rank": "",
        "score": "28",
        "seed": "",
        "winner": false
      },
      "bracketId": "",
      "bracketRegion": "",
      "bracketRound": "",
      "contestClock": "0:00",
      "currentPeriod": "FINAL",
      "finalMessage": "FINAL",
      "gameID": "692ca1fe-222a-48f4-b089-19b4cf2f7552",
      "gameState": "final",
      "home": {
        "conferences": [{
          "conferenceName": "Pac-12",
          "conferenceSeo": "pac-12"
        }],
        "description": "(6-4)",
        "names": {
          "char6": "AZ ST",
          "full": "Arizona State University",
          "seo": "arizona-st",
          "short": "Arizona St."
        },
        "rank": "",
        "score": "31",
        "seed": "",
        "winner": true
      },
      "liveVideoEnabled": false,
      "network": "",
      "startDate": "11-10-2018",
      "startTime": "02:00PM ET",
      "startTimeEpoch": "1541876400",
      "title": "Arizona St. UCLA",
      "url": "/game/football/fbs/2018/11/10/ucla-arizona-st",
      "videoState": ""
    }},
    {"game": {
      "away": {
        "conferences": [{
          "conferenceName": "C-USA",
          "conferenceSeo": "c-usa"
        }],
        "description": "(4-6)",
        "names": {
          "char6": "CHAR",
          "full": "The University of North Carolina at Charlotte",
          "seo": "charlotte",
          "short": "Charlotte"
        },
        "rank": "",
        "score": "13",
        "seed": "",
        "winner": false
      },
      "bracketId": "",
      "bracketRegion": "",
      "bracketRound": "",
      "contestClock": "0:00",
      "currentPeriod": "FINAL",
      "finalMessage": "FINAL",
      "gameID": "8c007d94-e2fd-4d5e-abf0-690fa964e551",
      "gameState": "final",
      "home": {
        "conferences": [{
          "conferenceName": "C-USA",
          "conferenceSeo": "c-usa"
        }],
        "description": "(6-3)",
        "names": {
          "char6": "MARSH",
          "full": "Marshall University",
          "seo": "marshall",
          "short": "Marshall"
        },
        "rank": "",
        "score": "30",
        "seed": "",
        "winner": true
      },
      "liveVideoEnabled": false,
      "network": "",
      "startDate": "11-10-2018",
      "startTime": "02:30PM ET",
      "startTimeEpoch": "1541878200",
      "title": "Marshall Charlotte",
      "url": "/game/football/fbs/2018/11/10/charlotte-marshall",
      "videoState": ""
    }},
    {"game": {
      "away": {
        "conferences": [{
          "conferenceName": "MAC",
          "conferenceSeo": "mac"
        }],
        "description": "(2-8)",
        "names": {
          "char6": "BGSU",
          "full": "Bowling Green State University",
          "seo": "bowling-green",
          "short": "Bowling Green"
        },
        "rank": "",
        "score": "24",
        "seed": "",
        "winner": true
      },
      "bracketId": "",
      "bracketRegion": "",
      "bracketRound": "",
      "contestClock": "0:00",
      "currentPeriod": "FINAL",
      "finalMessage": "FINAL",
      "gameID": "5fc7a153-3f67-434c-b82a-107214c33c72",
      "gameState": "final",
      "home": {
        "conferences": [{
          "conferenceName": "MAC",
          "conferenceSeo": "mac"
        }],
        "description": "(1-10)",
        "names": {
          "char6": "C MICH",
          "full": "Central Michigan University",
          "seo": "central-mich",
          "short": "Central Mich."
        },
        "rank": "",
        "score": "13",
        "seed": "",
        "winner": false
      },
      "liveVideoEnabled": false,
      "network": "",
      "startDate": "11-10-2018",
      "startTime": "03:00PM ET",
      "startTimeEpoch": "1541880000",
      "title": "Central Mich. Bowling Green",
      "url": "/game/football/fbs/2018/11/10/bowling-green-central-mich",
      "videoState": ""
    }},
    {"game": {
      "away": {
        "conferences": [{
          "conferenceName": "FBS Independent",
          "conferenceSeo": "fbs-independent"
        }],
        "description": "(4-5)",
        "names": {
          "char6": "LIBRTY",
          "full": "Liberty University",
          "seo": "liberty",
          "short": "Liberty"
        },
        "rank": "",
        "score": "24",
        "seed": "",
        "winner": false
      },
      "bracketId": "",
      "bracketRegion": "",
      "bracketRound": "",
      "contestClock": "0:00",
      "currentPeriod": "FINAL",
      "finalMessage": "FINAL",
      "gameID": "bdc0185f-64ae-40a6-9872-676de460dbcf",
      "gameState": "final",
      "home": {
        "conferences": [{
          "conferenceName": "ACC",
          "conferenceSeo": "acc"
        }],
        "description": "(7-3)",
        "names": {
          "char6": "UVA",
          "full": "University of Virginia",
          "seo": "virginia",
          "short": "Virginia"
        },
        "rank": "",
        "score": "45",
        "seed": "",
        "winner": true
      },
      "liveVideoEnabled": false,
      "network": "",
      "startDate": "11-10-2018",
      "startTime": "03:00PM ET",
      "startTimeEpoch": "1541880000",
      "title": "Virginia Liberty",
      "url": "/game/football/fbs/2018/11/10/liberty-virginia",
      "videoState": ""
    }},
    {"game": {
      "away": {
        "conferences": [{
          "conferenceName": "C-USA",
          "conferenceSeo": "c-usa"
        }],
        "description": "(7-3)",
        "names": {
          "char6": "MIDTEN",
          "full": "Middle Tennessee State University",
          "seo": "middle-tenn",
          "short": "Middle Tenn."
        },
        "rank": "",
        "score": "48",
        "seed": "",
        "winner": true
      },
      "bracketId": "",
      "bracketRegion": "",
      "bracketRound": "",
      "contestClock": "0:00",
      "currentPeriod": "FINAL",
      "finalMessage": "FINAL",
      "gameID": "5cb6c90c-f90c-447c-a38e-8ac62d4e98ac",
      "gameState": "final",
      "home": {
        "conferences": [{
          "conferenceName": "C-USA",
          "conferenceSeo": "c-usa"
        }],
        "description": "(1-9)",
        "names": {
          "char6": "UTEP",
          "full": "University of Texas at El Paso",
          "seo": "utep",
          "short": "UTEP"
        },
        "rank": "",
        "score": "32",
        "seed": "",
        "winner": false
      },
      "liveVideoEnabled": false,
      "network": "",
      "startDate": "11-10-2018",
      "startTime": "03:00PM ET",
      "startTimeEpoch": "1541880000",
      "title": "UTEP Middle Tenn.",
      "url": "/game/football/fbs/2018/11/10/middle-tenn-utep",
      "videoState": ""
    }},
    {"game": {
      "away": {
        "conferences": [{
          "conferenceName": "MWC",
          "conferenceSeo": "mwc"
        }],
        "description": "(3-7)",
        "names": {
          "char6": "N MEX",
          "full": "University of New Mexico",
          "seo": "new-mexico",
          "short": "New Mexico"
        },
        "rank": "",
        "score": "24",
        "seed": "",
        "winner": false
      },
      "bracketId": "",
      "bracketRegion": "",
      "bracketRound": "",
      "contestClock": "0:00",
      "currentPeriod": "FINAL",
      "finalMessage": "FINAL",
      "gameID": "16542234-15c8-4e8f-9b12-67634f6b7856",
      "gameState": "final",
      "home": {
        "conferences": [{
          "conferenceName": "MWC",
          "conferenceSeo": "mwc"
        }],
        "description": "(4-6)",
        "names": {
          "char6": "AIRFOR",
          "full": "U.S. Air Force Academy",
          "seo": "air-force",
          "short": "Air Force"
        },
        "rank": "",
        "score": "42",
        "seed": "",
        "winner": true
      },
      "liveVideoEnabled": false,
      "network": "",
      "startDate": "11-10-2018",
      "startTime": "03:30PM ET",
      "startTimeEpoch": "1541881800",
      "title": "Air Force New Mexico",
      "url": "/game/football/fbs/2018/11/10/new-mexico-air-force",
      "videoState": ""
    }},
    {"game": {
      "away": {
        "conferences": [{
          "conferenceName": "C-USA",
          "conferenceSeo": "c-usa"
        }],
        "description": "(7-3)",
        "names": {
          "char6": "NO TEX",
          "full": "University of North Texas",
          "seo": "north-texas",
          "short": "North Texas"
        },
        "rank": "",
        "score": "31",
        "seed": "",
        "winner": false
      },
      "bracketId": "",
      "bracketRegion": "",
      "bracketRound": "",
      "contestClock": "0:00",
      "currentPeriod": "FINAL",
      "finalMessage": "FINAL",
      "gameID": "a063afab-e788-442a-80a8-d18edf04e440",
      "gameState": "final",
      "home": {
        "conferences": [{
          "conferenceName": "C-USA",
          "conferenceSeo": "c-usa"
        }],
        "description": "(3-7)",
        "names": {
          "char6": "ODU",
          "full": "Old Dominion University",
          "seo": "old-dominion",
          "short": "Old Dominion"
        },
        "rank": "",
        "score": "34",
        "seed": "",
        "winner": true
      },
      "liveVideoEnabled": false,
      "network": "",
      "startDate": "11-10-2018",
      "startTime": "03:30PM ET",
      "startTimeEpoch": "1541881800",
      "title": "Old Dominion North Texas",
      "url": "/game/football/fbs/2018/11/10/north-texas-old-dominion",
      "videoState": ""
    }},
    {"game": {
      "away": {
        "conferences": [
          {
            "conferenceName": "Big Ten",
            "conferenceSeo": "big-ten"
          },
          {
            "conferenceName": "Top 25",
            "conferenceSeo": "top-25"
          }
        ],
        "description": "(9-1)",
        "names": {
          "char6": "MICH",
          "full": "University of Michigan",
          "seo": "michigan",
          "short": "Michigan"
        },
        "rank": "4",
        "score": "42",
        "seed": "",
        "winner": true
      },
      "bracketId": "",
      "bracketRegion": "",
      "bracketRound": "",
      "contestClock": "0:00",
      "currentPeriod": "FINAL",
      "finalMessage": "FINAL",
      "gameID": "d34f6bc6-957e-49b3-b664-ef565c4f5761",
      "gameState": "final",
      "home": {
        "conferences": [{
          "conferenceName": "Big Ten",
          "conferenceSeo": "big-ten"
        }],
        "description": "(1-9)",
        "names": {
          "char6": "RUTGER",
          "full": "Rutgers, The State University of New Jersey, New Brunswick",
          "seo": "rutgers",
          "short": "Rutgers"
        },
        "rank": "",
        "score": "7",
        "seed": "",
        "winner": false
      },
      "liveVideoEnabled": false,
      "network": "",
      "startDate": "11-10-2018",
      "startTime": "03:30PM ET",
      "startTimeEpoch": "1541881800",
      "title": "Rutgers Michigan",
      "url": "/game/football/fbs/2018/11/10/michigan-rutgers",
      "videoState": ""
    }},
    {"game": {
      "away": {
        "conferences": [{
          "conferenceName": "Big 12",
          "conferenceSeo": "big-12"
        }],
        "description": "(5-5)",
        "names": {
          "char6": "BAYLOR",
          "full": "Baylor University",
          "seo": "baylor",
          "short": "Baylor"
        },
        "rank": "",
        "score": "14",
        "seed": "",
        "winner": false
      },
      "bracketId": "",
      "bracketRegion": "",
      "bracketRound": "",
      "contestClock": "0:00",
      "currentPeriod": "FINAL",
      "finalMessage": "FINAL",
      "gameID": "84c6ccb2-4bf1-4cef-ac46-84ceb6809704",
      "gameState": "final",
      "home": {
        "conferences": [
          {
            "conferenceName": "Big 12",
            "conferenceSeo": "big-12"
          },
          {
            "conferenceName": "Top 25",
            "conferenceSeo": "top-25"
          }
        ],
        "description": "(6-3)",
        "names": {
          "char6": "IOWAST",
          "full": "Iowa State University",
          "seo": "iowa-st",
          "short": "Iowa State"
        },
        "rank": "22",
        "score": "28",
        "seed": "",
        "winner": true
      },
      "liveVideoEnabled": false,
      "network": "",
      "startDate": "11-10-2018",
      "startTime": "03:30PM ET",
      "startTimeEpoch": "1541881800",
      "title": "Iowa St. Baylor",
      "url": "/game/football/fbs/2018/11/10/baylor-iowa-st",
      "videoState": ""
    }},
    {"game": {
      "away": {
        "conferences": [{
          "conferenceName": "ACC",
          "conferenceSeo": "acc"
        }],
        "description": "(4-5)",
        "names": {
          "char6": "VT",
          "full": "Virginia Polytechnic Institute and State University",
          "seo": "virginia-tech",
          "short": "Virginia Tech"
        },
        "rank": "",
        "score": "22",
        "seed": "",
        "winner": false
      },
      "bracketId": "",
      "bracketRegion": "",
      "bracketRound": "",
      "contestClock": "0:00",
      "currentPeriod": "FINAL",
      "finalMessage": "FINAL",
      "gameID": "26fda752-2d2a-4598-aa8e-8ea0ef21c0c4",
      "gameState": "final",
      "home": {
        "conferences": [{
          "conferenceName": "ACC",
          "conferenceSeo": "acc"
        }],
        "description": "(6-4)",
        "names": {
          "char6": "PITT",
          "full": "University of Pittsburgh",
          "seo": "pittsburgh",
          "short": "Pittsburgh"
        },
        "rank": "",
        "score": "52",
        "seed": "",
        "winner": true
      },
      "liveVideoEnabled": false,
      "network": "",
      "startDate": "11-10-2018",
      "startTime": "03:30PM ET",
      "startTimeEpoch": "1541881800",
      "title": "Pittsburgh Virginia Tech",
      "url": "/game/football/fbs/2018/11/10/virginia-tech-pittsburgh",
      "videoState": ""
    }},
    {"game": {
      "away": {
        "conferences": [
          {
            "conferenceName": "SEC",
            "conferenceSeo": "sec"
          },
          {
            "conferenceName": "Top 25",
            "conferenceSeo": "top-25"
          }
        ],
        "description": "(7-3)",
        "names": {
          "char6": "UK",
          "full": "University of Kentucky",
          "seo": "kentucky",
          "short": "Kentucky"
        },
        "rank": "11",
        "score": "7",
        "seed": "",
        "winner": false
      },
      "bracketId": "",
      "bracketRegion": "",
      "bracketRound": "",
      "contestClock": "0:00",
      "currentPeriod": "FINAL",
      "finalMessage": "FINAL",
      "gameID": "6f8f7345-e959-475b-9f7a-7ac6cadc5244",
      "gameState": "final",
      "home": {
        "conferences": [{
          "conferenceName": "SEC",
          "conferenceSeo": "sec"
        }],
        "description": "(5-5)",
        "names": {
          "char6": "TENN",
          "full": "University of Tennessee, Knoxville",
          "seo": "tennessee",
          "short": "Tennessee"
        },
        "rank": "",
        "score": "24",
        "seed": "",
        "winner": true
      },
      "liveVideoEnabled": false,
      "network": "",
      "startDate": "11-10-2018",
      "startTime": "03:30PM ET",
      "startTimeEpoch": "1541881800",
      "title": "Tennessee Kentucky",
      "url": "/game/football/fbs/2018/11/10/kentucky-tennessee",
      "videoState": ""
    }},
    {"game": {
      "away": {
        "conferences": [{
          "conferenceName": "Big Ten",
          "conferenceSeo": "big-ten"
        }],
        "description": "(6-4)",
        "names": {
          "char6": "NWSTRN",
          "full": "Northwestern University",
          "seo": "northwestern",
          "short": "Northwestern"
        },
        "rank": "",
        "score": "14",
        "seed": "",
        "winner": true
      },
      "bracketId": "",
      "bracketRegion": "",
      "bracketRound": "",
      "contestClock": "0:00",
      "currentPeriod": "FINAL",
      "finalMessage": "FINAL",
      "gameID": "4adae0d4-4e8a-4b0e-ba27-a7fa02bb92a9",
      "gameState": "final",
      "home": {
        "conferences": [
          {
            "conferenceName": "Big Ten",
            "conferenceSeo": "big-ten"
          },
          {
            "conferenceName": "Top 25",
            "conferenceSeo": "top-25"
          }
        ],
        "description": "(6-4)",
        "names": {
          "char6": "IOWA",
          "full": "University of Iowa",
          "seo": "iowa",
          "short": "Iowa"
        },
        "rank": "21",
        "score": "10",
        "seed": "",
        "winner": false
      },
      "liveVideoEnabled": false,
      "network": "",
      "startDate": "11-10-2018",
      "startTime": "03:30PM ET",
      "startTimeEpoch": "1541881800",
      "title": "Iowa Northwestern",
      "url": "/game/football/fbs/2018/11/10/northwestern-iowa",
      "videoState": ""
    }},
    {"game": {
      "away": {
        "conferences": [
          {
            "conferenceName": "SEC",
            "conferenceSeo": "sec"
          },
          {
            "conferenceName": "Top 25",
            "conferenceSeo": "top-25"
          }
        ],
        "description": "(6-4)",
        "names": {
          "char6": "MISSST",
          "full": "Mississippi State University",
          "seo": "mississippi-st",
          "short": "Mississippi St."
        },
        "rank": "16",
        "score": "0",
        "seed": "",
        "winner": false
      },
      "bracketId": "",
      "bracketRegion": "",
      "bracketRound": "",
      "contestClock": "0:00",
      "currentPeriod": "FINAL",
      "finalMessage": "FINAL",
      "gameID": "bb9ba540-b89f-4042-bf1d-7f9f572a2c09",
      "gameState": "final",
      "home": {
        "conferences": [
          {
            "conferenceName": "SEC",
            "conferenceSeo": "sec"
          },
          {
            "conferenceName": "Top 25",
            "conferenceSeo": "top-25"
          }
        ],
        "description": "(10-0)",
        "names": {
          "char6": "ALA",
          "full": "University of Alabama",
          "seo": "alabama",
          "short": "Alabama"
        },
        "rank": "1",
        "score": "24",
        "seed": "",
        "winner": true
      },
      "liveVideoEnabled": false,
      "network": "",
      "startDate": "11-10-2018",
      "startTime": "03:30PM ET",
      "startTimeEpoch": "1541881800",
      "title": "Alabama Mississippi St.",
      "url": "/game/football/fbs/2018/11/10/mississippi-st-alabama",
      "videoState": ""
    }},
    {"game": {
      "away": {
        "conferences": [{
          "conferenceName": "Big 12",
          "conferenceSeo": "big-12"
        }],
        "description": "(5-5)",
        "names": {
          "char6": "OKLAST",
          "full": "Oklahoma State University",
          "seo": "oklahoma-st",
          "short": "Oklahoma State"
        },
        "rank": "",
        "score": "47",
        "seed": "",
        "winner": false
      },
      "bracketId": "",
      "bracketRegion": "",
      "bracketRound": "",
      "contestClock": "0:00",
      "currentPeriod": "FINAL",
      "finalMessage": "FINAL",
      "gameID": "3b895368-6236-4894-aade-b68833cf74f9",
      "gameState": "final",
      "home": {
        "conferences": [
          {
            "conferenceName": "Big 12",
            "conferenceSeo": "big-12"
          },
          {
            "conferenceName": "Top 25",
            "conferenceSeo": "top-25"
          }
        ],
        "description": "(9-1)",
        "names": {
          "char6": "OKLA",
          "full": "University of Oklahoma",
          "seo": "oklahoma",
          "short": "Oklahoma"
        },
        "rank": "6",
        "score": "48",
        "seed": "",
        "winner": true
      },
      "liveVideoEnabled": false,
      "network": "",
      "startDate": "11-10-2018",
      "startTime": "03:30PM ET",
      "startTimeEpoch": "1541881800",
      "title": "Oklahoma Oklahoma St.",
      "url": "/game/football/fbs/2018/11/10/oklahoma-st-oklahoma",
      "videoState": ""
    }},
    {"game": {
      "away": {
        "conferences": [
          {
            "conferenceName": "Pac-12",
            "conferenceSeo": "pac-12"
          },
          {
            "conferenceName": "Top 25",
            "conferenceSeo": "top-25"
          }
        ],
        "description": "(9-1)",
        "names": {
          "char6": "WASHST",
          "full": "Washington State University",
          "seo": "washington-st",
          "short": "Washington St."
        },
        "rank": "8",
        "score": "31",
        "seed": "",
        "winner": true
      },
      "bracketId": "",
      "bracketRegion": "",
      "bracketRound": "",
      "contestClock": "0:00",
      "currentPeriod": "FINAL",
      "finalMessage": "FINAL",
      "gameID": "111d8a6f-5ea2-4914-8e7b-0e65d0262ab4",
      "gameState": "final",
      "home": {
        "conferences": [{
          "conferenceName": "Pac-12",
          "conferenceSeo": "pac-12"
        }],
        "description": "(5-5)",
        "names": {
          "char6": "COLO",
          "full": "University of Colorado, Boulder",
          "seo": "colorado",
          "short": "Colorado"
        },
        "rank": "",
        "score": "7",
        "seed": "",
        "winner": false
      },
      "liveVideoEnabled": false,
      "network": "",
      "startDate": "11-10-2018",
      "startTime": "03:30PM ET",
      "startTimeEpoch": "1541881800",
      "title": "Colorado Washington St.",
      "url": "/game/football/fbs/2018/11/10/washington-st-colorado",
      "videoState": ""
    }},
    {"game": {
      "away": {
        "conferences": [{
          "conferenceName": "Big Ten",
          "conferenceSeo": "big-ten"
        }],
        "description": "(5-5)",
        "names": {
          "char6": "PURDUE",
          "full": "Purdue University",
          "seo": "purdue",
          "short": "Purdue"
        },
        "rank": "",
        "score": "10",
        "seed": "",
        "winner": false
      },
      "bracketId": "",
      "bracketRegion": "",
      "bracketRound": "",
      "contestClock": "0:00",
      "currentPeriod": "FINAL",
      "finalMessage": "FINAL",
      "gameID": "f51e0bf5-23a0-4d86-80b2-a65f257815d6",
      "gameState": "final",
      "home": {
        "conferences": [{
          "conferenceName": "Big Ten",
          "conferenceSeo": "big-ten"
        }],
        "description": "(5-5)",
        "names": {
          "char6": "MINN",
          "full": "University of Minnesota, Twin Cities",
          "seo": "minnesota",
          "short": "Minnesota"
        },
        "rank": "",
        "score": "41",
        "seed": "",
        "winner": true
      },
      "liveVideoEnabled": false,
      "network": "",
      "startDate": "11-10-2018",
      "startTime": "03:30PM ET",
      "startTimeEpoch": "1541881800",
      "title": "Minnesota Purdue",
      "url": "/game/football/fbs/2018/11/10/purdue-minnesota",
      "videoState": ""
    }},
    {"game": {
      "away": {
        "conferences": [{
          "conferenceName": "AAC",
          "conferenceSeo": "aac"
        }],
        "description": "(2-7)",
        "names": {
          "char6": "E CAR",
          "full": "East Carolina University",
          "seo": "east-carolina",
          "short": "East Carolina"
        },
        "rank": "",
        "score": "18",
        "seed": "",
        "winner": false
      },
      "bracketId": "",
      "bracketRegion": "",
      "bracketRound": "",
      "contestClock": "0:00",
      "currentPeriod": "FINAL",
      "finalMessage": "FINAL",
      "gameID": "db778ad5-d76e-4372-abb0-f7eeb0906608",
      "gameState": "final",
      "home": {
        "conferences": [{
          "conferenceName": "AAC",
          "conferenceSeo": "aac"
        }],
        "description": "(5-5)",
        "names": {
          "char6": "TULANE",
          "full": "Tulane University",
          "seo": "tulane",
          "short": "Tulane"
        },
        "rank": "",
        "score": "24",
        "seed": "",
        "winner": true
      },
      "liveVideoEnabled": false,
      "network": "",
      "startDate": "11-10-2018",
      "startTime": "04:00PM ET",
      "startTimeEpoch": "1541883600",
      "title": "Tulane East Carolina",
      "url": "/game/football/fbs/2018/11/10/east-carolina-tulane",
      "videoState": ""
    }},
    {"game": {
      "away": {
        "conferences": [{
          "conferenceName": "Sun Belt",
          "conferenceSeo": "sun-belt"
        }],
        "description": "(7-2)",
        "names": {
          "char6": "APP ST",
          "full": "Appalachian State University",
          "seo": "appalachian-st",
          "short": "Appalachian St."
        },
        "rank": "",
        "score": "38",
        "seed": "",
        "winner": true
      },
      "bracketId": "",
      "bracketRegion": "",
      "bracketRound": "",
      "contestClock": "0:00",
      "currentPeriod": "FINAL",
      "finalMessage": "FINAL",
      "gameID": "f6f5d0f3-7a26-4cf2-bb51-e135a45631ed",
      "gameState": "final",
      "home": {
        "conferences": [{
          "conferenceName": "Sun Belt",
          "conferenceSeo": "sun-belt"
        }],
        "description": "(3-7)",
        "names": {
          "char6": "TX ST",
          "full": "Texas State University",
          "seo": "texas-st",
          "short": "Texas State"
        },
        "rank": "",
        "score": "7",
        "seed": "",
        "winner": false
      },
      "liveVideoEnabled": false,
      "network": "",
      "startDate": "11-10-2018",
      "startTime": "04:00PM ET",
      "startTimeEpoch": "1541883600",
      "title": "Texas St. Appalachian St.",
      "url": "/game/football/fbs/2018/11/10/appalachian-st-texas-st",
      "videoState": ""
    }},
    {"game": {
      "away": {
        "conferences": [{
          "conferenceName": "MWC",
          "conferenceSeo": "mwc"
        }],
        "description": "(1-9)",
        "names": {
          "char6": "SJSU",
          "full": "San Jose State University",
          "seo": "san-jose-st",
          "short": "San Jose State"
        },
        "rank": "",
        "score": "24",
        "seed": "",
        "winner": false
      },
      "bracketId": "",
      "bracketRegion": "",
      "bracketRound": "",
      "contestClock": "0:00",
      "currentPeriod": "FINAL",
      "finalMessage": "FINAL",
      "gameID": "d4c752e2-44a7-4a23-965a-191f9f6dbcf5",
      "gameState": "final",
      "home": {
        "conferences": [{
          "conferenceName": "MWC",
          "conferenceSeo": "mwc"
        }],
        "description": "(9-1)",
        "names": {
          "char6": "UT ST",
          "full": "Utah State University",
          "seo": "utah-st",
          "short": "Utah State"
        },
        "rank": "",
        "score": "62",
        "seed": "",
        "winner": true
      },
      "liveVideoEnabled": false,
      "network": "",
      "startDate": "11-10-2018",
      "startTime": "04:00PM ET",
      "startTimeEpoch": "1541883600",
      "title": "Utah St. San Jose St.",
      "url": "/game/football/fbs/2018/11/10/san-jose-st-utah-st",
      "videoState": ""
    }},
    {"game": {
      "away": {
        "conferences": [{
          "conferenceName": "C-USA",
          "conferenceSeo": "c-usa"
        }],
        "description": "(1-9)",
        "names": {
          "char6": "W KY",
          "full": "Western Kentucky University",
          "seo": "western-ky",
          "short": "Western Ky."
        },
        "rank": "",
        "score": "15",
        "seed": "",
        "winner": false
      },
      "bracketId": "",
      "bracketRegion": "",
      "bracketRound": "",
      "contestClock": "0:00",
      "currentPeriod": "FINAL",
      "finalMessage": "FINAL",
      "gameID": "286695e3-19d3-4d85-80c7-9e24e55e1661",
      "gameState": "final",
      "home": {
        "conferences": [{
          "conferenceName": "C-USA",
          "conferenceSeo": "c-usa"
        }],
        "description": "(5-5)",
        "names": {
          "char6": "FAU",
          "full": "Florida Atlantic University",
          "seo": "fla-atlantic",
          "short": "Florida Atlantic"
        },
        "rank": "",
        "score": "34",
        "seed": "",
        "winner": true
      },
      "liveVideoEnabled": false,
      "network": "",
      "startDate": "11-10-2018",
      "startTime": "05:00PM ET",
      "startTimeEpoch": "1541887200",
      "title": "Fla. Atlantic Western Ky.",
      "url": "/game/football/fbs/2018/11/10/western-ky-fla-atlantic",
      "videoState": ""
    }},
    {"game": {
      "away": {
        "conferences": [{
          "conferenceName": "Sun Belt",
          "conferenceSeo": "sun-belt"
        }],
        "description": "(6-4)",
        "names": {
          "char6": "LA MON",
          "full": "University of Louisiana at Monroe",
          "seo": "la-monroe",
          "short": "La.-Monroe"
        },
        "rank": "",
        "score": "38",
        "seed": "",
        "winner": true
      },
      "bracketId": "",
      "bracketRegion": "",
      "bracketRound": "",
      "contestClock": "0:00",
      "currentPeriod": "FINAL",
      "finalMessage": "FINAL",
      "gameID": "f3f6ebad-ffbe-4581-9488-3b52db19c08a",
      "gameState": "final",
      "home": {
        "conferences": [{
          "conferenceName": "Sun Belt",
          "conferenceSeo": "sun-belt"
        }],
        "description": "(2-8)",
        "names": {
          "char6": "S ALA",
          "full": "University of South Alabama",
          "seo": "south-ala",
          "short": "South Alabama"
        },
        "rank": "",
        "score": "10",
        "seed": "",
        "winner": false
      },
      "liveVideoEnabled": false,
      "network": "",
      "startDate": "11-10-2018",
      "startTime": "05:00PM ET",
      "startTimeEpoch": "1541887200",
      "title": "South Alabama La.-Monroe",
      "url": "/game/football/fbs/2018/11/10/la-monroe-south-ala",
      "videoState": ""
    }},
    {"game": {
      "away": {
        "conferences": [{
          "conferenceName": "Sun Belt",
          "conferenceSeo": "sun-belt"
        }],
        "description": "(6-4)",
        "names": {
          "char6": "ARK ST",
          "full": "Arkansas State University",
          "seo": "arkansas-st",
          "short": "Arkansas State"
        },
        "rank": "",
        "score": "44",
        "seed": "",
        "winner": true
      },
      "bracketId": "",
      "bracketRegion": "",
      "bracketRound": "",
      "contestClock": "0:00",
      "currentPeriod": "FINAL",
      "finalMessage": "FINAL",
      "gameID": "3e76488f-f141-42c3-88f3-e83e1aba4fd9",
      "gameState": "final",
      "home": {
        "conferences": [{
          "conferenceName": "Sun Belt",
          "conferenceSeo": "sun-belt"
        }],
        "description": "(5-5)",
        "names": {
          "char6": "CO CAR",
          "full": "Coastal Carolina University",
          "seo": "coastal-caro",
          "short": "Coastal Caro."
        },
        "rank": "",
        "score": "16",
        "seed": "",
        "winner": false
      },
      "liveVideoEnabled": false,
      "network": "",
      "startDate": "11-10-2018",
      "startTime": "05:00PM ET",
      "startTimeEpoch": "1541887200",
      "title": "Coastal Caro. Arkansas St.",
      "url": "/game/football/fbs/2018/11/10/arkansas-st-coastal-caro",
      "videoState": ""
    }},
    {"game": {
      "away": {
        "conferences": [{
          "conferenceName": "Sun Belt",
          "conferenceSeo": "sun-belt"
        }],
        "description": "(2-8)",
        "names": {
          "char6": "GA ST",
          "full": "Georgia State University",
          "seo": "georgia-st",
          "short": "Georgia State"
        },
        "rank": "",
        "score": "22",
        "seed": "",
        "winner": false
      },
      "bracketId": "",
      "bracketRegion": "",
      "bracketRound": "",
      "contestClock": "0:00",
      "currentPeriod": "FINAL",
      "finalMessage": "FINAL",
      "gameID": "2cc859fd-946a-4c19-b21a-80f5e6be9b84",
      "gameState": "final",
      "home": {
        "conferences": [{
          "conferenceName": "Sun Belt",
          "conferenceSeo": "sun-belt"
        }],
        "description": "(5-5)",
        "names": {
          "char6": "ULL",
          "full": "University of Louisiana at Lafayette",
          "seo": "la-lafayette",
          "short": "Louisiana"
        },
        "rank": "",
        "score": "36",
        "seed": "",
        "winner": true
      },
      "liveVideoEnabled": false,
      "network": "",
      "startDate": "11-10-2018",
      "startTime": "05:00PM ET",
      "startTimeEpoch": "1541887200",
      "title": "Louisiana Georgia St.",
      "url": "/game/football/fbs/2018/11/10/georgia-st-la-lafayette",
      "videoState": ""
    }},
    {"game": {
      "away": {
        "conferences": [{
          "conferenceName": "Pac-12",
          "conferenceSeo": "pac-12"
        }],
        "description": "(6-4)",
        "names": {
          "char6": "OREGN",
          "full": "University of Oregon",
          "seo": "oregon",
          "short": "Oregon"
        },
        "rank": "",
        "score": "25",
        "seed": "",
        "winner": false
      },
      "bracketId": "",
      "bracketRegion": "",
      "bracketRound": "",
      "contestClock": "0:00",
      "currentPeriod": "FINAL",
      "finalMessage": "FINAL",
      "gameID": "dda3ac2d-7d89-4b02-8249-bd94db3684bc",
      "gameState": "final",
      "home": {
        "conferences": [{
          "conferenceName": "Pac-12",
          "conferenceSeo": "pac-12"
        }],
        "description": "(7-3)",
        "names": {
          "char6": "UTAH",
          "full": "University of Utah",
          "seo": "utah",
          "short": "Utah"
        },
        "rank": "",
        "score": "32",
        "seed": "",
        "winner": true
      },
      "liveVideoEnabled": false,
      "network": "",
      "startDate": "11-10-2018",
      "startTime": "05:30PM ET",
      "startTimeEpoch": "1541889000",
      "title": "Utah Oregon",
      "url": "/game/football/fbs/2018/11/10/oregon-utah",
      "videoState": ""
    }},
    {"game": {
      "away": {
        "conferences": [{
          "conferenceName": "AAC",
          "conferenceSeo": "aac"
        }],
        "description": "(6-4)",
        "names": {
          "char6": "TEMPLE",
          "full": "Temple University",
          "seo": "temple",
          "short": "Temple"
        },
        "rank": "",
        "score": "59",
        "seed": "",
        "winner": true
      },
      "bracketId": "",
      "bracketRegion": "",
      "bracketRound": "",
      "contestClock": "0:00",
      "currentPeriod": "FINAL",
      "finalMessage": "FINAL",
      "gameID": "1095c16e-8105-4ab9-b418-127da8fd32c3",
      "gameState": "final",
      "home": {
        "conferences": [{
          "conferenceName": "AAC",
          "conferenceSeo": "aac"
        }],
        "description": "(7-3)",
        "names": {
          "char6": "HOU",
          "full": "University of Houston",
          "seo": "houston",
          "short": "Houston"
        },
        "rank": "",
        "score": "49",
        "seed": "",
        "winner": false
      },
      "liveVideoEnabled": false,
      "network": "",
      "startDate": "11-10-2018",
      "startTime": "07:00PM ET",
      "startTimeEpoch": "1541894400",
      "title": "Houston Temple",
      "url": "/game/football/fbs/2018/11/10/temple-houston",
      "videoState": ""
    }},
    {"game": {
      "away": {
        "conferences": [
          {
            "conferenceName": "SEC",
            "conferenceSeo": "sec"
          },
          {
            "conferenceName": "Top 25",
            "conferenceSeo": "top-25"
          }
        ],
        "description": "(6-4)",
        "names": {
          "char6": "AUBURN",
          "full": "Auburn University",
          "seo": "auburn",
          "short": "Auburn"
        },
        "rank": "24",
        "score": "10",
        "seed": "",
        "winner": false
      },
      "bracketId": "",
      "bracketRegion": "",
      "bracketRound": "",
      "contestClock": "0:00",
      "currentPeriod": "FINAL",
      "finalMessage": "FINAL",
      "gameID": "e9b8d365-9f44-4f02-b312-66fb1f1d34a5",
      "gameState": "final",
      "home": {
        "conferences": [
          {
            "conferenceName": "SEC",
            "conferenceSeo": "sec"
          },
          {
            "conferenceName": "Top 25",
            "conferenceSeo": "top-25"
          }
        ],
        "description": "(9-1)",
        "names": {
          "char6": "UGA",
          "full": "University of Georgia",
          "seo": "georgia",
          "short": "Georgia"
        },
        "rank": "5",
        "score": "27",
        "seed": "",
        "winner": true
      },
      "liveVideoEnabled": false,
      "network": "",
      "startDate": "11-10-2018",
      "startTime": "07:00PM ET",
      "startTimeEpoch": "1541894400",
      "title": "Georgia Auburn",
      "url": "/game/football/fbs/2018/11/10/auburn-georgia",
      "videoState": ""
    }},
    {"game": {
      "away": {
        "conferences": [{
          "conferenceName": "AAC",
          "conferenceSeo": "aac"
        }],
        "description": "(7-3)",
        "names": {
          "char6": "USF",
          "full": "University of South Florida",
          "seo": "south-fla",
          "short": "South Florida"
        },
        "rank": "",
        "score": "23",
        "seed": "",
        "winner": false
      },
      "bracketId": "",
      "bracketRegion": "",
      "bracketRound": "",
      "contestClock": "0:00",
      "currentPeriod": "FINAL",
      "finalMessage": "FINAL",
      "gameID": "a7575b00-333b-4d49-abb4-4f16ba806d5b",
      "gameState": "final",
      "home": {
        "conferences": [{
          "conferenceName": "AAC",
          "conferenceSeo": "aac"
        }],
        "description": "(9-1)",
        "names": {
          "char6": "CINCY",
          "full": "University of Cincinnati",
          "seo": "cincinnati",
          "short": "Cincinnati"
        },
        "rank": "",
        "score": "35",
        "seed": "",
        "winner": true
      },
      "liveVideoEnabled": false,
      "network": "",
      "startDate": "11-10-2018",
      "startTime": "07:00PM ET",
      "startTimeEpoch": "1541894400",
      "title": "Cincinnati South Fla.",
      "url": "/game/football/fbs/2018/11/10/south-fla-cincinnati",
      "videoState": ""
    }},
    {"game": {
      "away": {
        "conferences": [{
          "conferenceName": "C-USA",
          "conferenceSeo": "c-usa"
        }],
        "description": "(1-10)",
        "names": {
          "char6": "RICE",
          "full": "Rice University",
          "seo": "rice",
          "short": "Rice"
        },
        "rank": "",
        "score": "13",
        "seed": "",
        "winner": false
      },
      "bracketId": "",
      "bracketRegion": "",
      "bracketRound": "",
      "contestClock": "0:00",
      "currentPeriod": "FINAL",
      "finalMessage": "FINAL",
      "gameID": "dc21a50b-d282-43df-8bd4-8a270554ae6b",
      "gameState": "final",
      "home": {
        "conferences": [{
          "conferenceName": "C-USA",
          "conferenceSeo": "c-usa"
        }],
        "description": "(7-3)",
        "names": {
          "char6": "LATECH",
          "full": "Louisiana Tech University",
          "seo": "louisiana-tech",
          "short": "Louisiana Tech"
        },
        "rank": "",
        "score": "28",
        "seed": "",
        "winner": true
      },
      "liveVideoEnabled": false,
      "network": "",
      "startDate": "11-10-2018",
      "startTime": "07:00PM ET",
      "startTimeEpoch": "1541894400",
      "title": "Louisiana Tech Rice",
      "url": "/game/football/fbs/2018/11/10/rice-louisiana-tech",
      "videoState": ""
    }},
    {"game": {
      "away": {
        "conferences": [{
          "conferenceName": "C-USA",
          "conferenceSeo": "c-usa"
        }],
        "description": "(7-3)",
        "names": {
          "char6": "FIU",
          "full": "Florida International University",
          "seo": "fiu",
          "short": "FIU"
        },
        "rank": "",
        "score": "45",
        "seed": "",
        "winner": true
      },
      "bracketId": "",
      "bracketRegion": "",
      "bracketRound": "",
      "contestClock": "0:00",
      "currentPeriod": "FINAL",
      "finalMessage": "FINAL",
      "gameID": "a41f7099-da16-4f70-a6e8-866bfa65f2e7",
      "gameState": "final",
      "home": {
        "conferences": [{
          "conferenceName": "C-USA",
          "conferenceSeo": "c-usa"
        }],
        "description": "(3-7)",
        "names": {
          "char6": "UTSA",
          "full": "University of Texas at San Antonio",
          "seo": "utsa",
          "short": "UTSA"
        },
        "rank": "",
        "score": "7",
        "seed": "",
        "winner": false
      },
      "liveVideoEnabled": false,
      "network": "",
      "startDate": "11-10-2018",
      "startTime": "07:00PM ET",
      "startTimeEpoch": "1541894400",
      "title": "UTSA FIU",
      "url": "/game/football/fbs/2018/11/10/fiu-utsa",
      "videoState": ""
    }},
    {"game": {
      "away": {
        "conferences": [{
          "conferenceName": "ACC",
          "conferenceSeo": "acc"
        }],
        "description": "(5-5)",
        "names": {
          "char6": "MIAMI",
          "full": "University of Miami (Florida)",
          "seo": "miami-fl",
          "short": "Miami (Fla.)"
        },
        "rank": "",
        "score": "21",
        "seed": "",
        "winner": false
      },
      "bracketId": "",
      "bracketRegion": "",
      "bracketRound": "",
      "contestClock": "0:00",
      "currentPeriod": "FINAL",
      "finalMessage": "FINAL",
      "gameID": "4d5b162d-0ece-420e-81e3-006b3c2e8d6e",
      "gameState": "final",
      "home": {
        "conferences": [{
          "conferenceName": "ACC",
          "conferenceSeo": "acc"
        }],
        "description": "(6-4)",
        "names": {
          "char6": "GATECH",
          "full": "Georgia Institute of Technology",
          "seo": "georgia-tech",
          "short": "Georgia Tech"
        },
        "rank": "",
        "score": "27",
        "seed": "",
        "winner": true
      },
      "liveVideoEnabled": false,
      "network": "",
      "startDate": "11-10-2018",
      "startTime": "07:00PM ET",
      "startTimeEpoch": "1541894400",
      "title": "Georgia Tech Miami (FL)",
      "url": "/game/football/fbs/2018/11/10/miami-fl-georgia-tech",
      "videoState": ""
    }},
    {"game": {
      "away": {
        "conferences": [{
          "conferenceName": "ACC",
          "conferenceSeo": "acc"
        }],
        "description": "(4-6)",
        "names": {
          "char6": "FSU",
          "full": "Florida State University",
          "seo": "florida-st",
          "short": "Florida State"
        },
        "rank": "",
        "score": "13",
        "seed": "",
        "winner": false
      },
      "bracketId": "",
      "bracketRegion": "",
      "bracketRound": "",
      "contestClock": "0:00",
      "currentPeriod": "FINAL",
      "finalMessage": "FINAL",
      "gameID": "5977d53c-605d-428d-bbeb-370f41b8ad00",
      "gameState": "final",
      "home": {
        "conferences": [
          {
            "conferenceName": "FBS Independent",
            "conferenceSeo": "fbs-independent"
          },
          {
            "conferenceName": "Top 25",
            "conferenceSeo": "top-25"
          }
        ],
        "description": "(10-0)",
        "names": {
          "char6": "N DAME",
          "full": "University of Notre Dame",
          "seo": "notre-dame",
          "short": "Notre Dame"
        },
        "rank": "3",
        "score": "42",
        "seed": "",
        "winner": true
      },
      "liveVideoEnabled": false,
      "network": "",
      "startDate": "11-10-2018",
      "startTime": "07:30PM ET",
      "startTimeEpoch": "1541896200",
      "title": "Notre Dame Florida St.",
      "url": "/game/football/fbs/2018/11/10/florida-st-notre-dame",
      "videoState": ""
    }},
    {"game": {
      "away": {
        "conferences": [{
          "conferenceName": "C-USA",
          "conferenceSeo": "c-usa"
        }],
        "description": "(4-5)",
        "names": {
          "char6": "S MISS",
          "full": "The University of Southern Mississippi",
          "seo": "southern-miss",
          "short": "Southern Miss"
        },
        "rank": "",
        "score": "23",
        "seed": "",
        "winner": false
      },
      "bracketId": "",
      "bracketRegion": "",
      "bracketRound": "",
      "contestClock": "",
      "currentPeriod": "FINAL (OT)",
      "finalMessage": "FINAL (OT)",
      "gameID": "4d2dbb12-8f7f-4b88-a61d-7e38fb9e4040",
      "gameState": "final",
      "home": {
        "conferences": [{
          "conferenceName": "C-USA",
          "conferenceSeo": "c-usa"
        }],
        "description": "(9-1)",
        "names": {
          "char6": "UAB",
          "full": "University of Alabama at Birmingham",
          "seo": "uab",
          "short": "UAB"
        },
        "rank": "",
        "score": "26",
        "seed": "",
        "winner": true
      },
      "liveVideoEnabled": false,
      "network": "",
      "startDate": "11-10-2018",
      "startTime": "07:30PM ET",
      "startTimeEpoch": "1541896200",
      "title": "UAB Southern Miss.",
      "url": "/game/football/fbs/2018/11/10/southern-miss-uab",
      "videoState": ""
    }},
    {"game": {
      "away": {
        "conferences": [
          {
            "conferenceName": "SEC",
            "conferenceSeo": "sec"
          },
          {
            "conferenceName": "Top 25",
            "conferenceSeo": "top-25"
          }
        ],
        "description": "(8-2)",
        "names": {
          "char6": "LSU",
          "full": "Louisiana State University",
          "seo": "lsu",
          "short": "LSU"
        },
        "rank": "7",
        "score": "24",
        "seed": "",
        "winner": true
      },
      "bracketId": "",
      "bracketRegion": "",
      "bracketRound": "",
      "contestClock": "0:00",
      "currentPeriod": "FINAL",
      "finalMessage": "FINAL",
      "gameID": "67ff3267-67be-42f8-afe2-7f599634e907",
      "gameState": "final",
      "home": {
        "conferences": [{
          "conferenceName": "SEC",
          "conferenceSeo": "sec"
        }],
        "description": "(2-8)",
        "names": {
          "char6": "ARK",
          "full": "University of Arkansas, Fayetteville",
          "seo": "arkansas",
          "short": "Arkansas"
        },
        "rank": "",
        "score": "17",
        "seed": "",
        "winner": false
      },
      "liveVideoEnabled": false,
      "network": "",
      "startDate": "11-10-2018",
      "startTime": "07:30PM ET",
      "startTimeEpoch": "1541896200",
      "title": "Arkansas LSU",
      "url": "/game/football/fbs/2018/11/10/lsu-arkansas",
      "videoState": ""
    }},
    {"game": {
      "away": {
        "conferences": [
          {
            "conferenceName": "Big 12",
            "conferenceSeo": "big-12"
          },
          {
            "conferenceName": "Top 25",
            "conferenceSeo": "top-25"
          }
        ],
        "description": "(7-3)",
        "names": {
          "char6": "TEXAS",
          "full": "University of Texas at Austin",
          "seo": "texas",
          "short": "Texas"
        },
        "rank": "19",
        "score": "41",
        "seed": "",
        "winner": true
      },
      "bracketId": "",
      "bracketRegion": "",
      "bracketRound": "",
      "contestClock": "0:00",
      "currentPeriod": "FINAL",
      "finalMessage": "FINAL",
      "gameID": "d8c45671-8464-495a-a43b-4b5b7a02253f",
      "gameState": "final",
      "home": {
        "conferences": [{
          "conferenceName": "Big 12",
          "conferenceSeo": "big-12"
        }],
        "description": "(5-5)",
        "names": {
          "char6": "TXTECH",
          "full": "Texas Tech University",
          "seo": "texas-tech",
          "short": "Texas Tech"
        },
        "rank": "",
        "score": "34",
        "seed": "",
        "winner": false
      },
      "liveVideoEnabled": false,
      "network": "",
      "startDate": "11-10-2018",
      "startTime": "07:30PM ET",
      "startTimeEpoch": "1541896200",
      "title": "Texas Tech Texas",
      "url": "/game/football/fbs/2018/11/10/texas-texas-tech",
      "videoState": ""
    }},
    {"game": {
      "away": {
        "conferences": [
          {
            "conferenceName": "ACC",
            "conferenceSeo": "acc"
          },
          {
            "conferenceName": "Top 25",
            "conferenceSeo": "top-25"
          }
        ],
        "description": "(10-0)",
        "names": {
          "char6": "CLEM",
          "full": "Clemson University",
          "seo": "clemson",
          "short": "Clemson"
        },
        "rank": "2",
        "score": "27",
        "seed": "",
        "winner": true
      },
      "bracketId": "",
      "bracketRegion": "",
      "bracketRound": "",
      "contestClock": "0:00",
      "currentPeriod": "FINAL",
      "finalMessage": "FINAL",
      "gameID": "cd5c88fe-1f70-4ad8-bb97-18a48c50149d",
      "gameState": "final",
      "home": {
        "conferences": [
          {
            "conferenceName": "ACC",
            "conferenceSeo": "acc"
          },
          {
            "conferenceName": "Top 25",
            "conferenceSeo": "top-25"
          }
        ],
        "description": "(7-3)",
        "names": {
          "char6": "BC",
          "full": "Boston College",
          "seo": "boston-college",
          "short": "Boston College"
        },
        "rank": "17",
        "score": "7",
        "seed": "",
        "winner": false
      },
      "liveVideoEnabled": false,
      "network": "",
      "startDate": "11-10-2018",
      "startTime": "08:00PM ET",
      "startTimeEpoch": "1541898000",
      "title": "Boston College Clemson",
      "url": "/game/football/fbs/2018/11/10/clemson-boston-college",
      "videoState": ""
    }},
    {"game": {
      "away": {
        "conferences": [{
          "conferenceName": "Pac-12",
          "conferenceSeo": "pac-12"
        }],
        "description": "(2-8)",
        "names": {
          "char6": "ORE ST",
          "full": "Oregon State University",
          "seo": "oregon-st",
          "short": "Oregon St."
        },
        "rank": "",
        "score": "17",
        "seed": "",
        "winner": false
      },
      "bracketId": "",
      "bracketRegion": "",
      "bracketRound": "",
      "contestClock": "0:00",
      "currentPeriod": "FINAL",
      "finalMessage": "FINAL",
      "gameID": "fe492161-160a-4975-8305-1b8fff89416a",
      "gameState": "final",
      "home": {
        "conferences": [{
          "conferenceName": "Pac-12",
          "conferenceSeo": "pac-12"
        }],
        "description": "(6-4)",
        "names": {
          "char6": "STAN",
          "full": "Stanford University",
          "seo": "stanford",
          "short": "Stanford"
        },
        "rank": "",
        "score": "48",
        "seed": "",
        "winner": true
      },
      "liveVideoEnabled": false,
      "network": "",
      "startDate": "11-10-2018",
      "startTime": "09:00PM ET",
      "startTimeEpoch": "1541901600",
      "title": "Stanford Oregon St.",
      "url": "/game/football/fbs/2018/11/10/oregon-st-stanford",
      "videoState": ""
    }},
    {"game": {
      "away": {
        "conferences": [{
          "conferenceName": "MWC",
          "conferenceSeo": "mwc"
        }],
        "description": "(3-7)",
        "names": {
          "char6": "UNLV",
          "full": "University of Nevada, Las Vegas",
          "seo": "unlv",
          "short": "UNLV"
        },
        "rank": "",
        "score": "27",
        "seed": "",
        "winner": true
      },
      "bracketId": "",
      "bracketRegion": "",
      "bracketRound": "",
      "contestClock": "0:00",
      "currentPeriod": "FINAL",
      "finalMessage": "FINAL",
      "gameID": "72280c75-ee7b-42e9-a11b-10a95eb80335",
      "gameState": "final",
      "home": {
        "conferences": [{
          "conferenceName": "MWC",
          "conferenceSeo": "mwc"
        }],
        "description": "(7-3)",
        "names": {
          "char6": "SDSU",
          "full": "San Diego State University",
          "seo": "san-diego-st",
          "short": "San Diego State"
        },
        "rank": "",
        "score": "24",
        "seed": "",
        "winner": false
      },
      "liveVideoEnabled": false,
      "network": "",
      "startDate": "11-10-2018",
      "startTime": "10:30PM ET",
      "startTimeEpoch": "1541907000",
      "title": "San Diego St. UNLV",
      "url": "/game/football/fbs/2018/11/10/unlv-san-diego-st",
      "videoState": ""
    }},
    {"game": {
      "away": {
        "conferences": [{
          "conferenceName": "MWC",
          "conferenceSeo": "mwc"
        }],
        "description": "(3-7)",
        "names": {
          "char6": "CO ST",
          "full": "Colorado State University",
          "seo": "colorado-st",
          "short": "Colorado State"
        },
        "rank": "",
        "score": "10",
        "seed": "",
        "winner": false
      },
      "bracketId": "",
      "bracketRegion": "",
      "bracketRound": "",
      "contestClock": "0:00",
      "currentPeriod": "FINAL",
      "finalMessage": "FINAL",
      "gameID": "c5be37c0-90a8-4143-918e-ce7497041d7e",
      "gameState": "final",
      "home": {
        "conferences": [{
          "conferenceName": "MWC",
          "conferenceSeo": "mwc"
        }],
        "description": "(6-4)",
        "names": {
          "char6": "NEVADA",
          "full": "University of Nevada, Reno",
          "seo": "nevada",
          "short": "Nevada"
        },
        "rank": "",
        "score": "49",
        "seed": "",
        "winner": true
      },
      "liveVideoEnabled": false,
      "network": "",
      "startDate": "11-10-2018",
      "startTime": "10:30PM ET",
      "startTimeEpoch": "1541907000",
      "title": "Nevada Colorado St.",
      "url": "/game/football/fbs/2018/11/10/colorado-st-nevada",
      "videoState": ""
    }},
    {"game": {
      "away": {
        "conferences": [{
          "conferenceName": "Pac-12",
          "conferenceSeo": "pac-12"
        }],
        "description": "(6-4)",
        "names": {
          "char6": "CAL",
          "full": "University of California, Berkeley",
          "seo": "california",
          "short": "California"
        },
        "rank": "",
        "score": "15",
        "seed": "",
        "winner": true
      },
      "bracketId": "",
      "bracketRegion": "",
      "bracketRound": "",
      "contestClock": "0:00",
      "currentPeriod": "FINAL",
      "finalMessage": "FINAL",
      "gameID": "432d6251-037a-47e8-ad3e-c6c44c885046",
      "gameState": "final",
      "home": {
        "conferences": [{
          "conferenceName": "Pac-12",
          "conferenceSeo": "pac-12"
        }],
        "description": "(5-5)",
        "names": {
          "char6": "USC",
          "full": "University of Southern California",
          "seo": "southern-california",
          "short": "USC"
        },
        "rank": "",
        "score": "14",
        "seed": "",
        "winner": false
      },
      "liveVideoEnabled": false,
      "network": "",
      "startDate": "11-10-2018",
      "startTime": "10:30PM ET",
      "startTimeEpoch": "1541907000",
      "title": "Southern California California",
      "url": "/game/football/fbs/2018/11/10/california-southern-california",
      "videoState": ""
    }}
  ],
  "inputMD5Sum": "972f54a144e1867f699e2321eb4c6b2f",
  "updated_at": "08-06-2019 13:12:11"
}