{
  "games": [{"game": {
    "away": {
      "conferenceNames": {
        "conferenceDisplay": "American Athletic Conference",
        "conferenceDivision": "fbs",
        "conferenceName": "AAC",
        "conferenceSeo": "american-athletic"
      },
      "description": "(9-4)",
      "names": {
        "char6": "NAVY",
        "full": "U.S. Naval Academy",
        "seo": "navy",
        "short": "Navy"
      },
      "rank": "25",
      "score": "17",
      "seed": "",
      "winner": false
    },
    "bracketId": "",
    "bracketRegion": "",
    "bracketRound": "",
    "contestClock": "0:00",
    "currentPeriod": "Final",
    "finalMessage": "Final",
    "gameID": "64fa6c5c-081b-43ca-a45b-20988fa633ea",
    "gameState": "final",
    "home": {
      "conferenceNames": {
        "conferenceDisplay": "FBS Independent",
        "conferenceDivision": "fbs",
        "conferenceName": "IND",
        "conferenceSeo": "fbs-independent"
      },
      "description": "(7-5)",
      "names": {
        "char6": "ARMY",
        "full": "U.S. Military Academy",
        "seo": "army",
        "short": "Army"
      },
      "rank": "",
      "score": "21",
      "seed": "",
      "winner": true
    },
    "liveVideoEnabled": false,
    "network": "",
    "startDate": "12-10-2016",
    "startTime": "03:00PM ET",
    "startTimeEpoch": "1481400000",
    "title": "Army Navy",
    "url": "/game/football/fbs/2016/12/10/navy-army",
    "videoState": ""
  }}],
  "inputMD5Sum": "d666d6e3db42bbf9f941906b5521d757"
}