{
  "MiddleTennessee vs Toledo": {
    "stadium": "ThomasARobinsonNationalStadium-Nassau-",
    "MiddleTennessee": {
      "points": 31,
      "1st downs": 26,
      "rushing 1st downs": 10,
      "passing 1st downs": 13,
      "penalty 1st downs": 3,
      "rushing yards": 159,
      "rushing attempts": 44,
      "passing yards": 276,
      "passing attempts": 41,
      "passing completions": 24,
      "passing interceptions": 1,
      "total yards": 435,
      "total plays": 85,
      "fumbles": 1,
      "fumbles lost": 0,
      "penalties": 7,
      "penalty yards": 40,
      "punts": 5,
      "punt yards": 221,
      "punt returns": 3,
      "punt return yards": 25,
      "kickoff returns": 2,
      "kickoff return yards": 22,
      "interception returns": 1,
      "interception return yards": 0,
      "3rd down conversions": 7,
      "3rd down attempts": 16,
      "4th down conversions": 1,
      "4th down attempts": 2
    },
    "Toledo": {
      "points": 24,
      "1st downs": 21,
      "rushing 1st downs": 13,
      "passing 1st downs": 7,
      "penalty 1st downs": 1,
      "rushing yards": 235,
      "rushing attempts": 32,
      "passing yards": 212,
      "passing attempts": 39,
      "passing completions": 18,
      "passing interceptions": 1,
      "total yards": 447,
      "total plays": 71,
      "fumbles": 2,
      "fumbles lost": 0,
      "penalties": 12,
      "penalty yards": 122,
      "punts": 7,
      "punt yards": 300,
      "punt returns": 2,
      "punt return yards": 8,
      "kickoff returns": 4,
      "kickoff return yards": 99,
      "interception returns": 1,
      "interception return yards": 49,
      "3rd down conversions": 4,
      "3rd down attempts": 15,
      "4th down conversions": 1,
      "4th down attempts": 1
    }
  },
  "NorthernIllinois vs CoastalCarolina": {
    "stadium": "ExploriaStadium-Orlando-FL",
    "NorthernIllinois": {
      "points": 41,
      "1st downs": 29,
      "rushing 1st downs": 18,
      "passing 1st downs": 9,
      "penalty 1st downs": 2,
      "rushing yards": 335,
      "rushing attempts": 55,
      "passing yards": 181,
      "passing attempts": 33,
      "passing completions": 20,
      "passing interceptions": 0,
      "total yards": 516,
      "total plays": 88,
      "fumbles": 2,
      "fumbles lost": 1,
      "penalties": 2,
      "penalty yards": 10,
      "punts": 0,
      "punt yards": 0,
      "punt returns": 1,
      "punt return yards": 0,
      "kickoff returns": 6,
      "kickoff return yards": 120,
      "interception returns": 0,
      "interception return yards": 0,
      "3rd down conversions": 5,
      "3rd down attempts": 14,
      "4th down conversions": 4,
      "4th down attempts": 5
    },
    "CoastalCarolina": {
      "points": 47,
      "1st downs": 22,
      "rushing 1st downs": 9,
      "passing 1st downs": 13,
      "penalty 1st downs": 0,
      "rushing yards": 199,
      "rushing attempts": 25,
      "passing yards": 315,
      "passing attempts": 30,
      "passing completions": 22,
      "passing interceptions": 0,
      "total yards": 514,
      "total plays": 55,
      "fumbles": 0,
      "fumbles lost": 0,
      "penalties": 7,
      "penalty yards": 64,
      "punts": 2,
      "punt yards": 79,
      "punt returns": 0,
      "punt return yards": 0,
      "kickoff returns": 4,
      "kickoff return yards": 92,
      "interception returns": 0,
      "interception return yards": 0,
      "3rd down conversions": 5,
      "3rd down attempts": 10,
      "4th down conversions": 1,
      "4th down attempts": 1
    }
  },
  "WesternKentucky vs AppalachianState": {
    "stadium": "FCS-FCS-FCS",
    "WesternKentucky": {
      "points": 59,
      "1st downs": 27,
      "rushing 1st downs": 11,
      "passing 1st downs": 14,
      "penalty 1st downs": 2,
      "rushing yards": 215,
      "rushing attempts": 28,
      "passing yards": 422,
      "passing attempts": 47,
      "passing completions": 33,
      "passing interceptions": 0,
      "total yards": 637,
      "total plays": 75,
      "fumbles": 1,
      "fumbles lost": 1,
      "penalties": 2,
      "penalty yards": 10,
      "punts": 3,
      "punt yards": 159,
      "punt returns": 1,
      "punt return yards": -1,
      "kickoff returns": 3,
      "kickoff return yards": 67,
      "interception returns": 2,
      "interception return yards": 10,
      "3rd down conversions": 8,
      "3rd down attempts": 13,
      "4th down conversions": 0,
      "4th down attempts": 0
    },
    "AppalachianState": {
      "points": 38,
      "1st downs": 24,
      "rushing 1st downs": 13,
      "passing 1st downs": 11,
      "penalty 1st downs": 0,
      "rushing yards": 251,
      "rushing attempts": 43,
      "passing yards": 358,
      "passing attempts": 35,
      "passing completions": 20,
      "passing interceptions": 2,
      "total yards": 609,
      "total plays": 78,
      "fumbles": 2,
      "fumbles lost": 2,
      "penalties": 6,
      "penalty yards": 35,
      "punts": 3,
      "punt yards": 116,
      "punt returns": 2,
      "punt return yards": 28,
      "kickoff returns": 6,
      "kickoff return yards": 163,
      "interception returns": 0,
      "interception return yards": 0,
      "3rd down conversions": 5,
      "3rd down attempts": 15,
      "4th down conversions": 2,
      "4th down attempts": 5
    }
  },
  "UTEP vs FresnoState": {
    "stadium": "FCS-FCS-FCS",
    "UTEP": {
      "points": 24,
      "1st downs": 16,
      "rushing 1st downs": 3,
      "passing 1st downs": 10,
      "penalty 1st downs": 3,
      "rushing yards": 95,
      "rushing attempts": 28,
      "passing yards": 303,
      "passing attempts": 29,
      "passing completions": 13,
      "passing interceptions": 1,
      "total yards": 398,
      "total plays": 57,
      "fumbles": 2,
      "fumbles lost": 1,
      "penalties": 7,
      "penalty yards": 51,
      "punts": 3,
      "punt yards": 117,
      "punt returns": 2,
      "punt return yards": -5,
      "kickoff returns": 4,
      "kickoff return yards": 90,
      "interception returns": 0,
      "interception return yards": 0,
      "3rd down conversions": 3,
      "3rd down attempts": 10,
      "4th down conversions": 1,
      "4th down attempts": 3
    },
    "FresnoState": {
      "points": 31,
      "1st downs": 25,
      "rushing 1st downs": 9,
      "passing 1st downs": 15,
      "penalty 1st downs": 1,
      "rushing yards": 181,
      "rushing attempts": 35,
      "passing yards": 286,
      "passing attempts": 41,
      "passing completions": 26,
      "passing interceptions": 0,
      "total yards": 467,
      "total plays": 76,
      "fumbles": 0,
      "fumbles lost": 0,
      "penalties": 5,
      "penalty yards": 60,
      "punts": 4,
      "punt yards": 198,
      "punt returns": 1,
      "punt return yards": 3,
      "kickoff returns": 2,
      "kickoff return yards": 50,
      "interception returns": 1,
      "interception return yards": 0,
      "3rd down conversions": 5,
      "3rd down attempts": 13,
      "4th down conversions": 0,
      "4th down attempts": 0
    }
  },
  "UAB vs BrighamYoung": {
    "stadium": "FCS-FCS-FCS",
    "UAB": {
      "points": 31,
      "1st downs": 23,
      "rushing 1st downs": 12,
      "passing 1st downs": 11,
      "penalty 1st downs": 0,
      "rushing yards": 223,
      "rushing attempts": 43,
      "passing yards": 189,
      "passing attempts": 23,
      "passing completions": 19,
      "passing interceptions": 1,
      "total yards": 412,
      "total plays": 66,
      "fumbles": 1,
      "fumbles lost": 0,
      "penalties": 3,
      "penalty yards": 18,
      "punts": 2,
      "punt yards": 76,
      "punt returns": 1,
      "punt return yards": 4,
      "kickoff returns": 2,
      "kickoff return yards": 15,
      "interception returns": 0,
      "interception return yards": 0,
      "3rd down conversions": 9,
      "3rd down attempts": 14,
      "4th down conversions": 2,
      "4th down attempts": 2
    },
    "BrighamYoung": {
      "points": 28,
      "1st downs": 18,
      "rushing 1st downs": 9,
      "passing 1st downs": 6,
      "penalty 1st downs": 3,
      "rushing yards": 199,
      "rushing attempts": 35,
      "passing yards": 195,
      "passing attempts": 23,
      "passing completions": 15,
      "passing interceptions": 0,
      "total yards": 394,
      "total plays": 58,
      "fumbles": 2,
      "fumbles lost": 1,
      "penalties": 2,
      "penalty yards": 10,
      "punts": 1,
      "punt yards": 43,
      "punt returns": 1,
      "punt return yards": 13,
      "kickoff returns": 5,
      "kickoff return yards": 85,
      "interception returns": 1,
      "interception return yards": 8,
      "3rd down conversions": 4,
      "3rd down attempts": 11,
      "4th down conversions": 2,
      "4th down attempts": 5
    }
  },
  "EasternMichigan vs Liberty": {
    "stadium": "FCS-FCS-FCS",
    "EasternMichigan": {
      "points": 20,
      "1st downs": 23,
      "rushing 1st downs": 9,
      "passing 1st downs": 12,
      "penalty 1st downs": 2,
      "rushing yards": 125,
      "rushing attempts": 39,
      "passing yards": 254,
      "passing attempts": 44,
      "passing completions": 28,
      "passing interceptions": 1,
      "total yards": 379,
      "total plays": 83,
      "fumbles": 0,
      "fumbles lost": 0,
      "penalties": 9,
      "penalty yards": 82,
      "punts": 5,
      "punt yards": 232,
      "punt returns": 1,
      "punt return yards": 5,
      "kickoff returns": 2,
      "kickoff return yards": 43,
      "interception returns": 1,
      "interception return yards": 34,
      "3rd down conversions": 6,
      "3rd down attempts": 17,
      "4th down conversions": 1,
      "4th down attempts": 4
    },
    "Liberty": {
      "points": 56,
      "1st downs": 22,
      "rushing 1st downs": 10,
      "passing 1st downs": 8,
      "penalty 1st downs": 4,
      "rushing yards": 233,
      "rushing attempts": 35,
      "passing yards": 295,
      "passing attempts": 26,
      "passing completions": 14,
      "passing interceptions": 1,
      "total yards": 528,
      "total plays": 61,
      "fumbles": 1,
      "fumbles lost": 0,
      "penalties": 6,
      "penalty yards": 48,
      "punts": 3,
      "punt yards": 146,
      "punt returns": 3,
      "punt return yards": -1,
      "kickoff returns": 2,
      "kickoff return yards": 22,
      "interception returns": 1,
      "interception return yards": 27,
      "3rd down conversions": 3,
      "3rd down attempts": 9,
      "4th down conversions": 1,
      "4th down attempts": 2
    }
  },
  "UtahState vs OregonState": {
    "stadium": "SoFiStadium-Inglewood-CA",
    "UtahState": {
      "points": 24,
      "1st downs": 26,
      "rushing 1st downs": 9,
      "passing 1st downs": 12,
      "penalty 1st downs": 5,
      "rushing yards": 110,
      "rushing attempts": 44,
      "passing yards": 273,
      "passing attempts": 31,
      "passing completions": 18,
      "passing interceptions": 2,
      "total yards": 383,
      "total plays": 75,
      "fumbles": 1,
      "fumbles lost": 1,
      "penalties": 5,
      "penalty yards": 46,
      "punts": 4,
      "punt yards": 164,
      "punt returns": 2,
      "punt return yards": 3,
      "kickoff returns": 3,
      "kickoff return yards": 61,
      "interception returns": 1,
      "interception return yards": 0,
      "3rd down conversions": 5,
      "3rd down attempts": 12,
      "4th down conversions": 0,
      "4th down attempts": 0
    },
    "OregonState": {
      "points": 13,
      "1st downs": 23,
      "rushing 1st downs": 11,
      "passing 1st downs": 10,
      "penalty 1st downs": 2,
      "rushing yards": 152,
      "rushing attempts": 36,
      "passing yards": 263,
      "passing attempts": 30,
      "passing completions": 21,
      "passing interceptions": 1,
      "total yards": 415,
      "total plays": 66,
      "fumbles": 1,
      "fumbles lost": 1,
      "penalties": 13,
      "penalty yards": 91,
      "punts": 3,
      "punt yards": 123,
      "punt returns": 2,
      "punt return yards": 0,
      "kickoff returns": 4,
      "kickoff return yards": 77,
      "interception returns": 2,
      "interception return yards": 0,
      "3rd down conversions": 4,
      "3rd down attempts": 12,
      "4th down conversions": 0,
      "4th down attempts": 2
    }
  },
  "LouisianaLafayette vs Marshall": {
    "stadium": "FCS-FCS-FCS",
    "LouisianaLafayette": {
      "points": 36,
      "1st downs": 23,
      "rushing 1st downs": 10,
      "passing 1st downs": 11,
      "penalty 1st downs": 2,
      "rushing yards": 220,
      "rushing attempts": 51,
      "passing yards": 278,
      "passing attempts": 32,
      "passing completions": 20,
      "passing interceptions": 0,
      "total yards": 498,
      "total plays": 83,
      "fumbles": 0,
      "fumbles lost": 0,
      "penalties": 6,
      "penalty yards": 50,
      "punts": 5,
      "punt yards": 227,
      "punt returns": 3,
      "punt return yards": 11,
      "kickoff returns": 3,
      "kickoff return yards": 30,
      "interception returns": 1,
      "interception return yards": 26,
      "3rd down conversions": 7,
      "3rd down attempts": 17,
      "4th down conversions": 0,
      "4th down attempts": 1
    },
    "Marshall": {
      "points": 21,
      "1st downs": 13,
      "rushing 1st downs": 8,
      "passing 1st downs": 5,
      "penalty 1st downs": 0,
      "rushing yards": 187,
      "rushing attempts": 30,
      "passing yards": 99,
      "passing attempts": 26,
      "passing completions": 15,
      "passing interceptions": 1,
      "total yards": 286,
      "total plays": 56,
      "fumbles": 2,
      "fumbles lost": 1,
      "penalties": 9,
      "penalty yards": 80,
      "punts": 8,
      "punt yards": 327,
      "punt returns": 4,
      "punt return yards": 34,
      "kickoff returns": 2,
      "kickoff return yards": 42,
      "interception returns": 0,
      "interception return yards": 0,
      "3rd down conversions": 5,
      "3rd down attempts": 13,
      "4th down conversions": 0,
      "4th down attempts": 0
    }
  },
  "OldDominion vs Tulsa": {
    "stadium": "BrooksStadium-Conway-SC",
    "OldDominion": {
      "points": 17,
      "1st downs": 10,
      "rushing 1st downs": 4,
      "passing 1st downs": 6,
      "penalty 1st downs": 0,
      "rushing yards": 71,
      "rushing attempts": 19,
      "passing yards": 176,
      "passing attempts": 28,
      "passing completions": 19,
      "passing interceptions": 1,
      "total yards": 247,
      "total plays": 47,
      "fumbles": 1,
      "fumbles lost": 1,
      "penalties": 6,
      "penalty yards": 59,
      "punts": 4,
      "punt yards": 156,
      "punt returns": 0,
      "punt return yards": 0,
      "kickoff returns": 5,
      "kickoff return yards": 161,
      "interception returns": 0,
      "interception return yards": 0,
      "3rd down conversions": 5,
      "3rd down attempts": 11,
      "4th down conversions": 0,
      "4th down attempts": 0
    },
    "Tulsa": {
      "points": 30,
      "1st downs": 35,
      "rushing 1st downs": 17,
      "passing 1st downs": 15,
      "penalty 1st downs": 3,
      "rushing yards": 244,
      "rushing attempts": 65,
      "passing yards": 285,
      "passing attempts": 34,
      "passing completions": 22,
      "passing interceptions": 0,
      "total yards": 529,
      "total plays": 99,
      "fumbles": 1,
      "fumbles lost": 0,
      "penalties": 8,
      "penalty yards": 85,
      "punts": 2,
      "punt yards": 75,
      "punt returns": 1,
      "punt return yards": 0,
      "kickoff returns": 4,
      "kickoff return yards": 41,
      "interception returns": 1,
      "interception return yards": 0,
      "3rd down conversions": 9,
      "3rd down attempts": 19,
      "4th down conversions": 2,
      "4th down attempts": 4
    }
  },
  "KentState vs Wyoming": {
    "stadium": "FCS-FCS-FCS",
    "KentState": {
      "points": 38,
      "1st downs": 29,
      "rushing 1st downs": 17,
      "passing 1st downs": 8,
      "penalty 1st downs": 4,
      "rushing yards": 319,
      "rushing attempts": 50,
      "passing yards": 337,
      "passing attempts": 28,
      "passing completions": 18,
      "passing interceptions": 0,
      "total yards": 656,
      "total plays": 78,
      "fumbles": 0,
      "fumbles lost": 0,
      "penalties": 12,
      "penalty yards": 95,
      "punts": 1,
      "punt yards": 26,
      "punt returns": 1,
      "punt return yards": 14,
      "kickoff returns": 7,
      "kickoff return yards": 167,
      "interception returns": 0,
      "interception return yards": 0,
      "3rd down conversions": 9,
      "3rd down attempts": 16,
      "4th down conversions": 0,
      "4th down attempts": 3
    },
    "Wyoming": {
      "points": 52,
      "1st downs": 22,
      "rushing 1st downs": 14,
      "passing 1st downs": 5,
      "penalty 1st downs": 3,
      "rushing yards": 404,
      "rushing attempts": 53,
      "passing yards": 127,
      "passing attempts": 11,
      "passing completions": 9,
      "passing interceptions": 0,
      "total yards": 531,
      "total plays": 64,
      "fumbles": 1,
      "fumbles lost": 0,
      "penalties": 7,
      "penalty yards": 74,
      "punts": 3,
      "punt yards": 132,
      "punt returns": 0,
      "punt return yards": 0,
      "kickoff returns": 7,
      "kickoff return yards": 106,
      "interception returns": 0,
      "interception return yards": 0,
      "3rd down conversions": 7,
      "3rd down attempts": 13,
      "4th down conversions": 0,
      "4th down attempts": 1
    }
  },
  "UTSA vs SanDiegoState": {
    "stadium": "ToyotaStadium-Frisco-TX",
    "UTSA": {
      "points": 24,
      "1st downs": 21,
      "rushing 1st downs": 6,
      "passing 1st downs": 9,
      "penalty 1st downs": 6,
      "rushing yards": 117,
      "rushing attempts": 24,
      "passing yards": 271,
      "passing attempts": 38,
      "passing completions": 22,
      "passing interceptions": 1,
      "total yards": 388,
      "total plays": 62,
      "fumbles": 0,
      "fumbles lost": 0,
      "penalties": 9,
      "penalty yards": 80,
      "punts": 3,
      "punt yards": 130,
      "punt returns": 2,
      "punt return yards": 12,
      "kickoff returns": 0,
      "kickoff return yards": 0,
      "interception returns": 0,
      "interception return yards": 0,
      "3rd down conversions": 1,
      "3rd down attempts": 9,
      "4th down conversions": 1,
      "4th down attempts": 3
    },
    "SanDiegoState": {
      "points": 38,
      "1st downs": 31,
      "rushing 1st downs": 10,
      "passing 1st downs": 17,
      "penalty 1st downs": 4,
      "rushing yards": 156,
      "rushing attempts": 40,
      "passing yards": 333,
      "passing attempts": 36,
      "passing completions": 24,
      "passing interceptions": 0,
      "total yards": 489,
      "total plays": 76,
      "fumbles": 0,
      "fumbles lost": 0,
      "penalties": 14,
      "penalty yards": 124,
      "punts": 3,
      "punt yards": 140,
      "punt returns": 1,
      "punt return yards": 1,
      "kickoff returns": 3,
      "kickoff return yards": 95,
      "interception returns": 1,
      "interception return yards": 0,
      "3rd down conversions": 5,
      "3rd down attempts": 10,
      "4th down conversions": 1,
      "4th down attempts": 2
    }
  },
  "Missouri vs Army": {
    "stadium": "FCS-FCS-FCS",
    "Missouri": {
      "points": 22,
      "1st downs": 28,
      "rushing 1st downs": 11,
      "passing 1st downs": 15,
      "penalty 1st downs": 2,
      "rushing yards": 195,
      "rushing attempts": 37,
      "passing yards": 238,
      "passing attempts": 34,
      "passing completions": 27,
      "passing interceptions": 0,
      "total yards": 433,
      "total plays": 71,
      "fumbles": 1,
      "fumbles lost": 1,
      "penalties": 5,
      "penalty yards": 40,
      "punts": 1,
      "punt yards": 41,
      "punt returns": 1,
      "punt return yards": -2,
      "kickoff returns": 3,
      "kickoff return yards": 54,
      "interception returns": 0,
      "interception return yards": 0,
      "3rd down conversions": 6,
      "3rd down attempts": 11,
      "4th down conversions": 0,
      "4th down attempts": 1
    },
    "Army": {
      "points": 24,
      "1st downs": 21,
      "rushing 1st downs": 15,
      "passing 1st downs": 5,
      "penalty 1st downs": 1,
      "rushing yards": 211,
      "rushing attempts": 55,
      "passing yards": 95,
      "passing attempts": 9,
      "passing completions": 6,
      "passing interceptions": 0,
      "total yards": 306,
      "total plays": 64,
      "fumbles": 0,
      "fumbles lost": 0,
      "penalties": 4,
      "penalty yards": 35,
      "punts": 3,
      "punt yards": 132,
      "punt returns": 0,
      "punt return yards": 0,
      "kickoff returns": 0,
      "kickoff return yards": 0,
      "interception returns": 0,
      "interception return yards": 0,
      "3rd down conversions": 5,
      "3rd down attempts": 14,
      "4th down conversions": 5,
      "4th down attempts": 5
    }
  },
  "NorthTexas vs MiamiOH": {
    "stadium": "FCS-FCS-FCS",
    "NorthTexas": {
      "points": 14,
      "1st downs": 18,
      "rushing 1st downs": 5,
      "passing 1st downs": 13,
      "penalty 1st downs": 0,
      "rushing yards": 89,
      "rushing attempts": 32,
      "passing yards": 228,
      "passing attempts": 32,
      "passing completions": 15,
      "passing interceptions": 2,
      "total yards": 317,
      "total plays": 64,
      "fumbles": 0,
      "fumbles lost": 0,
      "penalties": 5,
      "penalty yards": 72,
      "punts": 5,
      "punt yards": 270,
      "punt returns": 0,
      "punt return yards": 0,
      "kickoff returns": 1,
      "kickoff return yards": 19,
      "interception returns": 0,
      "interception return yards": 0,
      "3rd down conversions": 5,
      "3rd down attempts": 13,
      "4th down conversions": 1,
      "4th down attempts": 2
    },
    "MiamiOH": {
      "points": 27,
      "1st downs": 26,
      "rushing 1st downs": 11,
      "passing 1st downs": 11,
      "penalty 1st downs": 4,
      "rushing yards": 198,
      "rushing attempts": 48,
      "passing yards": 228,
      "passing attempts": 31,
      "passing completions": 22,
      "passing interceptions": 0,
      "total yards": 426,
      "total plays": 79,
      "fumbles": 1,
      "fumbles lost": 0,
      "penalties": 5,
      "penalty yards": 30,
      "punts": 3,
      "punt yards": 138,
      "punt returns": 3,
      "punt return yards": 21,
      "kickoff returns": 1,
      "kickoff return yards": 14,
      "interception returns": 2,
      "interception return yards": 44,
      "3rd down conversions": 8,
      "3rd down attempts": 16,
      "4th down conversions": 0,
      "4th down attempts": 0
    }
  },
  "UCF vs Florida": {
    "stadium": "RaymondJames-Tampa-FL",
    "UCF": {
      "points": 29,
      "1st downs": 20,
      "rushing 1st downs": 10,
      "passing 1st downs": 8,
      "penalty 1st downs": 2,
      "rushing yards": 288,
      "rushing attempts": 50,
      "passing yards": 148,
      "passing attempts": 25,
      "passing completions": 15,
      "passing interceptions": 0,
      "total yards": 436,
      "total plays": 75,
      "fumbles": 0,
      "fumbles lost": 0,
      "penalties": 4,
      "penalty yards": 42,
      "punts": 5,
      "punt yards": 208,
      "punt returns": 2,
      "punt return yards": 13,
      "kickoff returns": 2,
      "kickoff return yards": 56,
      "interception returns": 0,
      "interception return yards": 0,
      "3rd down conversions": 5,
      "3rd down attempts": 16,
      "4th down conversions": 2,
      "4th down attempts": 2
    },
    "Florida": {
      "points": 17,
      "1st downs": 19,
      "rushing 1st downs": 9,
      "passing 1st downs": 8,
      "penalty 1st downs": 2,
      "rushing yards": 205,
      "rushing attempts": 30,
      "passing yards": 171,
      "passing attempts": 37,
      "passing completions": 14,
      "passing interceptions": 0,
      "total yards": 376,
      "total plays": 67,
      "fumbles": 0,
      "fumbles lost": 0,
      "penalties": 8,
      "penalty yards": 85,
      "punts": 6,
      "punt yards": 268,
      "punt returns": 3,
      "punt return yards": 24,
      "kickoff returns": 5,
      "kickoff return yards": 109,
      "interception returns": 0,
      "interception return yards": 0,
      "3rd down conversions": 2,
      "3rd down attempts": 13,
      "4th down conversions": 0,
      "4th down attempts": 2
    }
  },
  "GeorgiaState vs BallState": {
    "stadium": "FCS-FCS-FCS",
    "GeorgiaState": {
      "points": 51,
      "1st downs": 21,
      "rushing 1st downs": 13,
      "passing 1st downs": 7,
      "penalty 1st downs": 1,
      "rushing yards": 259,
      "rushing attempts": 41,
      "passing yards": 205,
      "passing attempts": 21,
      "passing completions": 17,
      "passing interceptions": 0,
      "total yards": 464,
      "total plays": 62,
      "fumbles": 0,
      "fumbles lost": 0,
      "penalties": 7,
      "penalty yards": 85,
      "punts": 2,
      "punt yards": 75,
      "punt returns": 0,
      "punt return yards": 0,
      "kickoff returns": 0,
      "kickoff return yards": 0,
      "interception returns": 1,
      "interception return yards": 55,
      "3rd down conversions": 6,
      "3rd down attempts": 11,
      "4th down conversions": 0,
      "4th down attempts": 0
    },
    "BallState": {
      "points": 20,
      "1st downs": 22,
      "rushing 1st downs": 4,
      "passing 1st downs": 14,
      "penalty 1st downs": 4,
      "rushing yards": 74,
      "rushing attempts": 35,
      "passing yards": 293,
      "passing attempts": 46,
      "passing completions": 27,
      "passing interceptions": 1,
      "total yards": 367,
      "total plays": 81,
      "fumbles": 3,
      "fumbles lost": 1,
      "penalties": 3,
      "penalty yards": 32,
      "punts": 3,
      "punt yards": 120,
      "punt returns": 1,
      "punt return yards": -3,
      "kickoff returns": 6,
      "kickoff return yards": 137,
      "interception returns": 0,
      "interception return yards": 0,
      "3rd down conversions": 8,
      "3rd down attempts": 18,
      "4th down conversions": 1,
      "4th down attempts": 3
    }
  },
  "WesternMichigan vs Nevada": {
    "stadium": "FordField-Detroit-MI",
    "WesternMichigan": {
      "points": 52,
      "1st downs": 23,
      "rushing 1st downs": 18,
      "passing 1st downs": 5,
      "penalty 1st downs": 0,
      "rushing yards": 352,
      "rushing attempts": 52,
      "passing yards": 162,
      "passing attempts": 14,
      "passing completions": 8,
      "passing interceptions": 1,
      "total yards": 514,
      "total plays": 66,
      "fumbles": 0,
      "fumbles lost": 0,
      "penalties": 4,
      "penalty yards": 48,
      "punts": 2,
      "punt yards": 102,
      "punt returns": 0,
      "punt return yards": 0,
      "kickoff returns": 2,
      "kickoff return yards": 128,
      "interception returns": 1,
      "interception return yards": 0,
      "3rd down conversions": 6,
      "3rd down attempts": 10,
      "4th down conversions": 1,
      "4th down attempts": 1
    },
    "Nevada": {
      "points": 24,
      "1st downs": 16,
      "rushing 1st downs": 6,
      "passing 1st downs": 6,
      "penalty 1st downs": 4,
      "rushing yards": 121,
      "rushing attempts": 31,
      "passing yards": 121,
      "passing attempts": 23,
      "passing completions": 12,
      "passing interceptions": 1,
      "total yards": 242,
      "total plays": 54,
      "fumbles": 0,
      "fumbles lost": 0,
      "penalties": 3,
      "penalty yards": 35,
      "punts": 6,
      "punt yards": 295,
      "punt returns": 2,
      "punt return yards": -2,
      "kickoff returns": 8,
      "kickoff return yards": 134,
      "interception returns": 1,
      "interception return yards": 1,
      "3rd down conversions": 3,
      "3rd down attempts": 11,
      "4th down conversions": 1,
      "4th down attempts": 1
    }
  },
  "Houston vs Auburn": {
    "stadium": "FCS-FCS-FCS",
    "Houston": {
      "points": 17,
      "1st downs": 19,
      "rushing 1st downs": 6,
      "passing 1st downs": 12,
      "penalty 1st downs": 1,
      "rushing yards": 115,
      "rushing attempts": 26,
      "passing yards": 283,
      "passing attempts": 41,
      "passing completions": 26,
      "passing interceptions": 2,
      "total yards": 398,
      "total plays": 67,
      "fumbles": 2,
      "fumbles lost": 0,
      "penalties": 6,
      "penalty yards": 34,
      "punts": 4,
      "punt yards": 143,
      "punt returns": 0,
      "punt return yards": 0,
      "kickoff returns": 4,
      "kickoff return yards": 52,
      "interception returns": 0,
      "interception return yards": 0,
      "3rd down conversions": 6,
      "3rd down attempts": 14,
      "4th down conversions": 1,
      "4th down attempts": 2
    },
    "Auburn": {
      "points": 13,
      "1st downs": 15,
      "rushing 1st downs": 6,
      "passing 1st downs": 8,
      "penalty 1st downs": 1,
      "rushing yards": 125,
      "rushing attempts": 29,
      "passing yards": 227,
      "passing attempts": 37,
      "passing completions": 19,
      "passing interceptions": 0,
      "total yards": 352,
      "total plays": 66,
      "fumbles": 2,
      "fumbles lost": 0,
      "penalties": 3,
      "penalty yards": 35,
      "punts": 6,
      "punt yards": 230,
      "punt returns": 0,
      "punt return yards": 0,
      "kickoff returns": 2,
      "kickoff return yards": 42,
      "interception returns": 2,
      "interception return yards": 1,
      "3rd down conversions": 4,
      "3rd down attempts": 15,
      "4th down conversions": 1,
      "4th down attempts": 3
    }
  },
  "AirForce vs Louisville": {
    "stadium": "GeraldJFord-Dallas-TX",
    "AirForce": {
      "points": 31,
      "1st downs": 21,
      "rushing 1st downs": 11,
      "passing 1st downs": 9,
      "penalty 1st downs": 1,
      "rushing yards": 170,
      "rushing attempts": 55,
      "passing yards": 252,
      "passing attempts": 10,
      "passing completions": 9,
      "passing interceptions": 0,
      "total yards": 422,
      "total plays": 65,
      "fumbles": 1,
      "fumbles lost": 0,
      "penalties": 3,
      "penalty yards": 35,
      "punts": 3,
      "punt yards": 126,
      "punt returns": 0,
      "punt return yards": 0,
      "kickoff returns": 1,
      "kickoff return yards": 0,
      "interception returns": 0,
      "interception return yards": 0,
      "3rd down conversions": 8,
      "3rd down attempts": 14,
      "4th down conversions": 1,
      "4th down attempts": 1
    },
    "Louisville": {
      "points": 28,
      "1st downs": 21,
      "rushing 1st downs": 12,
      "passing 1st downs": 9,
      "penalty 1st downs": 0,
      "rushing yards": 195,
      "rushing attempts": 37,
      "passing yards": 207,
      "passing attempts": 22,
      "passing completions": 13,
      "passing interceptions": 0,
      "total yards": 402,
      "total plays": 59,
      "fumbles": 3,
      "fumbles lost": 0,
      "penalties": 3,
      "penalty yards": 30,
      "punts": 2,
      "punt yards": 93,
      "punt returns": 1,
      "punt return yards": 4,
      "kickoff returns": 5,
      "kickoff return yards": 159,
      "interception returns": 0,
      "interception return yards": 0,
      "3rd down conversions": 7,
      "3rd down attempts": 13,
      "4th down conversions": 2,
      "4th down attempts": 3
    }
  },
  "TexasTech vs MississippiState": {
    "stadium": "LibertyBowl-Memphis-TN",
    "TexasTech": {
      "points": 34,
      "1st downs": 24,
      "rushing 1st downs": 13,
      "passing 1st downs": 11,
      "penalty 1st downs": 0,
      "rushing yards": 260,
      "rushing attempts": 44,
      "passing yards": 252,
      "passing attempts": 28,
      "passing completions": 15,
      "passing interceptions": 0,
      "total yards": 512,
      "total plays": 72,
      "fumbles": 0,
      "fumbles lost": 0,
      "penalties": 6,
      "penalty yards": 50,
      "punts": 4,
      "punt yards": 184,
      "punt returns": 2,
      "punt return yards": 3,
      "kickoff returns": 0,
      "kickoff return yards": 0,
      "interception returns": 1,
      "interception return yards": 0,
      "3rd down conversions": 6,
      "3rd down attempts": 13,
      "4th down conversions": 0,
      "4th down attempts": 1
    },
    "MississippiState": {
      "points": 7,
      "1st downs": 22,
      "rushing 1st downs": 4,
      "passing 1st downs": 17,
      "penalty 1st downs": 1,
      "rushing yards": 54,
      "rushing attempts": 20,
      "passing yards": 290,
      "passing attempts": 53,
      "passing completions": 32,
      "passing interceptions": 1,
      "total yards": 344,
      "total plays": 73,
      "fumbles": 2,
      "fumbles lost": 2,
      "penalties": 4,
      "penalty yards": 35,
      "punts": 5,
      "punt yards": 212,
      "punt returns": 3,
      "punt return yards": 9,
      "kickoff returns": 4,
      "kickoff return yards": 74,
      "interception returns": 0,
      "interception return yards": 0,
      "3rd down conversions": 8,
      "3rd down attempts": 17,
      "4th down conversions": 1,
      "4th down attempts": 2
    }
  },
  "WestVirginia vs Minnesota": {
    "stadium": "FCS-FCS-FCS",
    "WestVirginia": {
      "points": 6,
      "1st downs": 15,
      "rushing 1st downs": 7,
      "passing 1st downs": 7,
      "penalty 1st downs": 1,
      "rushing yards": 66,
      "rushing attempts": 27,
      "passing yards": 140,
      "passing attempts": 31,
      "passing completions": 18,
      "passing interceptions": 1,
      "total yards": 206,
      "total plays": 58,
      "fumbles": 3,
      "fumbles lost": 0,
      "penalties": 4,
      "penalty yards": 20,
      "punts": 7,
      "punt yards": 299,
      "punt returns": 1,
      "punt return yards": -2,
      "kickoff returns": 2,
      "kickoff return yards": 21,
      "interception returns": 1,
      "interception return yards": 0,
      "3rd down conversions": 4,
      "3rd down attempts": 13,
      "4th down conversions": 0,
      "4th down attempts": 2
    },
    "Minnesota": {
      "points": 18,
      "1st downs": 17,
      "rushing 1st downs": 13,
      "passing 1st downs": 4,
      "penalty 1st downs": 0,
      "rushing yards": 249,
      "rushing attempts": 51,
      "passing yards": 109,
      "passing attempts": 13,
      "passing completions": 8,
      "passing interceptions": 1,
      "total yards": 358,
      "total plays": 64,
      "fumbles": 1,
      "fumbles lost": 1,
      "penalties": 3,
      "penalty yards": 27,
      "punts": 3,
      "punt yards": 131,
      "punt returns": 1,
      "punt return yards": 0,
      "kickoff returns": 1,
      "kickoff return yards": 16,
      "interception returns": 1,
      "interception return yards": 0,
      "3rd down conversions": 5,
      "3rd down attempts": 13,
      "4th down conversions": 0,
      "4th down attempts": 1
    }
  },
  "Maryland vs VirginiaTech": {
    "stadium": "ChaseField-Phoenix-Phoenix",
    "Maryland": {
      "points": 54,
      "1st downs": 22,
      "rushing 1st downs": 11,
      "passing 1st downs": 11,
      "penalty 1st downs": 0,
      "rushing yards": 206,
      "rushing attempts": 28,
      "passing yards": 275,
      "passing attempts": 25,
      "passing completions": 21,
      "passing interceptions": 0,
      "total yards": 481,
      "total plays": 53,
      "fumbles": 0,
      "fumbles lost": 0,
      "penalties": 3,
      "penalty yards": 22,
      "punts": 2,
      "punt yards": 102,
      "punt returns": 2,
      "punt return yards": 94,
      "kickoff returns": 2,
      "kickoff return yards": 28,
      "interception returns": 0,
      "interception return yards": 0,
      "3rd down conversions": 3,
      "3rd down attempts": 7,
      "4th down conversions": 1,
      "4th down attempts": 1
    },
    "VirginiaTech": {
      "points": 10,
      "1st downs": 13,
      "rushing 1st downs": 5,
      "passing 1st downs": 7,
      "penalty 1st downs": 1,
      "rushing yards": 122,
      "rushing attempts": 48,
      "passing yards": 137,
      "passing attempts": 19,
      "passing completions": 11,
      "passing interceptions": 0,
      "total yards": 259,
      "total plays": 67,
      "fumbles": 2,
      "fumbles lost": 1,
      "penalties": 3,
      "penalty yards": 25,
      "punts": 6,
      "punt yards": 234,
      "punt returns": 1,
      "punt return yards": 3,
      "kickoff returns": 7,
      "kickoff return yards": 171,
      "interception returns": 0,
      "interception return yards": 0,
      "3rd down conversions": 6,
      "3rd down attempts": 18,
      "4th down conversions": 3,
      "4th down attempts": 4
    }
  },
  "Clemson vs IowaState": {
    "stadium": "FCS-FCS-FCS",
    "Clemson": {
      "points": 20,
      "1st downs": 20,
      "rushing 1st downs": 8,
      "passing 1st downs": 10,
      "penalty 1st downs": 2,
      "rushing yards": 128,
      "rushing attempts": 40,
      "passing yards": 187,
      "passing attempts": 33,
      "passing completions": 21,
      "passing interceptions": 1,
      "total yards": 315,
      "total plays": 73,
      "fumbles": 0,
      "fumbles lost": 0,
      "penalties": 5,
      "penalty yards": 60,
      "punts": 5,
      "punt yards": 168,
      "punt returns": 2,
      "punt return yards": -1,
      "kickoff returns": 0,
      "kickoff return yards": 0,
      "interception returns": 1,
      "interception return yards": 18,
      "3rd down conversions": 9,
      "3rd down attempts": 18,
      "4th down conversions": 1,
      "4th down attempts": 1
    },
    "IowaState": {
      "points": 13,
      "1st downs": 14,
      "rushing 1st downs": 4,
      "passing 1st downs": 9,
      "penalty 1st downs": 1,
      "rushing yards": 66,
      "rushing attempts": 21,
      "passing yards": 204,
      "passing attempts": 39,
      "passing completions": 23,
      "passing interceptions": 1,
      "total yards": 270,
      "total plays": 60,
      "fumbles": 2,
      "fumbles lost": 0,
      "penalties": 8,
      "penalty yards": 70,
      "punts": 5,
      "punt yards": 191,
      "punt returns": 0,
      "punt return yards": 0,
      "kickoff returns": 1,
      "kickoff return yards": 17,
      "interception returns": 1,
      "interception return yards": 0,
      "3rd down conversions": 6,
      "3rd down attempts": 15,
      "4th down conversions": 0,
      "4th down attempts": 1
    }
  },
  "Oregon vs Oklahoma": {
    "stadium": "Alamodome-SanAntonio-TX",
    "Oregon": {
      "points": 32,
      "1st downs": 26,
      "rushing 1st downs": 13,
      "passing 1st downs": 12,
      "penalty 1st downs": 1,
      "rushing yards": 191,
      "rushing attempts": 33,
      "passing yards": 306,
      "passing attempts": 40,
      "passing completions": 27,
      "passing interceptions": 1,
      "total yards": 497,
      "total plays": 73,
      "fumbles": 0,
      "fumbles lost": 0,
      "penalties": 5,
      "penalty yards": 35,
      "punts": 3,
      "punt yards": 144,
      "punt returns": 0,
      "punt return yards": 0,
      "kickoff returns": 7,
      "kickoff return yards": 151,
      "interception returns": 0,
      "interception return yards": 0,
      "3rd down conversions": 6,
      "3rd down attempts": 13,
      "4th down conversions": 2,
      "4th down attempts": 3
    },
    "Oklahoma": {
      "points": 47,
      "1st downs": 27,
      "rushing 1st downs": 13,
      "passing 1st downs": 12,
      "penalty 1st downs": 2,
      "rushing yards": 322,
      "rushing attempts": 43,
      "passing yards": 242,
      "passing attempts": 27,
      "passing completions": 21,
      "passing interceptions": 0,
      "total yards": 564,
      "total plays": 70,
      "fumbles": 1,
      "fumbles lost": 0,
      "penalties": 8,
      "penalty yards": 75,
      "punts": 2,
      "punt yards": 99,
      "punt returns": 1,
      "punt return yards": 24,
      "kickoff returns": 1,
      "kickoff return yards": 24,
      "interception returns": 1,
      "interception return yards": 12,
      "3rd down conversions": 6,
      "3rd down attempts": 12,
      "4th down conversions": 2,
      "4th down attempts": 2
    }
  },
  "NorthCarolina vs SouthCarolina": {
    "stadium": "FCS-FCS-FCS",
    "NorthCarolina": {
      "points": 21,
      "1st downs": 14,
      "rushing 1st downs": 5,
      "passing 1st downs": 9,
      "penalty 1st downs": 0,
      "rushing yards": 128,
      "rushing attempts": 29,
      "passing yards": 205,
      "passing attempts": 21,
      "passing completions": 12,
      "passing interceptions": 0,
      "total yards": 333,
      "total plays": 50,
      "fumbles": 1,
      "fumbles lost": 0,
      "penalties": 4,
      "penalty yards": 37,
      "punts": 5,
      "punt yards": 233,
      "punt returns": 0,
      "punt return yards": 0,
      "kickoff returns": 1,
      "kickoff return yards": 16,
      "interception returns": 0,
      "interception return yards": 0,
      "3rd down conversions": 1,
      "3rd down attempts": 10,
      "4th down conversions": 1,
      "4th down attempts": 1
    },
    "SouthCarolina": {
      "points": 38,
      "1st downs": 27,
      "rushing 1st downs": 17,
      "passing 1st downs": 9,
      "penalty 1st downs": 1,
      "rushing yards": 301,
      "rushing attempts": 51,
      "passing yards": 242,
      "passing attempts": 15,
      "passing completions": 12,
      "passing interceptions": 0,
      "total yards": 543,
      "total plays": 66,
      "fumbles": 1,
      "fumbles lost": 0,
      "penalties": 4,
      "penalty yards": 20,
      "punts": 2,
      "punt yards": 83,
      "punt returns": 1,
      "punt return yards": -7,
      "kickoff returns": 0,
      "kickoff return yards": 0,
      "interception returns": 0,
      "interception return yards": 0,
      "3rd down conversions": 6,
      "3rd down attempts": 11,
      "4th down conversions": 0,
      "4th down attempts": 0
    }
  },
  "Tennessee vs Purdue": {
    "stadium": "FCS-FCS-FCS",
    "Tennessee": {
      "points": 45,
      "1st downs": 30,
      "rushing 1st downs": 16,
      "passing 1st downs": 11,
      "penalty 1st downs": 3,
      "rushing yards": 285,
      "rushing attempts": 62,
      "passing yards": 378,
      "passing attempts": 41,
      "passing completions": 26,
      "passing interceptions": 0,
      "total yards": 663,
      "total plays": 103,
      "fumbles": 4,
      "fumbles lost": 1,
      "penalties": 14,
      "penalty yards": 128,
      "punts": 6,
      "punt yards": 260,
      "punt returns": 2,
      "punt return yards": -6,
      "kickoff returns": 8,
      "kickoff return yards": 190,
      "interception returns": 3,
      "interception return yards": -2,
      "3rd down conversions": 8,
      "3rd down attempts": 20,
      "4th down conversions": 2,
      "4th down attempts": 6
    },
    "Purdue": {
      "points": 48,
      "1st downs": 26,
      "rushing 1st downs": 4,
      "passing 1st downs": 15,
      "penalty 1st downs": 7,
      "rushing yards": 93,
      "rushing attempts": 33,
      "passing yards": 534,
      "passing attempts": 48,
      "passing completions": 26,
      "passing interceptions": 3,
      "total yards": 627,
      "total plays": 81,
      "fumbles": 0,
      "fumbles lost": 0,
      "penalties": 5,
      "penalty yards": 61,
      "punts": 5,
      "punt yards": 205,
      "punt returns": 2,
      "punt return yards": 2,
      "kickoff returns": 0,
      "kickoff return yards": 0,
      "interception returns": 0,
      "interception return yards": 0,
      "3rd down conversions": 6,
      "3rd down attempts": 16,
      "4th down conversions": 0,
      "4th down attempts": 1
    }
  },
  "Pittsburgh vs MichiganState": {
    "stadium": "FCS-FCS-FCS",
    "Pittsburgh": {
      "points": 21,
      "1st downs": 14,
      "rushing 1st downs": 8,
      "passing 1st downs": 6,
      "penalty 1st downs": 0,
      "rushing yards": 104,
      "rushing attempts": 32,
      "passing yards": 170,
      "passing attempts": 23,
      "passing completions": 16,
      "passing interceptions": 1,
      "total yards": 274,
      "total plays": 55,
      "fumbles": 0,
      "fumbles lost": 0,
      "penalties": 4,
      "penalty yards": 30,
      "punts": 8,
      "punt yards": 344,
      "punt returns": 1,
      "punt return yards": 0,
      "kickoff returns": 3,
      "kickoff return yards": 37,
      "interception returns": 1,
      "interception return yards": 0,
      "3rd down conversions": 2,
      "3rd down attempts": 12,
      "4th down conversions": 2,
      "4th down attempts": 2
    },
    "MichiganState": {
      "points": 31,
      "1st downs": 25,
      "rushing 1st downs": 7,
      "passing 1st downs": 17,
      "penalty 1st downs": 1,
      "rushing yards": 56,
      "rushing attempts": 36,
      "passing yards": 354,
      "passing attempts": 50,
      "passing completions": 29,
      "passing interceptions": 1,
      "total yards": 410,
      "total plays": 86,
      "fumbles": 2,
      "fumbles lost": 1,
      "penalties": 6,
      "penalty yards": 35,
      "punts": 3,
      "punt yards": 138,
      "punt returns": 2,
      "punt return yards": 25,
      "kickoff returns": 1,
      "kickoff return yards": 16,
      "interception returns": 1,
      "interception return yards": 78,
      "3rd down conversions": 10,
      "3rd down attempts": 21,
      "4th down conversions": 3,
      "4th down attempts": 4
    }
  },
  "Wisconsin vs ArizonaState": {
    "stadium": "FCS-FCS-FCS",
    "Wisconsin": {
      "points": 20,
      "1st downs": 17,
      "rushing 1st downs": 7,
      "passing 1st downs": 8,
      "penalty 1st downs": 2,
      "rushing yards": 157,
      "rushing attempts": 43,
      "passing yards": 137,
      "passing attempts": 15,
      "passing completions": 11,
      "passing interceptions": 1,
      "total yards": 294,
      "total plays": 58,
      "fumbles": 0,
      "fumbles lost": 0,
      "penalties": 2,
      "penalty yards": 10,
      "punts": 3,
      "punt yards": 166,
      "punt returns": 2,
      "punt return yards": 12,
      "kickoff returns": 0,
      "kickoff return yards": 0,
      "interception returns": 1,
      "interception return yards": 0,
      "3rd down conversions": 5,
      "3rd down attempts": 11,
      "4th down conversions": 0,
      "4th down attempts": 1
    },
    "ArizonaState": {
      "points": 13,
      "1st downs": 13,
      "rushing 1st downs": 7,
      "passing 1st downs": 6,
      "penalty 1st downs": 0,
      "rushing yards": 60,
      "rushing attempts": 33,
      "passing yards": 159,
      "passing attempts": 21,
      "passing completions": 11,
      "passing interceptions": 1,
      "total yards": 219,
      "total plays": 54,
      "fumbles": 0,
      "fumbles lost": 0,
      "penalties": 6,
      "penalty yards": 27,
      "punts": 4,
      "punt yards": 180,
      "punt returns": 1,
      "punt return yards": 18,
      "kickoff returns": 2,
      "kickoff return yards": 23,
      "interception returns": 1,
      "interception return yards": 2,
      "3rd down conversions": 7,
      "3rd down attempts": 13,
      "4th down conversions": 0,
      "4th down attempts": 0
    }
  },
  "WakeForest vs Rutgers": {
    "stadium": "FCS-FCS-FCS",
    "WakeForest": {
      "points": 38,
      "1st downs": 29,
      "rushing 1st downs": 11,
      "passing 1st downs": 14,
      "penalty 1st downs": 4,
      "rushing yards": 148,
      "rushing attempts": 37,
      "passing yards": 304,
      "passing attempts": 39,
      "passing completions": 23,
      "passing interceptions": 0,
      "total yards": 452,
      "total plays": 76,
      "fumbles": 1,
      "fumbles lost": 0,
      "penalties": 3,
      "penalty yards": 35,
      "punts": 2,
      "punt yards": 98,
      "punt returns": 0,
      "punt return yards": 0,
      "kickoff returns": 2,
      "kickoff return yards": 27,
      "interception returns": 2,
      "interception return yards": 2,
      "3rd down conversions": 8,
      "3rd down attempts": 15,
      "4th down conversions": 1,
      "4th down attempts": 1
    },
    "Rutgers": {
      "points": 10,
      "1st downs": 17,
      "rushing 1st downs": 6,
      "passing 1st downs": 9,
      "penalty 1st downs": 2,
      "rushing yards": 106,
      "rushing attempts": 28,
      "passing yards": 165,
      "passing attempts": 33,
      "passing completions": 18,
      "passing interceptions": 2,
      "total yards": 271,
      "total plays": 61,
      "fumbles": 1,
      "fumbles lost": 0,
      "penalties": 7,
      "penalty yards": 49,
      "punts": 2,
      "punt yards": 84,
      "punt returns": 0,
      "punt return yards": 0,
      "kickoff returns": 6,
      "kickoff return yards": 146,
      "interception returns": 0,
      "interception return yards": 0,
      "3rd down conversions": 5,
      "3rd down attempts": 13,
      "4th down conversions": 1,
      "4th down attempts": 4
    }
  },
  "WashingtonState vs CentralMichigan": {
    "stadium": "SunBowl-ElPaso-TX",
    "WashingtonState": {
      "points": 42,
      "1st downs": 22,
      "rushing 1st downs": 4,
      "passing 1st downs": 10,
      "penalty 1st downs": 8,
      "rushing yards": 36,
      "rushing attempts": 46,
      "passing yards": 444,
      "passing attempts": 84,
      "passing completions": 40,
      "passing interceptions": 0,
      "total yards": 480,
      "total plays": 130,
      "fumbles": 2,
      "fumbles lost": 0,
      "penalties": 10,
      "penalty yards": 60,
      "punts": 18,
      "punt yards": 686,
      "punt returns": 2,
      "punt return yards": 20,
      "kickoff returns": 6,
      "kickoff return yards": 100,
      "interception returns": 2,
      "interception return yards": 0,
      "3rd down conversions": 4,
      "3rd down attempts": 32,
      "4th down conversions": 0,
      "4th down attempts": 10
    },
    "CentralMichigan": {
      "points": 48,
      "1st downs": 32,
      "rushing 1st downs": 10,
      "passing 1st downs": 18,
      "penalty 1st downs": 4,
      "rushing yards": 290,
      "rushing attempts": 86,
      "passing yards": 340,
      "passing attempts": 58,
      "passing completions": 30,
      "passing interceptions": 2,
      "total yards": 630,
      "total plays": 144,
      "fumbles": 2,
      "fumbles lost": 2,
      "penalties": 16,
      "penalty yards": 136,
      "punts": 14,
      "punt yards": 618,
      "punt returns": 6,
      "punt return yards": 92,
      "kickoff returns": 2,
      "kickoff return yards": 42,
      "interception returns": 0,
      "interception return yards": 0,
      "3rd down conversions": 6,
      "3rd down attempts": 34,
      "4th down conversions": 2,
      "4th down attempts": 2
    }
  },
  "Cincinnati vs Alabama": {
    "stadium": "ATTStadium-Arlington-TX",
    "Cincinnati": {
      "points": 6,
      "1st downs": 13,
      "rushing 1st downs": 6,
      "passing 1st downs": 7,
      "penalty 1st downs": 0,
      "rushing yards": 74,
      "rushing attempts": 26,
      "passing yards": 144,
      "passing attempts": 32,
      "passing completions": 17,
      "passing interceptions": 0,
      "total yards": 218,
      "total plays": 58,
      "fumbles": 0,
      "fumbles lost": 0,
      "penalties": 6,
      "penalty yards": 39,
      "punts": 5,
      "punt yards": 226,
      "punt returns": 1,
      "punt return yards": 12,
      "kickoff returns": 1,
      "kickoff return yards": 40,
      "interception returns": 1,
      "interception return yards": 0,
      "3rd down conversions": 2,
      "3rd down attempts": 12,
      "4th down conversions": 0,
      "4th down attempts": 3
    },
    "Alabama": {
      "points": 27,
      "1st downs": 27,
      "rushing 1st downs": 16,
      "passing 1st downs": 10,
      "penalty 1st downs": 1,
      "rushing yards": 301,
      "rushing attempts": 47,
      "passing yards": 181,
      "passing attempts": 28,
      "passing completions": 17,
      "passing interceptions": 1,
      "total yards": 482,
      "total plays": 75,
      "fumbles": 1,
      "fumbles lost": 0,
      "penalties": 6,
      "penalty yards": 36,
      "punts": 2,
      "punt yards": 88,
      "punt returns": 4,
      "punt return yards": -8,
      "kickoff returns": 1,
      "kickoff return yards": 15,
      "interception returns": 0,
      "interception return yards": 0,
      "3rd down conversions": 5,
      "3rd down attempts": 13,
      "4th down conversions": 1,
      "4th down attempts": 1
    }
  },
  "Georgia vs Michigan": {
    "stadium": "FCS-FCS-FCS",
    "Georgia": {
      "points": 34,
      "1st downs": 21,
      "rushing 1st downs": 12,
      "passing 1st downs": 9,
      "penalty 1st downs": 0,
      "rushing yards": 190,
      "rushing attempts": 35,
      "passing yards": 328,
      "passing attempts": 32,
      "passing completions": 22,
      "passing interceptions": 0,
      "total yards": 518,
      "total plays": 67,
      "fumbles": 0,
      "fumbles lost": 0,
      "penalties": 5,
      "penalty yards": 73,
      "punts": 2,
      "punt yards": 91,
      "punt returns": 0,
      "punt return yards": 0,
      "kickoff returns": 2,
      "kickoff return yards": 25,
      "interception returns": 2,
      "interception return yards": -8,
      "3rd down conversions": 10,
      "3rd down attempts": 16,
      "4th down conversions": 1,
      "4th down attempts": 1
    },
    "Michigan": {
      "points": 11,
      "1st downs": 17,
      "rushing 1st downs": 6,
      "passing 1st downs": 9,
      "penalty 1st downs": 2,
      "rushing yards": 88,
      "rushing attempts": 27,
      "passing yards": 237,
      "passing attempts": 36,
      "passing completions": 18,
      "passing interceptions": 2,
      "total yards": 325,
      "total plays": 63,
      "fumbles": 2,
      "fumbles lost": 1,
      "penalties": 4,
      "penalty yards": 30,
      "punts": 2,
      "punt yards": 89,
      "punt returns": 1,
      "punt return yards": 16,
      "kickoff returns": 0,
      "kickoff return yards": 0,
      "interception returns": 0,
      "interception return yards": 0,
      "3rd down conversions": 8,
      "3rd down attempts": 15,
      "4th down conversions": 0,
      "4th down attempts": 3
    }
  },
  "PennState vs Arkansas": {
    "stadium": "RaymondJames-Tampa-FL",
    "PennState": {
      "points": 10,
      "1st downs": 17,
      "rushing 1st downs": 8,
      "passing 1st downs": 8,
      "penalty 1st downs": 1,
      "rushing yards": 125,
      "rushing attempts": 28,
      "passing yards": 198,
      "passing attempts": 35,
      "passing completions": 15,
      "passing interceptions": 2,
      "total yards": 323,
      "total plays": 63,
      "fumbles": 1,
      "fumbles lost": 0,
      "penalties": 3,
      "penalty yards": 10,
      "punts": 5,
      "punt yards": 197,
      "punt returns": 2,
      "punt return yards": 23,
      "kickoff returns": 0,
      "kickoff return yards": 0,
      "interception returns": 2,
      "interception return yards": 0,
      "3rd down conversions": 6,
      "3rd down attempts": 15,
      "4th down conversions": 1,
      "4th down attempts": 2
    },
    "Arkansas": {
      "points": 24,
      "1st downs": 25,
      "rushing 1st downs": 21,
      "passing 1st downs": 3,
      "penalty 1st downs": 1,
      "rushing yards": 361,
      "rushing attempts": 58,
      "passing yards": 90,
      "passing attempts": 20,
      "passing completions": 14,
      "passing interceptions": 2,
      "total yards": 451,
      "total plays": 78,
      "fumbles": 1,
      "fumbles lost": 0,
      "penalties": 6,
      "penalty yards": 40,
      "punts": 5,
      "punt yards": 222,
      "punt returns": 1,
      "punt return yards": 8,
      "kickoff returns": 0,
      "kickoff return yards": 0,
      "interception returns": 2,
      "interception return yards": 0,
      "3rd down conversions": 4,
      "3rd down attempts": 14,
      "4th down conversions": 3,
      "4th down attempts": 3
    }
  },
  "OklahomaState vs NotreDame": {
    "stadium": "StateFarmStadium-Glendale-AZ",
    "OklahomaState": {
      "points": 37,
      "1st downs": 34,
      "rushing 1st downs": 14,
      "passing 1st downs": 19,
      "penalty 1st downs": 1,
      "rushing yards": 234,
      "rushing attempts": 44,
      "passing yards": 371,
      "passing attempts": 51,
      "passing completions": 34,
      "passing interceptions": 0,
      "total yards": 605,
      "total plays": 95,
      "fumbles": 2,
      "fumbles lost": 2,
      "penalties": 4,
      "penalty yards": 45,
      "punts": 6,
      "punt yards": 271,
      "punt returns": 0,
      "punt return yards": 0,
      "kickoff returns": 3,
      "kickoff return yards": 26,
      "interception returns": 1,
      "interception return yards": 11,
      "3rd down conversions": 3,
      "3rd down attempts": 14,
      "4th down conversions": 1,
      "4th down attempts": 1
    },
    "NotreDame": {
      "points": 35,
      "1st downs": 27,
      "rushing 1st downs": 1,
      "passing 1st downs": 24,
      "penalty 1st downs": 2,
      "rushing yards": 42,
      "rushing attempts": 21,
      "passing yards": 509,
      "passing attempts": 68,
      "passing completions": 38,
      "passing interceptions": 1,
      "total yards": 551,
      "total plays": 89,
      "fumbles": 2,
      "fumbles lost": 1,
      "penalties": 5,
      "penalty yards": 45,
      "punts": 7,
      "punt yards": 291,
      "punt returns": 4,
      "punt return yards": 9,
      "kickoff returns": 2,
      "kickoff return yards": 44,
      "interception returns": 0,
      "interception return yards": 0,
      "3rd down conversions": 11,
      "3rd down attempts": 20,
      "4th down conversions": 0,
      "4th down attempts": 1
    }
  },
  "Iowa vs Kentucky": {
    "stadium": "CampingWorldStadium-Orlando-FL",
    "Iowa": {
      "points": 17,
      "1st downs": 20,
      "rushing 1st downs": 6,
      "passing 1st downs": 12,
      "penalty 1st downs": 2,
      "rushing yards": 173,
      "rushing attempts": 30,
      "passing yards": 211,
      "passing attempts": 30,
      "passing completions": 19,
      "passing interceptions": 3,
      "total yards": 384,
      "total plays": 60,
      "fumbles": 0,
      "fumbles lost": 0,
      "penalties": 4,
      "penalty yards": 35,
      "punts": 4,
      "punt yards": 200,
      "punt returns": 1,
      "punt return yards": 3,
      "kickoff returns": 2,
      "kickoff return yards": 30,
      "interception returns": 1,
      "interception return yards": 0,
      "3rd down conversions": 4,
      "3rd down attempts": 11,
      "4th down conversions": 0,
      "4th down attempts": 1
    },
    "Kentucky": {
      "points": 20,
      "1st downs": 24,
      "rushing 1st downs": 11,
      "passing 1st downs": 10,
      "penalty 1st downs": 3,
      "rushing yards": 121,
      "rushing attempts": 47,
      "passing yards": 233,
      "passing attempts": 28,
      "passing completions": 17,
      "passing interceptions": 1,
      "total yards": 354,
      "total plays": 75,
      "fumbles": 0,
      "fumbles lost": 0,
      "penalties": 3,
      "penalty yards": 20,
      "punts": 4,
      "punt yards": 182,
      "punt returns": 0,
      "punt return yards": 0,
      "kickoff returns": 0,
      "kickoff return yards": 0,
      "interception returns": 3,
      "interception return yards": 3,
      "3rd down conversions": 6,
      "3rd down attempts": 14,
      "4th down conversions": 0,
      "4th down attempts": 2
    }
  },
  "Utah vs OhioState": {
    "stadium": "RoseBowl-Pasadena-CA",
    "Utah": {
      "points": 45,
      "1st downs": 25,
      "rushing 1st downs": 10,
      "passing 1st downs": 11,
      "penalty 1st downs": 4,
      "rushing yards": 226,
      "rushing attempts": 44,
      "passing yards": 237,
      "passing attempts": 24,
      "passing completions": 19,
      "passing interceptions": 0,
      "total yards": 463,
      "total plays": 68,
      "fumbles": 2,
      "fumbles lost": 1,
      "penalties": 5,
      "penalty yards": 50,
      "punts": 3,
      "punt yards": 114,
      "punt returns": 0,
      "punt return yards": 0,
      "kickoff returns": 8,
      "kickoff return yards": 222,
      "interception returns": 1,
      "interception return yards": 0,
      "3rd down conversions": 5,
      "3rd down attempts": 12,
      "4th down conversions": 1,
      "4th down attempts": 3
    },
    "OhioState": {
      "points": 48,
      "1st downs": 28,
      "rushing 1st downs": 5,
      "passing 1st downs": 21,
      "penalty 1st downs": 2,
      "rushing yards": 110,
      "rushing attempts": 20,
      "passing yards": 573,
      "passing attempts": 47,
      "passing completions": 37,
      "passing interceptions": 1,
      "total yards": 683,
      "total plays": 67,
      "fumbles": 1,
      "fumbles lost": 1,
      "penalties": 7,
      "penalty yards": 70,
      "punts": 2,
      "punt yards": 82,
      "punt returns": 0,
      "punt return yards": 0,
      "kickoff returns": 8,
      "kickoff return yards": 233,
      "interception returns": 0,
      "interception return yards": 0,
      "3rd down conversions": 4,
      "3rd down attempts": 9,
      "4th down conversions": 2,
      "4th down attempts": 2
    }
  },
  "Baylor vs OleMiss": {
    "stadium": "FCS-FCS-FCS",
    "Baylor": {
      "points": 21,
      "1st downs": 12,
      "rushing 1st downs": 10,
      "passing 1st downs": 1,
      "penalty 1st downs": 1,
      "rushing yards": 279,
      "rushing attempts": 41,
      "passing yards": 40,
      "passing attempts": 17,
      "passing completions": 7,
      "passing interceptions": 1,
      "total yards": 319,
      "total plays": 58,
      "fumbles": 0,
      "fumbles lost": 0,
      "penalties": 5,
      "penalty yards": 55,
      "punts": 6,
      "punt yards": 216,
      "punt returns": 3,
      "punt return yards": 27,
      "kickoff returns": 2,
      "kickoff return yards": 45,
      "interception returns": 3,
      "interception return yards": 112,
      "3rd down conversions": 7,
      "3rd down attempts": 15,
      "4th down conversions": 0,
      "4th down attempts": 2
    },
    "OleMiss": {
      "points": 7,
      "1st downs": 20,
      "rushing 1st downs": 12,
      "passing 1st downs": 7,
      "penalty 1st downs": 1,
      "rushing yards": 138,
      "rushing attempts": 54,
      "passing yards": 184,
      "passing attempts": 35,
      "passing completions": 17,
      "passing interceptions": 3,
      "total yards": 322,
      "total plays": 89,
      "fumbles": 0,
      "fumbles lost": 0,
      "penalties": 7,
      "penalty yards": 49,
      "punts": 5,
      "punt yards": 238,
      "punt returns": 1,
      "punt return yards": 15,
      "kickoff returns": 1,
      "kickoff return yards": 19,
      "interception returns": 1,
      "interception return yards": 9,
      "3rd down conversions": 6,
      "3rd down attempts": 22,
      "4th down conversions": 5,
      "4th down attempts": 7
    }
  },
  "LSU vs KansasState": {
    "stadium": "FCS-FCS-FCS",
    "LSU": {
      "points": 20,
      "1st downs": 15,
      "rushing 1st downs": 9,
      "passing 1st downs": 4,
      "penalty 1st downs": 2,
      "rushing yards": 170,
      "rushing attempts": 37,
      "passing yards": 138,
      "passing attempts": 11,
      "passing completions": 7,
      "passing interceptions": 2,
      "total yards": 308,
      "total plays": 48,
      "fumbles": 0,
      "fumbles lost": 0,
      "penalties": 6,
      "penalty yards": 59,
      "punts": 3,
      "punt yards": 135,
      "punt returns": 0,
      "punt return yards": 0,
      "kickoff returns": 2,
      "kickoff return yards": 36,
      "interception returns": 0,
      "interception return yards": 0,
      "3rd down conversions": 3,
      "3rd down attempts": 10,
      "4th down conversions": 2,
      "4th down attempts": 3
    },
    "KansasState": {
      "points": 42,
      "1st downs": 22,
      "rushing 1st downs": 8,
      "passing 1st downs": 13,
      "penalty 1st downs": 1,
      "rushing yards": 183,
      "rushing attempts": 34,
      "passing yards": 259,
      "passing attempts": 28,
      "passing completions": 21,
      "passing interceptions": 0,
      "total yards": 442,
      "total plays": 62,
      "fumbles": 0,
      "fumbles lost": 0,
      "penalties": 7,
      "penalty yards": 75,
      "punts": 2,
      "punt yards": 66,
      "punt returns": 1,
      "punt return yards": 19,
      "kickoff returns": 1,
      "kickoff return yards": 36,
      "interception returns": 2,
      "interception return yards": 32,
      "3rd down conversions": 8,
      "3rd down attempts": 12,
      "4th down conversions": 2,
      "4th down attempts": 2
    }
  },
  "Georgia vs Alabama": {
    "stadium": "FCS-FCS-FCS",
    "Georgia": {
      "points": 33,
      "1st downs": 20,
      "rushing 1st downs": 7,
      "passing 1st downs": 10,
      "penalty 1st downs": 3,
      "rushing yards": 140,
      "rushing attempts": 30,
      "passing yards": 224,
      "passing attempts": 26,
      "passing completions": 17,
      "passing interceptions": 0,
      "total yards": 364,
      "total plays": 56,
      "fumbles": 2,
      "fumbles lost": 1,
      "penalties": 10,
      "penalty yards": 70,
      "punts": 5,
      "punt yards": 223,
      "punt returns": 0,
      "punt return yards": 0,
      "kickoff returns": 1,
      "kickoff return yards": 59,
      "interception returns": 2,
      "interception return yards": 79,
      "3rd down conversions": 4,
      "3rd down attempts": 12,
      "4th down conversions": 0,
      "4th down attempts": 0
    },
    "Alabama": {
      "points": 18,
      "1st downs": 22,
      "rushing 1st downs": 5,
      "passing 1st downs": 15,
      "penalty 1st downs": 2,
      "rushing yards": 30,
      "rushing attempts": 28,
      "passing yards": 369,
      "passing attempts": 57,
      "passing completions": 35,
      "passing interceptions": 2,
      "total yards": 399,
      "total plays": 85,
      "fumbles": 1,
      "fumbles lost": 0,
      "penalties": 7,
      "penalty yards": 44,
      "punts": 4,
      "punt yards": 148,
      "punt returns": 1,
      "punt return yards": -2,
      "kickoff returns": 0,
      "kickoff return yards": 0,
      "interception returns": 0,
      "interception return yards": 0,
      "3rd down conversions": 9,
      "3rd down attempts": 20,
      "4th down conversions": 0,
      "4th down attempts": 1
    }
  }
}