{
  "inputMD5Sum": "293eff8664bca5cef5f5f6438dbe865c",
  "updated_at": "10-25-2020 14:02:56",
  "games": [
    {"game": {
      "gameID": "cdb998ab-55e3-4e4b-baae-dfbbb975cca5",
      "away": {
        "score": "17",
        "names": {
          "char6": "ARK ST",
          "short": "Arkansas St.",
          "seo": "arkansas-st",
          "full": "Arkansas State University"
        },
        "winner": false,
        "seed": "",
        "description": "(3-3)",
        "rank": "",
        "conferences": [{
          "conferenceName": "Sun Belt",
          "conferenceSeo": "sun-belt"
        }]
      },
      "finalMessage": "FINAL",
      "bracketRound": "",
      "title": "App State Arkansas St.",
      "url": "/game/4060714",
      "network": "",
      "home": {
        "score": "45",
        "names": {
          "char6": "APP ST",
          "short": "App State",
          "seo": "appalachian-st",
          "full": "Appalachian State University"
        },
        "winner": true,
        "seed": "",
        "description": "(3-1)",
        "rank": "",
        "conferences": [{
          "conferenceName": "Sun Belt",
          "conferenceSeo": "sun-belt"
        }]
      },
      "liveVideoEnabled": false,
      "startTime": "07:30PM ET",
      "startTimeEpoch": "1603409400",
      "bracketId": "",
      "gameState": "final",
      "startDate": "10-22-2020",
      "currentPeriod": "FINAL",
      "videoState": "",
      "bracketRegion": "",
      "contestClock": "0:00"
    }},
    {"game": {
      "gameID": "e5b24a02-37cd-4925-830e-e60b669f7666",
      "away": {
        "score": "19",
        "names": {
          "char6": "JAX ST",
          "short": "Jacksonville St.",
          "seo": "jacksonville-st",
          "full": "Jacksonville State University"
        },
        "winner": true,
        "seed": "",
        "description": "(3-1)",
        "rank": "",
        "conferences": [{
          "conferenceName": "OVC",
          "conferenceSeo": "ovc"
        }]
      },
      "finalMessage": "FINAL",
      "bracketRound": "",
      "title": "FIU Jacksonville St.",
      "url": "/game/4273841",
      "network": "",
      "home": {
        "score": "10",
        "names": {
          "char6": "FIU",
          "short": "FIU",
          "seo": "fiu",
          "full": "Florida International University"
        },
        "winner": false,
        "seed": "",
        "description": "(0-3)",
        "rank": "",
        "conferences": [{
          "conferenceName": "C-USA",
          "conferenceSeo": "c-usa"
        }]
      },
      "liveVideoEnabled": false,
      "startTime": "07:00PM ET",
      "startTimeEpoch": "1603494000",
      "bracketId": "",
      "gameState": "final",
      "startDate": "10-23-2020",
      "currentPeriod": "FINAL",
      "videoState": "",
      "bracketRegion": "",
      "contestClock": "0:00"
    }},
    {"game": {
      "gameID": "9270fd79-a140-44a9-ab44-6baa470758f9",
      "away": {
        "score": "42",
        "names": {
          "char6": "TULSA",
          "short": "Tulsa",
          "seo": "tulsa",
          "full": "The University of Tulsa"
        },
        "winner": true,
        "seed": "",
        "description": "(2-1)",
        "rank": "",
        "conferences": [{
          "conferenceName": "AAC",
          "conferenceSeo": "aac"
        }]
      },
      "finalMessage": "FINAL",
      "bracketRound": "",
      "title": "South Fla. Tulsa",
      "url": "/game/4060686",
      "network": "",
      "home": {
        "score": "13",
        "names": {
          "char6": "USF",
          "short": "South Fla.",
          "seo": "south-fla",
          "full": "University of South Florida"
        },
        "winner": false,
        "seed": "",
        "description": "(1-5)",
        "rank": "",
        "conferences": [{
          "conferenceName": "AAC",
          "conferenceSeo": "aac"
        }]
      },
      "liveVideoEnabled": false,
      "startTime": "07:30PM ET",
      "startTimeEpoch": "1603495800",
      "bracketId": "",
      "gameState": "final",
      "startDate": "10-23-2020",
      "currentPeriod": "FINAL",
      "videoState": "",
      "bracketRegion": "",
      "contestClock": "0:00"
    }},
    {"game": {
      "gameID": "b4dad95b-afcc-4313-9b4a-a2fe4a0f018b",
      "away": {
        "score": "24",
        "names": {
          "char6": "ULL",
          "short": "Louisiana",
          "seo": "la-lafayette",
          "full": "University of Louisiana at Lafayette"
        },
        "winner": true,
        "seed": "",
        "description": "(4-1)",
        "rank": "",
        "conferences": [{
          "conferenceName": "Sun Belt",
          "conferenceSeo": "sun-belt"
        }]
      },
      "finalMessage": "FINAL",
      "bracketRound": "",
      "title": "UAB Louisiana",
      "url": "/game/4060915",
      "network": "",
      "home": {
        "score": "20",
        "names": {
          "char6": "UAB",
          "short": "UAB",
          "seo": "uab",
          "full": "University of Alabama at Birmingham"
        },
        "winner": false,
        "seed": "",
        "description": "(4-2)",
        "rank": "",
        "conferences": [{
          "conferenceName": "C-USA",
          "conferenceSeo": "c-usa"
        }]
      },
      "liveVideoEnabled": false,
      "startTime": "08:00PM ET",
      "startTimeEpoch": "1603497600",
      "bracketId": "",
      "gameState": "final",
      "startDate": "10-23-2020",
      "currentPeriod": "FINAL",
      "videoState": "",
      "bracketRegion": "",
      "contestClock": "0:00"
    }},
    {"game": {
      "gameID": "649134ee-c8fa-4e53-989a-4c22fea491c5",
      "away": {
        "score": "7",
        "names": {
          "char6": "ILL",
          "short": "Illinois",
          "seo": "illinois",
          "full": "University of Illinois Urbana-Champaign"
        },
        "winner": false,
        "seed": "",
        "description": "(0-1)",
        "rank": "",
        "conferences": [{
          "conferenceName": "Big Ten",
          "conferenceSeo": "big-ten"
        }]
      },
      "finalMessage": "FINAL",
      "bracketRound": "",
      "title": "Wisconsin Illinois",
      "url": "/game/4616354",
      "network": "",
      "home": {
        "score": "45",
        "names": {
          "char6": "WISC",
          "short": "Wisconsin",
          "seo": "wisconsin",
          "full": "University of Wisconsin-Madison"
        },
        "winner": true,
        "seed": "",
        "description": "(1-0)",
        "rank": "14",
        "conferences": [
          {
            "conferenceName": "Big Ten",
            "conferenceSeo": "big-ten"
          },
          {
            "conferenceName": "Top 25",
            "conferenceSeo": "top-25"
          }
        ]
      },
      "liveVideoEnabled": false,
      "startTime": "08:00PM ET",
      "startTimeEpoch": "1603497600",
      "bracketId": "",
      "gameState": "final",
      "startDate": "10-23-2020",
      "currentPeriod": "FINAL",
      "videoState": "",
      "bracketRegion": "",
      "contestClock": "0:00"
    }},
    {"game": {
      "gameID": "b7fb8d8d-099a-4e9f-bcf8-9bd5a9eaa82a",
      "away": {
        "score": "14",
        "names": {
          "char6": "KANSAS",
          "short": "Kansas",
          "seo": "kansas",
          "full": "University of Kansas"
        },
        "winner": false,
        "seed": "",
        "description": "(0-5)",
        "rank": "",
        "conferences": [{
          "conferenceName": "Big 12",
          "conferenceSeo": "big-12"
        }]
      },
      "finalMessage": "FINAL",
      "bracketRound": "",
      "title": "Kansas St. Kansas",
      "url": "/game/4060687",
      "network": "",
      "home": {
        "score": "55",
        "names": {
          "char6": "KAN ST",
          "short": "Kansas St.",
          "seo": "kansas-st",
          "full": "Kansas State University"
        },
        "winner": true,
        "seed": "",
        "description": "(4-1)",
        "rank": "20",
        "conferences": [
          {
            "conferenceName": "Big 12",
            "conferenceSeo": "big-12"
          },
          {
            "conferenceName": "Top 25",
            "conferenceSeo": "top-25"
          }
        ]
      },
      "liveVideoEnabled": false,
      "startTime": "12:00PM ET",
      "startTimeEpoch": "1603555200",
      "bracketId": "",
      "gameState": "final",
      "startDate": "10-24-2020",
      "currentPeriod": "FINAL",
      "videoState": "",
      "bracketRegion": "",
      "contestClock": "0:00"
    }},
    {"game": {
      "gameID": "53988954-b59c-475d-bc60-ce122e305be9",
      "away": {
        "score": "28",
        "names": {
          "char6": "UTEP",
          "short": "UTEP",
          "seo": "utep",
          "full": "University of Texas at El Paso"
        },
        "winner": false,
        "seed": "",
        "description": "(3-3)",
        "rank": "",
        "conferences": [{
          "conferenceName": "C-USA",
          "conferenceSeo": "c-usa"
        }]
      },
      "finalMessage": "FINAL",
      "bracketRound": "",
      "title": "Charlotte UTEP",
      "url": "/game/4060689",
      "network": "",
      "home": {
        "score": "38",
        "names": {
          "char6": "CHAR",
          "short": "Charlotte",
          "seo": "charlotte",
          "full": "The University of North Carolina at Charlotte"
        },
        "winner": true,
        "seed": "",
        "description": "(2-2)",
        "rank": "",
        "conferences": [{
          "conferenceName": "C-USA",
          "conferenceSeo": "c-usa"
        }]
      },
      "liveVideoEnabled": false,
      "startTime": "12:00PM ET",
      "startTimeEpoch": "1603555200",
      "bracketId": "",
      "gameState": "final",
      "startDate": "10-24-2020",
      "currentPeriod": "FINAL",
      "videoState": "",
      "bracketRegion": "",
      "contestClock": "0:00"
    }},
    {"game": {
      "gameID": "24df38b7-9e79-4518-a944-fbf1ccf8c30c",
      "away": {
        "score": "16",
        "names": {
          "char6": "FSU",
          "short": "Florida St.",
          "seo": "florida-st",
          "full": "Florida State University"
        },
        "winner": false,
        "seed": "",
        "description": "(2-4)",
        "rank": "",
        "conferences": [{
          "conferenceName": "ACC",
          "conferenceSeo": "acc"
        }]
      },
      "finalMessage": "FINAL",
      "bracketRound": "",
      "title": "Louisville Florida St.",
      "url": "/game/4060690",
      "network": "",
      "home": {
        "score": "48",
        "names": {
          "char6": "LOUIS",
          "short": "Louisville",
          "seo": "louisville",
          "full": "University of Louisville"
        },
        "winner": true,
        "seed": "",
        "description": "(2-4)",
        "rank": "",
        "conferences": [{
          "conferenceName": "ACC",
          "conferenceSeo": "acc"
        }]
      },
      "liveVideoEnabled": false,
      "startTime": "12:00PM ET",
      "startTimeEpoch": "1603555200",
      "bracketId": "",
      "gameState": "final",
      "startDate": "10-24-2020",
      "currentPeriod": "FINAL",
      "videoState": "",
      "bracketRegion": "",
      "contestClock": "0:00"
    }},
    {"game": {
      "gameID": "26e3e814-823f-44a2-8685-09cc1a7b25f7",
      "away": {
        "score": "29",
        "names": {
          "char6": "TEMPLE",
          "short": "Temple",
          "seo": "temple",
          "full": "Temple University"
        },
        "winner": false,
        "seed": "",
        "description": "(1-2)",
        "rank": "",
        "conferences": [{
          "conferenceName": "AAC",
          "conferenceSeo": "aac"
        }]
      },
      "finalMessage": "FINAL",
      "bracketRound": "",
      "title": "Memphis Temple",
      "url": "/game/4060694",
      "network": "",
      "home": {
        "score": "41",
        "names": {
          "char6": "MEM",
          "short": "Memphis",
          "seo": "memphis",
          "full": "University of Memphis"
        },
        "winner": true,
        "seed": "",
        "description": "(3-1)",
        "rank": "",
        "conferences": [{
          "conferenceName": "AAC",
          "conferenceSeo": "aac"
        }]
      },
      "liveVideoEnabled": false,
      "startTime": "12:00PM ET",
      "startTimeEpoch": "1603555200",
      "bracketId": "",
      "gameState": "final",
      "startDate": "10-24-2020",
      "currentPeriod": "FINAL",
      "videoState": "",
      "bracketRegion": "",
      "contestClock": "0:00"
    }},
    {"game": {
      "gameID": "aedc0181-7b81-4000-9f21-878979da8792",
      "away": {
        "score": "21",
        "names": {
          "char6": "NC ST",
          "short": "NC State",
          "seo": "north-carolina-st",
          "full": "North Carolina State University"
        },
        "winner": false,
        "seed": "",
        "description": "(4-2)",
        "rank": "23",
        "conferences": [
          {
            "conferenceName": "ACC",
            "conferenceSeo": "acc"
          },
          {
            "conferenceName": "Top 25",
            "conferenceSeo": "top-25"
          }
        ]
      },
      "finalMessage": "FINAL",
      "bracketRound": "",
      "title": "North Carolina NC State",
      "url": "/game/4060696",
      "network": "",
      "home": {
        "score": "48",
        "names": {
          "char6": "UNC",
          "short": "North Carolina",
          "seo": "north-carolina",
          "full": "University of North Carolina, Chapel Hill"
        },
        "winner": true,
        "seed": "",
        "description": "(4-1)",
        "rank": "14",
        "conferences": [
          {
            "conferenceName": "ACC",
            "conferenceSeo": "acc"
          },
          {
            "conferenceName": "Top 25",
            "conferenceSeo": "top-25"
          }
        ]
      },
      "liveVideoEnabled": false,
      "startTime": "12:00PM ET",
      "startTimeEpoch": "1603555200",
      "bracketId": "",
      "gameState": "final",
      "startDate": "10-24-2020",
      "currentPeriod": "FINAL",
      "videoState": "",
      "bracketRegion": "",
      "contestClock": "0:00"
    }},
    {"game": {
      "gameID": "97b84e2d-b1fc-46be-9521-2ea8a16bddaf",
      "away": {
        "score": "33",
        "names": {
          "char6": "OKLA",
          "short": "Oklahoma",
          "seo": "oklahoma",
          "full": "University of Oklahoma"
        },
        "winner": true,
        "seed": "",
        "description": "(3-2)",
        "rank": "",
        "conferences": [{
          "conferenceName": "Big 12",
          "conferenceSeo": "big-12"
        }]
      },
      "finalMessage": "FINAL",
      "bracketRound": "",
      "title": "TCU Oklahoma",
      "url": "/game/4060701",
      "network": "",
      "home": {
        "score": "14",
        "names": {
          "char6": "TCU",
          "short": "TCU",
          "seo": "tcu",
          "full": "Texas Christian University"
        },
        "winner": false,
        "seed": "",
        "description": "(1-3)",
        "rank": "",
        "conferences": [{
          "conferenceName": "Big 12",
          "conferenceSeo": "big-12"
        }]
      },
      "liveVideoEnabled": false,
      "startTime": "12:00PM ET",
      "startTimeEpoch": "1603555200",
      "bracketId": "",
      "gameState": "final",
      "startDate": "10-24-2020",
      "currentPeriod": "FINAL",
      "videoState": "",
      "bracketRegion": "",
      "contestClock": "0:00"
    }},
    {"game": {
      "gameID": "1e415bd9-b3cb-4162-8005-83e88514132b",
      "away": {
        "score": "14",
        "names": {
          "char6": "GA SOU",
          "short": "Ga. Southern",
          "seo": "ga-southern",
          "full": "Georgia Southern University"
        },
        "winner": false,
        "seed": "",
        "description": "(3-2)",
        "rank": "",
        "conferences": [{
          "conferenceName": "Sun Belt",
          "conferenceSeo": "sun-belt"
        }]
      },
      "finalMessage": "FINAL",
      "bracketRound": "",
      "title": "Coastal Carolina Ga. Southern",
      "url": "/game/4060702",
      "network": "",
      "home": {
        "score": "28",
        "names": {
          "char6": "CO CAR",
          "short": "Coastal Carolina",
          "seo": "coastal-caro",
          "full": "Coastal Carolina University"
        },
        "winner": true,
        "seed": "",
        "description": "(5-0)",
        "rank": "25",
        "conferences": [
          {
            "conferenceName": "Sun Belt",
            "conferenceSeo": "sun-belt"
          },
          {
            "conferenceName": "Top 25",
            "conferenceSeo": "top-25"
          }
        ]
      },
      "liveVideoEnabled": false,
      "startTime": "12:00PM ET",
      "startTimeEpoch": "1603555200",
      "bracketId": "",
      "gameState": "final",
      "startDate": "10-24-2020",
      "currentPeriod": "FINAL",
      "videoState": "",
      "bracketRegion": "",
      "contestClock": "0:00"
    }},
    {"game": {
      "gameID": "363425db-a877-4240-bb3b-1ee913d025cb",
      "away": {
        "score": "21",
        "names": {
          "char6": "SYR",
          "short": "Syracuse",
          "seo": "syracuse",
          "full": "Syracuse University"
        },
        "winner": false,
        "seed": "",
        "description": "(1-5)",
        "rank": "",
        "conferences": [{
          "conferenceName": "ACC",
          "conferenceSeo": "acc"
        }]
      },
      "finalMessage": "FINAL",
      "bracketRound": "",
      "title": "Clemson Syracuse",
      "url": "/game/4060705",
      "network": "",
      "home": {
        "score": "47",
        "names": {
          "char6": "CLEM",
          "short": "Clemson",
          "seo": "clemson",
          "full": "Clemson University"
        },
        "winner": true,
        "seed": "",
        "description": "(6-0)",
        "rank": "1",
        "conferences": [
          {
            "conferenceName": "ACC",
            "conferenceSeo": "acc"
          },
          {
            "conferenceName": "Top 25",
            "conferenceSeo": "top-25"
          }
        ]
      },
      "liveVideoEnabled": false,
      "startTime": "12:00PM ET",
      "startTimeEpoch": "1603555200",
      "bracketId": "",
      "gameState": "final",
      "startDate": "10-24-2020",
      "currentPeriod": "FINAL",
      "videoState": "",
      "bracketRegion": "",
      "contestClock": "0:00"
    }},
    {"game": {
      "gameID": "461bbd35-96d3-4c9d-a513-b08c0ccbedb3",
      "away": {
        "score": "35",
        "names": {
          "char6": "AUBURN",
          "short": "Auburn",
          "seo": "auburn",
          "full": "Auburn University"
        },
        "winner": true,
        "seed": "",
        "description": "(3-2)",
        "rank": "",
        "conferences": [{
          "conferenceName": "SEC",
          "conferenceSeo": "sec"
        }]
      },
      "finalMessage": "FINAL",
      "bracketRound": "",
      "title": "Ole Miss Auburn",
      "url": "/game/4060708",
      "network": "",
      "home": {
        "score": "28",
        "names": {
          "char6": "MISS",
          "short": "Ole Miss",
          "seo": "ole-miss",
          "full": "University of Mississippi"
        },
        "winner": false,
        "seed": "",
        "description": "(1-4)",
        "rank": "",
        "conferences": [{
          "conferenceName": "SEC",
          "conferenceSeo": "sec"
        }]
      },
      "liveVideoEnabled": false,
      "startTime": "12:00PM ET",
      "startTimeEpoch": "1603555200",
      "bracketId": "",
      "gameState": "final",
      "startDate": "10-24-2020",
      "currentPeriod": "FINAL",
      "videoState": "",
      "bracketRegion": "",
      "contestClock": "0:00"
    }},
    {"game": {
      "gameID": "fa80af6e-8ae3-4813-9090-d215431e6349",
      "away": {
        "score": "3",
        "names": {
          "char6": "MERCER",
          "short": "Mercer",
          "seo": "mercer",
          "full": "Mercer University"
        },
        "winner": false,
        "seed": "",
        "description": "(0-2)",
        "rank": "",
        "conferences": [{
          "conferenceName": "SoCon",
          "conferenceSeo": "socon"
        }]
      },
      "finalMessage": "FINAL",
      "bracketRound": "",
      "title": "Army West Point Mercer",
      "url": "/game/4060936",
      "network": "",
      "home": {
        "score": "49",
        "names": {
          "char6": "ARMY",
          "short": "Army West Point",
          "seo": "army",
          "full": "U.S. Military Academy"
        },
        "winner": true,
        "seed": "",
        "description": "(6-1)",
        "rank": "",
        "conferences": [{
          "conferenceName": "FBS Independent",
          "conferenceSeo": "fbs-independent"
        }]
      },
      "liveVideoEnabled": false,
      "startTime": "12:00PM ET",
      "startTimeEpoch": "1603555200",
      "bracketId": "",
      "gameState": "final",
      "startDate": "10-24-2020",
      "currentPeriod": "FINAL",
      "videoState": "",
      "bracketRegion": "",
      "contestClock": "0:00"
    }},
    {"game": {
      "gameID": "ab25807f-cef7-4ae9-9bcf-555eae9cd9f7",
      "away": {
        "score": "17",
        "names": {
          "char6": "NEB",
          "short": "Nebraska",
          "seo": "nebraska",
          "full": "University of Nebraska, Lincoln"
        },
        "winner": false,
        "seed": "",
        "description": "(0-1)",
        "rank": "",
        "conferences": [{
          "conferenceName": "Big Ten",
          "conferenceSeo": "big-ten"
        }]
      },
      "finalMessage": "FINAL",
      "bracketRound": "",
      "title": "Ohio St. Nebraska",
      "url": "/game/4616349",
      "network": "",
      "home": {
        "score": "52",
        "names": {
          "char6": "OHIOST",
          "short": "Ohio St.",
          "seo": "ohio-st",
          "full": "The Ohio State University"
        },
        "winner": true,
        "seed": "",
        "description": "(1-0)",
        "rank": "5",
        "conferences": [
          {
            "conferenceName": "Big Ten",
            "conferenceSeo": "big-ten"
          },
          {
            "conferenceName": "Top 25",
            "conferenceSeo": "top-25"
          }
        ]
      },
      "liveVideoEnabled": false,
      "startTime": "12:00PM ET",
      "startTimeEpoch": "1603555200",
      "bracketId": "",
      "gameState": "final",
      "startDate": "10-24-2020",
      "currentPeriod": "FINAL",
      "videoState": "",
      "bracketRegion": "",
      "contestClock": "0:00"
    }},
    {"game": {
      "gameID": "42aebee3-b8ab-481e-b466-9357b7b38c07",
      "away": {
        "score": "38",
        "names": {
          "char6": "RUTGER",
          "short": "Rutgers",
          "seo": "rutgers",
          "full": "Rutgers, The State University of New Jersey, New Brunswick"
        },
        "winner": true,
        "seed": "",
        "description": "(1-0)",
        "rank": "",
        "conferences": [{
          "conferenceName": "Big Ten",
          "conferenceSeo": "big-ten"
        }]
      },
      "finalMessage": "FINAL",
      "bracketRound": "",
      "title": "Michigan St. Rutgers",
      "url": "/game/4616350",
      "network": "",
      "home": {
        "score": "27",
        "names": {
          "char6": "MICHST",
          "short": "Michigan St.",
          "seo": "michigan-st",
          "full": "Michigan State University"
        },
        "winner": false,
        "seed": "",
        "description": "(0-1)",
        "rank": "",
        "conferences": [{
          "conferenceName": "Big Ten",
          "conferenceSeo": "big-ten"
        }]
      },
      "liveVideoEnabled": false,
      "startTime": "12:00PM ET",
      "startTimeEpoch": "1603555200",
      "bracketId": "",
      "gameState": "final",
      "startDate": "10-24-2020",
      "currentPeriod": "FINAL",
      "videoState": "",
      "bracketRegion": "",
      "contestClock": "0:00"
    }},
    {"game": {
      "gameID": "7fbac986-c875-4cc5-bda1-94c0c17f4b3d",
      "away": {
        "score": "",
        "names": {
          "char6": "MIZZOU",
          "short": "Missouri",
          "seo": "missouri",
          "full": "University of Missouri, Columbia"
        },
        "winner": false,
        "seed": "",
        "description": "(1-2)",
        "rank": "",
        "conferences": [{
          "conferenceName": "SEC",
          "conferenceSeo": "sec"
        }]
      },
      "finalMessage": "",
      "bracketRound": "",
      "title": "Florida Missouri",
      "url": "/game/4060692",
      "network": "",
      "home": {
        "score": "",
        "names": {
          "char6": "FLA",
          "short": "Florida",
          "seo": "florida",
          "full": "University of Florida"
        },
        "winner": false,
        "seed": "",
        "description": "(2-1)",
        "rank": "10",
        "conferences": [
          {
            "conferenceName": "SEC",
            "conferenceSeo": "sec"
          },
          {
            "conferenceName": "Top 25",
            "conferenceSeo": "top-25"
          }
        ]
      },
      "liveVideoEnabled": false,
      "startTime": "01:00PM ET",
      "startTimeEpoch": "1603558800",
      "bracketId": "",
      "gameState": "postponed",
      "startDate": "10-24-2020",
      "currentPeriod": "",
      "videoState": "",
      "bracketRegion": "",
      "contestClock": ""
    }},
    {"game": {
      "gameID": "1f852c79-80ae-46ec-afa2-508b913877c8",
      "away": {
        "score": "",
        "names": {
          "char6": "UGA",
          "short": "Georgia",
          "seo": "georgia",
          "full": "University of Georgia"
        },
        "winner": false,
        "seed": "",
        "description": "(3-1)",
        "rank": "4",
        "conferences": [
          {
            "conferenceName": "SEC",
            "conferenceSeo": "sec"
          },
          {
            "conferenceName": "Top 25",
            "conferenceSeo": "top-25"
          }
        ]
      },
      "finalMessage": "",
      "bracketRound": "",
      "title": "Kentucky Georgia",
      "url": "/game/4060703",
      "network": "",
      "home": {
        "score": "",
        "names": {
          "char6": "UK",
          "short": "Kentucky",
          "seo": "kentucky",
          "full": "University of Kentucky"
        },
        "winner": false,
        "seed": "",
        "description": "(2-2)",
        "rank": "",
        "conferences": [{
          "conferenceName": "SEC",
          "conferenceSeo": "sec"
        }]
      },
      "liveVideoEnabled": false,
      "startTime": "01:00PM ET",
      "startTimeEpoch": "1603558800",
      "bracketId": "",
      "gameState": "postponed",
      "startDate": "10-24-2020",
      "currentPeriod": "",
      "videoState": "",
      "bracketRegion": "",
      "contestClock": ""
    }},
    {"game": {
      "gameID": "874f3e73-f114-4c57-8c07-b307837cb7ff",
      "away": {
        "score": "35",
        "names": {
          "char6": "S MISS",
          "short": "Southern Miss.",
          "seo": "southern-miss",
          "full": "The University of Southern Mississippi"
        },
        "winner": false,
        "seed": "",
        "description": "(1-4)",
        "rank": "",
        "conferences": [{
          "conferenceName": "C-USA",
          "conferenceSeo": "c-usa"
        }]
      },
      "finalMessage": "FINAL",
      "bracketRound": "",
      "title": "Liberty Southern Miss.",
      "url": "/game/4060715",
      "network": "",
      "home": {
        "score": "56",
        "names": {
          "char6": "LIBRTY",
          "short": "Liberty",
          "seo": "liberty",
          "full": "Liberty University"
        },
        "winner": true,
        "seed": "",
        "description": "(6-0)",
        "rank": "",
        "conferences": [{
          "conferenceName": "FBS Independent",
          "conferenceSeo": "fbs-independent"
        }]
      },
      "liveVideoEnabled": false,
      "startTime": "01:00PM ET",
      "startTimeEpoch": "1603558800",
      "bracketId": "",
      "gameState": "final",
      "startDate": "10-24-2020",
      "currentPeriod": "FINAL",
      "videoState": "",
      "bracketRegion": "",
      "contestClock": "0:00"
    }},
    {"game": {
      "gameID": "efb102b3-06e4-48f3-b746-5d69b805dd01",
      "away": {
        "score": "34",
        "names": {
          "char6": "TULANE",
          "short": "Tulane",
          "seo": "tulane",
          "full": "Tulane University"
        },
        "winner": false,
        "seed": "",
        "description": "(2-4)",
        "rank": "",
        "conferences": [{
          "conferenceName": "AAC",
          "conferenceSeo": "aac"
        }]
      },
      "finalMessage": "FINAL",
      "bracketRound": "",
      "title": "UCF Tulane",
      "url": "/game/4060691",
      "network": "",
      "home": {
        "score": "51",
        "names": {
          "char6": "UCF",
          "short": "UCF",
          "seo": "ucf",
          "full": "University of Central Florida"
        },
        "winner": true,
        "seed": "",
        "description": "(3-2)",
        "rank": "",
        "conferences": [{
          "conferenceName": "AAC",
          "conferenceSeo": "aac"
        }]
      },
      "liveVideoEnabled": false,
      "startTime": "02:00PM ET",
      "startTimeEpoch": "1603562400",
      "bracketId": "",
      "gameState": "final",
      "startDate": "10-24-2020",
      "currentPeriod": "FINAL",
      "videoState": "",
      "bracketRegion": "",
      "contestClock": "0:00"
    }},
    {"game": {
      "gameID": "92c86c6d-57c5-40cc-85e6-775232a05a14",
      "away": {
        "score": "9",
        "names": {
          "char6": "FAU",
          "short": "Fla. Atlantic",
          "seo": "fla-atlantic",
          "full": "Florida Atlantic University"
        },
        "winner": false,
        "seed": "",
        "description": "(1-1)",
        "rank": "",
        "conferences": [{
          "conferenceName": "C-USA",
          "conferenceSeo": "c-usa"
        }]
      },
      "finalMessage": "FINAL",
      "bracketRound": "",
      "title": "Marshall Fla. Atlantic",
      "url": "/game/4060713",
      "network": "",
      "home": {
        "score": "20",
        "names": {
          "char6": "MARSH",
          "short": "Marshall",
          "seo": "marshall",
          "full": "Marshall University"
        },
        "winner": true,
        "seed": "",
        "description": "(5-0)",
        "rank": "22",
        "conferences": [
          {
            "conferenceName": "C-USA",
            "conferenceSeo": "c-usa"
          },
          {
            "conferenceName": "Top 25",
            "conferenceSeo": "top-25"
          }
        ]
      },
      "liveVideoEnabled": false,
      "startTime": "02:30PM ET",
      "startTimeEpoch": "1603564200",
      "bracketId": "",
      "gameState": "final",
      "startDate": "10-24-2020",
      "currentPeriod": "FINAL",
      "videoState": "",
      "bracketRegion": "",
      "contestClock": "0:00"
    }},
    {"game": {
      "gameID": "b92f9300-e7bf-42ac-8fa2-a70f9e327a86",
      "away": {
        "score": "40",
        "names": {
          "char6": "MIDTEN",
          "short": "Middle Tenn.",
          "seo": "middle-tenn",
          "full": "Middle Tennessee State University"
        },
        "winner": true,
        "seed": "",
        "description": "(2-5)",
        "rank": "",
        "conferences": [{
          "conferenceName": "C-USA",
          "conferenceSeo": "c-usa"
        }]
      },
      "finalMessage": "FINAL (2OT)",
      "bracketRound": "",
      "title": "Rice Middle Tenn.",
      "url": "/game/4060688",
      "network": "",
      "home": {
        "score": "34",
        "names": {
          "char6": "RICE",
          "short": "Rice",
          "seo": "rice",
          "full": "Rice University"
        },
        "winner": false,
        "seed": "",
        "description": "(0-1)",
        "rank": "",
        "conferences": [{
          "conferenceName": "C-USA",
          "conferenceSeo": "c-usa"
        }]
      },
      "liveVideoEnabled": false,
      "startTime": "03:30PM ET",
      "startTimeEpoch": "1603567800",
      "bracketId": "",
      "gameState": "final",
      "startDate": "10-24-2020",
      "currentPeriod": "FINAL (2OT)",
      "videoState": "",
      "bracketRegion": "",
      "contestClock": ""
    }},
    {"game": {
      "gameID": "14c2e76d-298b-49b2-8eb0-80e433826c9a",
      "away": {
        "score": "16",
        "names": {
          "char6": "VT",
          "short": "Virginia Tech",
          "seo": "virginia-tech",
          "full": "Virginia Polytechnic Institute and State University"
        },
        "winner": false,
        "seed": "",
        "description": "(3-2)",
        "rank": "19",
        "conferences": [
          {
            "conferenceName": "ACC",
            "conferenceSeo": "acc"
          },
          {
            "conferenceName": "Top 25",
            "conferenceSeo": "top-25"
          }
        ]
      },
      "finalMessage": "FINAL",
      "bracketRound": "",
      "title": "Wake Forest Virginia Tech",
      "url": "/game/4060697",
      "network": "",
      "home": {
        "score": "23",
        "names": {
          "char6": "WAKE",
          "short": "Wake Forest",
          "seo": "wake-forest",
          "full": "Wake Forest University"
        },
        "winner": true,
        "seed": "",
        "description": "(3-2)",
        "rank": "",
        "conferences": [{
          "conferenceName": "ACC",
          "conferenceSeo": "acc"
        }]
      },
      "liveVideoEnabled": false,
      "startTime": "03:30PM ET",
      "startTimeEpoch": "1603567800",
      "bracketId": "",
      "gameState": "final",
      "startDate": "10-24-2020",
      "currentPeriod": "FINAL",
      "videoState": "",
      "bracketRegion": "",
      "contestClock": "0:00"
    }},
    {"game": {
      "gameID": "6b790684-6fea-40e7-b82e-7df0445bd39b",
      "away": {
        "score": "45",
        "names": {
          "char6": "N DAME",
          "short": "Notre Dame",
          "seo": "notre-dame",
          "full": "University of Notre Dame"
        },
        "winner": true,
        "seed": "",
        "description": "(5-0)",
        "rank": "3",
        "conferences": [
          {
            "conferenceName": "ACC",
            "conferenceSeo": "acc"
          },
          {
            "conferenceName": "Top 25",
            "conferenceSeo": "top-25"
          }
        ]
      },
      "finalMessage": "FINAL",
      "bracketRound": "",
      "title": "Pittsburgh Notre Dame",
      "url": "/game/4060698",
      "network": "",
      "home": {
        "score": "3",
        "names": {
          "char6": "PITT",
          "short": "Pittsburgh",
          "seo": "pittsburgh",
          "full": "University of Pittsburgh"
        },
        "winner": false,
        "seed": "",
        "description": "(3-4)",
        "rank": "",
        "conferences": [{
          "conferenceName": "ACC",
          "conferenceSeo": "acc"
        }]
      },
      "liveVideoEnabled": false,
      "startTime": "03:30PM ET",
      "startTimeEpoch": "1603567800",
      "bracketId": "",
      "gameState": "final",
      "startDate": "10-24-2020",
      "currentPeriod": "FINAL",
      "videoState": "",
      "bracketRegion": "",
      "contestClock": "0:00"
    }},
    {"game": {
      "gameID": "9f26cc5c-215a-43b3-ae09-6a697aaefa84",
      "away": {
        "score": "16",
        "names": {
          "char6": "BAYLOR",
          "short": "Baylor",
          "seo": "baylor",
          "full": "Baylor University"
        },
        "winner": false,
        "seed": "",
        "description": "(1-2)",
        "rank": "",
        "conferences": [{
          "conferenceName": "Big 12",
          "conferenceSeo": "big-12"
        }]
      },
      "finalMessage": "FINAL",
      "bracketRound": "",
      "title": "Texas Baylor",
      "url": "/game/4060700",
      "network": "",
      "home": {
        "score": "27",
        "names": {
          "char6": "TEXAS",
          "short": "Texas",
          "seo": "texas",
          "full": "University of Texas at Austin"
        },
        "winner": true,
        "seed": "",
        "description": "(3-2)",
        "rank": "",
        "conferences": [{
          "conferenceName": "Big 12",
          "conferenceSeo": "big-12"
        }]
      },
      "liveVideoEnabled": false,
      "startTime": "03:30PM ET",
      "startTimeEpoch": "1603567800",
      "bracketId": "",
      "gameState": "final",
      "startDate": "10-24-2020",
      "currentPeriod": "FINAL",
      "videoState": "",
      "bracketRegion": "",
      "contestClock": "0:00"
    }},
    {"game": {
      "gameID": "f6363da3-8f3a-4b7b-9296-727e520b0e6b",
      "away": {
        "score": "21",
        "names": {
          "char6": "IOWAST",
          "short": "Iowa St.",
          "seo": "iowa-st",
          "full": "Iowa State University"
        },
        "winner": false,
        "seed": "",
        "description": "(3-2)",
        "rank": "17",
        "conferences": [
          {
            "conferenceName": "Big 12",
            "conferenceSeo": "big-12"
          },
          {
            "conferenceName": "Top 25",
            "conferenceSeo": "top-25"
          }
        ]
      },
      "finalMessage": "FINAL",
      "bracketRound": "",
      "title": "Oklahoma St. Iowa St.",
      "url": "/game/4060704",
      "network": "",
      "home": {
        "score": "24",
        "names": {
          "char6": "OKLAST",
          "short": "Oklahoma St.",
          "seo": "oklahoma-st",
          "full": "Oklahoma State University"
        },
        "winner": true,
        "seed": "",
        "description": "(4-0)",
        "rank": "6",
        "conferences": [
          {
            "conferenceName": "Big 12",
            "conferenceSeo": "big-12"
          },
          {
            "conferenceName": "Top 25",
            "conferenceSeo": "top-25"
          }
        ]
      },
      "liveVideoEnabled": false,
      "startTime": "03:30PM ET",
      "startTimeEpoch": "1603567800",
      "bracketId": "",
      "gameState": "final",
      "startDate": "10-24-2020",
      "currentPeriod": "FINAL",
      "videoState": "",
      "bracketRegion": "",
      "contestClock": "0:00"
    }},
    {"game": {
      "gameID": "01a9c9a3-8e70-43ec-ab14-3feb5098f87b",
      "away": {
        "score": "37",
        "names": {
          "char6": "HOU",
          "short": "Houston",
          "seo": "houston",
          "full": "University of Houston"
        },
        "winner": true,
        "seed": "",
        "description": "(2-1)",
        "rank": "",
        "conferences": [{
          "conferenceName": "AAC",
          "conferenceSeo": "aac"
        }]
      },
      "finalMessage": "FINAL",
      "bracketRound": "",
      "title": "Navy Houston",
      "url": "/game/4060707",
      "network": "",
      "home": {
        "score": "21",
        "names": {
          "char6": "NAVY",
          "short": "Navy",
          "seo": "navy",
          "full": "U.S. Naval Academy"
        },
        "winner": false,
        "seed": "",
        "description": "(3-3)",
        "rank": "",
        "conferences": [{
          "conferenceName": "AAC",
          "conferenceSeo": "aac"
        }]
      },
      "liveVideoEnabled": false,
      "startTime": "03:30PM ET",
      "startTimeEpoch": "1603567800",
      "bracketId": "",
      "gameState": "final",
      "startDate": "10-24-2020",
      "currentPeriod": "FINAL",
      "videoState": "",
      "bracketRegion": "",
      "contestClock": "0:00"
    }},
    {"game": {
      "gameID": "89fa5d65-b371-4129-84d4-fd00c4158c14",
      "away": {
        "score": "48",
        "names": {
          "char6": "ALA",
          "short": "Alabama",
          "seo": "alabama",
          "full": "University of Alabama"
        },
        "winner": true,
        "seed": "",
        "description": "(5-0)",
        "rank": "2",
        "conferences": [
          {
            "conferenceName": "SEC",
            "conferenceSeo": "sec"
          },
          {
            "conferenceName": "Top 25",
            "conferenceSeo": "top-25"
          }
        ]
      },
      "finalMessage": "FINAL",
      "bracketRound": "",
      "title": "Tennessee Alabama",
      "url": "/game/4060712",
      "network": "",
      "home": {
        "score": "17",
        "names": {
          "char6": "TENN",
          "short": "Tennessee",
          "seo": "tennessee",
          "full": "University of Tennessee, Knoxville"
        },
        "winner": false,
        "seed": "",
        "description": "(2-3)",
        "rank": "",
        "conferences": [{
          "conferenceName": "SEC",
          "conferenceSeo": "sec"
        }]
      },
      "liveVideoEnabled": false,
      "startTime": "03:30PM ET",
      "startTimeEpoch": "1603567800",
      "bracketId": "",
      "gameState": "final",
      "startDate": "10-24-2020",
      "currentPeriod": "FINAL",
      "videoState": "",
      "bracketRegion": "",
      "contestClock": "0:00"
    }},
    {"game": {
      "gameID": "01e54e34-c29c-4944-b9cb-4d7ba24ec73d",
      "away": {
        "score": "20",
        "names": {
          "char6": "IOWA",
          "short": "Iowa",
          "seo": "iowa",
          "full": "University of Iowa"
        },
        "winner": false,
        "seed": "",
        "description": "(0-1)",
        "rank": "",
        "conferences": [{
          "conferenceName": "Big Ten",
          "conferenceSeo": "big-ten"
        }]
      },
      "finalMessage": "FINAL",
      "bracketRound": "",
      "title": "Purdue Iowa",
      "url": "/game/4616348",
      "network": "",
      "home": {
        "score": "24",
        "names": {
          "char6": "PURDUE",
          "short": "Purdue",
          "seo": "purdue",
          "full": "Purdue University"
        },
        "winner": true,
        "seed": "",
        "description": "(1-0)",
        "rank": "",
        "conferences": [{
          "conferenceName": "Big Ten",
          "conferenceSeo": "big-ten"
        }]
      },
      "liveVideoEnabled": false,
      "startTime": "03:30PM ET",
      "startTimeEpoch": "1603567800",
      "bracketId": "",
      "gameState": "final",
      "startDate": "10-24-2020",
      "currentPeriod": "FINAL",
      "videoState": "",
      "bracketRegion": "",
      "contestClock": "0:00"
    }},
    {"game": {
      "gameID": "04e2bd10-5acd-4838-a8b8-7f2720a55b52",
      "away": {
        "score": "35",
        "names": {
          "char6": "PENNST",
          "short": "Penn St.",
          "seo": "penn-st",
          "full": "Pennsylvania State University"
        },
        "winner": false,
        "seed": "",
        "description": "(0-1)",
        "rank": "8",
        "conferences": [
          {
            "conferenceName": "Big Ten",
            "conferenceSeo": "big-ten"
          },
          {
            "conferenceName": "Top 25",
            "conferenceSeo": "top-25"
          }
        ]
      },
      "finalMessage": "FINAL (OT)",
      "bracketRound": "",
      "title": "Indiana Penn St.",
      "url": "/game/4616352",
      "network": "",
      "home": {
        "score": "36",
        "names": {
          "char6": "IND",
          "short": "Indiana",
          "seo": "indiana",
          "full": "Indiana University, Bloomington"
        },
        "winner": true,
        "seed": "",
        "description": "(1-0)",
        "rank": "",
        "conferences": [{
          "conferenceName": "Big Ten",
          "conferenceSeo": "big-ten"
        }]
      },
      "liveVideoEnabled": false,
      "startTime": "03:30PM ET",
      "startTimeEpoch": "1603567800",
      "bracketId": "",
      "gameState": "final",
      "startDate": "10-24-2020",
      "currentPeriod": "FINAL (OT)",
      "videoState": "",
      "bracketRegion": "",
      "contestClock": ""
    }},
    {"game": {
      "gameID": "9b637092-d72f-4865-a9d7-cde549d1f451",
      "away": {
        "score": "36",
        "names": {
          "char6": "GA ST",
          "short": "Georgia St.",
          "seo": "georgia-st",
          "full": "Georgia State University"
        },
        "winner": true,
        "seed": "",
        "description": "(2-2)",
        "rank": "",
        "conferences": [{
          "conferenceName": "Sun Belt",
          "conferenceSeo": "sun-belt"
        }]
      },
      "finalMessage": "FINAL",
      "bracketRound": "",
      "title": "Troy Georgia St.",
      "url": "/game/4060693",
      "network": "",
      "home": {
        "score": "34",
        "names": {
          "char6": "TROY",
          "short": "Troy",
          "seo": "troy",
          "full": "Troy University"
        },
        "winner": false,
        "seed": "",
        "description": "(3-2)",
        "rank": "",
        "conferences": [{
          "conferenceName": "Sun Belt",
          "conferenceSeo": "sun-belt"
        }]
      },
      "liveVideoEnabled": false,
      "startTime": "04:00PM ET",
      "startTimeEpoch": "1603569600",
      "bracketId": "",
      "gameState": "final",
      "startDate": "10-24-2020",
      "currentPeriod": "FINAL",
      "videoState": "",
      "bracketRegion": "",
      "contestClock": "0:00"
    }},
    {"game": {
      "gameID": "37e09534-3cbf-426a-a106-5b1c03271a6f",
      "away": {
        "score": "27",
        "names": {
          "char6": "GATECH",
          "short": "Georgia Tech",
          "seo": "georgia-tech",
          "full": "Georgia Institute of Technology"
        },
        "winner": false,
        "seed": "",
        "description": "(2-4)",
        "rank": "",
        "conferences": [{
          "conferenceName": "ACC",
          "conferenceSeo": "acc"
        }]
      },
      "finalMessage": "FINAL",
      "bracketRound": "",
      "title": "Boston College Georgia Tech",
      "url": "/game/4060711",
      "network": "",
      "home": {
        "score": "48",
        "names": {
          "char6": "BC",
          "short": "Boston College",
          "seo": "boston-college",
          "full": "Boston College"
        },
        "winner": true,
        "seed": "",
        "description": "(4-2)",
        "rank": "",
        "conferences": [{
          "conferenceName": "ACC",
          "conferenceSeo": "acc"
        }]
      },
      "liveVideoEnabled": false,
      "startTime": "04:00PM ET",
      "startTimeEpoch": "1603569600",
      "bracketId": "",
      "gameState": "final",
      "startDate": "10-24-2020",
      "currentPeriod": "FINAL",
      "videoState": "",
      "bracketRegion": "",
      "contestClock": "0:00"
    }},
    {"game": {
      "gameID": "677982c9-482b-459a-8878-a57d152f6357",
      "away": {
        "score": "10",
        "names": {
          "char6": "CHAT",
          "short": "Chattanooga",
          "seo": "chattanooga",
          "full": "University of Tennessee at Chattanooga"
        },
        "winner": false,
        "seed": "",
        "description": "(0-1)",
        "rank": "",
        "conferences": [{
          "conferenceName": "SoCon",
          "conferenceSeo": "socon"
        }]
      },
      "finalMessage": "FINAL",
      "bracketRound": "",
      "title": "Western Ky. Chattanooga",
      "url": "/game/4060935",
      "network": "",
      "home": {
        "score": "13",
        "names": {
          "char6": "W KY",
          "short": "Western Ky.",
          "seo": "western-ky",
          "full": "Western Kentucky University"
        },
        "winner": true,
        "seed": "",
        "description": "(2-4)",
        "rank": "",
        "conferences": [{
          "conferenceName": "C-USA",
          "conferenceSeo": "c-usa"
        }]
      },
      "liveVideoEnabled": false,
      "startTime": "04:00PM ET",
      "startTimeEpoch": "1603569600",
      "bracketId": "",
      "gameState": "final",
      "startDate": "10-24-2020",
      "currentPeriod": "FINAL",
      "videoState": "",
      "bracketRegion": "",
      "contestClock": "0:00"
    }},
    {"game": {
      "gameID": "b333a8f5-02d5-4278-ae2e-4fb8ea29f2dc",
      "away": {
        "score": "10",
        "names": {
          "char6": "UK",
          "short": "Kentucky",
          "seo": "kentucky",
          "full": "University of Kentucky"
        },
        "winner": false,
        "seed": "",
        "description": "(2-3)",
        "rank": "",
        "conferences": [{
          "conferenceName": "SEC",
          "conferenceSeo": "sec"
        }]
      },
      "finalMessage": "FINAL",
      "bracketRound": "",
      "title": "Missouri Kentucky",
      "url": "/game/5206183",
      "network": "",
      "home": {
        "score": "20",
        "names": {
          "char6": "MIZZOU",
          "short": "Missouri",
          "seo": "missouri",
          "full": "University of Missouri, Columbia"
        },
        "winner": true,
        "seed": "",
        "description": "(2-2)",
        "rank": "",
        "conferences": [{
          "conferenceName": "SEC",
          "conferenceSeo": "sec"
        }]
      },
      "liveVideoEnabled": false,
      "startTime": "04:00PM ET",
      "startTimeEpoch": "1603569600",
      "bracketId": "",
      "gameState": "final",
      "startDate": "10-24-2020",
      "currentPeriod": "FINAL",
      "videoState": "",
      "bracketRegion": "",
      "contestClock": "0:00"
    }},
    {"game": {
      "gameID": "a953b463-0859-436c-b8ab-a4c305ddd35f",
      "away": {
        "score": "27",
        "names": {
          "char6": "WVU",
          "short": "West Virginia",
          "seo": "west-virginia",
          "full": "West Virginia University"
        },
        "winner": false,
        "seed": "",
        "description": "(3-2)",
        "rank": "",
        "conferences": [{
          "conferenceName": "Big 12",
          "conferenceSeo": "big-12"
        }]
      },
      "finalMessage": "FINAL",
      "bracketRound": "",
      "title": "Texas Tech West Virginia",
      "url": "/game/4060709",
      "network": "",
      "home": {
        "score": "34",
        "names": {
          "char6": "TXTECH",
          "short": "Texas Tech",
          "seo": "texas-tech",
          "full": "Texas Tech University"
        },
        "winner": true,
        "seed": "",
        "description": "(2-3)",
        "rank": "",
        "conferences": [{
          "conferenceName": "Big 12",
          "conferenceSeo": "big-12"
        }]
      },
      "liveVideoEnabled": false,
      "startTime": "05:30PM ET",
      "startTimeEpoch": "1603575000",
      "bracketId": "",
      "gameState": "final",
      "startDate": "10-24-2020",
      "currentPeriod": "FINAL",
      "videoState": "",
      "bracketRegion": "",
      "contestClock": "0:00"
    }},
    {"game": {
      "gameID": "e2f1d942-ee31-4a10-8f9a-d22e498e9e7f",
      "away": {
        "score": "14",
        "names": {
          "char6": "LA MON",
          "short": "ULM",
          "seo": "la-monroe",
          "full": "University of Louisiana Monroe"
        },
        "winner": false,
        "seed": "",
        "description": "(0-6)",
        "rank": "",
        "conferences": [{
          "conferenceName": "Sun Belt",
          "conferenceSeo": "sun-belt"
        }]
      },
      "finalMessage": "FINAL",
      "bracketRound": "",
      "title": "South Alabama ULM",
      "url": "/game/4060685",
      "network": "",
      "home": {
        "score": "38",
        "names": {
          "char6": "S ALA",
          "short": "South Alabama",
          "seo": "south-ala",
          "full": "University of South Alabama"
        },
        "winner": true,
        "seed": "",
        "description": "(3-2)",
        "rank": "",
        "conferences": [{
          "conferenceName": "Sun Belt",
          "conferenceSeo": "sun-belt"
        }]
      },
      "liveVideoEnabled": false,
      "startTime": "07:00PM ET",
      "startTimeEpoch": "1603580400",
      "bracketId": "",
      "gameState": "final",
      "startDate": "10-24-2020",
      "currentPeriod": "FINAL",
      "videoState": "",
      "bracketRegion": "",
      "contestClock": "0:00"
    }},
    {"game": {
      "gameID": "f07ddce4-7972-4b45-b83e-ce95143c1eb2",
      "away": {
        "score": "24",
        "names": {
          "char6": "S CAR",
          "short": "South Carolina",
          "seo": "south-carolina",
          "full": "University of South Carolina, Columbia"
        },
        "winner": false,
        "seed": "",
        "description": "(2-3)",
        "rank": "",
        "conferences": [{
          "conferenceName": "SEC",
          "conferenceSeo": "sec"
        }]
      },
      "finalMessage": "FINAL",
      "bracketRound": "",
      "title": "LSU South Carolina",
      "url": "/game/4060699",
      "network": "",
      "home": {
        "score": "52",
        "names": {
          "char6": "LSU",
          "short": "LSU",
          "seo": "lsu",
          "full": "Louisiana State University"
        },
        "winner": true,
        "seed": "",
        "description": "(2-2)",
        "rank": "",
        "conferences": [{
          "conferenceName": "SEC",
          "conferenceSeo": "sec"
        }]
      },
      "liveVideoEnabled": false,
      "startTime": "07:00PM ET",
      "startTimeEpoch": "1603580400",
      "bracketId": "",
      "gameState": "final",
      "startDate": "10-24-2020",
      "currentPeriod": "FINAL",
      "videoState": "",
      "bracketRegion": "",
      "contestClock": "0:00"
    }},
    {"game": {
      "gameID": "5a50e436-0978-4bfa-91d8-cfc78ef95dd9",
      "away": {
        "score": "13",
        "names": {
          "char6": "UT ST",
          "short": "Utah St.",
          "seo": "utah-st",
          "full": "Utah State University"
        },
        "winner": false,
        "seed": "",
        "description": "(0-1)",
        "rank": "",
        "conferences": [{
          "conferenceName": "Mountain West",
          "conferenceSeo": "mountain-west"
        }]
      },
      "finalMessage": "FINAL",
      "bracketRound": "",
      "title": "Boise St. Utah St.",
      "url": "/game/4877497",
      "network": "",
      "home": {
        "score": "42",
        "names": {
          "char6": "BOISE",
          "short": "Boise St.",
          "seo": "boise-st",
          "full": "Boise State University"
        },
        "winner": true,
        "seed": "",
        "description": "(1-0)",
        "rank": "",
        "conferences": [{
          "conferenceName": "Mountain West",
          "conferenceSeo": "mountain-west"
        }]
      },
      "liveVideoEnabled": false,
      "startTime": "07:00PM ET",
      "startTimeEpoch": "1603580400",
      "bracketId": "",
      "gameState": "final",
      "startDate": "10-24-2020",
      "currentPeriod": "FINAL",
      "videoState": "",
      "bracketRegion": "",
      "contestClock": "0:00"
    }},
    {"game": {
      "gameID": "61f8351d-8aa7-4e9e-a4db-e28f9082c34e",
      "away": {
        "score": "34",
        "names": {
          "char6": "WYO",
          "short": "Wyoming",
          "seo": "wyoming",
          "full": "University of Wyoming"
        },
        "winner": false,
        "seed": "",
        "description": "(0-1)",
        "rank": "",
        "conferences": [{
          "conferenceName": "Mountain West",
          "conferenceSeo": "mountain-west"
        }]
      },
      "finalMessage": "FINAL (OT)",
      "bracketRound": "",
      "title": "Nevada Wyoming",
      "url": "/game/4877500",
      "network": "",
      "home": {
        "score": "37",
        "names": {
          "char6": "NEVADA",
          "short": "Nevada",
          "seo": "nevada",
          "full": "University of Nevada, Reno"
        },
        "winner": true,
        "seed": "",
        "description": "(1-0)",
        "rank": "",
        "conferences": [{
          "conferenceName": "Mountain West",
          "conferenceSeo": "mountain-west"
        }]
      },
      "liveVideoEnabled": false,
      "startTime": "07:00PM ET",
      "startTimeEpoch": "1603580400",
      "bracketId": "",
      "gameState": "final",
      "startDate": "10-24-2020",
      "currentPeriod": "FINAL (OT)",
      "videoState": "",
      "bracketRegion": "",
      "contestClock": ""
    }},
    {"game": {
      "gameID": "7d71d9f2-c031-4326-8fc8-28d454ebc9af",
      "away": {
        "score": "49",
        "names": {
          "char6": "MICH",
          "short": "Michigan",
          "seo": "michigan",
          "full": "University of Michigan"
        },
        "winner": true,
        "seed": "",
        "description": "(1-0)",
        "rank": "18",
        "conferences": [
          {
            "conferenceName": "Big Ten",
            "conferenceSeo": "big-ten"
          },
          {
            "conferenceName": "Top 25",
            "conferenceSeo": "top-25"
          }
        ]
      },
      "finalMessage": "FINAL",
      "bracketRound": "",
      "title": "Minnesota Michigan",
      "url": "/game/4616351",
      "network": "",
      "home": {
        "score": "24",
        "names": {
          "char6": "MINN",
          "short": "Minnesota",
          "seo": "minnesota",
          "full": "University of Minnesota, Twin Cities"
        },
        "winner": false,
        "seed": "",
        "description": "(0-1)",
        "rank": "21",
        "conferences": [
          {
            "conferenceName": "Big Ten",
            "conferenceSeo": "big-ten"
          },
          {
            "conferenceName": "Top 25",
            "conferenceSeo": "top-25"
          }
        ]
      },
      "liveVideoEnabled": false,
      "startTime": "07:30PM ET",
      "startTimeEpoch": "1603582200",
      "bracketId": "",
      "gameState": "final",
      "startDate": "10-24-2020",
      "currentPeriod": "FINAL",
      "videoState": "",
      "bracketRegion": "",
      "contestClock": "0:00"
    }},
    {"game": {
      "gameID": "ad4023a9-9227-4d93-befa-12590debccdc",
      "away": {
        "score": "3",
        "names": {
          "char6": "MD",
          "short": "Maryland",
          "seo": "maryland",
          "full": "University of Maryland, College Park"
        },
        "winner": false,
        "seed": "",
        "description": "(0-1)",
        "rank": "",
        "conferences": [{
          "conferenceName": "Big Ten",
          "conferenceSeo": "big-ten"
        }]
      },
      "finalMessage": "FINAL",
      "bracketRound": "",
      "title": "Northwestern Maryland",
      "url": "/game/4616353",
      "network": "",
      "home": {
        "score": "43",
        "names": {
          "char6": "NWSTRN",
          "short": "Northwestern",
          "seo": "northwestern",
          "full": "Northwestern University"
        },
        "winner": true,
        "seed": "",
        "description": "(1-0)",
        "rank": "",
        "conferences": [{
          "conferenceName": "Big Ten",
          "conferenceSeo": "big-ten"
        }]
      },
      "liveVideoEnabled": false,
      "startTime": "07:30PM ET",
      "startTimeEpoch": "1603582200",
      "bracketId": "",
      "gameState": "final",
      "startDate": "10-24-2020",
      "currentPeriod": "FINAL",
      "videoState": "",
      "bracketRegion": "",
      "contestClock": "0:00"
    }},
    {"game": {
      "gameID": "f9b69175-4d4e-481d-8a91-8b75ec300294",
      "away": {
        "score": "34",
        "names": {
          "char6": "HAWAII",
          "short": "Hawaii",
          "seo": "hawaii",
          "full": "University of Hawaii, Manoa"
        },
        "winner": true,
        "seed": "",
        "description": "(1-0)",
        "rank": "",
        "conferences": [{
          "conferenceName": "Mountain West",
          "conferenceSeo": "mountain-west"
        }]
      },
      "finalMessage": "FINAL",
      "bracketRound": "",
      "title": "Fresno St. Hawaii",
      "url": "/game/4877501",
      "network": "",
      "home": {
        "score": "19",
        "names": {
          "char6": "FRESNO",
          "short": "Fresno St.",
          "seo": "fresno-st",
          "full": "California State University, Fresno"
        },
        "winner": false,
        "seed": "",
        "description": "(0-1)",
        "rank": "",
        "conferences": [{
          "conferenceName": "Mountain West",
          "conferenceSeo": "mountain-west"
        }]
      },
      "liveVideoEnabled": false,
      "startTime": "07:30PM ET",
      "startTimeEpoch": "1603582200",
      "bracketId": "",
      "gameState": "final",
      "startDate": "10-24-2020",
      "currentPeriod": "FINAL",
      "videoState": "",
      "bracketRegion": "",
      "contestClock": "0:00"
    }},
    {"game": {
      "gameID": "67ade784-9b16-47e3-9ab2-81b6b967aa2b",
      "away": {
        "score": "26",
        "names": {
          "char6": "LATECH",
          "short": "Louisiana Tech",
          "seo": "louisiana-tech",
          "full": "Louisiana Tech University"
        },
        "winner": false,
        "seed": "",
        "description": "(3-3)",
        "rank": "",
        "conferences": [{
          "conferenceName": "C-USA",
          "conferenceSeo": "c-usa"
        }]
      },
      "finalMessage": "FINAL",
      "bracketRound": "",
      "title": "UTSA Louisiana Tech",
      "url": "/game/4060706",
      "network": "",
      "home": {
        "score": "27",
        "names": {
          "char6": "UTSA",
          "short": "UTSA",
          "seo": "utsa",
          "full": "University of Texas at San Antonio"
        },
        "winner": true,
        "seed": "",
        "description": "(4-3)",
        "rank": "",
        "conferences": [{
          "conferenceName": "C-USA",
          "conferenceSeo": "c-usa"
        }]
      },
      "liveVideoEnabled": false,
      "startTime": "08:00PM ET",
      "startTimeEpoch": "1603584000",
      "bracketId": "",
      "gameState": "final",
      "startDate": "10-24-2020",
      "currentPeriod": "FINAL",
      "videoState": "",
      "bracketRegion": "",
      "contestClock": "0:00"
    }},
    {"game": {
      "gameID": "afc96216-7e98-45cc-83b8-6641c59c08a8",
      "away": {
        "score": "14",
        "names": {
          "char6": "UVA",
          "short": "Virginia",
          "seo": "virginia",
          "full": "University of Virginia"
        },
        "winner": false,
        "seed": "",
        "description": "(1-4)",
        "rank": "",
        "conferences": [{
          "conferenceName": "ACC",
          "conferenceSeo": "acc"
        }]
      },
      "finalMessage": "FINAL",
      "bracketRound": "",
      "title": "Miami (FL) Virginia",
      "url": "/game/4060710",
      "network": "",
      "home": {
        "score": "19",
        "names": {
          "char6": "MIAMI",
          "short": "Miami (FL)",
          "seo": "miami-fl",
          "full": "University of Miami (Florida)"
        },
        "winner": true,
        "seed": "",
        "description": "(5-1)",
        "rank": "11",
        "conferences": [
          {
            "conferenceName": "ACC",
            "conferenceSeo": "acc"
          },
          {
            "conferenceName": "Top 25",
            "conferenceSeo": "top-25"
          }
        ]
      },
      "liveVideoEnabled": false,
      "startTime": "08:00PM ET",
      "startTimeEpoch": "1603584000",
      "bracketId": "",
      "gameState": "final",
      "startDate": "10-24-2020",
      "currentPeriod": "FINAL",
      "videoState": "",
      "bracketRegion": "",
      "contestClock": "0:00"
    }},
    {"game": {
      "gameID": "328abb46-0220-4092-ae95-629642ef1133",
      "away": {
        "score": "42",
        "names": {
          "char6": "CINCY",
          "short": "Cincinnati",
          "seo": "cincinnati",
          "full": "University of Cincinnati"
        },
        "winner": true,
        "seed": "",
        "description": "(4-0)",
        "rank": "9",
        "conferences": [
          {
            "conferenceName": "AAC",
            "conferenceSeo": "aac"
          },
          {
            "conferenceName": "Top 25",
            "conferenceSeo": "top-25"
          }
        ]
      },
      "finalMessage": "FINAL",
      "bracketRound": "",
      "title": "SMU Cincinnati",
      "url": "/game/4060695",
      "network": "",
      "home": {
        "score": "13",
        "names": {
          "char6": "SMU",
          "short": "SMU",
          "seo": "smu",
          "full": "Southern Methodist University"
        },
        "winner": false,
        "seed": "",
        "description": "(5-1)",
        "rank": "16",
        "conferences": [
          {
            "conferenceName": "AAC",
            "conferenceSeo": "aac"
          },
          {
            "conferenceName": "Top 25",
            "conferenceSeo": "top-25"
          }
        ]
      },
      "liveVideoEnabled": false,
      "startTime": "09:00PM ET",
      "startTimeEpoch": "1603587600",
      "bracketId": "",
      "gameState": "final",
      "startDate": "10-24-2020",
      "currentPeriod": "FINAL",
      "videoState": "",
      "bracketRegion": "",
      "contestClock": "0:00"
    }},
    {"game": {
      "gameID": "bb63e917-63b9-4c2e-aed8-67ef9ec16a91",
      "away": {
        "score": "14",
        "names": {
          "char6": "TX ST",
          "short": "Texas St.",
          "seo": "texas-st",
          "full": "Texas State University"
        },
        "winner": false,
        "seed": "",
        "description": "(1-6)",
        "rank": "",
        "conferences": [{
          "conferenceName": "Sun Belt",
          "conferenceSeo": "sun-belt"
        }]
      },
      "finalMessage": "FINAL",
      "bracketRound": "",
      "title": "BYU Texas St.",
      "url": "/game/4107459",
      "network": "",
      "home": {
        "score": "52",
        "names": {
          "char6": "BYU",
          "short": "BYU",
          "seo": "byu",
          "full": "Brigham Young University"
        },
        "winner": true,
        "seed": "",
        "description": "(6-0)",
        "rank": "12",
        "conferences": [
          {
            "conferenceName": "FBS Independent",
            "conferenceSeo": "fbs-independent"
          },
          {
            "conferenceName": "Top 25",
            "conferenceSeo": "top-25"
          }
        ]
      },
      "liveVideoEnabled": false,
      "startTime": "10:15PM ET",
      "startTimeEpoch": "1603592100",
      "bracketId": "",
      "gameState": "final",
      "startDate": "10-24-2020",
      "currentPeriod": "FINAL",
      "videoState": "",
      "bracketRegion": "",
      "contestClock": "0:00"
    }},
    {"game": {
      "gameID": "a9668105-3011-4035-8578-d3de99f7b189",
      "away": {
        "score": "6",
        "names": {
          "char6": "AIRFOR",
          "short": "Air Force",
          "seo": "air-force",
          "full": "U.S. Air Force Academy"
        },
        "winner": false,
        "seed": "",
        "description": "(1-1)",
        "rank": "",
        "conferences": [{
          "conferenceName": "Mountain West",
          "conferenceSeo": "mountain-west"
        }]
      },
      "finalMessage": "FINAL",
      "bracketRound": "",
      "title": "San Jose St. Air Force",
      "url": "/game/4877498",
      "network": "",
      "home": {
        "score": "17",
        "names": {
          "char6": "SJSU",
          "short": "San Jose St.",
          "seo": "san-jose-st",
          "full": "San Jose State University"
        },
        "winner": true,
        "seed": "",
        "description": "(1-0)",
        "rank": "",
        "conferences": [{
          "conferenceName": "Mountain West",
          "conferenceSeo": "mountain-west"
        }]
      },
      "liveVideoEnabled": false,
      "startTime": "10:30PM ET",
      "startTimeEpoch": "1603593000",
      "bracketId": "",
      "gameState": "final",
      "startDate": "10-24-2020",
      "currentPeriod": "FINAL",
      "videoState": "",
      "bracketRegion": "",
      "contestClock": "0:00"
    }},
    {"game": {
      "gameID": "f260550e-3b15-4188-8591-5f0236ca61b4",
      "away": {
        "score": "6",
        "names": {
          "char6": "UNLV",
          "short": "UNLV",
          "seo": "unlv",
          "full": "University of Nevada, Las Vegas"
        },
        "winner": false,
        "seed": "",
        "description": "(0-1)",
        "rank": "",
        "conferences": [{
          "conferenceName": "Mountain West",
          "conferenceSeo": "mountain-west"
        }]
      },
      "finalMessage": "FINAL",
      "bracketRound": "",
      "title": "San Diego St. UNLV",
      "url": "/game/4877499",
      "network": "",
      "home": {
        "score": "34",
        "names": {
          "char6": "SDSU",
          "short": "San Diego St.",
          "seo": "san-diego-st",
          "full": "San Diego State University"
        },
        "winner": true,
        "seed": "",
        "description": "(1-0)",
        "rank": "",
        "conferences": [{
          "conferenceName": "Mountain West",
          "conferenceSeo": "mountain-west"
        }]
      },
      "liveVideoEnabled": false,
      "startTime": "10:30PM ET",
      "startTimeEpoch": "1603593000",
      "bracketId": "",
      "gameState": "final",
      "startDate": "10-24-2020",
      "currentPeriod": "FINAL",
      "videoState": "",
      "bracketRegion": "",
      "contestClock": "0:00"
    }}
  ]
}