{
  "games": [
    {
      "game": {
        "away": {
          "names": {
            "short": "Nevada",
            "standard": "Nevada"
          },
          "score": "48"
        },
        "gameState": "final",
        "home": {
          "names": {
            "short": "Arizona",
            "standard": "Arizona"
          },
          "score": "49"
        },
        "startDate": "12-15-2012",
        "startTime": "12:00PM ET",
        "url": "/fbs/2012/12/15/nevada-arizona",
        "location": "UniversityStadiumAlbuquerqueNewMexico"
      }
    },
    {
      "game": {
        "away": {
          "names": {
            "short": "Toledo",
            "standard": "Toledo"
          },
          "score": "15"
        },
        "gameState": "final",
        "home": {
          "names": {
            "short": "UtahState",
            "standard": "UtahState"
          },
          "score": "41"
        },
        "startDate": "12-15-2012",
        "startTime": "12:00PM ET",
        "url": "/fbs/2012/12/15/toledo-utah-st",
        "location": "BroncoStadiumBoiseIdaho"
      }
    },
    {
      "game": {
        "away": {
          "names": {
            "short": "BrighamYoung",
            "standard": "BrighamYoung"
          },
          "score": "23"
        },
        "gameState": "final",
        "home": {
          "names": {
            "short": "SanDiegoState",
            "standard": "SanDiegoState"
          },
          "score": "6"
        },
        "startDate": "12-20-2012",
        "startTime": "12:00PM ET",
        "url": "/fbs/2012/12/20/byu-san-diego-st",
        "location": "QualcommStadiumSanDiegoCalifornia"
      }
    },
    {
      "game": {
        "away": {
          "names": {
            "short": "BallState",
            "standard": "BallState"
          },
          "score": "17"
        },
        "gameState": "final",
        "home": {
          "names": {
            "short": "UCF",
            "standard": "UCF"
          },
          "score": "38"
        },
        "startDate": "12-21-2012",
        "startTime": "12:00PM ET",
        "url": "/fbs/2012/12/21/ball-st-ucf",
        "location": "TropicanaFieldStPetersburgFlorida"
      }
    },
    {
      "game": {
        "away": {
          "names": {
            "short": "EastCarolina",
            "standard": "EastCarolina"
          },
          "score": "34"
        },
        "gameState": "final",
        "home": {
          "names": {
            "short": "LouisianaLafayette",
            "standard": "LouisianaLafayette"
          },
          "score": "43"
        },
        "startDate": "12-22-2012",
        "startTime": "12:00PM ET",
        "url": "/fbs/2012/12/22/east-carolina-la-lafayette",
        "location": "MercedesBenzSuperdomeNewOrleansLouisiana"
      }
    },
    {
      "game": {
        "away": {
          "names": {
            "short": "Washington",
            "standard": "Washington"
          },
          "score": "26"
        },
        "gameState": "final",
        "home": {
          "names": {
            "short": "BoiseState",
            "standard": "BoiseState"
          },
          "score": "28"
        },
        "startDate": "12-22-2012",
        "startTime": "12:00PM ET",
        "url": "/fbs/2012/12/22/washington-boise-st",
        "location": "SamBoydStadiumLasVegasNevada"
      }
    },
    {
      "game": {
        "away": {
          "names": {
            "short": "FresnoState",
            "standard": "FresnoState"
          },
          "score": "10"
        },
        "gameState": "final",
        "home": {
          "names": {
            "short": "SouthernMethodist",
            "standard": "SouthernMethodist"
          },
          "score": "43"
        },
        "startDate": "12-24-2012",
        "startTime": "12:00PM ET",
        "url": "/fbs/2012/12/24/fresno-st-smu",
        "location": "AlohaStadiumHonoluluHawaii"
      }
    },
    {
      "game": {
        "away": {
          "names": {
            "short": "WesternKentucky",
            "standard": "WesternKentucky"
          },
          "score": "21"
        },
        "gameState": "final",
        "home": {
          "names": {
            "short": "CentralMichigan",
            "standard": "CentralMichigan"
          },
          "score": "24"
        },
        "startDate": "12-26-2012",
        "startTime": "12:00PM ET",
        "url": "/fbs/2012/12/26/western-ky-central-mich",
        "location": "FordFieldDetroitMichigan"
      }
    },
    {
      "game": {
        "away": {
          "names": {
            "short": "SanJoseState",
            "standard": "SanJoseState"
          },
          "score": "29"
        },
        "gameState": "final",
        "home": {
          "names": {
            "short": "BowlingGreen",
            "standard": "BowlingGreen"
          },
          "score": "20"
        },
        "startDate": "12-27-2012",
        "startTime": "12:00PM ET",
        "url": "/fbs/2012/12/27/san-jose-st-bowling-green",
        "location": "RFKMemorialStadiumWashingtonDistrictofColumbia"
      }
    },
    {
      "game": {
        "away": {
          "names": {
            "short": "Cincinnati",
            "standard": "Cincinnati"
          },
          "score": "48"
        },
        "gameState": "final",
        "home": {
          "names": {
            "short": "Duke",
            "standard": "Duke"
          },
          "score": "34"
        },
        "startDate": "12-27-2012",
        "startTime": "12:00PM ET",
        "url": "/fbs/2012/12/27/cincinnati-duke",
        "location": "BankofAmericaStadiumCharlotteNorthCarolina"
      }
    },
    {
      "game": {
        "away": {
          "names": {
            "short": "Baylor",
            "standard": "Baylor"
          },
          "score": "49"
        },
        "gameState": "final",
        "home": {
          "names": {
            "short": "UCLA",
            "standard": "UCLA"
          },
          "score": "26"
        },
        "startDate": "12-27-2012",
        "startTime": "12:00PM ET",
        "url": "/fbs/2012/12/27/baylor-ucla",
        "location": "QualcommStadiumSanDiegoCalifornia"
      }
    },
    {
      "game": {
        "away": {
          "names": {
            "short": "Ohio",
            "standard": "Ohio"
          },
          "score": "45"
        },
        "gameState": "final",
        "home": {
          "names": {
            "short": "LouisianaMonroe",
            "standard": "LouisianaMonroe"
          },
          "score": "14"
        },
        "startDate": "12-28-2012",
        "startTime": "12:00PM ET",
        "url": "/fbs/2012/12/28/ohio-la-monroe",
        "location": "IndependenceStadiumShreveportLouisiana"
      }
    },
    {
      "game": {
        "away": {
          "names": {
            "short": "Rutgers",
            "standard": "Rutgers"
          },
          "score": "10"
        },
        "gameState": "final",
        "home": {
          "names": {
            "short": "VirginiaTech",
            "standard": "VirginiaTech"
          },
          "score": "13"
        },
        "startDate": "12-28-2012",
        "startTime": "12:00PM ET",
        "url": "/fbs/2012/12/28/rutgers-virginia-tech",
        "location": "FloridaCitrusBowlOrlandoFlorida"
      }
    },
    {
      "game": {
        "away": {
          "names": {
            "short": "Minnesota",
            "standard": "Minnesota"
          },
          "score": "31"
        },
        "gameState": "final",
        "home": {
          "names": {
            "short": "TexasTech",
            "standard": "TexasTech"
          },
          "score": "34"
        },
        "startDate": "12-28-2012",
        "startTime": "12:00PM ET",
        "url": "/fbs/2012/12/28/minnesota-texas-tech",
        "location": "ReliantStadiumHoustonTexas"
      }
    },
    {
      "game": {
        "away": {
          "names": {
            "short": "Rice",
            "standard": "Rice"
          },
          "score": "33"
        },
        "gameState": "final",
        "home": {
          "names": {
            "short": "AirForce",
            "standard": "AirForce"
          },
          "score": "14"
        },
        "startDate": "12-29-2012",
        "startTime": "12:00PM ET",
        "url": "/fbs/2012/12/29/rice-air-force",
        "location": "AmonGCarterStadiumFortWorthTexas"
      }
    },
    {
      "game": {
        "away": {
          "names": {
            "short": "WestVirginia",
            "standard": "WestVirginia"
          },
          "score": "14"
        },
        "gameState": "final",
        "home": {
          "names": {
            "short": "Syracuse",
            "standard": "Syracuse"
          },
          "score": "38"
        },
        "startDate": "12-29-2012",
        "startTime": "12:00PM ET",
        "url": "/fbs/2012/12/29/west-virginia-syracuse",
        "location": "YankeeStadiumBronxNewYork"
      }
    },
    {
      "game": {
        "away": {
          "names": {
            "short": "Navy",
            "standard": "Navy"
          },
          "score": "28"
        },
        "gameState": "final",
        "home": {
          "names": {
            "short": "ArizonaState",
            "standard": "ArizonaState"
          },
          "score": "62"
        },
        "startDate": "12-29-2012",
        "startTime": "12:00PM ET",
        "url": "/fbs/2012/12/29/navy-arizona-st",
        "location": "ATTParkSanFranciscoCalifornia"
      }
    },
    {
      "game": {
        "away": {
          "names": {
            "short": "Texas",
            "standard": "Texas"
          },
          "score": "31"
        },
        "gameState": "final",
        "home": {
          "names": {
            "short": "OregonState",
            "standard": "OregonState"
          },
          "score": "27"
        },
        "startDate": "12-29-2012",
        "startTime": "12:00PM ET",
        "url": "/fbs/2012/12/29/texas-oregon-st",
        "location": "AlamodomeSanAntonioTexas"
      }
    },
    {
      "game": {
        "away": {
          "names": {
            "short": "TCU",
            "standard": "TCU"
          },
          "score": "16"
        },
        "gameState": "final",
        "home": {
          "names": {
            "short": "MichiganState",
            "standard": "MichiganState"
          },
          "score": "17"
        },
        "startDate": "12-29-2012",
        "startTime": "12:00PM ET",
        "url": "/fbs/2012/12/29/tcu-michigan-st",
        "location": "SunDevilStadiumTempeArizona"
      }
    },
    {
      "game": {
        "away": {
          "names": {
            "short": "NorthCarolinaState",
            "standard": "NorthCarolinaState"
          },
          "score": "24"
        },
        "gameState": "final",
        "home": {
          "names": {
            "short": "Vanderbilt",
            "standard": "Vanderbilt"
          },
          "score": "38"
        },
        "startDate": "12-31-2012",
        "startTime": "12:00PM ET",
        "url": "/fbs/2012/12/31/north-carolina-st-vanderbilt",
        "location": "LPFieldNashvilleTennessee"
      }
    },
    {
      "game": {
        "away": {
          "names": {
            "short": "USC",
            "standard": "USC"
          },
          "score": "7"
        },
        "gameState": "final",
        "home": {
          "names": {
            "short": "GeorgiaTech",
            "standard": "GeorgiaTech"
          },
          "score": "21"
        },
        "startDate": "12-31-2012",
        "startTime": "12:00PM ET",
        "url": "/fbs/2012/12/31/southern-california-georgia-tech",
        "location": "SunBowlElPasoTexas"
      }
    },
    {
      "game": {
        "away": {
          "names": {
            "short": "IowaState",
            "standard": "IowaState"
          },
          "score": "17"
        },
        "gameState": "final",
        "home": {
          "names": {
            "short": "Tulsa",
            "standard": "Tulsa"
          },
          "score": "31"
        },
        "startDate": "12-31-2012",
        "startTime": "12:00PM ET",
        "url": "/fbs/2012/12/31/iowa-st-tulsa",
        "location": "LibertyBowlMemorialMemphisTennessee"
      }
    },
    {
      "game": {
        "away": {
          "names": {
            "short": "LSU",
            "standard": "LSU"
          },
          "score": "24"
        },
        "gameState": "final",
        "home": {
          "names": {
            "short": "Clemson",
            "standard": "Clemson"
          },
          "score": "25"
        },
        "startDate": "12-31-2012",
        "startTime": "12:00PM ET",
        "url": "/fbs/2012/12/31/lsu-clemson",
        "location": "GeorgiaDomeAtlantaGeorgia"
      }
    },
    {
      "game": {
        "away": {
          "names": {
            "short": "Purdue",
            "standard": "Purdue"
          },
          "score": "14"
        },
        "gameState": "final",
        "home": {
          "names": {
            "short": "OklahomaState",
            "standard": "OklahomaState"
          },
          "score": "58"
        },
        "startDate": "01-01-2013",
        "startTime": "12:00PM ET",
        "url": "/fbs/2013/01/01/purdue-oklahoma-st",
        "location": "CottonBowlDallasTexas"
      }
    },
    {
      "game": {
        "away": {
          "names": {
            "short": "MississippiState",
            "standard": "MississippiState"
          },
          "score": "20"
        },
        "gameState": "final",
        "home": {
          "names": {
            "short": "Northwestern",
            "standard": "Northwestern"
          },
          "score": "34"
        },
        "startDate": "01-01-2013",
        "startTime": "12:00PM ET",
        "url": "/fbs/2013/01/01/mississippi-st-northwestern",
        "location": "EverBankFieldJacksonvilleFlorida"
      }
    },
    {
      "game": {
        "away": {
          "names": {
            "short": "Georgia",
            "standard": "Georgia"
          },
          "score": "45"
        },
        "gameState": "final",
        "home": {
          "names": {
            "short": "Nebraska",
            "standard": "Nebraska"
          },
          "score": "31"
        },
        "startDate": "01-01-2013",
        "startTime": "12:00PM ET",
        "url": "/fbs/2013/01/01/georgia-nebraska",
        "location": "FloridaCitrusBowlOrlandoFlorida"
      }
    },
    {
      "game": {
        "away": {
          "names": {
            "short": "SouthCarolina",
            "standard": "SouthCarolina"
          },
          "score": "33"
        },
        "gameState": "final",
        "home": {
          "names": {
            "short": "Michigan",
            "standard": "Michigan"
          },
          "score": "28"
        },
        "startDate": "01-01-2013",
        "startTime": "12:00PM ET",
        "url": "/fbs/2013/01/01/south-carolina-michigan",
        "location": "RaymondJamesStadiumTampaFlorida"
      }
    },
    {
      "game": {
        "away": {
          "names": {
            "short": "Wisconsin",
            "standard": "Wisconsin"
          },
          "score": "14"
        },
        "gameState": "final",
        "home": {
          "names": {
            "short": "Stanford",
            "standard": "Stanford"
          },
          "score": "20"
        },
        "startDate": "01-01-2013",
        "startTime": "12:00PM ET",
        "url": "/fbs/2013/01/01/wisconsin-stanford",
        "location": "RoseBowlPasadenaCalifornia"
      }
    },
    {
      "game": {
        "away": {
          "names": {
            "short": "NorthernIllinois",
            "standard": "NorthernIllinois"
          },
          "score": "10"
        },
        "gameState": "final",
        "home": {
          "names": {
            "short": "FloridaState",
            "standard": "FloridaState"
          },
          "score": "31"
        },
        "startDate": "01-01-2013",
        "startTime": "12:00PM ET",
        "url": "/fbs/2013/01/01/northern-ill-florida-st",
        "location": "SunLifeStadiumMiamiGardensFlorida"
      }
    },
    {
      "game": {
        "away": {
          "names": {
            "short": "Louisville",
            "standard": "Louisville"
          },
          "score": "33"
        },
        "gameState": "final",
        "home": {
          "names": {
            "short": "Florida",
            "standard": "Florida"
          },
          "score": "23"
        },
        "startDate": "01-02-2013",
        "startTime": "12:00PM ET",
        "url": "/fbs/2013/01/02/louisville-florida",
        "location": "MercedesBenzSuperdomeNewOrleansLouisiana"
      }
    },
    {
      "game": {
        "away": {
          "names": {
            "short": "Oregon",
            "standard": "Oregon"
          },
          "score": "35"
        },
        "gameState": "final",
        "home": {
          "names": {
            "short": "KansasState",
            "standard": "KansasState"
          },
          "score": "17"
        },
        "startDate": "01-03-2013",
        "startTime": "12:00PM ET",
        "url": "/fbs/2013/01/03/oregon-kansas-st",
        "location": "UniversityofPhoenixStadiumGlendaleArizona"
      }
    },
    {
      "game": {
        "away": {
          "names": {
            "short": "TexasAM",
            "standard": "TexasAM"
          },
          "score": "41"
        },
        "gameState": "final",
        "home": {
          "names": {
            "short": "Oklahoma",
            "standard": "Oklahoma"
          },
          "score": "13"
        },
        "startDate": "01-04-2013",
        "startTime": "12:00PM ET",
        "url": "/fbs/2013/01/04/texas-am-oklahoma",
        "location": "CowboysStadiumArlingtonTexas"
      }
    },
    {
      "game": {
        "away": {
          "names": {
            "short": "Pittsburgh",
            "standard": "Pittsburgh"
          },
          "score": "17"
        },
        "gameState": "final",
        "home": {
          "names": {
            "short": "OleMiss",
            "standard": "OleMiss"
          },
          "score": "38"
        },
        "startDate": "01-05-2013",
        "startTime": "12:00PM ET",
        "url": "/fbs/2013/01/05/pittsburgh-ole-miss",
        "location": "LegionFieldBirminghamAlabama"
      }
    },
    {
      "game": {
        "away": {
          "names": {
            "short": "KentState",
            "standard": "KentState"
          },
          "score": "13"
        },
        "gameState": "final",
        "home": {
          "names": {
            "short": "ArkansasState",
            "standard": "ArkansasState"
          },
          "score": "17"
        },
        "startDate": "01-06-2013",
        "startTime": "12:00PM ET",
        "url": "/fbs/2013/01/06/kent-st-arkansas-st",
        "location": "LaddPeeblesStadiumMobileAlabama"
      }
    },
    {
      "game": {
        "away": {
          "names": {
            "short": "Alabama",
            "standard": "Alabama"
          },
          "score": "42"
        },
        "gameState": "final",
        "home": {
          "names": {
            "short": "NotreDame",
            "standard": "NotreDame"
          },
          "score": "14"
        },
        "startDate": "01-07-2013",
        "startTime": "12:00PM ET",
        "url": "/fbs/2013/01/07/alabama-notre-dame",
        "location": "SunLifeStadiumMiamiGardensFlorida"
      }
    }
  ]
}