{
  "NorthernIllinois vs Buffalo": {
    "stadium": "FordField-Detroit-MI",
    "NorthernIllinois": {
      "points": 30,
      "1st downs": 23,
      "rushing 1st downs": 9,
      "passing 1st downs": 14,
      "penalty 1st downs": 0,
      "rushing yards": 109,
      "rushing attempts": 34,
      "passing yards": 300,
      "passing attempts": 33,
      "passing completions": 21,
      "passing interceptions": 1,
      "total yards": 409,
      "total plays": 67,
      "fumbles": 0,
      "fumbles lost": 0,
      "penalties": 7,
      "penalty yards": 91,
      "punts": 4,
      "punt yards": 153,
      "punt returns": 1,
      "punt return yards": 4,
      "kickoff returns": 1,
      "kickoff return yards": 16,
      "interception returns": 0,
      "interception return yards": 0,
      "3rd down conversions": 5,
      "3rd down attempts": 13,
      "4th down conversions": 3,
      "4th down attempts": 3
    },
    "Buffalo": {
      "points": 29,
      "1st downs": 26,
      "rushing 1st downs": 11,
      "passing 1st downs": 10,
      "penalty 1st downs": 5,
      "rushing yards": 142,
      "rushing attempts": 42,
      "passing yards": 252,
      "passing attempts": 35,
      "passing completions": 18,
      "passing interceptions": 0,
      "total yards": 394,
      "total plays": 77,
      "fumbles": 0,
      "fumbles lost": 0,
      "penalties": 3,
      "penalty yards": 20,
      "punts": 5,
      "punt yards": 209,
      "punt returns": 0,
      "punt return yards": 0,
      "kickoff returns": 3,
      "kickoff return yards": 62,
      "interception returns": 1,
      "interception return yards": -13,
      "3rd down conversions": 7,
      "3rd down attempts": 15,
      "4th down conversions": 1,
      "4th down attempts": 2
    }
  },
  "Utah vs Washington": {
    "stadium": "LevisStadium-SantaClara-CA",
    "Utah": {
      "points": 3,
      "1st downs": 12,
      "rushing 1st downs": 2,
      "passing 1st downs": 9,
      "penalty 1st downs": 1,
      "rushing yards": 51,
      "rushing attempts": 25,
      "passing yards": 137,
      "passing attempts": 27,
      "passing completions": 17,
      "passing interceptions": 3,
      "total yards": 188,
      "total plays": 52,
      "fumbles": 0,
      "fumbles lost": 0,
      "penalties": 2,
      "penalty yards": 10,
      "punts": 4,
      "punt yards": 169,
      "punt returns": 0,
      "punt return yards": 0,
      "kickoff returns": 2,
      "kickoff return yards": 32,
      "interception returns": 1,
      "interception return yards": 0,
      "3rd down conversions": 4,
      "3rd down attempts": 12,
      "4th down conversions": 0,
      "4th down attempts": 1
    },
    "Washington": {
      "points": 10,
      "1st downs": 19,
      "rushing 1st downs": 11,
      "passing 1st downs": 8,
      "penalty 1st downs": 0,
      "rushing yards": 119,
      "rushing attempts": 40,
      "passing yards": 187,
      "passing attempts": 33,
      "passing completions": 21,
      "passing interceptions": 1,
      "total yards": 306,
      "total plays": 73,
      "fumbles": 0,
      "fumbles lost": 0,
      "penalties": 4,
      "penalty yards": 45,
      "punts": 3,
      "punt yards": 109,
      "punt returns": 2,
      "punt return yards": 4,
      "kickoff returns": 1,
      "kickoff return yards": 11,
      "interception returns": 3,
      "interception return yards": 66,
      "3rd down conversions": 8,
      "3rd down attempts": 18,
      "4th down conversions": 2,
      "4th down attempts": 4
    }
  },
  "Marshall vs VirginiaTech": {
    "stadium": "LaneStadium-Blacksburg-VA",
    "Marshall": {
      "points": 20,
      "1st downs": 19,
      "rushing 1st downs": 7,
      "passing 1st downs": 11,
      "penalty 1st downs": 1,
      "rushing yards": 232,
      "rushing attempts": 35,
      "passing yards": 220,
      "passing attempts": 34,
      "passing completions": 19,
      "passing interceptions": 1,
      "total yards": 452,
      "total plays": 69,
      "fumbles": 3,
      "fumbles lost": 1,
      "penalties": 11,
      "penalty yards": 67,
      "punts": 5,
      "punt yards": 209,
      "punt returns": 1,
      "punt return yards": -1,
      "kickoff returns": 2,
      "kickoff return yards": 32,
      "interception returns": 0,
      "interception return yards": 0,
      "3rd down conversions": 4,
      "3rd down attempts": 13,
      "4th down conversions": 1,
      "4th down attempts": 3
    },
    "VirginiaTech": {
      "points": 41,
      "1st downs": 22,
      "rushing 1st downs": 9,
      "passing 1st downs": 9,
      "penalty 1st downs": 4,
      "rushing yards": 142,
      "rushing attempts": 38,
      "passing yards": 312,
      "passing attempts": 26,
      "passing completions": 18,
      "passing interceptions": 0,
      "total yards": 454,
      "total plays": 64,
      "fumbles": 0,
      "fumbles lost": 0,
      "penalties": 5,
      "penalty yards": 46,
      "punts": 5,
      "punt yards": 197,
      "punt returns": 2,
      "punt return yards": 25,
      "kickoff returns": 2,
      "kickoff return yards": 44,
      "interception returns": 1,
      "interception return yards": 0,
      "3rd down conversions": 4,
      "3rd down attempts": 13,
      "4th down conversions": 0,
      "4th down attempts": 0
    }
  },
  "EastCarolina vs NorthCarolinaState": {
    "stadium": "WayneDayFamilyFieldatCarterFinleyStadium-Raleigh-NC",
    "EastCarolina": {
      "points": 3,
      "1st downs": 4,
      "rushing 1st downs": 2,
      "passing 1st downs": 2,
      "penalty 1st downs": 0,
      "rushing yards": 31,
      "rushing attempts": 26,
      "passing yards": 73,
      "passing attempts": 25,
      "passing completions": 9,
      "passing interceptions": 2,
      "total yards": 104,
      "total plays": 51,
      "fumbles": 3,
      "fumbles lost": 1,
      "penalties": 2,
      "penalty yards": 20,
      "punts": 11,
      "punt yards": 442,
      "punt returns": 0,
      "punt return yards": 0,
      "kickoff returns": 4,
      "kickoff return yards": 62,
      "interception returns": 1,
      "interception return yards": 16,
      "3rd down conversions": 1,
      "3rd down attempts": 15,
      "4th down conversions": 0,
      "4th down attempts": 0
    },
    "NorthCarolinaState": {
      "points": 58,
      "1st downs": 33,
      "rushing 1st downs": 10,
      "passing 1st downs": 21,
      "penalty 1st downs": 2,
      "rushing yards": 234,
      "rushing attempts": 38,
      "passing yards": 421,
      "passing attempts": 45,
      "passing completions": 33,
      "passing interceptions": 1,
      "total yards": 655,
      "total plays": 83,
      "fumbles": 2,
      "fumbles lost": 2,
      "penalties": 3,
      "penalty yards": 30,
      "punts": 2,
      "punt yards": 77,
      "punt returns": 3,
      "punt return yards": 34,
      "kickoff returns": 0,
      "kickoff return yards": 0,
      "interception returns": 2,
      "interception return yards": 50,
      "3rd down conversions": 10,
      "3rd down attempts": 16,
      "4th down conversions": 1,
      "4th down attempts": 1
    }
  },
  "Texas vs Oklahoma": {
    "stadium": "ATTStadium-Arlington-TX",
    "Texas": {
      "points": 27,
      "1st downs": 23,
      "rushing 1st downs": 7,
      "passing 1st downs": 14,
      "penalty 1st downs": 2,
      "rushing yards": 88,
      "rushing attempts": 32,
      "passing yards": 349,
      "passing attempts": 37,
      "passing completions": 23,
      "passing interceptions": 1,
      "total yards": 437,
      "total plays": 69,
      "fumbles": 1,
      "fumbles lost": 0,
      "penalties": 13,
      "penalty yards": 128,
      "punts": 4,
      "punt yards": 149,
      "punt returns": 0,
      "punt return yards": 0,
      "kickoff returns": 1,
      "kickoff return yards": 22,
      "interception returns": 0,
      "interception return yards": 0,
      "3rd down conversions": 8,
      "3rd down attempts": 13,
      "4th down conversions": 1,
      "4th down attempts": 1
    },
    "Oklahoma": {
      "points": 39,
      "1st downs": 29,
      "rushing 1st downs": 8,
      "passing 1st downs": 16,
      "penalty 1st downs": 5,
      "rushing yards": 129,
      "rushing attempts": 40,
      "passing yards": 379,
      "passing attempts": 34,
      "passing completions": 25,
      "passing interceptions": 0,
      "total yards": 508,
      "total plays": 74,
      "fumbles": 1,
      "fumbles lost": 1,
      "penalties": 5,
      "penalty yards": 60,
      "punts": 2,
      "punt yards": 81,
      "punt returns": 1,
      "punt return yards": -1,
      "kickoff returns": 1,
      "kickoff return yards": 26,
      "interception returns": 1,
      "interception return yards": 5,
      "3rd down conversions": 8,
      "3rd down attempts": 14,
      "4th down conversions": 1,
      "4th down attempts": 1
    }
  },
  "LouisianaLafayette vs AppalachianState": {
    "stadium": "KiddBrewerStadium-Boone-NC",
    "LouisianaLafayette": {
      "points": 19,
      "1st downs": 16,
      "rushing 1st downs": 10,
      "passing 1st downs": 5,
      "penalty 1st downs": 1,
      "rushing yards": 216,
      "rushing attempts": 44,
      "passing yards": 85,
      "passing attempts": 22,
      "passing completions": 10,
      "passing interceptions": 2,
      "total yards": 301,
      "total plays": 66,
      "fumbles": 0,
      "fumbles lost": 0,
      "penalties": 5,
      "penalty yards": 35,
      "punts": 3,
      "punt yards": 142,
      "punt returns": 3,
      "punt return yards": 6,
      "kickoff returns": 6,
      "kickoff return yards": 180,
      "interception returns": 0,
      "interception return yards": 0,
      "3rd down conversions": 6,
      "3rd down attempts": 15,
      "4th down conversions": 1,
      "4th down attempts": 2
    },
    "AppalachianState": {
      "points": 30,
      "1st downs": 13,
      "rushing 1st downs": 8,
      "passing 1st downs": 4,
      "penalty 1st downs": 1,
      "rushing yards": 225,
      "rushing attempts": 44,
      "passing yards": 75,
      "passing attempts": 13,
      "passing completions": 6,
      "passing interceptions": 0,
      "total yards": 300,
      "total plays": 57,
      "fumbles": 0,
      "fumbles lost": 0,
      "penalties": 4,
      "penalty yards": 35,
      "punts": 4,
      "punt yards": 185,
      "punt returns": 1,
      "punt return yards": 3,
      "kickoff returns": 3,
      "kickoff return yards": 113,
      "interception returns": 2,
      "interception return yards": 31,
      "3rd down conversions": 3,
      "3rd down attempts": 12,
      "4th down conversions": 1,
      "4th down attempts": 2
    }
  },
  "FCS vs IowaState": {
    "stadium": "JackTriceStadium-Ames-IA",
    "FCS": {
      "points": 24,
      "1st downs": 14,
      "rushing 1st downs": 5,
      "passing 1st downs": 9,
      "penalty 1st downs": 0,
      "rushing yards": 58,
      "rushing attempts": 30,
      "passing yards": 221,
      "passing attempts": 29,
      "passing completions": 20,
      "passing interceptions": 1,
      "total yards": 279,
      "total plays": 59,
      "fumbles": 2,
      "fumbles lost": 0,
      "penalties": 5,
      "penalty yards": 50,
      "punts": 5,
      "punt yards": 172,
      "punt returns": 1,
      "punt return yards": -1,
      "kickoff returns": 4,
      "kickoff return yards": 67,
      "interception returns": 1,
      "interception return yards": 9,
      "3rd down conversions": 6,
      "3rd down attempts": 14,
      "4th down conversions": 0,
      "4th down attempts": 0
    },
    "IowaState": {
      "points": 27,
      "1st downs": 17,
      "rushing 1st downs": 8,
      "passing 1st downs": 8,
      "penalty 1st downs": 1,
      "rushing yards": 114,
      "rushing attempts": 42,
      "passing yards": 159,
      "passing attempts": 25,
      "passing completions": 17,
      "passing interceptions": 1,
      "total yards": 273,
      "total plays": 67,
      "fumbles": 1,
      "fumbles lost": 1,
      "penalties": 2,
      "penalty yards": 15,
      "punts": 2,
      "punt yards": 76,
      "punt returns": 0,
      "punt return yards": 0,
      "kickoff returns": 5,
      "kickoff return yards": 92,
      "interception returns": 1,
      "interception return yards": 19,
      "3rd down conversions": 8,
      "3rd down attempts": 14,
      "4th down conversions": 0,
      "4th down attempts": 3
    }
  },
  "Akron vs SouthCarolina": {
    "stadium": "WilliamsBriceStadium-Columbia-SC",
    "Akron": {
      "points": 3,
      "1st downs": 18,
      "rushing 1st downs": 7,
      "passing 1st downs": 10,
      "penalty 1st downs": 1,
      "rushing yards": 82,
      "rushing attempts": 40,
      "passing yards": 178,
      "passing attempts": 39,
      "passing completions": 19,
      "passing interceptions": 0,
      "total yards": 260,
      "total plays": 79,
      "fumbles": 5,
      "fumbles lost": 2,
      "penalties": 3,
      "penalty yards": 24,
      "punts": 7,
      "punt yards": 276,
      "punt returns": 2,
      "punt return yards": 25,
      "kickoff returns": 1,
      "kickoff return yards": 13,
      "interception returns": 2,
      "interception return yards": 4,
      "3rd down conversions": 4,
      "3rd down attempts": 18,
      "4th down conversions": 0,
      "4th down attempts": 3
    },
    "SouthCarolina": {
      "points": 28,
      "1st downs": 16,
      "rushing 1st downs": 6,
      "passing 1st downs": 9,
      "penalty 1st downs": 1,
      "rushing yards": 185,
      "rushing attempts": 38,
      "passing yards": 199,
      "passing attempts": 27,
      "passing completions": 14,
      "passing interceptions": 2,
      "total yards": 384,
      "total plays": 65,
      "fumbles": 2,
      "fumbles lost": 2,
      "penalties": 6,
      "penalty yards": 41,
      "punts": 6,
      "punt yards": 228,
      "punt returns": 2,
      "punt return yards": 21,
      "kickoff returns": 1,
      "kickoff return yards": 28,
      "interception returns": 0,
      "interception return yards": 0,
      "3rd down conversions": 8,
      "3rd down attempts": 17,
      "4th down conversions": 0,
      "4th down attempts": 1
    }
  },
  "UAB vs MiddleTennessee": {
    "stadium": "JohnnyRedFloydStadium-Murfreesboro-TN",
    "UAB": {
      "points": 27,
      "1st downs": 21,
      "rushing 1st downs": 15,
      "passing 1st downs": 4,
      "penalty 1st downs": 2,
      "rushing yards": 225,
      "rushing attempts": 54,
      "passing yards": 140,
      "passing attempts": 15,
      "passing completions": 9,
      "passing interceptions": 1,
      "total yards": 365,
      "total plays": 69,
      "fumbles": 0,
      "fumbles lost": 0,
      "penalties": 4,
      "penalty yards": 25,
      "punts": 4,
      "punt yards": 184,
      "punt returns": 1,
      "punt return yards": 5,
      "kickoff returns": 2,
      "kickoff return yards": 26,
      "interception returns": 2,
      "interception return yards": 0,
      "3rd down conversions": 6,
      "3rd down attempts": 14,
      "4th down conversions": 0,
      "4th down attempts": 1
    },
    "MiddleTennessee": {
      "points": 25,
      "1st downs": 18,
      "rushing 1st downs": 4,
      "passing 1st downs": 13,
      "penalty 1st downs": 1,
      "rushing yards": 94,
      "rushing attempts": 24,
      "passing yards": 362,
      "passing attempts": 45,
      "passing completions": 29,
      "passing interceptions": 2,
      "total yards": 456,
      "total plays": 69,
      "fumbles": 0,
      "fumbles lost": 0,
      "penalties": 3,
      "penalty yards": 15,
      "punts": 2,
      "punt yards": 81,
      "punt returns": 1,
      "punt return yards": 8,
      "kickoff returns": 0,
      "kickoff return yards": 0,
      "interception returns": 1,
      "interception return yards": 1,
      "3rd down conversions": 3,
      "3rd down attempts": 15,
      "4th down conversions": 2,
      "4th down attempts": 4
    }
  },
  "FCS vs Liberty": {
    "stadium": "WilliamsStadium-Lynchburg-VA",
    "FCS": {
      "points": 17,
      "1st downs": 17,
      "rushing 1st downs": 5,
      "passing 1st downs": 11,
      "penalty 1st downs": 1,
      "rushing yards": 114,
      "rushing attempts": 22,
      "passing yards": 197,
      "passing attempts": 37,
      "passing completions": 21,
      "passing interceptions": 2,
      "total yards": 311,
      "total plays": 59,
      "fumbles": 2,
      "fumbles lost": 2,
      "penalties": 3,
      "penalty yards": 35,
      "punts": 5,
      "punt yards": 169,
      "punt returns": 1,
      "punt return yards": -1,
      "kickoff returns": 5,
      "kickoff return yards": 58,
      "interception returns": 0,
      "interception return yards": 0,
      "3rd down conversions": 6,
      "3rd down attempts": 13,
      "4th down conversions": 0,
      "4th down attempts": 0
    },
    "Liberty": {
      "points": 52,
      "1st downs": 29,
      "rushing 1st downs": 17,
      "passing 1st downs": 11,
      "penalty 1st downs": 1,
      "rushing yards": 308,
      "rushing attempts": 43,
      "passing yards": 165,
      "passing attempts": 32,
      "passing completions": 19,
      "passing interceptions": 0,
      "total yards": 473,
      "total plays": 75,
      "fumbles": 0,
      "fumbles lost": 0,
      "penalties": 1,
      "penalty yards": 15,
      "punts": 2,
      "punt yards": 77,
      "punt returns": 0,
      "punt return yards": 0,
      "kickoff returns": 3,
      "kickoff return yards": 66,
      "interception returns": 2,
      "interception return yards": 61,
      "3rd down conversions": 7,
      "3rd down attempts": 12,
      "4th down conversions": 1,
      "4th down attempts": 1
    }
  },
  "Stanford vs California": {
    "stadium": "CaliforniaMemorialStadium-Berkeley-CA",
    "Stanford": {
      "points": 23,
      "1st downs": 16,
      "rushing 1st downs": 5,
      "passing 1st downs": 10,
      "penalty 1st downs": 1,
      "rushing yards": 92,
      "rushing attempts": 35,
      "passing yards": 237,
      "passing attempts": 29,
      "passing completions": 18,
      "passing interceptions": 0,
      "total yards": 329,
      "total plays": 64,
      "fumbles": 2,
      "fumbles lost": 1,
      "penalties": 5,
      "penalty yards": 40,
      "punts": 6,
      "punt yards": 297,
      "punt returns": 2,
      "punt return yards": 23,
      "kickoff returns": 2,
      "kickoff return yards": 49,
      "interception returns": 2,
      "interception return yards": 43,
      "3rd down conversions": 6,
      "3rd down attempts": 14,
      "4th down conversions": 0,
      "4th down attempts": 0
    },
    "California": {
      "points": 13,
      "1st downs": 18,
      "rushing 1st downs": 8,
      "passing 1st downs": 9,
      "penalty 1st downs": 1,
      "rushing yards": 155,
      "rushing attempts": 35,
      "passing yards": 197,
      "passing attempts": 39,
      "passing completions": 22,
      "passing interceptions": 2,
      "total yards": 352,
      "total plays": 74,
      "fumbles": 1,
      "fumbles lost": 1,
      "penalties": 3,
      "penalty yards": 30,
      "punts": 5,
      "punt yards": 196,
      "punt returns": 2,
      "punt return yards": 10,
      "kickoff returns": 1,
      "kickoff return yards": 19,
      "interception returns": 0,
      "interception return yards": 0,
      "3rd down conversions": 7,
      "3rd down attempts": 18,
      "4th down conversions": 3,
      "4th down attempts": 3
    }
  },
  "Memphis vs UCF": {
    "stadium": "SpectrumStadium-Orlando-FL",
    "Memphis": {
      "points": 41,
      "1st downs": 23,
      "rushing 1st downs": 14,
      "passing 1st downs": 9,
      "penalty 1st downs": 0,
      "rushing yards": 401,
      "rushing attempts": 45,
      "passing yards": 182,
      "passing attempts": 30,
      "passing completions": 18,
      "passing interceptions": 1,
      "total yards": 583,
      "total plays": 75,
      "fumbles": 0,
      "fumbles lost": 0,
      "penalties": 10,
      "penalty yards": 79,
      "punts": 5,
      "punt yards": 232,
      "punt returns": 0,
      "punt return yards": 0,
      "kickoff returns": 7,
      "kickoff return yards": 152,
      "interception returns": 0,
      "interception return yards": 0,
      "3rd down conversions": 6,
      "3rd down attempts": 15,
      "4th down conversions": 0,
      "4th down attempts": 1
    },
    "UCF": {
      "points": 56,
      "1st downs": 34,
      "rushing 1st downs": 18,
      "passing 1st downs": 13,
      "penalty 1st downs": 3,
      "rushing yards": 350,
      "rushing attempts": 62,
      "passing yards": 348,
      "passing attempts": 28,
      "passing completions": 19,
      "passing interceptions": 0,
      "total yards": 698,
      "total plays": 90,
      "fumbles": 4,
      "fumbles lost": 3,
      "penalties": 5,
      "penalty yards": 44,
      "punts": 1,
      "punt yards": 45,
      "punt returns": 2,
      "punt return yards": 42,
      "kickoff returns": 3,
      "kickoff return yards": 63,
      "interception returns": 1,
      "interception return yards": 0,
      "3rd down conversions": 9,
      "3rd down attempts": 13,
      "4th down conversions": 1,
      "4th down attempts": 2
    }
  },
  "Alabama vs Georgia": {
    "stadium": "MercedesBenzStadium-Atlanta-GA",
    "Alabama": {
      "points": 35,
      "1st downs": 21,
      "rushing 1st downs": 9,
      "passing 1st downs": 10,
      "penalty 1st downs": 2,
      "rushing yards": 157,
      "rushing attempts": 29,
      "passing yards": 246,
      "passing attempts": 34,
      "passing completions": 17,
      "passing interceptions": 2,
      "total yards": 403,
      "total plays": 63,
      "fumbles": 2,
      "fumbles lost": 0,
      "penalties": 3,
      "penalty yards": 10,
      "punts": 5,
      "punt yards": 201,
      "punt returns": 1,
      "punt return yards": 36,
      "kickoff returns": 0,
      "kickoff return yards": 0,
      "interception returns": 0,
      "interception return yards": 0,
      "3rd down conversions": 5,
      "3rd down attempts": 11,
      "4th down conversions": 0,
      "4th down attempts": 0
    },
    "Georgia": {
      "points": 28,
      "1st downs": 23,
      "rushing 1st downs": 8,
      "passing 1st downs": 14,
      "penalty 1st downs": 1,
      "rushing yards": 153,
      "rushing attempts": 39,
      "passing yards": 301,
      "passing attempts": 40,
      "passing completions": 25,
      "passing interceptions": 0,
      "total yards": 454,
      "total plays": 79,
      "fumbles": 1,
      "fumbles lost": 0,
      "penalties": 6,
      "penalty yards": 50,
      "punts": 6,
      "punt yards": 288,
      "punt returns": 2,
      "punt return yards": 16,
      "kickoff returns": 4,
      "kickoff return yards": 67,
      "interception returns": 2,
      "interception return yards": 29,
      "3rd down conversions": 5,
      "3rd down attempts": 16,
      "4th down conversions": 2,
      "4th down attempts": 3
    }
  },
  "FresnoState vs BoiseState": {
    "stadium": "AlbertsonsStadium-Boise-ID",
    "FresnoState": {
      "points": 19,
      "1st downs": 14,
      "rushing 1st downs": 4,
      "passing 1st downs": 8,
      "penalty 1st downs": 2,
      "rushing yards": 118,
      "rushing attempts": 33,
      "passing yards": 170,
      "passing attempts": 32,
      "passing completions": 20,
      "passing interceptions": 0,
      "total yards": 288,
      "total plays": 65,
      "fumbles": 2,
      "fumbles lost": 2,
      "penalties": 6,
      "penalty yards": 50,
      "punts": 8,
      "punt yards": 321,
      "punt returns": 0,
      "punt return yards": 0,
      "kickoff returns": 3,
      "kickoff return yards": 58,
      "interception returns": 0,
      "interception return yards": 0,
      "3rd down conversions": 4,
      "3rd down attempts": 15,
      "4th down conversions": 0,
      "4th down attempts": 0
    },
    "BoiseState": {
      "points": 16,
      "1st downs": 22,
      "rushing 1st downs": 14,
      "passing 1st downs": 6,
      "penalty 1st downs": 2,
      "rushing yards": 225,
      "rushing attempts": 55,
      "passing yards": 125,
      "passing attempts": 31,
      "passing completions": 15,
      "passing interceptions": 0,
      "total yards": 350,
      "total plays": 86,
      "fumbles": 1,
      "fumbles lost": 1,
      "penalties": 6,
      "penalty yards": 50,
      "punts": 8,
      "punt yards": 313,
      "punt returns": 3,
      "punt return yards": 0,
      "kickoff returns": 3,
      "kickoff return yards": 78,
      "interception returns": 0,
      "interception return yards": 0,
      "3rd down conversions": 6,
      "3rd down attempts": 18,
      "4th down conversions": 0,
      "4th down attempts": 1
    }
  },
  "Northwestern vs OhioState": {
    "stadium": "LucasOilStadium-Indianapolis-IN",
    "Northwestern": {
      "points": 24,
      "1st downs": 21,
      "rushing 1st downs": 6,
      "passing 1st downs": 13,
      "penalty 1st downs": 2,
      "rushing yards": 151,
      "rushing attempts": 24,
      "passing yards": 267,
      "passing attempts": 44,
      "passing completions": 27,
      "passing interceptions": 2,
      "total yards": 418,
      "total plays": 68,
      "fumbles": 1,
      "fumbles lost": 1,
      "penalties": 3,
      "penalty yards": 15,
      "punts": 7,
      "punt yards": 288,
      "punt returns": 1,
      "punt return yards": 1,
      "kickoff returns": 0,
      "kickoff return yards": 0,
      "interception returns": 1,
      "interception return yards": 0,
      "3rd down conversions": 5,
      "3rd down attempts": 15,
      "4th down conversions": 0,
      "4th down attempts": 1
    },
    "OhioState": {
      "points": 45,
      "1st downs": 31,
      "rushing 1st downs": 6,
      "passing 1st downs": 25,
      "penalty 1st downs": 0,
      "rushing yards": 108,
      "rushing attempts": 46,
      "passing yards": 499,
      "passing attempts": 41,
      "passing completions": 34,
      "passing interceptions": 1,
      "total yards": 607,
      "total plays": 87,
      "fumbles": 1,
      "fumbles lost": 1,
      "penalties": 9,
      "penalty yards": 90,
      "punts": 4,
      "punt yards": 219,
      "punt returns": 2,
      "punt return yards": 9,
      "kickoff returns": 2,
      "kickoff return yards": 43,
      "interception returns": 2,
      "interception return yards": 1,
      "3rd down conversions": 10,
      "3rd down attempts": 18,
      "4th down conversions": 1,
      "4th down attempts": 1
    }
  },
  "Clemson vs Pittsburgh": {
    "stadium": "BankofAmericaStadium-Charlotte-NC",
    "Clemson": {
      "points": 42,
      "1st downs": 13,
      "rushing 1st downs": 9,
      "passing 1st downs": 4,
      "penalty 1st downs": 0,
      "rushing yards": 301,
      "rushing attempts": 35,
      "passing yards": 118,
      "passing attempts": 24,
      "passing completions": 12,
      "passing interceptions": 0,
      "total yards": 419,
      "total plays": 59,
      "fumbles": 0,
      "fumbles lost": 0,
      "penalties": 6,
      "penalty yards": 41,
      "punts": 7,
      "punt yards": 251,
      "punt returns": 5,
      "punt return yards": 0,
      "kickoff returns": 0,
      "kickoff return yards": 0,
      "interception returns": 1,
      "interception return yards": 31,
      "3rd down conversions": 4,
      "3rd down attempts": 12,
      "4th down conversions": 0,
      "4th down attempts": 1
    },
    "Pittsburgh": {
      "points": 10,
      "1st downs": 11,
      "rushing 1st downs": 10,
      "passing 1st downs": 1,
      "penalty 1st downs": 0,
      "rushing yards": 192,
      "rushing attempts": 48,
      "passing yards": 8,
      "passing attempts": 16,
      "passing completions": 4,
      "passing interceptions": 1,
      "total yards": 200,
      "total plays": 64,
      "fumbles": 2,
      "fumbles lost": 2,
      "penalties": 8,
      "penalty yards": 54,
      "punts": 9,
      "punt yards": 382,
      "punt returns": 1,
      "punt return yards": 3,
      "kickoff returns": 4,
      "kickoff return yards": 69,
      "interception returns": 0,
      "interception return yards": 0,
      "3rd down conversions": 3,
      "3rd down attempts": 17,
      "4th down conversions": 1,
      "4th down attempts": 2
    }
  }
}