{
  "AppalachianState vs GeorgiaSouthern": {
    "stadium": "PaulsonStadium-Statesboro-GA",
    "AppalachianState": {
      "points": 14,
      "1st downs": 20,
      "rushing 1st downs": 6,
      "passing 1st downs": 12,
      "penalty 1st downs": 2,
      "rushing yards": 74,
      "rushing attempts": 22,
      "passing yards": 256,
      "passing attempts": 42,
      "passing completions": 23,
      "passing interceptions": 2,
      "total yards": 330,
      "total plays": 64,
      "fumbles": 0,
      "fumbles lost": 0,
      "penalties": 7,
      "penalty yards": 55,
      "punts": 4,
      "punt yards": 175,
      "punt returns": 0,
      "punt return yards": 0,
      "kickoff returns": 2,
      "kickoff return yards": 27,
      "interception returns": 1,
      "interception return yards": 0,
      "3rd down conversions": 4,
      "3rd down attempts": 13,
      "4th down conversions": 1,
      "4th down attempts": 3
    },
    "GeorgiaSouthern": {
      "points": 34,
      "1st downs": 24,
      "rushing 1st downs": 18,
      "passing 1st downs": 5,
      "penalty 1st downs": 1,
      "rushing yards": 408,
      "rushing attempts": 60,
      "passing yards": 88,
      "passing attempts": 12,
      "passing completions": 8,
      "passing interceptions": 1,
      "total yards": 496,
      "total plays": 72,
      "fumbles": 0,
      "fumbles lost": 0,
      "penalties": 7,
      "penalty yards": 75,
      "punts": 2,
      "punt yards": 80,
      "punt returns": 1,
      "punt return yards": 16,
      "kickoff returns": 3,
      "kickoff return yards": 70,
      "interception returns": 2,
      "interception return yards": 0,
      "3rd down conversions": 6,
      "3rd down attempts": 14,
      "4th down conversions": 2,
      "4th down attempts": 2
    }
  },
  "TexasTech vs OklahomaState": {
    "stadium": "BoonePickensStadium-Stillwater-OK",
    "TexasTech": {
      "points": 35,
      "1st downs": 34,
      "rushing 1st downs": 8,
      "passing 1st downs": 21,
      "penalty 1st downs": 5,
      "rushing yards": 112,
      "rushing attempts": 31,
      "passing yards": 394,
      "passing attempts": 60,
      "passing completions": 37,
      "passing interceptions": 3,
      "total yards": 506,
      "total plays": 91,
      "fumbles": 2,
      "fumbles lost": 0,
      "penalties": 16,
      "penalty yards": 158,
      "punts": 5,
      "punt yards": 240,
      "punt returns": 3,
      "punt return yards": 0,
      "kickoff returns": 8,
      "kickoff return yards": 166,
      "interception returns": 2,
      "interception return yards": 0,
      "3rd down conversions": 8,
      "3rd down attempts": 16,
      "4th down conversions": 0,
      "4th down attempts": 2
    },
    "OklahomaState": {
      "points": 45,
      "1st downs": 25,
      "rushing 1st downs": 9,
      "passing 1st downs": 12,
      "penalty 1st downs": 4,
      "rushing yards": 158,
      "rushing attempts": 42,
      "passing yards": 370,
      "passing attempts": 31,
      "passing completions": 17,
      "passing interceptions": 2,
      "total yards": 528,
      "total plays": 73,
      "fumbles": 1,
      "fumbles lost": 0,
      "penalties": 10,
      "penalty yards": 127,
      "punts": 6,
      "punt yards": 274,
      "punt returns": 3,
      "punt return yards": 2,
      "kickoff returns": 3,
      "kickoff return yards": 63,
      "interception returns": 3,
      "interception return yards": 7,
      "3rd down conversions": 4,
      "3rd down attempts": 12,
      "4th down conversions": 1,
      "4th down attempts": 1
    }
  },
  "UCLA vs ArizonaState": {
    "stadium": "SunDevilStadium-Tempe-AZ",
    "UCLA": {
      "points": 62,
      "1st downs": 23,
      "rushing 1st downs": 10,
      "passing 1st downs": 10,
      "penalty 1st downs": 3,
      "rushing yards": 225,
      "rushing attempts": 35,
      "passing yards": 355,
      "passing attempts": 23,
      "passing completions": 18,
      "passing interceptions": 0,
      "total yards": 580,
      "total plays": 58,
      "fumbles": 0,
      "fumbles lost": 0,
      "penalties": 7,
      "penalty yards": 68,
      "punts": 3,
      "punt yards": 115,
      "punt returns": 0,
      "punt return yards": 0,
      "kickoff returns": 6,
      "kickoff return yards": 223,
      "interception returns": 2,
      "interception return yards": 95,
      "3rd down conversions": 6,
      "3rd down attempts": 12,
      "4th down conversions": 0,
      "4th down attempts": 0
    },
    "ArizonaState": {
      "points": 27,
      "1st downs": 40,
      "rushing 1st downs": 9,
      "passing 1st downs": 28,
      "penalty 1st downs": 3,
      "rushing yards": 138,
      "rushing attempts": 36,
      "passing yards": 488,
      "passing attempts": 69,
      "passing completions": 42,
      "passing interceptions": 2,
      "total yards": 626,
      "total plays": 105,
      "fumbles": 2,
      "fumbles lost": 2,
      "penalties": 7,
      "penalty yards": 69,
      "punts": 1,
      "punt yards": 46,
      "punt returns": 0,
      "punt return yards": 0,
      "kickoff returns": 3,
      "kickoff return yards": 53,
      "interception returns": 0,
      "interception return yards": 0,
      "3rd down conversions": 11,
      "3rd down attempts": 20,
      "4th down conversions": 2,
      "4th down attempts": 5
    }
  },
  "MiddleTennessee vs OldDominion": {
    "stadium": "ForemanFieldatSBBallardStadium-Norfolk-VA",
    "MiddleTennessee": {
      "points": 41,
      "1st downs": 31,
      "rushing 1st downs": 20,
      "passing 1st downs": 11,
      "penalty 1st downs": 0,
      "rushing yards": 280,
      "rushing attempts": 57,
      "passing yards": 259,
      "passing attempts": 30,
      "passing completions": 25,
      "passing interceptions": 0,
      "total yards": 539,
      "total plays": 87,
      "fumbles": 3,
      "fumbles lost": 2,
      "penalties": 9,
      "penalty yards": 85,
      "punts": 3,
      "punt yards": 112,
      "punt returns": 3,
      "punt return yards": 85,
      "kickoff returns": 4,
      "kickoff return yards": 87,
      "interception returns": 3,
      "interception return yards": -2,
      "3rd down conversions": 9,
      "3rd down attempts": 16,
      "4th down conversions": 1,
      "4th down attempts": 1
    },
    "OldDominion": {
      "points": 28,
      "1st downs": 24,
      "rushing 1st downs": 5,
      "passing 1st downs": 17,
      "penalty 1st downs": 2,
      "rushing yards": 41,
      "rushing attempts": 19,
      "passing yards": 362,
      "passing attempts": 44,
      "passing completions": 29,
      "passing interceptions": 3,
      "total yards": 403,
      "total plays": 63,
      "fumbles": 2,
      "fumbles lost": 1,
      "penalties": 2,
      "penalty yards": 25,
      "punts": 5,
      "punt yards": 223,
      "punt returns": 1,
      "punt return yards": 2,
      "kickoff returns": 7,
      "kickoff return yards": 113,
      "interception returns": 0,
      "interception return yards": 0,
      "3rd down conversions": 3,
      "3rd down attempts": 8,
      "4th down conversions": 0,
      "4th down attempts": 0
    }
  },
  "FresnoState vs NewMexico": {
    "stadium": "UniversityStadium-Albuquerque-NM",
    "FresnoState": {
      "points": 35,
      "1st downs": 33,
      "rushing 1st downs": 16,
      "passing 1st downs": 14,
      "penalty 1st downs": 3,
      "rushing yards": 272,
      "rushing attempts": 44,
      "passing yards": 321,
      "passing attempts": 43,
      "passing completions": 29,
      "passing interceptions": 1,
      "total yards": 593,
      "total plays": 87,
      "fumbles": 2,
      "fumbles lost": 1,
      "penalties": 4,
      "penalty yards": 27,
      "punts": 3,
      "punt yards": 121,
      "punt returns": 1,
      "punt return yards": 3,
      "kickoff returns": 2,
      "kickoff return yards": 35,
      "interception returns": 0,
      "interception return yards": 0,
      "3rd down conversions": 6,
      "3rd down attempts": 14,
      "4th down conversions": 1,
      "4th down attempts": 3
    },
    "NewMexico": {
      "points": 24,
      "1st downs": 18,
      "rushing 1st downs": 14,
      "passing 1st downs": 4,
      "penalty 1st downs": 0,
      "rushing yards": 280,
      "rushing attempts": 56,
      "passing yards": 97,
      "passing attempts": 8,
      "passing completions": 4,
      "passing interceptions": 0,
      "total yards": 377,
      "total plays": 64,
      "fumbles": 0,
      "fumbles lost": 0,
      "penalties": 5,
      "penalty yards": 59,
      "punts": 6,
      "punt yards": 261,
      "punt returns": 1,
      "punt return yards": 1,
      "kickoff returns": 4,
      "kickoff return yards": 65,
      "interception returns": 1,
      "interception return yards": 3,
      "3rd down conversions": 4,
      "3rd down attempts": 13,
      "4th down conversions": 1,
      "4th down attempts": 2
    }
  },
  "TCU vs SouthernMethodist": {
    "stadium": "GeraldJFordStadium-Dallas-TX",
    "TCU": {
      "points": 56,
      "1st downs": 35,
      "rushing 1st downs": 14,
      "passing 1st downs": 20,
      "penalty 1st downs": 1,
      "rushing yards": 265,
      "rushing attempts": 38,
      "passing yards": 349,
      "passing attempts": 43,
      "passing completions": 28,
      "passing interceptions": 0,
      "total yards": 614,
      "total plays": 81,
      "fumbles": 0,
      "fumbles lost": 0,
      "penalties": 5,
      "penalty yards": 48,
      "punts": 3,
      "punt yards": 80,
      "punt returns": 3,
      "punt return yards": 65,
      "kickoff returns": 0,
      "kickoff return yards": 0,
      "interception returns": 1,
      "interception return yards": -4,
      "3rd down conversions": 5,
      "3rd down attempts": 11,
      "4th down conversions": 0,
      "4th down attempts": 1
    },
    "SouthernMethodist": {
      "points": 0,
      "1st downs": 17,
      "rushing 1st downs": 8,
      "passing 1st downs": 8,
      "penalty 1st downs": 1,
      "rushing yards": 89,
      "rushing attempts": 45,
      "passing yards": 156,
      "passing attempts": 33,
      "passing completions": 16,
      "passing interceptions": 1,
      "total yards": 245,
      "total plays": 78,
      "fumbles": 2,
      "fumbles lost": 2,
      "penalties": 6,
      "penalty yards": 50,
      "punts": 8,
      "punt yards": 347,
      "punt returns": 0,
      "punt return yards": 0,
      "kickoff returns": 8,
      "kickoff return yards": 123,
      "interception returns": 0,
      "interception return yards": 0,
      "3rd down conversions": 4,
      "3rd down attempts": 18,
      "4th down conversions": 3,
      "4th down attempts": 5
    }
  },
  "Tennessee vs Georgia": {
    "stadium": "SanfordStadium-Athens-GA",
    "Tennessee": {
      "points": 32,
      "1st downs": 24,
      "rushing 1st downs": 10,
      "passing 1st downs": 12,
      "penalty 1st downs": 2,
      "rushing yards": 117,
      "rushing attempts": 34,
      "passing yards": 284,
      "passing attempts": 44,
      "passing completions": 27,
      "passing interceptions": 0,
      "total yards": 401,
      "total plays": 78,
      "fumbles": 2,
      "fumbles lost": 2,
      "penalties": 7,
      "penalty yards": 49,
      "punts": 8,
      "punt yards": 357,
      "punt returns": 1,
      "punt return yards": 4,
      "kickoff returns": 4,
      "kickoff return yards": 102,
      "interception returns": 2,
      "interception return yards": 0,
      "3rd down conversions": 6,
      "3rd down attempts": 17,
      "4th down conversions": 0,
      "4th down attempts": 0
    },
    "Georgia": {
      "points": 35,
      "1st downs": 28,
      "rushing 1st downs": 18,
      "passing 1st downs": 9,
      "penalty 1st downs": 1,
      "rushing yards": 289,
      "rushing attempts": 53,
      "passing yards": 147,
      "passing attempts": 25,
      "passing completions": 16,
      "passing interceptions": 2,
      "total yards": 436,
      "total plays": 78,
      "fumbles": 2,
      "fumbles lost": 0,
      "penalties": 7,
      "penalty yards": 57,
      "punts": 7,
      "punt yards": 294,
      "punt returns": 5,
      "punt return yards": 41,
      "kickoff returns": 5,
      "kickoff return yards": 86,
      "interception returns": 0,
      "interception return yards": 0,
      "3rd down conversions": 1,
      "3rd down attempts": 10,
      "4th down conversions": 2,
      "4th down attempts": 2
    }
  },
  "Vanderbilt vs Kentucky": {
    "stadium": "CommonwealthStadium-Lexington-KY",
    "Vanderbilt": {
      "points": 7,
      "1st downs": 8,
      "rushing 1st downs": 4,
      "passing 1st downs": 4,
      "penalty 1st downs": 0,
      "rushing yards": 54,
      "rushing attempts": 22,
      "passing yards": 85,
      "passing attempts": 25,
      "passing completions": 8,
      "passing interceptions": 3,
      "total yards": 139,
      "total plays": 47,
      "fumbles": 1,
      "fumbles lost": 0,
      "penalties": 2,
      "penalty yards": 10,
      "punts": 8,
      "punt yards": 358,
      "punt returns": 0,
      "punt return yards": 0,
      "kickoff returns": 3,
      "kickoff return yards": 34,
      "interception returns": 1,
      "interception return yards": 13,
      "3rd down conversions": 2,
      "3rd down attempts": 12,
      "4th down conversions": 0,
      "4th down attempts": 1
    },
    "Kentucky": {
      "points": 17,
      "1st downs": 24,
      "rushing 1st downs": 14,
      "passing 1st downs": 10,
      "penalty 1st downs": 0,
      "rushing yards": 183,
      "rushing attempts": 50,
      "passing yards": 201,
      "passing attempts": 30,
      "passing completions": 23,
      "passing interceptions": 1,
      "total yards": 384,
      "total plays": 80,
      "fumbles": 4,
      "fumbles lost": 2,
      "penalties": 5,
      "penalty yards": 55,
      "punts": 5,
      "punt yards": 234,
      "punt returns": 3,
      "punt return yards": 5,
      "kickoff returns": 2,
      "kickoff return yards": 56,
      "interception returns": 3,
      "interception return yards": 51,
      "3rd down conversions": 6,
      "3rd down attempts": 15,
      "4th down conversions": 0,
      "4th down attempts": 1
    }
  },
  "SouthFlorida vs Wisconsin": {
    "stadium": "CampRandallStadium-Madison-WI",
    "SouthFlorida": {
      "points": 10,
      "1st downs": 8,
      "rushing 1st downs": 3,
      "passing 1st downs": 5,
      "penalty 1st downs": 0,
      "rushing yards": 72,
      "rushing attempts": 19,
      "passing yards": 173,
      "passing attempts": 19,
      "passing completions": 8,
      "passing interceptions": 1,
      "total yards": 245,
      "total plays": 38,
      "fumbles": 2,
      "fumbles lost": 1,
      "penalties": 11,
      "penalty yards": 90,
      "punts": 5,
      "punt yards": 228,
      "punt returns": 1,
      "punt return yards": 23,
      "kickoff returns": 3,
      "kickoff return yards": 72,
      "interception returns": 0,
      "interception return yards": 0,
      "3rd down conversions": 2,
      "3rd down attempts": 9,
      "4th down conversions": 0,
      "4th down attempts": 0
    },
    "Wisconsin": {
      "points": 27,
      "1st downs": 29,
      "rushing 1st downs": 15,
      "passing 1st downs": 9,
      "penalty 1st downs": 5,
      "rushing yards": 294,
      "rushing attempts": 57,
      "passing yards": 160,
      "passing attempts": 18,
      "passing completions": 11,
      "passing interceptions": 0,
      "total yards": 454,
      "total plays": 75,
      "fumbles": 2,
      "fumbles lost": 1,
      "penalties": 4,
      "penalty yards": 35,
      "punts": 3,
      "punt yards": 114,
      "punt returns": 1,
      "punt return yards": 24,
      "kickoff returns": 0,
      "kickoff return yards": 0,
      "interception returns": 1,
      "interception return yards": 19,
      "3rd down conversions": 5,
      "3rd down attempts": 12,
      "4th down conversions": 0,
      "4th down attempts": 0
    }
  },
  "Iowa vs Purdue": {
    "stadium": "RossAdeStadium-WestLafayette-IN",
    "Iowa": {
      "points": 24,
      "1st downs": 24,
      "rushing 1st downs": 13,
      "passing 1st downs": 10,
      "penalty 1st downs": 1,
      "rushing yards": 175,
      "rushing attempts": 51,
      "passing yards": 245,
      "passing attempts": 37,
      "passing completions": 17,
      "passing interceptions": 1,
      "total yards": 420,
      "total plays": 88,
      "fumbles": 0,
      "fumbles lost": 0,
      "penalties": 3,
      "penalty yards": 14,
      "punts": 7,
      "punt yards": 278,
      "punt returns": 0,
      "punt return yards": 0,
      "kickoff returns": 2,
      "kickoff return yards": 83,
      "interception returns": 2,
      "interception return yards": 31,
      "3rd down conversions": 8,
      "3rd down attempts": 19,
      "4th down conversions": 1,
      "4th down attempts": 3
    },
    "Purdue": {
      "points": 10,
      "1st downs": 9,
      "rushing 1st downs": 7,
      "passing 1st downs": 2,
      "penalty 1st downs": 0,
      "rushing yards": 84,
      "rushing attempts": 30,
      "passing yards": 72,
      "passing attempts": 32,
      "passing completions": 13,
      "passing interceptions": 2,
      "total yards": 156,
      "total plays": 62,
      "fumbles": 0,
      "fumbles lost": 0,
      "penalties": 3,
      "penalty yards": 19,
      "punts": 9,
      "punt yards": 381,
      "punt returns": 2,
      "punt return yards": 34,
      "kickoff returns": 2,
      "kickoff return yards": 25,
      "interception returns": 1,
      "interception return yards": 39,
      "3rd down conversions": 6,
      "3rd down attempts": 17,
      "4th down conversions": 0,
      "4th down attempts": 0
    }
  },
  "Northwestern vs PennState": {
    "stadium": "BeaverStadium-UniversityPark-PA",
    "Northwestern": {
      "points": 29,
      "1st downs": 20,
      "rushing 1st downs": 6,
      "passing 1st downs": 14,
      "penalty 1st downs": 0,
      "rushing yards": 103,
      "rushing attempts": 38,
      "passing yards": 258,
      "passing attempts": 37,
      "passing completions": 21,
      "passing interceptions": 1,
      "total yards": 361,
      "total plays": 75,
      "fumbles": 0,
      "fumbles lost": 0,
      "penalties": 8,
      "penalty yards": 75,
      "punts": 6,
      "punt yards": 223,
      "punt returns": 1,
      "punt return yards": 42,
      "kickoff returns": 2,
      "kickoff return yards": 56,
      "interception returns": 1,
      "interception return yards": 49,
      "3rd down conversions": 7,
      "3rd down attempts": 17,
      "4th down conversions": 0,
      "4th down attempts": 2
    },
    "PennState": {
      "points": 6,
      "1st downs": 14,
      "rushing 1st downs": 3,
      "passing 1st downs": 9,
      "penalty 1st downs": 2,
      "rushing yards": 50,
      "rushing attempts": 25,
      "passing yards": 216,
      "passing attempts": 46,
      "passing completions": 22,
      "passing interceptions": 1,
      "total yards": 266,
      "total plays": 71,
      "fumbles": 1,
      "fumbles lost": 1,
      "penalties": 4,
      "penalty yards": 35,
      "punts": 7,
      "punt yards": 250,
      "punt returns": 2,
      "punt return yards": 43,
      "kickoff returns": 4,
      "kickoff return yards": 67,
      "interception returns": 1,
      "interception return yards": 2,
      "3rd down conversions": 3,
      "3rd down attempts": 17,
      "4th down conversions": 1,
      "4th down attempts": 4
    }
  },
  "UTEP vs KansasState": {
    "stadium": "BillSnyderFamilyFootballStadium-Manhattan-KS",
    "UTEP": {
      "points": 28,
      "1st downs": 13,
      "rushing 1st downs": 3,
      "passing 1st downs": 9,
      "penalty 1st downs": 1,
      "rushing yards": 59,
      "rushing attempts": 31,
      "passing yards": 201,
      "passing attempts": 28,
      "passing completions": 18,
      "passing interceptions": 0,
      "total yards": 260,
      "total plays": 59,
      "fumbles": 0,
      "fumbles lost": 0,
      "penalties": 5,
      "penalty yards": 40,
      "punts": 7,
      "punt yards": 307,
      "punt returns": 2,
      "punt return yards": -3,
      "kickoff returns": 6,
      "kickoff return yards": 85,
      "interception returns": 0,
      "interception return yards": 0,
      "3rd down conversions": 4,
      "3rd down attempts": 14,
      "4th down conversions": 1,
      "4th down attempts": 2
    },
    "KansasState": {
      "points": 58,
      "1st downs": 22,
      "rushing 1st downs": 12,
      "passing 1st downs": 9,
      "penalty 1st downs": 1,
      "rushing yards": 188,
      "rushing attempts": 37,
      "passing yards": 263,
      "passing attempts": 19,
      "passing completions": 13,
      "passing interceptions": 0,
      "total yards": 451,
      "total plays": 56,
      "fumbles": 2,
      "fumbles lost": 1,
      "penalties": 6,
      "penalty yards": 55,
      "punts": 2,
      "punt yards": 89,
      "punt returns": 5,
      "punt return yards": 143,
      "kickoff returns": 4,
      "kickoff return yards": 47,
      "interception returns": 0,
      "interception return yards": 0,
      "3rd down conversions": 2,
      "3rd down attempts": 8,
      "4th down conversions": 1,
      "4th down attempts": 2
    }
  },
  "Tulane vs Rutgers": {
    "stadium": "HighPointSolutionsStadium-Piscataway-NJ",
    "Tulane": {
      "points": 6,
      "1st downs": 13,
      "rushing 1st downs": 7,
      "passing 1st downs": 4,
      "penalty 1st downs": 2,
      "rushing yards": 152,
      "rushing attempts": 31,
      "passing yards": 152,
      "passing attempts": 29,
      "passing completions": 18,
      "passing interceptions": 0,
      "total yards": 304,
      "total plays": 60,
      "fumbles": 0,
      "fumbles lost": 0,
      "penalties": 7,
      "penalty yards": 62,
      "punts": 8,
      "punt yards": 314,
      "punt returns": 2,
      "punt return yards": 11,
      "kickoff returns": 4,
      "kickoff return yards": 71,
      "interception returns": 1,
      "interception return yards": 6,
      "3rd down conversions": 3,
      "3rd down attempts": 15,
      "4th down conversions": 2,
      "4th down attempts": 3
    },
    "Rutgers": {
      "points": 31,
      "1st downs": 22,
      "rushing 1st downs": 11,
      "passing 1st downs": 10,
      "penalty 1st downs": 1,
      "rushing yards": 171,
      "rushing attempts": 40,
      "passing yards": 291,
      "passing attempts": 21,
      "passing completions": 14,
      "passing interceptions": 1,
      "total yards": 462,
      "total plays": 61,
      "fumbles": 0,
      "fumbles lost": 0,
      "penalties": 4,
      "penalty yards": 30,
      "punts": 4,
      "punt yards": 172,
      "punt returns": 0,
      "punt return yards": 0,
      "kickoff returns": 0,
      "kickoff return yards": 0,
      "interception returns": 0,
      "interception return yards": 0,
      "3rd down conversions": 3,
      "3rd down attempts": 10,
      "4th down conversions": 2,
      "4th down attempts": 2
    }
  },
  "Wyoming vs MichiganState": {
    "stadium": "SpartanStadium-EastLansing-MI",
    "Wyoming": {
      "points": 14,
      "1st downs": 12,
      "rushing 1st downs": 5,
      "passing 1st downs": 7,
      "penalty 1st downs": 0,
      "rushing yards": 98,
      "rushing attempts": 27,
      "passing yards": 188,
      "passing attempts": 24,
      "passing completions": 16,
      "passing interceptions": 1,
      "total yards": 286,
      "total plays": 51,
      "fumbles": 2,
      "fumbles lost": 2,
      "penalties": 5,
      "penalty yards": 43,
      "punts": 4,
      "punt yards": 166,
      "punt returns": 1,
      "punt return yards": 1,
      "kickoff returns": 4,
      "kickoff return yards": 82,
      "interception returns": 0,
      "interception return yards": 0,
      "3rd down conversions": 5,
      "3rd down attempts": 12,
      "4th down conversions": 0,
      "4th down attempts": 1
    },
    "MichiganState": {
      "points": 56,
      "1st downs": 31,
      "rushing 1st downs": 21,
      "passing 1st downs": 9,
      "penalty 1st downs": 1,
      "rushing yards": 338,
      "rushing attempts": 52,
      "passing yards": 195,
      "passing attempts": 20,
      "passing completions": 16,
      "passing interceptions": 0,
      "total yards": 533,
      "total plays": 72,
      "fumbles": 0,
      "fumbles lost": 0,
      "penalties": 9,
      "penalty yards": 84,
      "punts": 1,
      "punt yards": 43,
      "punt returns": 1,
      "punt return yards": 0,
      "kickoff returns": 3,
      "kickoff return yards": 88,
      "interception returns": 1,
      "interception return yards": 19,
      "3rd down conversions": 7,
      "3rd down attempts": 12,
      "4th down conversions": 2,
      "4th down attempts": 4
    }
  },
  "WesternMichigan vs VirginiaTech": {
    "stadium": "LaneStadium-Blacksburg-VA",
    "WesternMichigan": {
      "points": 17,
      "1st downs": 12,
      "rushing 1st downs": 5,
      "passing 1st downs": 6,
      "penalty 1st downs": 1,
      "rushing yards": 19,
      "rushing attempts": 24,
      "passing yards": 212,
      "passing attempts": 33,
      "passing completions": 18,
      "passing interceptions": 1,
      "total yards": 231,
      "total plays": 57,
      "fumbles": 1,
      "fumbles lost": 1,
      "penalties": 7,
      "penalty yards": 85,
      "punts": 8,
      "punt yards": 357,
      "punt returns": 1,
      "punt return yards": 3,
      "kickoff returns": 3,
      "kickoff return yards": 71,
      "interception returns": 2,
      "interception return yards": 39,
      "3rd down conversions": 4,
      "3rd down attempts": 15,
      "4th down conversions": 0,
      "4th down attempts": 1
    },
    "VirginiaTech": {
      "points": 35,
      "1st downs": 27,
      "rushing 1st downs": 14,
      "passing 1st downs": 9,
      "penalty 1st downs": 4,
      "rushing yards": 308,
      "rushing attempts": 47,
      "passing yards": 178,
      "passing attempts": 32,
      "passing completions": 14,
      "passing interceptions": 2,
      "total yards": 486,
      "total plays": 79,
      "fumbles": 0,
      "fumbles lost": 0,
      "penalties": 9,
      "penalty yards": 69,
      "punts": 5,
      "punt yards": 192,
      "punt returns": 5,
      "punt return yards": 58,
      "kickoff returns": 4,
      "kickoff return yards": 70,
      "interception returns": 1,
      "interception return yards": 0,
      "3rd down conversions": 10,
      "3rd down attempts": 18,
      "4th down conversions": 0,
      "4th down attempts": 0
    }
  },
  "ColoradoState vs BostonCollege": {
    "stadium": "AlumniStadium-ChestnutHill-MA",
    "ColoradoState": {
      "points": 24,
      "1st downs": 25,
      "rushing 1st downs": 7,
      "passing 1st downs": 18,
      "penalty 1st downs": 0,
      "rushing yards": 162,
      "rushing attempts": 24,
      "passing yards": 268,
      "passing attempts": 41,
      "passing completions": 27,
      "passing interceptions": 2,
      "total yards": 430,
      "total plays": 65,
      "fumbles": 0,
      "fumbles lost": 0,
      "penalties": 7,
      "penalty yards": 69,
      "punts": 2,
      "punt yards": 79,
      "punt returns": 2,
      "punt return yards": 17,
      "kickoff returns": 4,
      "kickoff return yards": 86,
      "interception returns": 1,
      "interception return yards": 7,
      "3rd down conversions": 8,
      "3rd down attempts": 14,
      "4th down conversions": 1,
      "4th down attempts": 2
    },
    "BostonCollege": {
      "points": 21,
      "1st downs": 24,
      "rushing 1st downs": 12,
      "passing 1st downs": 9,
      "penalty 1st downs": 3,
      "rushing yards": 240,
      "rushing attempts": 48,
      "passing yards": 169,
      "passing attempts": 18,
      "passing completions": 12,
      "passing interceptions": 1,
      "total yards": 409,
      "total plays": 66,
      "fumbles": 3,
      "fumbles lost": 0,
      "penalties": 5,
      "penalty yards": 35,
      "punts": 4,
      "punt yards": 160,
      "punt returns": 0,
      "punt return yards": 0,
      "kickoff returns": 2,
      "kickoff return yards": 37,
      "interception returns": 2,
      "interception return yards": 2,
      "3rd down conversions": 6,
      "3rd down attempts": 13,
      "4th down conversions": 1,
      "4th down attempts": 1
    }
  },
  "Army vs FCS": {
    "stadium": "YaleBowl-NewHaven-CT",
    "Army": {
      "points": 43,
      "1st downs": 25,
      "rushing 1st downs": 17,
      "passing 1st downs": 8,
      "penalty 1st downs": 0,
      "rushing yards": 386,
      "rushing attempts": 53,
      "passing yards": 211,
      "passing attempts": 21,
      "passing completions": 12,
      "passing interceptions": 0,
      "total yards": 597,
      "total plays": 74,
      "fumbles": 0,
      "fumbles lost": 0,
      "penalties": 8,
      "penalty yards": 71,
      "punts": 4,
      "punt yards": 169,
      "punt returns": 1,
      "punt return yards": 4,
      "kickoff returns": 3,
      "kickoff return yards": 43,
      "interception returns": 1,
      "interception return yards": 45,
      "3rd down conversions": 6,
      "3rd down attempts": 14,
      "4th down conversions": 1,
      "4th down attempts": 3
    },
    "FCS": {
      "points": 49,
      "1st downs": 39,
      "rushing 1st downs": 22,
      "passing 1st downs": 15,
      "penalty 1st downs": 2,
      "rushing yards": 335,
      "rushing attempts": 56,
      "passing yards": 290,
      "passing attempts": 40,
      "passing completions": 23,
      "passing interceptions": 1,
      "total yards": 625,
      "total plays": 96,
      "fumbles": 1,
      "fumbles lost": 1,
      "penalties": 7,
      "penalty yards": 40,
      "punts": 3,
      "punt yards": 120,
      "punt returns": 2,
      "punt return yards": 5,
      "kickoff returns": 1,
      "kickoff return yards": 29,
      "interception returns": 0,
      "interception return yards": 0,
      "3rd down conversions": 7,
      "3rd down attempts": 15,
      "4th down conversions": 3,
      "4th down attempts": 3
    }
  },
  "Akron vs Pittsburgh": {
    "stadium": "HeinzField-Pittsburgh-PA",
    "Akron": {
      "points": 21,
      "1st downs": 23,
      "rushing 1st downs": 12,
      "passing 1st downs": 11,
      "penalty 1st downs": 0,
      "rushing yards": 169,
      "rushing attempts": 36,
      "passing yards": 213,
      "passing attempts": 35,
      "passing completions": 17,
      "passing interceptions": 1,
      "total yards": 382,
      "total plays": 71,
      "fumbles": 2,
      "fumbles lost": 1,
      "penalties": 11,
      "penalty yards": 78,
      "punts": 7,
      "punt yards": 359,
      "punt returns": 2,
      "punt return yards": 2,
      "kickoff returns": 0,
      "kickoff return yards": 0,
      "interception returns": 1,
      "interception return yards": 7,
      "3rd down conversions": 7,
      "3rd down attempts": 16,
      "4th down conversions": 0,
      "4th down attempts": 0
    },
    "Pittsburgh": {
      "points": 10,
      "1st downs": 22,
      "rushing 1st downs": 8,
      "passing 1st downs": 13,
      "penalty 1st downs": 1,
      "rushing yards": 129,
      "rushing attempts": 40,
      "passing yards": 220,
      "passing attempts": 34,
      "passing completions": 20,
      "passing interceptions": 1,
      "total yards": 349,
      "total plays": 74,
      "fumbles": 1,
      "fumbles lost": 0,
      "penalties": 7,
      "penalty yards": 55,
      "punts": 7,
      "punt yards": 293,
      "punt returns": 2,
      "punt return yards": -7,
      "kickoff returns": 4,
      "kickoff return yards": 113,
      "interception returns": 1,
      "interception return yards": 0,
      "3rd down conversions": 5,
      "3rd down attempts": 16,
      "4th down conversions": 2,
      "4th down attempts": 3
    }
  },
  "Maryland vs Indiana": {
    "stadium": "MemorialStadium-Bloomington-IN",
    "Maryland": {
      "points": 37,
      "1st downs": 24,
      "rushing 1st downs": 9,
      "passing 1st downs": 14,
      "penalty 1st downs": 1,
      "rushing yards": 123,
      "rushing attempts": 36,
      "passing yards": 361,
      "passing attempts": 33,
      "passing completions": 22,
      "passing interceptions": 0,
      "total yards": 484,
      "total plays": 69,
      "fumbles": 0,
      "fumbles lost": 0,
      "penalties": 8,
      "penalty yards": 83,
      "punts": 4,
      "punt yards": 158,
      "punt returns": 2,
      "punt return yards": 11,
      "kickoff returns": 0,
      "kickoff return yards": 0,
      "interception returns": 1,
      "interception return yards": 0,
      "3rd down conversions": 5,
      "3rd down attempts": 14,
      "4th down conversions": 2,
      "4th down attempts": 2
    },
    "Indiana": {
      "points": 15,
      "1st downs": 23,
      "rushing 1st downs": 12,
      "passing 1st downs": 6,
      "penalty 1st downs": 5,
      "rushing yards": 206,
      "rushing attempts": 47,
      "passing yards": 126,
      "passing attempts": 37,
      "passing completions": 14,
      "passing interceptions": 1,
      "total yards": 332,
      "total plays": 84,
      "fumbles": 0,
      "fumbles lost": 0,
      "penalties": 9,
      "penalty yards": 55,
      "punts": 4,
      "punt yards": 182,
      "punt returns": 1,
      "punt return yards": -1,
      "kickoff returns": 6,
      "kickoff return yards": 153,
      "interception returns": 0,
      "interception return yards": 0,
      "3rd down conversions": 9,
      "3rd down attempts": 19,
      "4th down conversions": 0,
      "4th down attempts": 1
    }
  },
  "FCS vs Ohio": {
    "stadium": "PedenStadium-Athens-OH",
    "FCS": {
      "points": 19,
      "1st downs": 23,
      "rushing 1st downs": 6,
      "passing 1st downs": 15,
      "penalty 1st downs": 2,
      "rushing yards": 143,
      "rushing attempts": 30,
      "passing yards": 289,
      "passing attempts": 47,
      "passing completions": 30,
      "passing interceptions": 0,
      "total yards": 432,
      "total plays": 77,
      "fumbles": 0,
      "fumbles lost": 0,
      "penalties": 13,
      "penalty yards": 124,
      "punts": 5,
      "punt yards": 150,
      "punt returns": 0,
      "punt return yards": 0,
      "kickoff returns": 7,
      "kickoff return yards": 136,
      "interception returns": 2,
      "interception return yards": 9,
      "3rd down conversions": 9,
      "3rd down attempts": 19,
      "4th down conversions": 1,
      "4th down attempts": 2
    },
    "Ohio": {
      "points": 34,
      "1st downs": 23,
      "rushing 1st downs": 14,
      "passing 1st downs": 6,
      "penalty 1st downs": 3,
      "rushing yards": 229,
      "rushing attempts": 41,
      "passing yards": 158,
      "passing attempts": 31,
      "passing completions": 17,
      "passing interceptions": 2,
      "total yards": 387,
      "total plays": 72,
      "fumbles": 2,
      "fumbles lost": 0,
      "penalties": 6,
      "penalty yards": 60,
      "punts": 3,
      "punt yards": 101,
      "punt returns": 1,
      "punt return yards": 4,
      "kickoff returns": 3,
      "kickoff return yards": 73,
      "interception returns": 0,
      "interception return yards": 0,
      "3rd down conversions": 7,
      "3rd down attempts": 14,
      "4th down conversions": 1,
      "4th down attempts": 1
    }
  },
  "BowlingGreen vs Massachusetts": {
    "stadium": "WarrenMcGuirkAlumniStadium-Amherst-MA",
    "BowlingGreen": {
      "points": 47,
      "1st downs": 31,
      "rushing 1st downs": 15,
      "passing 1st downs": 15,
      "penalty 1st downs": 1,
      "rushing yards": 225,
      "rushing attempts": 48,
      "passing yards": 443,
      "passing attempts": 60,
      "passing completions": 38,
      "passing interceptions": 3,
      "total yards": 668,
      "total plays": 108,
      "fumbles": 0,
      "fumbles lost": 0,
      "penalties": 13,
      "penalty yards": 112,
      "punts": 6,
      "punt yards": 238,
      "punt returns": 2,
      "punt return yards": 4,
      "kickoff returns": 7,
      "kickoff return yards": 130,
      "interception returns": 1,
      "interception return yards": 0,
      "3rd down conversions": 10,
      "3rd down attempts": 23,
      "4th down conversions": 1,
      "4th down attempts": 3
    },
    "Massachusetts": {
      "points": 42,
      "1st downs": 31,
      "rushing 1st downs": 4,
      "passing 1st downs": 24,
      "penalty 1st downs": 3,
      "rushing yards": 49,
      "rushing attempts": 31,
      "passing yards": 589,
      "passing attempts": 61,
      "passing completions": 36,
      "passing interceptions": 1,
      "total yards": 638,
      "total plays": 92,
      "fumbles": 4,
      "fumbles lost": 3,
      "penalties": 4,
      "penalty yards": 30,
      "punts": 6,
      "punt yards": 194,
      "punt returns": 1,
      "punt return yards": 0,
      "kickoff returns": 7,
      "kickoff return yards": 137,
      "interception returns": 3,
      "interception return yards": 54,
      "3rd down conversions": 6,
      "3rd down attempts": 17,
      "4th down conversions": 1,
      "4th down attempts": 3
    }
  },
  "KentState vs Virginia": {
    "stadium": "ScottStadium-Charlottesville-VA",
    "KentState": {
      "points": 13,
      "1st downs": 18,
      "rushing 1st downs": 2,
      "passing 1st downs": 13,
      "penalty 1st downs": 3,
      "rushing yards": 34,
      "rushing attempts": 33,
      "passing yards": 246,
      "passing attempts": 35,
      "passing completions": 17,
      "passing interceptions": 3,
      "total yards": 280,
      "total plays": 68,
      "fumbles": 2,
      "fumbles lost": 2,
      "penalties": 7,
      "penalty yards": 60,
      "punts": 6,
      "punt yards": 278,
      "punt returns": 1,
      "punt return yards": 0,
      "kickoff returns": 2,
      "kickoff return yards": 29,
      "interception returns": 2,
      "interception return yards": 14,
      "3rd down conversions": 4,
      "3rd down attempts": 14,
      "4th down conversions": 0,
      "4th down attempts": 0
    },
    "Virginia": {
      "points": 45,
      "1st downs": 30,
      "rushing 1st downs": 15,
      "passing 1st downs": 13,
      "penalty 1st downs": 2,
      "rushing yards": 254,
      "rushing attempts": 45,
      "passing yards": 266,
      "passing attempts": 32,
      "passing completions": 19,
      "passing interceptions": 2,
      "total yards": 520,
      "total plays": 77,
      "fumbles": 1,
      "fumbles lost": 1,
      "penalties": 9,
      "penalty yards": 79,
      "punts": 3,
      "punt yards": 123,
      "punt returns": 2,
      "punt return yards": 21,
      "kickoff returns": 4,
      "kickoff return yards": 92,
      "interception returns": 3,
      "interception return yards": 79,
      "3rd down conversions": 7,
      "3rd down attempts": 11,
      "4th down conversions": 0,
      "4th down attempts": 0
    }
  },
  "FloridaInternational vs UAB": {
    "stadium": "LegionField-Birmingham-AL",
    "FloridaInternational": {
      "points": 34,
      "1st downs": 9,
      "rushing 1st downs": 4,
      "passing 1st downs": 5,
      "penalty 1st downs": 0,
      "rushing yards": 93,
      "rushing attempts": 37,
      "passing yards": 204,
      "passing attempts": 24,
      "passing completions": 9,
      "passing interceptions": 0,
      "total yards": 297,
      "total plays": 61,
      "fumbles": 0,
      "fumbles lost": 0,
      "penalties": 10,
      "penalty yards": 65,
      "punts": 10,
      "punt yards": 381,
      "punt returns": 1,
      "punt return yards": 2,
      "kickoff returns": 3,
      "kickoff return yards": 54,
      "interception returns": 4,
      "interception return yards": 103,
      "3rd down conversions": 4,
      "3rd down attempts": 17,
      "4th down conversions": 0,
      "4th down attempts": 0
    },
    "UAB": {
      "points": 20,
      "1st downs": 22,
      "rushing 1st downs": 14,
      "passing 1st downs": 7,
      "penalty 1st downs": 1,
      "rushing yards": 184,
      "rushing attempts": 47,
      "passing yards": 196,
      "passing attempts": 36,
      "passing completions": 18,
      "passing interceptions": 4,
      "total yards": 380,
      "total plays": 83,
      "fumbles": 2,
      "fumbles lost": 2,
      "penalties": 5,
      "penalty yards": 40,
      "punts": 6,
      "punt yards": 278,
      "punt returns": 5,
      "punt return yards": 41,
      "kickoff returns": 6,
      "kickoff return yards": 123,
      "interception returns": 0,
      "interception return yards": 0,
      "3rd down conversions": 7,
      "3rd down attempts": 18,
      "4th down conversions": 1,
      "4th down attempts": 3
    }
  },
  "WesternKentucky vs Navy": {
    "stadium": "NavyMarineCorpsMemorialStadium-Annapolis-MD",
    "WesternKentucky": {
      "points": 36,
      "1st downs": 31,
      "rushing 1st downs": 12,
      "passing 1st downs": 19,
      "penalty 1st downs": 0,
      "rushing yards": 164,
      "rushing attempts": 34,
      "passing yards": 387,
      "passing attempts": 54,
      "passing completions": 38,
      "passing interceptions": 1,
      "total yards": 551,
      "total plays": 88,
      "fumbles": 0,
      "fumbles lost": 0,
      "penalties": 7,
      "penalty yards": 66,
      "punts": 5,
      "punt yards": 193,
      "punt returns": 3,
      "punt return yards": 24,
      "kickoff returns": 4,
      "kickoff return yards": 86,
      "interception returns": 2,
      "interception return yards": 44,
      "3rd down conversions": 7,
      "3rd down attempts": 15,
      "4th down conversions": 0,
      "4th down attempts": 0
    },
    "Navy": {
      "points": 27,
      "1st downs": 23,
      "rushing 1st downs": 20,
      "passing 1st downs": 3,
      "penalty 1st downs": 0,
      "rushing yards": 412,
      "rushing attempts": 52,
      "passing yards": 55,
      "passing attempts": 15,
      "passing completions": 3,
      "passing interceptions": 1,
      "total yards": 467,
      "total plays": 67,
      "fumbles": 2,
      "fumbles lost": 1,
      "penalties": 3,
      "penalty yards": 25,
      "punts": 5,
      "punt yards": 224,
      "punt returns": 1,
      "punt return yards": 0,
      "kickoff returns": 8,
      "kickoff return yards": 143,
      "interception returns": 1,
      "interception return yards": 37,
      "3rd down conversions": 2,
      "3rd down attempts": 11,
      "4th down conversions": 1,
      "4th down attempts": 3
    }
  },
  "Minnesota vs Michigan": {
    "stadium": "MichiganStadium-AnnArbor-MI",
    "Minnesota": {
      "points": 30,
      "1st downs": 21,
      "rushing 1st downs": 11,
      "passing 1st downs": 10,
      "penalty 1st downs": 0,
      "rushing yards": 206,
      "rushing attempts": 47,
      "passing yards": 167,
      "passing attempts": 23,
      "passing completions": 14,
      "passing interceptions": 0,
      "total yards": 373,
      "total plays": 70,
      "fumbles": 1,
      "fumbles lost": 0,
      "penalties": 7,
      "penalty yards": 65,
      "punts": 6,
      "punt yards": 246,
      "punt returns": 4,
      "punt return yards": 66,
      "kickoff returns": 1,
      "kickoff return yards": 28,
      "interception returns": 1,
      "interception return yards": 30,
      "3rd down conversions": 5,
      "3rd down attempts": 14,
      "4th down conversions": 1,
      "4th down attempts": 1
    },
    "Michigan": {
      "points": 14,
      "1st downs": 12,
      "rushing 1st downs": 6,
      "passing 1st downs": 4,
      "penalty 1st downs": 2,
      "rushing yards": 83,
      "rushing attempts": 28,
      "passing yards": 88,
      "passing attempts": 25,
      "passing completions": 10,
      "passing interceptions": 1,
      "total yards": 171,
      "total plays": 53,
      "fumbles": 3,
      "fumbles lost": 1,
      "penalties": 2,
      "penalty yards": 23,
      "punts": 8,
      "punt yards": 400,
      "punt returns": 1,
      "punt return yards": -3,
      "kickoff returns": 2,
      "kickoff return yards": 38,
      "interception returns": 0,
      "interception return yards": 0,
      "3rd down conversions": 4,
      "3rd down attempts": 13,
      "4th down conversions": 0,
      "4th down attempts": 0
    }
  },
  "Arkansas vs TexasAM": {
    "stadium": "ATTStadium-Arlington-TX",
    "Arkansas": {
      "points": 28,
      "1st downs": 22,
      "rushing 1st downs": 13,
      "passing 1st downs": 7,
      "penalty 1st downs": 2,
      "rushing yards": 285,
      "rushing attempts": 47,
      "passing yards": 199,
      "passing attempts": 27,
      "passing completions": 15,
      "passing interceptions": 0,
      "total yards": 484,
      "total plays": 74,
      "fumbles": 3,
      "fumbles lost": 1,
      "penalties": 8,
      "penalty yards": 76,
      "punts": 7,
      "punt yards": 304,
      "punt returns": 1,
      "punt return yards": 7,
      "kickoff returns": 3,
      "kickoff return yards": 67,
      "interception returns": 1,
      "interception return yards": 0,
      "3rd down conversions": 5,
      "3rd down attempts": 15,
      "4th down conversions": 1,
      "4th down attempts": 2
    },
    "TexasAM": {
      "points": 35,
      "1st downs": 21,
      "rushing 1st downs": 7,
      "passing 1st downs": 14,
      "penalty 1st downs": 0,
      "rushing yards": 137,
      "rushing attempts": 27,
      "passing yards": 386,
      "passing attempts": 41,
      "passing completions": 21,
      "passing interceptions": 1,
      "total yards": 523,
      "total plays": 68,
      "fumbles": 0,
      "fumbles lost": 0,
      "penalties": 9,
      "penalty yards": 70,
      "punts": 6,
      "punt yards": 245,
      "punt returns": 1,
      "punt return yards": -1,
      "kickoff returns": 4,
      "kickoff return yards": 104,
      "interception returns": 0,
      "interception return yards": 0,
      "3rd down conversions": 4,
      "3rd down attempts": 13,
      "4th down conversions": 0,
      "4th down attempts": 1
    }
  },
  "WakeForest vs Louisville": {
    "stadium": "PapaJohnsCardinalStadium-Louisville-KY",
    "WakeForest": {
      "points": 10,
      "1st downs": 7,
      "rushing 1st downs": 1,
      "passing 1st downs": 5,
      "penalty 1st downs": 1,
      "rushing yards": 0,
      "rushing attempts": 23,
      "passing yards": 122,
      "passing attempts": 34,
      "passing completions": 19,
      "passing interceptions": 3,
      "total yards": 100,
      "total plays": 57,
      "fumbles": 1,
      "fumbles lost": 0,
      "penalties": 4,
      "penalty yards": 45,
      "punts": 9,
      "punt yards": 379,
      "punt returns": 2,
      "punt return yards": 17,
      "kickoff returns": 1,
      "kickoff return yards": 18,
      "interception returns": 0,
      "interception return yards": 0,
      "3rd down conversions": 2,
      "3rd down attempts": 16,
      "4th down conversions": 0,
      "4th down attempts": 1
    },
    "Louisville": {
      "points": 20,
      "1st downs": 21,
      "rushing 1st downs": 11,
      "passing 1st downs": 9,
      "penalty 1st downs": 1,
      "rushing yards": 215,
      "rushing attempts": 49,
      "passing yards": 206,
      "passing attempts": 32,
      "passing completions": 16,
      "passing interceptions": 0,
      "total yards": 421,
      "total plays": 81,
      "fumbles": 3,
      "fumbles lost": 3,
      "penalties": 11,
      "penalty yards": 89,
      "punts": 5,
      "punt yards": 196,
      "punt returns": 3,
      "punt return yards": 10,
      "kickoff returns": 1,
      "kickoff return yards": 16,
      "interception returns": 3,
      "interception return yards": 30,
      "3rd down conversions": 8,
      "3rd down attempts": 18,
      "4th down conversions": 1,
      "4th down attempts": 2
    }
  },
  "FloridaState vs NorthCarolinaState": {
    "stadium": "CarterFinleyStadium-Raleigh-NC",
    "FloridaState": {
      "points": 56,
      "1st downs": 31,
      "rushing 1st downs": 9,
      "passing 1st downs": 19,
      "penalty 1st downs": 3,
      "rushing yards": 166,
      "rushing attempts": 33,
      "passing yards": 365,
      "passing attempts": 38,
      "passing completions": 26,
      "passing interceptions": 2,
      "total yards": 531,
      "total plays": 71,
      "fumbles": 2,
      "fumbles lost": 2,
      "penalties": 9,
      "penalty yards": 58,
      "punts": 3,
      "punt yards": 119,
      "punt returns": 2,
      "punt return yards": 18,
      "kickoff returns": 5,
      "kickoff return yards": 101,
      "interception returns": 0,
      "interception return yards": 0,
      "3rd down conversions": 8,
      "3rd down attempts": 11,
      "4th down conversions": 0,
      "4th down attempts": 0
    },
    "NorthCarolinaState": {
      "points": 41,
      "1st downs": 33,
      "rushing 1st downs": 16,
      "passing 1st downs": 16,
      "penalty 1st downs": 1,
      "rushing yards": 161,
      "rushing attempts": 37,
      "passing yards": 359,
      "passing attempts": 50,
      "passing completions": 32,
      "passing interceptions": 0,
      "total yards": 520,
      "total plays": 87,
      "fumbles": 3,
      "fumbles lost": 2,
      "penalties": 8,
      "penalty yards": 83,
      "punts": 5,
      "punt yards": 238,
      "punt returns": 1,
      "punt return yards": 6,
      "kickoff returns": 7,
      "kickoff return yards": 90,
      "interception returns": 2,
      "interception return yards": 19,
      "3rd down conversions": 7,
      "3rd down attempts": 16,
      "4th down conversions": 1,
      "4th down attempts": 2
    }
  },
  "MiamiOH vs Buffalo": {
    "stadium": "UniversityatBuffaloStadium-Amherst-NY",
    "MiamiOH": {
      "points": 27,
      "1st downs": 14,
      "rushing 1st downs": 4,
      "passing 1st downs": 9,
      "penalty 1st downs": 1,
      "rushing yards": 133,
      "rushing attempts": 22,
      "passing yards": 238,
      "passing attempts": 38,
      "passing completions": 12,
      "passing interceptions": 0,
      "total yards": 371,
      "total plays": 60,
      "fumbles": 0,
      "fumbles lost": 0,
      "penalties": 6,
      "penalty yards": 55,
      "punts": 8,
      "punt yards": 338,
      "punt returns": 1,
      "punt return yards": 0,
      "kickoff returns": 4,
      "kickoff return yards": 118,
      "interception returns": 1,
      "interception return yards": 0,
      "3rd down conversions": 4,
      "3rd down attempts": 15,
      "4th down conversions": 1,
      "4th down attempts": 2
    },
    "Buffalo": {
      "points": 35,
      "1st downs": 33,
      "rushing 1st downs": 16,
      "passing 1st downs": 15,
      "penalty 1st downs": 2,
      "rushing yards": 273,
      "rushing attempts": 49,
      "passing yards": 302,
      "passing attempts": 39,
      "passing completions": 29,
      "passing interceptions": 0,
      "total yards": 575,
      "total plays": 88,
      "fumbles": 0,
      "fumbles lost": 0,
      "penalties": 5,
      "penalty yards": 58,
      "punts": 6,
      "punt yards": 235,
      "punt returns": 1,
      "punt return yards": 0,
      "kickoff returns": 4,
      "kickoff return yards": 54,
      "interception returns": 0,
      "interception return yards": 0,
      "3rd down conversions": 10,
      "3rd down attempts": 17,
      "4th down conversions": 0,
      "4th down attempts": 0
    }
  },
  "Colorado vs California": {
    "stadium": "CaliforniaMemorialStadium-Berkeley-CA",
    "Colorado": {
      "points": 56,
      "1st downs": 43,
      "rushing 1st downs": 9,
      "passing 1st downs": 30,
      "penalty 1st downs": 4,
      "rushing yards": 180,
      "rushing attempts": 43,
      "passing yards": 449,
      "passing attempts": 67,
      "passing completions": 46,
      "passing interceptions": 1,
      "total yards": 629,
      "total plays": 110,
      "fumbles": 2,
      "fumbles lost": 0,
      "penalties": 9,
      "penalty yards": 85,
      "punts": 4,
      "punt yards": 150,
      "punt returns": 1,
      "punt return yards": 2,
      "kickoff returns": 6,
      "kickoff return yards": 133,
      "interception returns": 1,
      "interception return yards": 11,
      "3rd down conversions": 8,
      "3rd down attempts": 18,
      "4th down conversions": 3,
      "4th down attempts": 4
    },
    "California": {
      "points": 59,
      "1st downs": 25,
      "rushing 1st downs": 7,
      "passing 1st downs": 16,
      "penalty 1st downs": 2,
      "rushing yards": 127,
      "rushing attempts": 30,
      "passing yards": 449,
      "passing attempts": 41,
      "passing completions": 23,
      "passing interceptions": 1,
      "total yards": 576,
      "total plays": 71,
      "fumbles": 2,
      "fumbles lost": 1,
      "penalties": 12,
      "penalty yards": 107,
      "punts": 4,
      "punt yards": 168,
      "punt returns": 0,
      "punt return yards": 0,
      "kickoff returns": 5,
      "kickoff return yards": 132,
      "interception returns": 1,
      "interception return yards": 0,
      "3rd down conversions": 9,
      "3rd down attempts": 15,
      "4th down conversions": 0,
      "4th down attempts": 0
    }
  },
  "LouisianaTech vs Auburn": {
    "stadium": "JordanHareStadium-Auburn-AL",
    "LouisianaTech": {
      "points": 17,
      "1st downs": 15,
      "rushing 1st downs": 6,
      "passing 1st downs": 7,
      "penalty 1st downs": 2,
      "rushing yards": 105,
      "rushing attempts": 33,
      "passing yards": 216,
      "passing attempts": 35,
      "passing completions": 20,
      "passing interceptions": 1,
      "total yards": 321,
      "total plays": 68,
      "fumbles": 3,
      "fumbles lost": 1,
      "penalties": 5,
      "penalty yards": 40,
      "punts": 9,
      "punt yards": 380,
      "punt returns": 0,
      "punt return yards": 0,
      "kickoff returns": 4,
      "kickoff return yards": 118,
      "interception returns": 0,
      "interception return yards": 0,
      "3rd down conversions": 5,
      "3rd down attempts": 18,
      "4th down conversions": 1,
      "4th down attempts": 1
    },
    "Auburn": {
      "points": 45,
      "1st downs": 25,
      "rushing 1st downs": 15,
      "passing 1st downs": 10,
      "penalty 1st downs": 0,
      "rushing yards": 254,
      "rushing attempts": 48,
      "passing yards": 219,
      "passing attempts": 22,
      "passing completions": 14,
      "passing interceptions": 0,
      "total yards": 473,
      "total plays": 70,
      "fumbles": 0,
      "fumbles lost": 0,
      "penalties": 5,
      "penalty yards": 50,
      "punts": 5,
      "punt yards": 181,
      "punt returns": 4,
      "punt return yards": 129,
      "kickoff returns": 2,
      "kickoff return yards": 52,
      "interception returns": 1,
      "interception return yards": 36,
      "3rd down conversions": 6,
      "3rd down attempts": 14,
      "4th down conversions": 0,
      "4th down attempts": 1
    }
  },
  "Temple vs Connecticut": {
    "stadium": "RentschlerField-EastHartford-CT",
    "Temple": {
      "points": 36,
      "1st downs": 16,
      "rushing 1st downs": 3,
      "passing 1st downs": 13,
      "penalty 1st downs": 0,
      "rushing yards": 41,
      "rushing attempts": 24,
      "passing yards": 231,
      "passing attempts": 31,
      "passing completions": 20,
      "passing interceptions": 0,
      "total yards": 272,
      "total plays": 55,
      "fumbles": 2,
      "fumbles lost": 1,
      "penalties": 5,
      "penalty yards": 57,
      "punts": 5,
      "punt yards": 181,
      "punt returns": 3,
      "punt return yards": 4,
      "kickoff returns": 4,
      "kickoff return yards": 62,
      "interception returns": 2,
      "interception return yards": 123,
      "3rd down conversions": 4,
      "3rd down attempts": 12,
      "4th down conversions": 0,
      "4th down attempts": 0
    },
    "Connecticut": {
      "points": 10,
      "1st downs": 19,
      "rushing 1st downs": 11,
      "passing 1st downs": 6,
      "penalty 1st downs": 2,
      "rushing yards": 133,
      "rushing attempts": 43,
      "passing yards": 174,
      "passing attempts": 28,
      "passing completions": 14,
      "passing interceptions": 2,
      "total yards": 307,
      "total plays": 71,
      "fumbles": 2,
      "fumbles lost": 1,
      "penalties": 7,
      "penalty yards": 70,
      "punts": 6,
      "punt yards": 210,
      "punt returns": 1,
      "punt return yards": 9,
      "kickoff returns": 6,
      "kickoff return yards": 104,
      "interception returns": 0,
      "interception return yards": 0,
      "3rd down conversions": 3,
      "3rd down attempts": 13,
      "4th down conversions": 1,
      "4th down attempts": 1
    }
  },
  "Texas vs Kansas": {
    "stadium": "MemorialStadiumLawrence-KS-Lawrence",
    "Texas": {
      "points": 23,
      "1st downs": 20,
      "rushing 1st downs": 8,
      "passing 1st downs": 10,
      "penalty 1st downs": 2,
      "rushing yards": 111,
      "rushing attempts": 36,
      "passing yards": 218,
      "passing attempts": 34,
      "passing completions": 19,
      "passing interceptions": 0,
      "total yards": 329,
      "total plays": 70,
      "fumbles": 2,
      "fumbles lost": 0,
      "penalties": 6,
      "penalty yards": 46,
      "punts": 6,
      "punt yards": 255,
      "punt returns": 2,
      "punt return yards": 41,
      "kickoff returns": 0,
      "kickoff return yards": 0,
      "interception returns": 4,
      "interception return yards": 25,
      "3rd down conversions": 7,
      "3rd down attempts": 17,
      "4th down conversions": 1,
      "4th down attempts": 2
    },
    "Kansas": {
      "points": 0,
      "1st downs": 19,
      "rushing 1st downs": 12,
      "passing 1st downs": 6,
      "penalty 1st downs": 1,
      "rushing yards": 173,
      "rushing attempts": 51,
      "passing yards": 140,
      "passing attempts": 31,
      "passing completions": 12,
      "passing interceptions": 4,
      "total yards": 313,
      "total plays": 82,
      "fumbles": 1,
      "fumbles lost": 0,
      "penalties": 7,
      "penalty yards": 52,
      "punts": 6,
      "punt yards": 248,
      "punt returns": 2,
      "punt return yards": 5,
      "kickoff returns": 0,
      "kickoff return yards": 0,
      "interception returns": 0,
      "interception return yards": 0,
      "3rd down conversions": 9,
      "3rd down attempts": 20,
      "4th down conversions": 0,
      "4th down attempts": 3
    }
  },
  "Stanford vs Washington": {
    "stadium": "HuskyStadium-Seattle-WA",
    "Stanford": {
      "points": 20,
      "1st downs": 23,
      "rushing 1st downs": 8,
      "passing 1st downs": 12,
      "penalty 1st downs": 3,
      "rushing yards": 186,
      "rushing attempts": 40,
      "passing yards": 178,
      "passing attempts": 26,
      "passing completions": 17,
      "passing interceptions": 1,
      "total yards": 364,
      "total plays": 66,
      "fumbles": 3,
      "fumbles lost": 2,
      "penalties": 8,
      "penalty yards": 85,
      "punts": 5,
      "punt yards": 210,
      "punt returns": 1,
      "punt return yards": 2,
      "kickoff returns": 3,
      "kickoff return yards": 91,
      "interception returns": 0,
      "interception return yards": 0,
      "3rd down conversions": 3,
      "3rd down attempts": 12,
      "4th down conversions": 0,
      "4th down attempts": 0
    },
    "Washington": {
      "points": 13,
      "1st downs": 14,
      "rushing 1st downs": 7,
      "passing 1st downs": 4,
      "penalty 1st downs": 3,
      "rushing yards": 81,
      "rushing attempts": 38,
      "passing yards": 98,
      "passing attempts": 30,
      "passing completions": 15,
      "passing interceptions": 0,
      "total yards": 179,
      "total plays": 68,
      "fumbles": 2,
      "fumbles lost": 0,
      "penalties": 10,
      "penalty yards": 85,
      "punts": 8,
      "punt yards": 388,
      "punt returns": 3,
      "punt return yards": 6,
      "kickoff returns": 2,
      "kickoff return yards": 38,
      "interception returns": 1,
      "interception return yards": 0,
      "3rd down conversions": 5,
      "3rd down attempts": 18,
      "4th down conversions": 1,
      "4th down attempts": 4
    }
  },
  "UTSA vs FloridaAtlantic": {
    "stadium": "FAUStadium-BocaRaton-FL",
    "UTSA": {
      "points": 37,
      "1st downs": 0,
      "rushing 1st downs": 0,
      "passing 1st downs": 0,
      "penalty 1st downs": 0,
      "rushing yards": 140,
      "rushing attempts": 40,
      "passing yards": 272,
      "passing attempts": 39,
      "passing completions": 20,
      "passing interceptions": 2,
      "total yards": 412,
      "total plays": 79,
      "fumbles": 0,
      "fumbles lost": 0,
      "penalties": 6,
      "penalty yards": 50,
      "punts": 4,
      "punt yards": 178,
      "punt returns": 0,
      "punt return yards": 0,
      "kickoff returns": 5,
      "kickoff return yards": 186,
      "interception returns": 0,
      "interception return yards": 0,
      "3rd down conversions": 0,
      "3rd down attempts": 0,
      "4th down conversions": 0,
      "4th down attempts": 0
    },
    "FloridaAtlantic": {
      "points": 41,
      "1st downs": 0,
      "rushing 1st downs": 0,
      "passing 1st downs": 0,
      "penalty 1st downs": 0,
      "rushing yards": 114,
      "rushing attempts": 33,
      "passing yards": 295,
      "passing attempts": 34,
      "passing completions": 24,
      "passing interceptions": 0,
      "total yards": 409,
      "total plays": 67,
      "fumbles": 0,
      "fumbles lost": 0,
      "penalties": 5,
      "penalty yards": 52,
      "punts": 4,
      "punt yards": 184,
      "punt returns": 2,
      "punt return yards": 4,
      "kickoff returns": 3,
      "kickoff return yards": 86,
      "interception returns": 2,
      "interception return yards": 0,
      "3rd down conversions": 0,
      "3rd down attempts": 0,
      "4th down conversions": 0,
      "4th down attempts": 0
    }
  },
  "SouthAlabama vs Idaho": {
    "stadium": "KibbieDome-Moscow-ID",
    "SouthAlabama": {
      "points": 34,
      "1st downs": 19,
      "rushing 1st downs": 11,
      "passing 1st downs": 7,
      "penalty 1st downs": 1,
      "rushing yards": 233,
      "rushing attempts": 38,
      "passing yards": 196,
      "passing attempts": 25,
      "passing completions": 15,
      "passing interceptions": 1,
      "total yards": 429,
      "total plays": 63,
      "fumbles": 1,
      "fumbles lost": 1,
      "penalties": 8,
      "penalty yards": 65,
      "punts": 5,
      "punt yards": 216,
      "punt returns": 1,
      "punt return yards": 7,
      "kickoff returns": 2,
      "kickoff return yards": 57,
      "interception returns": 2,
      "interception return yards": 78,
      "3rd down conversions": 5,
      "3rd down attempts": 12,
      "4th down conversions": 0,
      "4th down attempts": 0
    },
    "Idaho": {
      "points": 10,
      "1st downs": 19,
      "rushing 1st downs": 4,
      "passing 1st downs": 11,
      "penalty 1st downs": 4,
      "rushing yards": 30,
      "rushing attempts": 33,
      "passing yards": 239,
      "passing attempts": 40,
      "passing completions": 25,
      "passing interceptions": 2,
      "total yards": 269,
      "total plays": 73,
      "fumbles": 1,
      "fumbles lost": 0,
      "penalties": 7,
      "penalty yards": 59,
      "punts": 6,
      "punt yards": 299,
      "punt returns": 2,
      "punt return yards": 22,
      "kickoff returns": 6,
      "kickoff return yards": 97,
      "interception returns": 1,
      "interception return yards": 0,
      "3rd down conversions": 6,
      "3rd down attempts": 18,
      "4th down conversions": 1,
      "4th down attempts": 2
    }
  },
  "Cincinnati vs OhioState": {
    "stadium": "OhioStadium-Columbus-OH",
    "Cincinnati": {
      "points": 28,
      "1st downs": 15,
      "rushing 1st downs": 5,
      "passing 1st downs": 10,
      "penalty 1st downs": 0,
      "rushing yards": 70,
      "rushing attempts": 19,
      "passing yards": 352,
      "passing attempts": 33,
      "passing completions": 21,
      "passing interceptions": 0,
      "total yards": 422,
      "total plays": 52,
      "fumbles": 2,
      "fumbles lost": 0,
      "penalties": 6,
      "penalty yards": 40,
      "punts": 7,
      "punt yards": 260,
      "punt returns": 0,
      "punt return yards": 0,
      "kickoff returns": 5,
      "kickoff return yards": 83,
      "interception returns": 0,
      "interception return yards": 0,
      "3rd down conversions": 4,
      "3rd down attempts": 11,
      "4th down conversions": 0,
      "4th down attempts": 0
    },
    "OhioState": {
      "points": 50,
      "1st downs": 46,
      "rushing 1st downs": 29,
      "passing 1st downs": 17,
      "penalty 1st downs": 0,
      "rushing yards": 380,
      "rushing attempts": 65,
      "passing yards": 330,
      "passing attempts": 36,
      "passing completions": 26,
      "passing interceptions": 0,
      "total yards": 710,
      "total plays": 101,
      "fumbles": 1,
      "fumbles lost": 1,
      "penalties": 7,
      "penalty yards": 40,
      "punts": 1,
      "punt yards": 42,
      "punt returns": 1,
      "punt return yards": 2,
      "kickoff returns": 1,
      "kickoff return yards": 18,
      "interception returns": 0,
      "interception return yards": 0,
      "3rd down conversions": 9,
      "3rd down attempts": 14,
      "4th down conversions": 1,
      "4th down attempts": 2
    }
  },
  "NorthCarolina vs Clemson": {
    "stadium": "MemorialStadium-Clemson-SC",
    "NorthCarolina": {
      "points": 35,
      "1st downs": 26,
      "rushing 1st downs": 10,
      "passing 1st downs": 14,
      "penalty 1st downs": 2,
      "rushing yards": 84,
      "rushing attempts": 30,
      "passing yards": 394,
      "passing attempts": 49,
      "passing completions": 30,
      "passing interceptions": 1,
      "total yards": 478,
      "total plays": 79,
      "fumbles": 0,
      "fumbles lost": 0,
      "penalties": 15,
      "penalty yards": 130,
      "punts": 8,
      "punt yards": 345,
      "punt returns": 4,
      "punt return yards": 22,
      "kickoff returns": 5,
      "kickoff return yards": 103,
      "interception returns": 1,
      "interception return yards": 7,
      "3rd down conversions": 8,
      "3rd down attempts": 18,
      "4th down conversions": 1,
      "4th down attempts": 1
    },
    "Clemson": {
      "points": 50,
      "1st downs": 27,
      "rushing 1st downs": 6,
      "passing 1st downs": 17,
      "penalty 1st downs": 4,
      "rushing yards": 92,
      "rushing attempts": 43,
      "passing yards": 436,
      "passing attempts": 39,
      "passing completions": 28,
      "passing interceptions": 1,
      "total yards": 528,
      "total plays": 82,
      "fumbles": 1,
      "fumbles lost": 0,
      "penalties": 4,
      "penalty yards": 19,
      "punts": 5,
      "punt yards": 233,
      "punt returns": 3,
      "punt return yards": 24,
      "kickoff returns": 3,
      "kickoff return yards": 52,
      "interception returns": 0,
      "interception return yards": 0,
      "3rd down conversions": 10,
      "3rd down attempts": 18,
      "4th down conversions": 0,
      "4th down attempts": 0
    }
  },
  "BoiseState vs AirForce": {
    "stadium": "FalconStadium-USAirForceAcademy-CO",
    "BoiseState": {
      "points": 14,
      "1st downs": 26,
      "rushing 1st downs": 6,
      "passing 1st downs": 18,
      "penalty 1st downs": 2,
      "rushing yards": 97,
      "rushing attempts": 29,
      "passing yards": 370,
      "passing attempts": 58,
      "passing completions": 30,
      "passing interceptions": 5,
      "total yards": 467,
      "total plays": 87,
      "fumbles": 2,
      "fumbles lost": 2,
      "penalties": 9,
      "penalty yards": 80,
      "punts": 3,
      "punt yards": 126,
      "punt returns": 3,
      "punt return yards": 52,
      "kickoff returns": 4,
      "kickoff return yards": 66,
      "interception returns": 0,
      "interception return yards": 0,
      "3rd down conversions": 7,
      "3rd down attempts": 18,
      "4th down conversions": 2,
      "4th down attempts": 6
    },
    "AirForce": {
      "points": 28,
      "1st downs": 19,
      "rushing 1st downs": 14,
      "passing 1st downs": 3,
      "penalty 1st downs": 2,
      "rushing yards": 287,
      "rushing attempts": 60,
      "passing yards": 48,
      "passing attempts": 12,
      "passing completions": 5,
      "passing interceptions": 0,
      "total yards": 335,
      "total plays": 72,
      "fumbles": 4,
      "fumbles lost": 2,
      "penalties": 5,
      "penalty yards": 47,
      "punts": 9,
      "punt yards": 407,
      "punt returns": 0,
      "punt return yards": 0,
      "kickoff returns": 0,
      "kickoff return yards": 0,
      "interception returns": 5,
      "interception return yards": 57,
      "3rd down conversions": 6,
      "3rd down attempts": 17,
      "4th down conversions": 1,
      "4th down attempts": 1
    }
  },
  "CentralMichigan vs Toledo": {
    "stadium": "GlassBowl-Toledo-OH",
    "CentralMichigan": {
      "points": 28,
      "1st downs": 24,
      "rushing 1st downs": 8,
      "passing 1st downs": 15,
      "penalty 1st downs": 1,
      "rushing yards": 95,
      "rushing attempts": 26,
      "passing yards": 291,
      "passing attempts": 31,
      "passing completions": 24,
      "passing interceptions": 1,
      "total yards": 386,
      "total plays": 57,
      "fumbles": 1,
      "fumbles lost": 1,
      "penalties": 3,
      "penalty yards": 35,
      "punts": 3,
      "punt yards": 158,
      "punt returns": 0,
      "punt return yards": 0,
      "kickoff returns": 2,
      "kickoff return yards": 43,
      "interception returns": 1,
      "interception return yards": 0,
      "3rd down conversions": 4,
      "3rd down attempts": 8,
      "4th down conversions": 0,
      "4th down attempts": 0
    },
    "Toledo": {
      "points": 42,
      "1st downs": 30,
      "rushing 1st downs": 13,
      "passing 1st downs": 16,
      "penalty 1st downs": 1,
      "rushing yards": 204,
      "rushing attempts": 38,
      "passing yards": 339,
      "passing attempts": 34,
      "passing completions": 23,
      "passing interceptions": 1,
      "total yards": 543,
      "total plays": 72,
      "fumbles": 4,
      "fumbles lost": 1,
      "penalties": 6,
      "penalty yards": 47,
      "punts": 1,
      "punt yards": 39,
      "punt returns": 2,
      "punt return yards": -3,
      "kickoff returns": 5,
      "kickoff return yards": 124,
      "interception returns": 1,
      "interception return yards": 11,
      "3rd down conversions": 5,
      "3rd down attempts": 10,
      "4th down conversions": 1,
      "4th down attempts": 1
    }
  },
  "Rice vs SouthernMiss": {
    "stadium": "MMRobertsStadium-Hattiesburg-MS",
    "Rice": {
      "points": 41,
      "1st downs": 23,
      "rushing 1st downs": 14,
      "passing 1st downs": 8,
      "penalty 1st downs": 1,
      "rushing yards": 217,
      "rushing attempts": 48,
      "passing yards": 178,
      "passing attempts": 22,
      "passing completions": 14,
      "passing interceptions": 1,
      "total yards": 395,
      "total plays": 70,
      "fumbles": 0,
      "fumbles lost": 0,
      "penalties": 6,
      "penalty yards": 65,
      "punts": 4,
      "punt yards": 188,
      "punt returns": 2,
      "punt return yards": 28,
      "kickoff returns": 5,
      "kickoff return yards": 148,
      "interception returns": 2,
      "interception return yards": 31,
      "3rd down conversions": 6,
      "3rd down attempts": 14,
      "4th down conversions": 1,
      "4th down attempts": 1
    },
    "SouthernMiss": {
      "points": 23,
      "1st downs": 20,
      "rushing 1st downs": 4,
      "passing 1st downs": 13,
      "penalty 1st downs": 3,
      "rushing yards": 40,
      "rushing attempts": 23,
      "passing yards": 283,
      "passing attempts": 46,
      "passing completions": 24,
      "passing interceptions": 2,
      "total yards": 323,
      "total plays": 69,
      "fumbles": 2,
      "fumbles lost": 1,
      "penalties": 6,
      "penalty yards": 55,
      "punts": 4,
      "punt yards": 150,
      "punt returns": 3,
      "punt return yards": 39,
      "kickoff returns": 0,
      "kickoff return yards": 0,
      "interception returns": 1,
      "interception return yards": 45,
      "3rd down conversions": 8,
      "3rd down attempts": 17,
      "4th down conversions": 0,
      "4th down attempts": 3
    }
  },
  "Missouri vs SouthCarolina": {
    "stadium": "WilliamsBriceStadium-Columbia-SC",
    "Missouri": {
      "points": 21,
      "1st downs": 18,
      "rushing 1st downs": 11,
      "passing 1st downs": 5,
      "penalty 1st downs": 2,
      "rushing yards": 148,
      "rushing attempts": 36,
      "passing yards": 132,
      "passing attempts": 34,
      "passing completions": 12,
      "passing interceptions": 0,
      "total yards": 280,
      "total plays": 70,
      "fumbles": 0,
      "fumbles lost": 0,
      "penalties": 8,
      "penalty yards": 74,
      "punts": 10,
      "punt yards": 420,
      "punt returns": 3,
      "punt return yards": 46,
      "kickoff returns": 1,
      "kickoff return yards": 32,
      "interception returns": 0,
      "interception return yards": 0,
      "3rd down conversions": 2,
      "3rd down attempts": 16,
      "4th down conversions": 3,
      "4th down attempts": 3
    },
    "SouthCarolina": {
      "points": 20,
      "1st downs": 18,
      "rushing 1st downs": 9,
      "passing 1st downs": 7,
      "penalty 1st downs": 2,
      "rushing yards": 119,
      "rushing attempts": 42,
      "passing yards": 219,
      "passing attempts": 37,
      "passing completions": 21,
      "passing interceptions": 0,
      "total yards": 338,
      "total plays": 79,
      "fumbles": 0,
      "fumbles lost": 0,
      "penalties": 8,
      "penalty yards": 71,
      "punts": 9,
      "punt yards": 392,
      "punt returns": 2,
      "punt return yards": 33,
      "kickoff returns": 1,
      "kickoff return yards": 33,
      "interception returns": 0,
      "interception return yards": 0,
      "3rd down conversions": 8,
      "3rd down attempts": 21,
      "4th down conversions": 0,
      "4th down attempts": 2
    }
  },
  "Troy vs LouisianaMonroe": {
    "stadium": "MaloneStadium-Monroe-LA",
    "Troy": {
      "points": 20,
      "1st downs": 18,
      "rushing 1st downs": 7,
      "passing 1st downs": 11,
      "penalty 1st downs": 0,
      "rushing yards": 81,
      "rushing attempts": 32,
      "passing yards": 270,
      "passing attempts": 34,
      "passing completions": 23,
      "passing interceptions": 0,
      "total yards": 351,
      "total plays": 66,
      "fumbles": 1,
      "fumbles lost": 1,
      "penalties": 3,
      "penalty yards": 45,
      "punts": 8,
      "punt yards": 325,
      "punt returns": 0,
      "punt return yards": 0,
      "kickoff returns": 3,
      "kickoff return yards": 88,
      "interception returns": 1,
      "interception return yards": 0,
      "3rd down conversions": 4,
      "3rd down attempts": 14,
      "4th down conversions": 0,
      "4th down attempts": 1
    },
    "LouisianaMonroe": {
      "points": 22,
      "1st downs": 19,
      "rushing 1st downs": 4,
      "passing 1st downs": 14,
      "penalty 1st downs": 1,
      "rushing yards": 29,
      "rushing attempts": 33,
      "passing yards": 328,
      "passing attempts": 43,
      "passing completions": 28,
      "passing interceptions": 1,
      "total yards": 357,
      "total plays": 76,
      "fumbles": 0,
      "fumbles lost": 0,
      "penalties": 0,
      "penalty yards": 0,
      "punts": 6,
      "punt yards": 290,
      "punt returns": 1,
      "punt return yards": -5,
      "kickoff returns": 3,
      "kickoff return yards": 80,
      "interception returns": 0,
      "interception return yards": 0,
      "3rd down conversions": 7,
      "3rd down attempts": 18,
      "4th down conversions": 1,
      "4th down attempts": 1
    }
  },
  "NewMexicoState vs LSU": {
    "stadium": "TigerStadium-BatonRouge-LA",
    "NewMexicoState": {
      "points": 7,
      "1st downs": 12,
      "rushing 1st downs": 7,
      "passing 1st downs": 5,
      "penalty 1st downs": 0,
      "rushing yards": 172,
      "rushing attempts": 37,
      "passing yards": 102,
      "passing attempts": 33,
      "passing completions": 16,
      "passing interceptions": 2,
      "total yards": 274,
      "total plays": 70,
      "fumbles": 4,
      "fumbles lost": 2,
      "penalties": 5,
      "penalty yards": 35,
      "punts": 10,
      "punt yards": 381,
      "punt returns": 2,
      "punt return yards": 7,
      "kickoff returns": 1,
      "kickoff return yards": 21,
      "interception returns": 2,
      "interception return yards": 0,
      "3rd down conversions": 4,
      "3rd down attempts": 17,
      "4th down conversions": 0,
      "4th down attempts": 0
    },
    "LSU": {
      "points": 63,
      "1st downs": 34,
      "rushing 1st downs": 23,
      "passing 1st downs": 10,
      "penalty 1st downs": 1,
      "rushing yards": 363,
      "rushing attempts": 54,
      "passing yards": 200,
      "passing attempts": 20,
      "passing completions": 14,
      "passing interceptions": 2,
      "total yards": 563,
      "total plays": 74,
      "fumbles": 2,
      "fumbles lost": 2,
      "penalties": 5,
      "penalty yards": 35,
      "punts": 3,
      "punt yards": 143,
      "punt returns": 3,
      "punt return yards": 24,
      "kickoff returns": 0,
      "kickoff return yards": 0,
      "interception returns": 2,
      "interception return yards": 29,
      "3rd down conversions": 3,
      "3rd down attempts": 6,
      "4th down conversions": 0,
      "4th down attempts": 0
    }
  },
  "Memphis vs OleMiss": {
    "stadium": "VaughtHemingwayStadium-University-MS",
    "Memphis": {
      "points": 3,
      "1st downs": 14,
      "rushing 1st downs": 5,
      "passing 1st downs": 4,
      "penalty 1st downs": 5,
      "rushing yards": 23,
      "rushing attempts": 31,
      "passing yards": 81,
      "passing attempts": 31,
      "passing completions": 13,
      "passing interceptions": 1,
      "total yards": 104,
      "total plays": 62,
      "fumbles": 1,
      "fumbles lost": 1,
      "penalties": 9,
      "penalty yards": 105,
      "punts": 10,
      "punt yards": 421,
      "punt returns": 2,
      "punt return yards": 6,
      "kickoff returns": 2,
      "kickoff return yards": 39,
      "interception returns": 2,
      "interception return yards": 17,
      "3rd down conversions": 3,
      "3rd down attempts": 16,
      "4th down conversions": 0,
      "4th down attempts": 1
    },
    "OleMiss": {
      "points": 24,
      "1st downs": 30,
      "rushing 1st downs": 9,
      "passing 1st downs": 14,
      "penalty 1st downs": 7,
      "rushing yards": 178,
      "rushing attempts": 42,
      "passing yards": 248,
      "passing attempts": 37,
      "passing completions": 22,
      "passing interceptions": 2,
      "total yards": 426,
      "total plays": 79,
      "fumbles": 3,
      "fumbles lost": 2,
      "penalties": 10,
      "penalty yards": 125,
      "punts": 4,
      "punt yards": 185,
      "punt returns": 3,
      "punt return yards": 1,
      "kickoff returns": 1,
      "kickoff return yards": 22,
      "interception returns": 1,
      "interception return yards": 47,
      "3rd down conversions": 7,
      "3rd down attempts": 14,
      "4th down conversions": 0,
      "4th down attempts": 0
    }
  },
  "Duke vs MiamiFL": {
    "stadium": "SunLifeStadium-MiamiGardens-FL",
    "Duke": {
      "points": 10,
      "1st downs": 17,
      "rushing 1st downs": 5,
      "passing 1st downs": 8,
      "penalty 1st downs": 4,
      "rushing yards": 85,
      "rushing attempts": 25,
      "passing yards": 179,
      "passing attempts": 51,
      "passing completions": 22,
      "passing interceptions": 2,
      "total yards": 264,
      "total plays": 76,
      "fumbles": 2,
      "fumbles lost": 1,
      "penalties": 8,
      "penalty yards": 50,
      "punts": 9,
      "punt yards": 443,
      "punt returns": 3,
      "punt return yards": 8,
      "kickoff returns": 3,
      "kickoff return yards": 57,
      "interception returns": 0,
      "interception return yards": 0,
      "3rd down conversions": 2,
      "3rd down attempts": 16,
      "4th down conversions": 0,
      "4th down attempts": 3
    },
    "MiamiFL": {
      "points": 22,
      "1st downs": 23,
      "rushing 1st downs": 13,
      "passing 1st downs": 9,
      "penalty 1st downs": 1,
      "rushing yards": 203,
      "rushing attempts": 41,
      "passing yards": 223,
      "passing attempts": 34,
      "passing completions": 20,
      "passing interceptions": 0,
      "total yards": 426,
      "total plays": 75,
      "fumbles": 2,
      "fumbles lost": 2,
      "penalties": 8,
      "penalty yards": 93,
      "punts": 8,
      "punt yards": 347,
      "punt returns": 4,
      "punt return yards": 17,
      "kickoff returns": 2,
      "kickoff return yards": 34,
      "interception returns": 2,
      "interception return yards": 20,
      "3rd down conversions": 2,
      "3rd down attempts": 13,
      "4th down conversions": 1,
      "4th down attempts": 1
    }
  },
  "NotreDame vs Syracuse": {
    "stadium": "MetLifeStadium-EastRutherford-NJ",
    "NotreDame": {
      "points": 31,
      "1st downs": 31,
      "rushing 1st downs": 11,
      "passing 1st downs": 18,
      "penalty 1st downs": 2,
      "rushing yards": 161,
      "rushing attempts": 41,
      "passing yards": 362,
      "passing attempts": 39,
      "passing completions": 32,
      "passing interceptions": 2,
      "total yards": 523,
      "total plays": 80,
      "fumbles": 4,
      "fumbles lost": 3,
      "penalties": 8,
      "penalty yards": 80,
      "punts": 2,
      "punt yards": 80,
      "punt returns": 1,
      "punt return yards": 16,
      "kickoff returns": 4,
      "kickoff return yards": 33,
      "interception returns": 1,
      "interception return yards": 15,
      "3rd down conversions": 10,
      "3rd down attempts": 15,
      "4th down conversions": 0,
      "4th down attempts": 0
    },
    "Syracuse": {
      "points": 15,
      "1st downs": 18,
      "rushing 1st downs": 7,
      "passing 1st downs": 9,
      "penalty 1st downs": 2,
      "rushing yards": 135,
      "rushing attempts": 30,
      "passing yards": 294,
      "passing attempts": 38,
      "passing completions": 22,
      "passing interceptions": 1,
      "total yards": 429,
      "total plays": 68,
      "fumbles": 1,
      "fumbles lost": 0,
      "penalties": 10,
      "penalty yards": 85,
      "punts": 5,
      "punt yards": 194,
      "punt returns": 0,
      "punt return yards": 0,
      "kickoff returns": 2,
      "kickoff return yards": 38,
      "interception returns": 2,
      "interception return yards": 29,
      "3rd down conversions": 3,
      "3rd down attempts": 15,
      "4th down conversions": 2,
      "4th down attempts": 4
    }
  },
  "TexasState vs Tulsa": {
    "stadium": "SkellyFieldatHAChapmanStadium-Tulsa-OK",
    "TexasState": {
      "points": 37,
      "1st downs": 24,
      "rushing 1st downs": 12,
      "passing 1st downs": 11,
      "penalty 1st downs": 1,
      "rushing yards": 181,
      "rushing attempts": 49,
      "passing yards": 228,
      "passing attempts": 31,
      "passing completions": 21,
      "passing interceptions": 0,
      "total yards": 409,
      "total plays": 80,
      "fumbles": 1,
      "fumbles lost": 0,
      "penalties": 7,
      "penalty yards": 77,
      "punts": 8,
      "punt yards": 333,
      "punt returns": 2,
      "punt return yards": 6,
      "kickoff returns": 2,
      "kickoff return yards": 28,
      "interception returns": 1,
      "interception return yards": 0,
      "3rd down conversions": 5,
      "3rd down attempts": 16,
      "4th down conversions": 2,
      "4th down attempts": 2
    },
    "Tulsa": {
      "points": 34,
      "1st downs": 28,
      "rushing 1st downs": 15,
      "passing 1st downs": 10,
      "penalty 1st downs": 3,
      "rushing yards": 200,
      "rushing attempts": 56,
      "passing yards": 234,
      "passing attempts": 40,
      "passing completions": 23,
      "passing interceptions": 1,
      "total yards": 434,
      "total plays": 96,
      "fumbles": 2,
      "fumbles lost": 0,
      "penalties": 4,
      "penalty yards": 34,
      "punts": 7,
      "punt yards": 310,
      "punt returns": 3,
      "punt return yards": 4,
      "kickoff returns": 1,
      "kickoff return yards": 20,
      "interception returns": 0,
      "interception return yards": 0,
      "3rd down conversions": 8,
      "3rd down attempts": 21,
      "4th down conversions": 3,
      "4th down attempts": 4
    }
  },
  "WashingtonState vs Utah": {
    "stadium": "RiceEcclesStadium-SaltLakeCity-UT",
    "WashingtonState": {
      "points": 28,
      "1st downs": 27,
      "rushing 1st downs": 6,
      "passing 1st downs": 19,
      "penalty 1st downs": 2,
      "rushing yards": 78,
      "rushing attempts": 25,
      "passing yards": 417,
      "passing attempts": 61,
      "passing completions": 39,
      "passing interceptions": 2,
      "total yards": 495,
      "total plays": 86,
      "fumbles": 1,
      "fumbles lost": 1,
      "penalties": 4,
      "penalty yards": 40,
      "punts": 6,
      "punt yards": 232,
      "punt returns": 3,
      "punt return yards": 18,
      "kickoff returns": 2,
      "kickoff return yards": 48,
      "interception returns": 0,
      "interception return yards": 0,
      "3rd down conversions": 10,
      "3rd down attempts": 20,
      "4th down conversions": 2,
      "4th down attempts": 4
    },
    "Utah": {
      "points": 27,
      "1st downs": 18,
      "rushing 1st downs": 10,
      "passing 1st downs": 7,
      "penalty 1st downs": 1,
      "rushing yards": 192,
      "rushing attempts": 40,
      "passing yards": 165,
      "passing attempts": 40,
      "passing completions": 18,
      "passing interceptions": 0,
      "total yards": 357,
      "total plays": 80,
      "fumbles": 1,
      "fumbles lost": 1,
      "penalties": 8,
      "penalty yards": 78,
      "punts": 7,
      "punt yards": 321,
      "punt returns": 2,
      "punt return yards": 66,
      "kickoff returns": 3,
      "kickoff return yards": 50,
      "interception returns": 2,
      "interception return yards": 18,
      "3rd down conversions": 7,
      "3rd down attempts": 20,
      "4th down conversions": 1,
      "4th down attempts": 3
    }
  },
  "UNLV vs SanDiegoState": {
    "stadium": "QualcommStadium-SanDiego-CA",
    "UNLV": {
      "points": 17,
      "1st downs": 29,
      "rushing 1st downs": 10,
      "passing 1st downs": 13,
      "penalty 1st downs": 6,
      "rushing yards": 109,
      "rushing attempts": 38,
      "passing yards": 346,
      "passing attempts": 33,
      "passing completions": 18,
      "passing interceptions": 2,
      "total yards": 455,
      "total plays": 71,
      "fumbles": 0,
      "fumbles lost": 0,
      "penalties": 8,
      "penalty yards": 72,
      "punts": 4,
      "punt yards": 160,
      "punt returns": 1,
      "punt return yards": 48,
      "kickoff returns": 6,
      "kickoff return yards": 87,
      "interception returns": 0,
      "interception return yards": 0,
      "3rd down conversions": 6,
      "3rd down attempts": 14,
      "4th down conversions": 2,
      "4th down attempts": 2
    },
    "SanDiegoState": {
      "points": 34,
      "1st downs": 28,
      "rushing 1st downs": 13,
      "passing 1st downs": 10,
      "penalty 1st downs": 5,
      "rushing yards": 257,
      "rushing attempts": 43,
      "passing yards": 209,
      "passing attempts": 28,
      "passing completions": 16,
      "passing interceptions": 0,
      "total yards": 466,
      "total plays": 71,
      "fumbles": 0,
      "fumbles lost": 0,
      "penalties": 6,
      "penalty yards": 66,
      "punts": 5,
      "punt yards": 191,
      "punt returns": 0,
      "punt return yards": 0,
      "kickoff returns": 4,
      "kickoff return yards": 52,
      "interception returns": 2,
      "interception return yards": 26,
      "3rd down conversions": 5,
      "3rd down attempts": 12,
      "4th down conversions": 0,
      "4th down attempts": 0
    }
  },
  "Baylor vs IowaState": {
    "stadium": "JackTriceStadium-Ames-IA",
    "Baylor": {
      "points": 49,
      "1st downs": 35,
      "rushing 1st downs": 15,
      "passing 1st downs": 17,
      "penalty 1st downs": 3,
      "rushing yards": 244,
      "rushing attempts": 47,
      "passing yards": 357,
      "passing attempts": 50,
      "passing completions": 32,
      "passing interceptions": 1,
      "total yards": 601,
      "total plays": 97,
      "fumbles": 0,
      "fumbles lost": 0,
      "penalties": 10,
      "penalty yards": 78,
      "punts": 5,
      "punt yards": 218,
      "punt returns": 3,
      "punt return yards": 7,
      "kickoff returns": 1,
      "kickoff return yards": 20,
      "interception returns": 1,
      "interception return yards": 0,
      "3rd down conversions": 6,
      "3rd down attempts": 17,
      "4th down conversions": 3,
      "4th down attempts": 4
    },
    "IowaState": {
      "points": 28,
      "1st downs": 19,
      "rushing 1st downs": 7,
      "passing 1st downs": 9,
      "penalty 1st downs": 3,
      "rushing yards": 127,
      "rushing attempts": 34,
      "passing yards": 212,
      "passing attempts": 39,
      "passing completions": 17,
      "passing interceptions": 1,
      "total yards": 339,
      "total plays": 73,
      "fumbles": 1,
      "fumbles lost": 0,
      "penalties": 7,
      "penalty yards": 45,
      "punts": 9,
      "punt yards": 382,
      "punt returns": 0,
      "punt return yards": 0,
      "kickoff returns": 4,
      "kickoff return yards": 80,
      "interception returns": 1,
      "interception return yards": 3,
      "3rd down conversions": 8,
      "3rd down attempts": 18,
      "4th down conversions": 0,
      "4th down attempts": 1
    }
  },
  "Illinois vs Nebraska": {
    "stadium": "MemorialStadiumLincoln-NE-Lincoln",
    "Illinois": {
      "points": 14,
      "1st downs": 17,
      "rushing 1st downs": 4,
      "passing 1st downs": 10,
      "penalty 1st downs": 3,
      "rushing yards": 78,
      "rushing attempts": 24,
      "passing yards": 261,
      "passing attempts": 38,
      "passing completions": 17,
      "passing interceptions": 3,
      "total yards": 339,
      "total plays": 62,
      "fumbles": 0,
      "fumbles lost": 0,
      "penalties": 7,
      "penalty yards": 53,
      "punts": 8,
      "punt yards": 338,
      "punt returns": 0,
      "punt return yards": 0,
      "kickoff returns": 1,
      "kickoff return yards": 28,
      "interception returns": 1,
      "interception return yards": 14,
      "3rd down conversions": 3,
      "3rd down attempts": 14,
      "4th down conversions": 0,
      "4th down attempts": 1
    },
    "Nebraska": {
      "points": 45,
      "1st downs": 37,
      "rushing 1st downs": 30,
      "passing 1st downs": 6,
      "penalty 1st downs": 1,
      "rushing yards": 458,
      "rushing attempts": 70,
      "passing yards": 166,
      "passing attempts": 21,
      "passing completions": 10,
      "passing interceptions": 1,
      "total yards": 624,
      "total plays": 91,
      "fumbles": 2,
      "fumbles lost": 1,
      "penalties": 8,
      "penalty yards": 70,
      "punts": 3,
      "punt yards": 113,
      "punt returns": 3,
      "punt return yards": 12,
      "kickoff returns": 1,
      "kickoff return yards": 4,
      "interception returns": 3,
      "interception return yards": 71,
      "3rd down conversions": 7,
      "3rd down attempts": 15,
      "4th down conversions": 1,
      "4th down attempts": 2
    }
  },
  "OregonState vs USC": {
    "stadium": "LosAngelesMemorialColiseum-LosAngeles-CA",
    "OregonState": {
      "points": 10,
      "1st downs": 17,
      "rushing 1st downs": 6,
      "passing 1st downs": 4,
      "penalty 1st downs": 7,
      "rushing yards": 58,
      "rushing attempts": 21,
      "passing yards": 123,
      "passing attempts": 35,
      "passing completions": 15,
      "passing interceptions": 2,
      "total yards": 181,
      "total plays": 56,
      "fumbles": 1,
      "fumbles lost": 0,
      "penalties": 13,
      "penalty yards": 108,
      "punts": 8,
      "punt yards": 322,
      "punt returns": 2,
      "punt return yards": 5,
      "kickoff returns": 4,
      "kickoff return yards": 170,
      "interception returns": 0,
      "interception return yards": 0,
      "3rd down conversions": 1,
      "3rd down attempts": 10,
      "4th down conversions": 0,
      "4th down attempts": 0
    },
    "USC": {
      "points": 35,
      "1st downs": 26,
      "rushing 1st downs": 12,
      "passing 1st downs": 10,
      "penalty 1st downs": 4,
      "rushing yards": 200,
      "rushing attempts": 48,
      "passing yards": 261,
      "passing attempts": 33,
      "passing completions": 24,
      "passing interceptions": 0,
      "total yards": 461,
      "total plays": 81,
      "fumbles": 1,
      "fumbles lost": 0,
      "penalties": 14,
      "penalty yards": 125,
      "punts": 6,
      "punt yards": 243,
      "punt returns": 2,
      "punt return yards": 12,
      "kickoff returns": 3,
      "kickoff return yards": 76,
      "interception returns": 2,
      "interception return yards": 31,
      "3rd down conversions": 8,
      "3rd down attempts": 19,
      "4th down conversions": 3,
      "4th down attempts": 3
    }
  },
  "Nevada vs SanJoseState": {
    "stadium": "SpartanStadium-SanJose-CA",
    "Nevada": {
      "points": 21,
      "1st downs": 17,
      "rushing 1st downs": 13,
      "passing 1st downs": 2,
      "penalty 1st downs": 2,
      "rushing yards": 192,
      "rushing attempts": 36,
      "passing yards": 64,
      "passing attempts": 18,
      "passing completions": 10,
      "passing interceptions": 0,
      "total yards": 256,
      "total plays": 54,
      "fumbles": 0,
      "fumbles lost": 0,
      "penalties": 8,
      "penalty yards": 56,
      "punts": 7,
      "punt yards": 290,
      "punt returns": 0,
      "punt return yards": 0,
      "kickoff returns": 0,
      "kickoff return yards": 0,
      "interception returns": 2,
      "interception return yards": 27,
      "3rd down conversions": 0,
      "3rd down attempts": 10,
      "4th down conversions": 0,
      "4th down attempts": 0
    },
    "SanJoseState": {
      "points": 10,
      "1st downs": 25,
      "rushing 1st downs": 10,
      "passing 1st downs": 13,
      "penalty 1st downs": 2,
      "rushing yards": 170,
      "rushing attempts": 37,
      "passing yards": 276,
      "passing attempts": 46,
      "passing completions": 32,
      "passing interceptions": 2,
      "total yards": 446,
      "total plays": 83,
      "fumbles": 1,
      "fumbles lost": 1,
      "penalties": 9,
      "penalty yards": 95,
      "punts": 5,
      "punt yards": 169,
      "punt returns": 2,
      "punt return yards": 5,
      "kickoff returns": 3,
      "kickoff return yards": 52,
      "interception returns": 0,
      "interception return yards": 0,
      "3rd down conversions": 6,
      "3rd down attempts": 17,
      "4th down conversions": 2,
      "4th down attempts": 3
    }
  }
}