{
  "Toledo vs BallState": {
    "stadium": "ScheumannStadium-Muncie-IN",
    "Toledo": {
      "points": 58,
      "1st downs": 16,
      "rushing 1st downs": 10,
      "passing 1st downs": 6,
      "penalty 1st downs": 0,
      "rushing yards": 335,
      "rushing attempts": 34,
      "passing yards": 267,
      "passing attempts": 18,
      "passing completions": 8,
      "passing interceptions": 0,
      "total yards": 602,
      "total plays": 52,
      "fumbles": 1,
      "fumbles lost": 1,
      "penalties": 8,
      "penalty yards": 90,
      "punts": 5,
      "punt yards": 231,
      "punt returns": 4,
      "punt return yards": 108,
      "kickoff returns": 1,
      "kickoff return yards": 16,
      "interception returns": 0,
      "interception return yards": 0,
      "3rd down conversions": 1,
      "3rd down attempts": 8,
      "4th down conversions": 0,
      "4th down attempts": 1
    },
    "BallState": {
      "points": 17,
      "1st downs": 16,
      "rushing 1st downs": 6,
      "passing 1st downs": 6,
      "penalty 1st downs": 4,
      "rushing yards": 204,
      "rushing attempts": 46,
      "passing yards": 105,
      "passing attempts": 37,
      "passing completions": 18,
      "passing interceptions": 0,
      "total yards": 309,
      "total plays": 83,
      "fumbles": 0,
      "fumbles lost": 0,
      "penalties": 3,
      "penalty yards": 25,
      "punts": 10,
      "punt yards": 367,
      "punt returns": 0,
      "punt return yards": 0,
      "kickoff returns": 4,
      "kickoff return yards": 92,
      "interception returns": 0,
      "interception return yards": 0,
      "3rd down conversions": 3,
      "3rd down attempts": 19,
      "4th down conversions": 1,
      "4th down attempts": 4
    }
  },
  "EasternMichigan vs NorthernIllinois": {
    "stadium": "BrighamFieldatHuskieStadium-DeKalb-IL",
    "EasternMichigan": {
      "points": 27,
      "1st downs": 15,
      "rushing 1st downs": 2,
      "passing 1st downs": 11,
      "penalty 1st downs": 2,
      "rushing yards": 96,
      "rushing attempts": 33,
      "passing yards": 307,
      "passing attempts": 45,
      "passing completions": 23,
      "passing interceptions": 0,
      "total yards": 403,
      "total plays": 78,
      "fumbles": 0,
      "fumbles lost": 0,
      "penalties": 6,
      "penalty yards": 69,
      "punts": 9,
      "punt yards": 378,
      "punt returns": 4,
      "punt return yards": 48,
      "kickoff returns": 4,
      "kickoff return yards": 61,
      "interception returns": 0,
      "interception return yards": 0,
      "3rd down conversions": 5,
      "3rd down attempts": 20,
      "4th down conversions": 0,
      "4th down attempts": 0
    },
    "NorthernIllinois": {
      "points": 30,
      "1st downs": 18,
      "rushing 1st downs": 6,
      "passing 1st downs": 10,
      "penalty 1st downs": 2,
      "rushing yards": 114,
      "rushing attempts": 36,
      "passing yards": 278,
      "passing attempts": 40,
      "passing completions": 23,
      "passing interceptions": 0,
      "total yards": 392,
      "total plays": 76,
      "fumbles": 4,
      "fumbles lost": 1,
      "penalties": 9,
      "penalty yards": 72,
      "punts": 10,
      "punt yards": 429,
      "punt returns": 3,
      "punt return yards": 8,
      "kickoff returns": 3,
      "kickoff return yards": 75,
      "interception returns": 0,
      "interception return yards": 0,
      "3rd down conversions": 3,
      "3rd down attempts": 17,
      "4th down conversions": 0,
      "4th down attempts": 1
    }
  },
  "SouthAlabama vs GeorgiaState": {
    "stadium": "GeorgiaStateStadium-Atlanta-GA",
    "SouthAlabama": {
      "points": 13,
      "1st downs": 15,
      "rushing 1st downs": 2,
      "passing 1st downs": 12,
      "penalty 1st downs": 1,
      "rushing yards": 41,
      "rushing attempts": 23,
      "passing yards": 297,
      "passing attempts": 48,
      "passing completions": 27,
      "passing interceptions": 2,
      "total yards": 338,
      "total plays": 71,
      "fumbles": 1,
      "fumbles lost": 0,
      "penalties": 3,
      "penalty yards": 32,
      "punts": 5,
      "punt yards": 232,
      "punt returns": 2,
      "punt return yards": 18,
      "kickoff returns": 4,
      "kickoff return yards": 63,
      "interception returns": 0,
      "interception return yards": 0,
      "3rd down conversions": 5,
      "3rd down attempts": 16,
      "4th down conversions": 1,
      "4th down attempts": 3
    },
    "GeorgiaState": {
      "points": 21,
      "1st downs": 16,
      "rushing 1st downs": 4,
      "passing 1st downs": 10,
      "penalty 1st downs": 2,
      "rushing yards": 114,
      "rushing attempts": 34,
      "passing yards": 195,
      "passing attempts": 31,
      "passing completions": 17,
      "passing interceptions": 0,
      "total yards": 309,
      "total plays": 65,
      "fumbles": 1,
      "fumbles lost": 1,
      "penalties": 7,
      "penalty yards": 63,
      "punts": 5,
      "punt yards": 230,
      "punt returns": 0,
      "punt return yards": 0,
      "kickoff returns": 3,
      "kickoff return yards": 66,
      "interception returns": 2,
      "interception return yards": 56,
      "3rd down conversions": 7,
      "3rd down attempts": 14,
      "4th down conversions": 0,
      "4th down attempts": 1
    }
  },
  "Stanford vs OregonState": {
    "stadium": "ReserStadium-Corvallis-OR",
    "Stanford": {
      "points": 15,
      "1st downs": 12,
      "rushing 1st downs": 5,
      "passing 1st downs": 6,
      "penalty 1st downs": 1,
      "rushing yards": 81,
      "rushing attempts": 27,
      "passing yards": 141,
      "passing attempts": 33,
      "passing completions": 16,
      "passing interceptions": 1,
      "total yards": 222,
      "total plays": 60,
      "fumbles": 1,
      "fumbles lost": 0,
      "penalties": 8,
      "penalty yards": 81,
      "punts": 5,
      "punt yards": 230,
      "punt returns": 0,
      "punt return yards": 0,
      "kickoff returns": 1,
      "kickoff return yards": 19,
      "interception returns": 1,
      "interception return yards": 9,
      "3rd down conversions": 5,
      "3rd down attempts": 16,
      "4th down conversions": 1,
      "4th down attempts": 1
    },
    "OregonState": {
      "points": 14,
      "1st downs": 20,
      "rushing 1st downs": 9,
      "passing 1st downs": 7,
      "penalty 1st downs": 4,
      "rushing yards": 138,
      "rushing attempts": 41,
      "passing yards": 126,
      "passing attempts": 22,
      "passing completions": 13,
      "passing interceptions": 1,
      "total yards": 264,
      "total plays": 63,
      "fumbles": 2,
      "fumbles lost": 2,
      "penalties": 6,
      "penalty yards": 47,
      "punts": 5,
      "punt yards": 143,
      "punt returns": 1,
      "punt return yards": -5,
      "kickoff returns": 0,
      "kickoff return yards": 0,
      "interception returns": 1,
      "interception return yards": 0,
      "3rd down conversions": 6,
      "3rd down attempts": 14,
      "4th down conversions": 0,
      "4th down attempts": 0
    }
  },
  "FloridaState vs BostonCollege": {
    "stadium": "AlumniStadium-ChestnutHill-MA",
    "FloridaState": {
      "points": 3,
      "1st downs": 10,
      "rushing 1st downs": 3,
      "passing 1st downs": 7,
      "penalty 1st downs": 0,
      "rushing yards": 64,
      "rushing attempts": 29,
      "passing yards": 149,
      "passing attempts": 27,
      "passing completions": 12,
      "passing interceptions": 1,
      "total yards": 213,
      "total plays": 56,
      "fumbles": 2,
      "fumbles lost": 2,
      "penalties": 7,
      "penalty yards": 71,
      "punts": 7,
      "punt yards": 299,
      "punt returns": 4,
      "punt return yards": -10,
      "kickoff returns": 2,
      "kickoff return yards": 45,
      "interception returns": 0,
      "interception return yards": 0,
      "3rd down conversions": 4,
      "3rd down attempts": 14,
      "4th down conversions": 1,
      "4th down attempts": 2
    },
    "BostonCollege": {
      "points": 35,
      "1st downs": 19,
      "rushing 1st downs": 12,
      "passing 1st downs": 3,
      "penalty 1st downs": 4,
      "rushing yards": 241,
      "rushing attempts": 55,
      "passing yards": 88,
      "passing attempts": 21,
      "passing completions": 7,
      "passing interceptions": 0,
      "total yards": 329,
      "total plays": 76,
      "fumbles": 0,
      "fumbles lost": 0,
      "penalties": 1,
      "penalty yards": 10,
      "punts": 4,
      "punt yards": 176,
      "punt returns": 3,
      "punt return yards": 30,
      "kickoff returns": 2,
      "kickoff return yards": 68,
      "interception returns": 1,
      "interception return yards": 1,
      "3rd down conversions": 6,
      "3rd down attempts": 16,
      "4th down conversions": 2,
      "4th down attempts": 4
    }
  },
  "Tulane vs Memphis": {
    "stadium": "LibertyBowlMemorialStadium-Memphis-TN",
    "Tulane": {
      "points": 26,
      "1st downs": 18,
      "rushing 1st downs": 11,
      "passing 1st downs": 6,
      "penalty 1st downs": 1,
      "rushing yards": 122,
      "rushing attempts": 52,
      "passing yards": 203,
      "passing attempts": 31,
      "passing completions": 15,
      "passing interceptions": 0,
      "total yards": 325,
      "total plays": 83,
      "fumbles": 2,
      "fumbles lost": 0,
      "penalties": 4,
      "penalty yards": 27,
      "punts": 7,
      "punt yards": 264,
      "punt returns": 0,
      "punt return yards": 0,
      "kickoff returns": 9,
      "kickoff return yards": 179,
      "interception returns": 1,
      "interception return yards": 1,
      "3rd down conversions": 11,
      "3rd down attempts": 23,
      "4th down conversions": 2,
      "4th down attempts": 3
    },
    "Memphis": {
      "points": 56,
      "1st downs": 19,
      "rushing 1st downs": 6,
      "passing 1st downs": 12,
      "penalty 1st downs": 1,
      "rushing yards": 259,
      "rushing attempts": 32,
      "passing yards": 298,
      "passing attempts": 31,
      "passing completions": 18,
      "passing interceptions": 1,
      "total yards": 557,
      "total plays": 63,
      "fumbles": 0,
      "fumbles lost": 0,
      "penalties": 8,
      "penalty yards": 80,
      "punts": 4,
      "punt yards": 154,
      "punt returns": 0,
      "punt return yards": 0,
      "kickoff returns": 2,
      "kickoff return yards": 18,
      "interception returns": 0,
      "interception return yards": 0,
      "3rd down conversions": 9,
      "3rd down attempts": 14,
      "4th down conversions": 0,
      "4th down attempts": 1
    }
  },
  "Tulsa vs SouthernMethodist": {
    "stadium": "GeraldJFordStadium-Dallas-TX",
    "Tulsa": {
      "points": 34,
      "1st downs": 22,
      "rushing 1st downs": 12,
      "passing 1st downs": 6,
      "penalty 1st downs": 4,
      "rushing yards": 246,
      "rushing attempts": 53,
      "passing yards": 212,
      "passing attempts": 25,
      "passing completions": 9,
      "passing interceptions": 1,
      "total yards": 458,
      "total plays": 78,
      "fumbles": 0,
      "fumbles lost": 0,
      "penalties": 8,
      "penalty yards": 73,
      "punts": 4,
      "punt yards": 163,
      "punt returns": 0,
      "punt return yards": 0,
      "kickoff returns": 4,
      "kickoff return yards": 108,
      "interception returns": 0,
      "interception return yards": 0,
      "3rd down conversions": 10,
      "3rd down attempts": 19,
      "4th down conversions": 0,
      "4th down attempts": 1
    },
    "SouthernMethodist": {
      "points": 38,
      "1st downs": 20,
      "rushing 1st downs": 5,
      "passing 1st downs": 13,
      "penalty 1st downs": 2,
      "rushing yards": 215,
      "rushing attempts": 30,
      "passing yards": 366,
      "passing attempts": 34,
      "passing completions": 20,
      "passing interceptions": 0,
      "total yards": 581,
      "total plays": 64,
      "fumbles": 2,
      "fumbles lost": 0,
      "penalties": 7,
      "penalty yards": 90,
      "punts": 5,
      "punt yards": 209,
      "punt returns": 1,
      "punt return yards": -4,
      "kickoff returns": 3,
      "kickoff return yards": 61,
      "interception returns": 1,
      "interception return yards": 0,
      "3rd down conversions": 4,
      "3rd down attempts": 13,
      "4th down conversions": 0,
      "4th down attempts": 1
    }
  },
  "Buffalo vs Akron": {
    "stadium": "InfoCisionStadiumSummaField-Akron-OH",
    "Buffalo": {
      "points": 20,
      "1st downs": 28,
      "rushing 1st downs": 9,
      "passing 1st downs": 17,
      "penalty 1st downs": 2,
      "rushing yards": 141,
      "rushing attempts": 34,
      "passing yards": 313,
      "passing attempts": 50,
      "passing completions": 34,
      "passing interceptions": 1,
      "total yards": 454,
      "total plays": 84,
      "fumbles": 0,
      "fumbles lost": 0,
      "penalties": 4,
      "penalty yards": 31,
      "punts": 4,
      "punt yards": 144,
      "punt returns": 0,
      "punt return yards": 0,
      "kickoff returns": 3,
      "kickoff return yards": 56,
      "interception returns": 1,
      "interception return yards": 0,
      "3rd down conversions": 8,
      "3rd down attempts": 18,
      "4th down conversions": 2,
      "4th down attempts": 2
    },
    "Akron": {
      "points": 21,
      "1st downs": 19,
      "rushing 1st downs": 7,
      "passing 1st downs": 12,
      "penalty 1st downs": 0,
      "rushing yards": 81,
      "rushing attempts": 25,
      "passing yards": 286,
      "passing attempts": 29,
      "passing completions": 21,
      "passing interceptions": 1,
      "total yards": 367,
      "total plays": 54,
      "fumbles": 1,
      "fumbles lost": 0,
      "penalties": 4,
      "penalty yards": 49,
      "punts": 4,
      "punt yards": 167,
      "punt returns": 0,
      "punt return yards": 0,
      "kickoff returns": 4,
      "kickoff return yards": 88,
      "interception returns": 1,
      "interception return yards": 0,
      "3rd down conversions": 7,
      "3rd down attempts": 12,
      "4th down conversions": 0,
      "4th down attempts": 0
    }
  },
  "OklahomaState vs WestVirginia": {
    "stadium": "MountaineerFieldatMilanPuskarStadium-Morgantown-WV",
    "OklahomaState": {
      "points": 50,
      "1st downs": 27,
      "rushing 1st downs": 14,
      "passing 1st downs": 12,
      "penalty 1st downs": 1,
      "rushing yards": 246,
      "rushing attempts": 56,
      "passing yards": 216,
      "passing attempts": 34,
      "passing completions": 20,
      "passing interceptions": 1,
      "total yards": 462,
      "total plays": 90,
      "fumbles": 3,
      "fumbles lost": 3,
      "penalties": 6,
      "penalty yards": 56,
      "punts": 3,
      "punt yards": 116,
      "punt returns": 2,
      "punt return yards": 26,
      "kickoff returns": 4,
      "kickoff return yards": 46,
      "interception returns": 4,
      "interception return yards": 102,
      "3rd down conversions": 8,
      "3rd down attempts": 18,
      "4th down conversions": 3,
      "4th down attempts": 3
    },
    "WestVirginia": {
      "points": 39,
      "1st downs": 20,
      "rushing 1st downs": 6,
      "passing 1st downs": 10,
      "penalty 1st downs": 4,
      "rushing yards": 62,
      "rushing attempts": 30,
      "passing yards": 285,
      "passing attempts": 42,
      "passing completions": 20,
      "passing interceptions": 4,
      "total yards": 347,
      "total plays": 72,
      "fumbles": 2,
      "fumbles lost": 1,
      "penalties": 6,
      "penalty yards": 41,
      "punts": 6,
      "punt yards": 241,
      "punt returns": 0,
      "punt return yards": 0,
      "kickoff returns": 4,
      "kickoff return yards": 85,
      "interception returns": 1,
      "interception return yards": 39,
      "3rd down conversions": 2,
      "3rd down attempts": 15,
      "4th down conversions": 3,
      "4th down attempts": 3
    }
  },
  "Wisconsin vs Illinois": {
    "stadium": "MemorialStadiumChampaign-IL-Champaign",
    "Wisconsin": {
      "points": 24,
      "1st downs": 19,
      "rushing 1st downs": 9,
      "passing 1st downs": 8,
      "penalty 1st downs": 2,
      "rushing yards": 168,
      "rushing attempts": 45,
      "passing yards": 135,
      "passing attempts": 19,
      "passing completions": 10,
      "passing interceptions": 1,
      "total yards": 303,
      "total plays": 64,
      "fumbles": 1,
      "fumbles lost": 0,
      "penalties": 4,
      "penalty yards": 50,
      "punts": 5,
      "punt yards": 183,
      "punt returns": 1,
      "punt return yards": 0,
      "kickoff returns": 1,
      "kickoff return yards": 29,
      "interception returns": 2,
      "interception return yards": 46,
      "3rd down conversions": 5,
      "3rd down attempts": 12,
      "4th down conversions": 1,
      "4th down attempts": 1
    },
    "Illinois": {
      "points": 10,
      "1st downs": 17,
      "rushing 1st downs": 8,
      "passing 1st downs": 6,
      "penalty 1st downs": 3,
      "rushing yards": 134,
      "rushing attempts": 33,
      "passing yards": 152,
      "passing attempts": 31,
      "passing completions": 9,
      "passing interceptions": 2,
      "total yards": 286,
      "total plays": 64,
      "fumbles": 2,
      "fumbles lost": 1,
      "penalties": 5,
      "penalty yards": 40,
      "punts": 4,
      "punt yards": 164,
      "punt returns": 1,
      "punt return yards": 8,
      "kickoff returns": 0,
      "kickoff return yards": 0,
      "interception returns": 1,
      "interception return yards": 20,
      "3rd down conversions": 6,
      "3rd down attempts": 14,
      "4th down conversions": 0,
      "4th down attempts": 0
    }
  },
  "MiamiFL vs NorthCarolina": {
    "stadium": "KenanMemorialStadium-ChapelHill-NC",
    "MiamiFL": {
      "points": 24,
      "1st downs": 16,
      "rushing 1st downs": 4,
      "passing 1st downs": 10,
      "penalty 1st downs": 2,
      "rushing yards": 59,
      "rushing attempts": 32,
      "passing yards": 356,
      "passing attempts": 41,
      "passing completions": 17,
      "passing interceptions": 1,
      "total yards": 415,
      "total plays": 73,
      "fumbles": 3,
      "fumbles lost": 1,
      "penalties": 5,
      "penalty yards": 60,
      "punts": 8,
      "punt yards": 305,
      "punt returns": 1,
      "punt return yards": 15,
      "kickoff returns": 2,
      "kickoff return yards": 30,
      "interception returns": 3,
      "interception return yards": 16,
      "3rd down conversions": 4,
      "3rd down attempts": 17,
      "4th down conversions": 1,
      "4th down attempts": 2
    },
    "NorthCarolina": {
      "points": 19,
      "1st downs": 27,
      "rushing 1st downs": 12,
      "passing 1st downs": 12,
      "penalty 1st downs": 3,
      "rushing yards": 176,
      "rushing attempts": 46,
      "passing yards": 252,
      "passing attempts": 46,
      "passing completions": 20,
      "passing interceptions": 3,
      "total yards": 428,
      "total plays": 92,
      "fumbles": 1,
      "fumbles lost": 1,
      "penalties": 7,
      "penalty yards": 56,
      "punts": 5,
      "punt yards": 240,
      "punt returns": 0,
      "punt return yards": 0,
      "kickoff returns": 2,
      "kickoff return yards": 52,
      "interception returns": 1,
      "interception return yards": 8,
      "3rd down conversions": 6,
      "3rd down attempts": 18,
      "4th down conversions": 2,
      "4th down attempts": 4
    }
  },
  "Texas vs Baylor": {
    "stadium": "McLaneStadium-Waco-TX",
    "Texas": {
      "points": 38,
      "1st downs": 19,
      "rushing 1st downs": 8,
      "passing 1st downs": 11,
      "penalty 1st downs": 0,
      "rushing yards": 171,
      "rushing attempts": 35,
      "passing yards": 256,
      "passing attempts": 36,
      "passing completions": 27,
      "passing interceptions": 1,
      "total yards": 427,
      "total plays": 71,
      "fumbles": 0,
      "fumbles lost": 0,
      "penalties": 7,
      "penalty yards": 72,
      "punts": 6,
      "punt yards": 267,
      "punt returns": 2,
      "punt return yards": -1,
      "kickoff returns": 2,
      "kickoff return yards": 55,
      "interception returns": 1,
      "interception return yards": 43,
      "3rd down conversions": 5,
      "3rd down attempts": 15,
      "4th down conversions": 0,
      "4th down attempts": 2
    },
    "Baylor": {
      "points": 7,
      "1st downs": 12,
      "rushing 1st downs": 6,
      "passing 1st downs": 5,
      "penalty 1st downs": 1,
      "rushing yards": 31,
      "rushing attempts": 37,
      "passing yards": 218,
      "passing attempts": 38,
      "passing completions": 21,
      "passing interceptions": 1,
      "total yards": 249,
      "total plays": 75,
      "fumbles": 2,
      "fumbles lost": 2,
      "penalties": 6,
      "penalty yards": 34,
      "punts": 8,
      "punt yards": 316,
      "punt returns": 1,
      "punt return yards": 5,
      "kickoff returns": 4,
      "kickoff return yards": 95,
      "interception returns": 1,
      "interception return yards": 20,
      "3rd down conversions": 4,
      "3rd down attempts": 18,
      "4th down conversions": 1,
      "4th down attempts": 5
    }
  },
  "Arkansas vs OleMiss": {
    "stadium": "VaughtHemingwayStadium-Oxford-MS",
    "Arkansas": {
      "points": 38,
      "1st downs": 27,
      "rushing 1st downs": 15,
      "passing 1st downs": 10,
      "penalty 1st downs": 2,
      "rushing yards": 260,
      "rushing attempts": 53,
      "passing yards": 189,
      "passing attempts": 30,
      "passing completions": 19,
      "passing interceptions": 1,
      "total yards": 449,
      "total plays": 83,
      "fumbles": 1,
      "fumbles lost": 1,
      "penalties": 1,
      "penalty yards": 10,
      "punts": 3,
      "punt yards": 113,
      "punt returns": 0,
      "punt return yards": 0,
      "kickoff returns": 7,
      "kickoff return yards": 156,
      "interception returns": 1,
      "interception return yards": 54,
      "3rd down conversions": 12,
      "3rd down attempts": 19,
      "4th down conversions": 0,
      "4th down attempts": 2
    },
    "OleMiss": {
      "points": 37,
      "1st downs": 22,
      "rushing 1st downs": 8,
      "passing 1st downs": 14,
      "penalty 1st downs": 0,
      "rushing yards": 198,
      "rushing attempts": 29,
      "passing yards": 368,
      "passing attempts": 30,
      "passing completions": 20,
      "passing interceptions": 1,
      "total yards": 566,
      "total plays": 59,
      "fumbles": 2,
      "fumbles lost": 2,
      "penalties": 3,
      "penalty yards": 27,
      "punts": 2,
      "punt yards": 88,
      "punt returns": 1,
      "punt return yards": 15,
      "kickoff returns": 7,
      "kickoff return yards": 127,
      "interception returns": 1,
      "interception return yards": 15,
      "3rd down conversions": 4,
      "3rd down attempts": 9,
      "4th down conversions": 0,
      "4th down attempts": 0
    }
  },
  "Rutgers vs Michigan": {
    "stadium": "MichiganStadium-AnnArbor-MI",
    "Rutgers": {
      "points": 14,
      "1st downs": 9,
      "rushing 1st downs": 4,
      "passing 1st downs": 4,
      "penalty 1st downs": 1,
      "rushing yards": 94,
      "rushing attempts": 31,
      "passing yards": 101,
      "passing attempts": 16,
      "passing completions": 8,
      "passing interceptions": 0,
      "total yards": 195,
      "total plays": 47,
      "fumbles": 1,
      "fumbles lost": 0,
      "penalties": 3,
      "penalty yards": 20,
      "punts": 8,
      "punt yards": 352,
      "punt returns": 0,
      "punt return yards": 0,
      "kickoff returns": 3,
      "kickoff return yards": 61,
      "interception returns": 1,
      "interception return yards": 3,
      "3rd down conversions": 3,
      "3rd down attempts": 11,
      "4th down conversions": 0,
      "4th down attempts": 0
    },
    "Michigan": {
      "points": 35,
      "1st downs": 25,
      "rushing 1st downs": 16,
      "passing 1st downs": 9,
      "penalty 1st downs": 0,
      "rushing yards": 334,
      "rushing attempts": 51,
      "passing yards": 137,
      "passing attempts": 20,
      "passing completions": 13,
      "passing interceptions": 1,
      "total yards": 471,
      "total plays": 71,
      "fumbles": 3,
      "fumbles lost": 0,
      "penalties": 3,
      "penalty yards": 25,
      "punts": 3,
      "punt yards": 125,
      "punt returns": 3,
      "punt return yards": 28,
      "kickoff returns": 3,
      "kickoff return yards": 59,
      "interception returns": 0,
      "interception return yards": 0,
      "3rd down conversions": 3,
      "3rd down attempts": 9,
      "4th down conversions": 1,
      "4th down attempts": 2
    }
  },
  "Louisville vs WakeForest": {
    "stadium": "BBTField-WinstonSalem-NC",
    "Louisville": {
      "points": 32,
      "1st downs": 30,
      "rushing 1st downs": 10,
      "passing 1st downs": 19,
      "penalty 1st downs": 1,
      "rushing yards": 191,
      "rushing attempts": 42,
      "passing yards": 332,
      "passing attempts": 46,
      "passing completions": 28,
      "passing interceptions": 1,
      "total yards": 523,
      "total plays": 88,
      "fumbles": 1,
      "fumbles lost": 0,
      "penalties": 0,
      "penalty yards": 0,
      "punts": 5,
      "punt yards": 196,
      "punt returns": 1,
      "punt return yards": -2,
      "kickoff returns": 2,
      "kickoff return yards": 31,
      "interception returns": 0,
      "interception return yards": 0,
      "3rd down conversions": 7,
      "3rd down attempts": 17,
      "4th down conversions": 2,
      "4th down attempts": 3
    },
    "WakeForest": {
      "points": 42,
      "1st downs": 26,
      "rushing 1st downs": 10,
      "passing 1st downs": 16,
      "penalty 1st downs": 0,
      "rushing yards": 164,
      "rushing attempts": 39,
      "passing yards": 461,
      "passing attempts": 34,
      "passing completions": 28,
      "passing interceptions": 0,
      "total yards": 625,
      "total plays": 73,
      "fumbles": 1,
      "fumbles lost": 1,
      "penalties": 6,
      "penalty yards": 55,
      "punts": 2,
      "punt yards": 77,
      "punt returns": 2,
      "punt return yards": 5,
      "kickoff returns": 4,
      "kickoff return yards": 50,
      "interception returns": 1,
      "interception return yards": 0,
      "3rd down conversions": 8,
      "3rd down attempts": 13,
      "4th down conversions": 1,
      "4th down attempts": 3
    }
  },
  "Virginia vs Pittsburgh": {
    "stadium": "HeinzField-Pittsburgh-PA",
    "Virginia": {
      "points": 14,
      "1st downs": 20,
      "rushing 1st downs": 4,
      "passing 1st downs": 12,
      "penalty 1st downs": 4,
      "rushing yards": 102,
      "rushing attempts": 31,
      "passing yards": 212,
      "passing attempts": 42,
      "passing completions": 22,
      "passing interceptions": 1,
      "total yards": 314,
      "total plays": 73,
      "fumbles": 0,
      "fumbles lost": 0,
      "penalties": 3,
      "penalty yards": 45,
      "punts": 4,
      "punt yards": 182,
      "punt returns": 3,
      "punt return yards": 18,
      "kickoff returns": 4,
      "kickoff return yards": 130,
      "interception returns": 1,
      "interception return yards": 1,
      "3rd down conversions": 6,
      "3rd down attempts": 17,
      "4th down conversions": 1,
      "4th down attempts": 5
    },
    "Pittsburgh": {
      "points": 31,
      "1st downs": 19,
      "rushing 1st downs": 11,
      "passing 1st downs": 6,
      "penalty 1st downs": 2,
      "rushing yards": 176,
      "rushing attempts": 40,
      "passing yards": 134,
      "passing attempts": 18,
      "passing completions": 10,
      "passing interceptions": 1,
      "total yards": 310,
      "total plays": 58,
      "fumbles": 1,
      "fumbles lost": 0,
      "penalties": 6,
      "penalty yards": 65,
      "punts": 3,
      "punt yards": 110,
      "punt returns": 2,
      "punt return yards": 75,
      "kickoff returns": 1,
      "kickoff return yards": 3,
      "interception returns": 1,
      "interception return yards": 16,
      "3rd down conversions": 5,
      "3rd down attempts": 12,
      "4th down conversions": 0,
      "4th down attempts": 0
    }
  },
  "California vs Colorado": {
    "stadium": "FolsomField-Boulder-CO",
    "California": {
      "points": 28,
      "1st downs": 26,
      "rushing 1st downs": 8,
      "passing 1st downs": 16,
      "penalty 1st downs": 2,
      "rushing yards": 61,
      "rushing attempts": 25,
      "passing yards": 374,
      "passing attempts": 53,
      "passing completions": 30,
      "passing interceptions": 1,
      "total yards": 435,
      "total plays": 78,
      "fumbles": 1,
      "fumbles lost": 0,
      "penalties": 4,
      "penalty yards": 35,
      "punts": 7,
      "punt yards": 333,
      "punt returns": 1,
      "punt return yards": 5,
      "kickoff returns": 3,
      "kickoff return yards": 57,
      "interception returns": 0,
      "interception return yards": 0,
      "3rd down conversions": 8,
      "3rd down attempts": 17,
      "4th down conversions": 2,
      "4th down attempts": 2
    },
    "Colorado": {
      "points": 44,
      "1st downs": 27,
      "rushing 1st downs": 16,
      "passing 1st downs": 10,
      "penalty 1st downs": 1,
      "rushing yards": 200,
      "rushing attempts": 53,
      "passing yards": 353,
      "passing attempts": 27,
      "passing completions": 21,
      "passing interceptions": 0,
      "total yards": 553,
      "total plays": 80,
      "fumbles": 1,
      "fumbles lost": 0,
      "penalties": 7,
      "penalty yards": 58,
      "punts": 3,
      "punt yards": 148,
      "punt returns": 4,
      "punt return yards": 26,
      "kickoff returns": 1,
      "kickoff return yards": 25,
      "interception returns": 1,
      "interception return yards": 100,
      "3rd down conversions": 11,
      "3rd down attempts": 17,
      "4th down conversions": 0,
      "4th down attempts": 1
    }
  },
  "FloridaInternational vs Marshall": {
    "stadium": "JoanCEdwardsStadium-Huntington-WV",
    "FloridaInternational": {
      "points": 41,
      "1st downs": 0,
      "rushing 1st downs": 0,
      "passing 1st downs": 0,
      "penalty 1st downs": 0,
      "rushing yards": 224,
      "rushing attempts": 48,
      "passing yards": 177,
      "passing attempts": 18,
      "passing completions": 14,
      "passing interceptions": 0,
      "total yards": 401,
      "total plays": 66,
      "fumbles": 0,
      "fumbles lost": 0,
      "penalties": 6,
      "penalty yards": 60,
      "punts": 6,
      "punt yards": 209,
      "punt returns": 0,
      "punt return yards": 0,
      "kickoff returns": 3,
      "kickoff return yards": 33,
      "interception returns": 2,
      "interception return yards": 0,
      "3rd down conversions": 0,
      "3rd down attempts": 0,
      "4th down conversions": 0,
      "4th down attempts": 0
    },
    "Marshall": {
      "points": 30,
      "1st downs": 0,
      "rushing 1st downs": 0,
      "passing 1st downs": 0,
      "penalty 1st downs": 0,
      "rushing yards": 142,
      "rushing attempts": 29,
      "passing yards": 363,
      "passing attempts": 52,
      "passing completions": 33,
      "passing interceptions": 2,
      "total yards": 505,
      "total plays": 81,
      "fumbles": 0,
      "fumbles lost": 0,
      "penalties": 3,
      "penalty yards": 35,
      "punts": 2,
      "punt yards": 70,
      "punt returns": 1,
      "punt return yards": 0,
      "kickoff returns": 7,
      "kickoff return yards": 124,
      "interception returns": 0,
      "interception return yards": 0,
      "3rd down conversions": 0,
      "3rd down attempts": 0,
      "4th down conversions": 0,
      "4th down attempts": 0
    }
  },
  "KansasState vs Kansas": {
    "stadium": "MemorialStadiumLawrence-KS-Lawrence",
    "KansasState": {
      "points": 30,
      "1st downs": 15,
      "rushing 1st downs": 11,
      "passing 1st downs": 4,
      "penalty 1st downs": 0,
      "rushing yards": 202,
      "rushing attempts": 43,
      "passing yards": 138,
      "passing attempts": 13,
      "passing completions": 8,
      "passing interceptions": 0,
      "total yards": 340,
      "total plays": 56,
      "fumbles": 1,
      "fumbles lost": 1,
      "penalties": 6,
      "penalty yards": 35,
      "punts": 4,
      "punt yards": 176,
      "punt returns": 3,
      "punt return yards": 61,
      "kickoff returns": 5,
      "kickoff return yards": 183,
      "interception returns": 1,
      "interception return yards": 0,
      "3rd down conversions": 3,
      "3rd down attempts": 11,
      "4th down conversions": 0,
      "4th down attempts": 1
    },
    "Kansas": {
      "points": 20,
      "1st downs": 20,
      "rushing 1st downs": 6,
      "passing 1st downs": 14,
      "penalty 1st downs": 0,
      "rushing yards": 64,
      "rushing attempts": 28,
      "passing yards": 418,
      "passing attempts": 48,
      "passing completions": 23,
      "passing interceptions": 1,
      "total yards": 482,
      "total plays": 76,
      "fumbles": 2,
      "fumbles lost": 1,
      "penalties": 4,
      "penalty yards": 42,
      "punts": 6,
      "punt yards": 194,
      "punt returns": 1,
      "punt return yards": 13,
      "kickoff returns": 4,
      "kickoff return yards": 65,
      "interception returns": 0,
      "interception return yards": 0,
      "3rd down conversions": 6,
      "3rd down attempts": 16,
      "4th down conversions": 0,
      "4th down attempts": 2
    }
  },
  "AirForce vs ColoradoState": {
    "stadium": "SonnyLubickFieldatHughesStadium-FortCollins-CO",
    "AirForce": {
      "points": 45,
      "1st downs": 30,
      "rushing 1st downs": 26,
      "passing 1st downs": 1,
      "penalty 1st downs": 3,
      "rushing yards": 413,
      "rushing attempts": 74,
      "passing yards": 64,
      "passing attempts": 4,
      "passing completions": 2,
      "passing interceptions": 1,
      "total yards": 477,
      "total plays": 78,
      "fumbles": 1,
      "fumbles lost": 0,
      "penalties": 4,
      "penalty yards": 28,
      "punts": 1,
      "punt yards": 69,
      "punt returns": 1,
      "punt return yards": 6,
      "kickoff returns": 0,
      "kickoff return yards": 0,
      "interception returns": 3,
      "interception return yards": 30,
      "3rd down conversions": 8,
      "3rd down attempts": 13,
      "4th down conversions": 1,
      "4th down attempts": 1
    },
    "ColoradoState": {
      "points": 28,
      "1st downs": 22,
      "rushing 1st downs": 7,
      "passing 1st downs": 13,
      "penalty 1st downs": 2,
      "rushing yards": 166,
      "rushing attempts": 23,
      "passing yards": 269,
      "passing attempts": 31,
      "passing completions": 17,
      "passing interceptions": 3,
      "total yards": 435,
      "total plays": 54,
      "fumbles": 0,
      "fumbles lost": 0,
      "penalties": 4,
      "penalty yards": 40,
      "punts": 2,
      "punt yards": 96,
      "punt returns": 0,
      "punt return yards": 0,
      "kickoff returns": 3,
      "kickoff return yards": 22,
      "interception returns": 1,
      "interception return yards": 5,
      "3rd down conversions": 6,
      "3rd down attempts": 10,
      "4th down conversions": 2,
      "4th down attempts": 2
    }
  },
  "SanJoseState vs BrighamYoung": {
    "stadium": "LaVellEdwardsStadium-Provo-UT",
    "SanJoseState": {
      "points": 20,
      "1st downs": 23,
      "rushing 1st downs": 9,
      "passing 1st downs": 12,
      "penalty 1st downs": 2,
      "rushing yards": 140,
      "rushing attempts": 41,
      "passing yards": 198,
      "passing attempts": 39,
      "passing completions": 25,
      "passing interceptions": 1,
      "total yards": 338,
      "total plays": 80,
      "fumbles": 6,
      "fumbles lost": 4,
      "penalties": 2,
      "penalty yards": 10,
      "punts": 5,
      "punt yards": 223,
      "punt returns": 2,
      "punt return yards": 2,
      "kickoff returns": 5,
      "kickoff return yards": 77,
      "interception returns": 1,
      "interception return yards": 0,
      "3rd down conversions": 7,
      "3rd down attempts": 17,
      "4th down conversions": 3,
      "4th down attempts": 3
    },
    "BrighamYoung": {
      "points": 41,
      "1st downs": 22,
      "rushing 1st downs": 7,
      "passing 1st downs": 15,
      "penalty 1st downs": 0,
      "rushing yards": 266,
      "rushing attempts": 39,
      "passing yards": 332,
      "passing attempts": 38,
      "passing completions": 21,
      "passing interceptions": 1,
      "total yards": 598,
      "total plays": 77,
      "fumbles": 1,
      "fumbles lost": 1,
      "penalties": 6,
      "penalty yards": 65,
      "punts": 3,
      "punt yards": 128,
      "punt returns": 1,
      "punt return yards": 2,
      "kickoff returns": 2,
      "kickoff return yards": 16,
      "interception returns": 1,
      "interception return yards": 0,
      "3rd down conversions": 5,
      "3rd down attempts": 15,
      "4th down conversions": 3,
      "4th down attempts": 3
    }
  },
  "PennState vs OhioState": {
    "stadium": "OhioStadium-Columbus-OH",
    "PennState": {
      "points": 38,
      "1st downs": 17,
      "rushing 1st downs": 5,
      "passing 1st downs": 9,
      "penalty 1st downs": 3,
      "rushing yards": 91,
      "rushing attempts": 35,
      "passing yards": 192,
      "passing attempts": 29,
      "passing completions": 17,
      "passing interceptions": 0,
      "total yards": 283,
      "total plays": 64,
      "fumbles": 0,
      "fumbles lost": 0,
      "penalties": 9,
      "penalty yards": 73,
      "punts": 5,
      "punt yards": 213,
      "punt returns": 0,
      "punt return yards": 0,
      "kickoff returns": 7,
      "kickoff return yards": 185,
      "interception returns": 0,
      "interception return yards": 0,
      "3rd down conversions": 7,
      "3rd down attempts": 15,
      "4th down conversions": 0,
      "4th down attempts": 1
    },
    "OhioState": {
      "points": 39,
      "1st downs": 27,
      "rushing 1st downs": 10,
      "passing 1st downs": 14,
      "penalty 1st downs": 3,
      "rushing yards": 201,
      "rushing attempts": 39,
      "passing yards": 328,
      "passing attempts": 39,
      "passing completions": 33,
      "passing interceptions": 0,
      "total yards": 529,
      "total plays": 78,
      "fumbles": 2,
      "fumbles lost": 2,
      "penalties": 10,
      "penalty yards": 79,
      "punts": 3,
      "punt yards": 130,
      "punt returns": 3,
      "punt return yards": 23,
      "kickoff returns": 6,
      "kickoff return yards": 137,
      "interception returns": 0,
      "interception return yards": 0,
      "3rd down conversions": 5,
      "3rd down attempts": 12,
      "4th down conversions": 0,
      "4th down attempts": 1
    }
  },
  "AppalachianState vs Massachusetts": {
    "stadium": "WarrenMcGuirkAlumniStadium-Amherst-MA",
    "AppalachianState": {
      "points": 27,
      "1st downs": 15,
      "rushing 1st downs": 9,
      "passing 1st downs": 5,
      "penalty 1st downs": 1,
      "rushing yards": 234,
      "rushing attempts": 47,
      "passing yards": 133,
      "passing attempts": 29,
      "passing completions": 14,
      "passing interceptions": 1,
      "total yards": 367,
      "total plays": 76,
      "fumbles": 2,
      "fumbles lost": 2,
      "penalties": 11,
      "penalty yards": 104,
      "punts": 8,
      "punt yards": 302,
      "punt returns": 5,
      "punt return yards": 57,
      "kickoff returns": 2,
      "kickoff return yards": 44,
      "interception returns": 2,
      "interception return yards": 53,
      "3rd down conversions": 5,
      "3rd down attempts": 18,
      "4th down conversions": 1,
      "4th down attempts": 3
    },
    "Massachusetts": {
      "points": 30,
      "1st downs": 18,
      "rushing 1st downs": 6,
      "passing 1st downs": 9,
      "penalty 1st downs": 3,
      "rushing yards": 209,
      "rushing attempts": 39,
      "passing yards": 190,
      "passing attempts": 33,
      "passing completions": 20,
      "passing interceptions": 2,
      "total yards": 399,
      "total plays": 72,
      "fumbles": 2,
      "fumbles lost": 2,
      "penalties": 11,
      "penalty yards": 82,
      "punts": 8,
      "punt yards": 357,
      "punt returns": 2,
      "punt return yards": 25,
      "kickoff returns": 3,
      "kickoff return yards": 37,
      "interception returns": 1,
      "interception return yards": -2,
      "3rd down conversions": 3,
      "3rd down attempts": 16,
      "4th down conversions": 0,
      "4th down attempts": 0
    }
  },
  "NorthCarolinaState vs NotreDame": {
    "stadium": "NotreDameStadium-SouthBend-IN",
    "NorthCarolinaState": {
      "points": 14,
      "1st downs": 14,
      "rushing 1st downs": 4,
      "passing 1st downs": 9,
      "penalty 1st downs": 1,
      "rushing yards": 50,
      "rushing attempts": 24,
      "passing yards": 213,
      "passing attempts": 37,
      "passing completions": 17,
      "passing interceptions": 1,
      "total yards": 263,
      "total plays": 61,
      "fumbles": 1,
      "fumbles lost": 0,
      "penalties": 12,
      "penalty yards": 89,
      "punts": 8,
      "punt yards": 356,
      "punt returns": 1,
      "punt return yards": 11,
      "kickoff returns": 5,
      "kickoff return yards": 118,
      "interception returns": 0,
      "interception return yards": 0,
      "3rd down conversions": 5,
      "3rd down attempts": 16,
      "4th down conversions": 0,
      "4th down attempts": 2
    },
    "NotreDame": {
      "points": 35,
      "1st downs": 25,
      "rushing 1st downs": 15,
      "passing 1st downs": 6,
      "penalty 1st downs": 4,
      "rushing yards": 318,
      "rushing attempts": 54,
      "passing yards": 104,
      "passing attempts": 19,
      "passing completions": 10,
      "passing interceptions": 0,
      "total yards": 422,
      "total plays": 73,
      "fumbles": 0,
      "fumbles lost": 0,
      "penalties": 4,
      "penalty yards": 29,
      "punts": 6,
      "punt yards": 242,
      "punt returns": 3,
      "punt return yards": 11,
      "kickoff returns": 3,
      "kickoff return yards": 73,
      "interception returns": 1,
      "interception return yards": 69,
      "3rd down conversions": 9,
      "3rd down attempts": 16,
      "4th down conversions": 0,
      "4th down attempts": 0
    }
  },
  "UCLA vs Washington": {
    "stadium": "AlaskaAirlinesFieldatHuskyStadium-Seattle-WA",
    "UCLA": {
      "points": 23,
      "1st downs": 15,
      "rushing 1st downs": 4,
      "passing 1st downs": 9,
      "penalty 1st downs": 2,
      "rushing yards": 62,
      "rushing attempts": 28,
      "passing yards": 170,
      "passing attempts": 33,
      "passing completions": 19,
      "passing interceptions": 0,
      "total yards": 232,
      "total plays": 61,
      "fumbles": 1,
      "fumbles lost": 1,
      "penalties": 6,
      "penalty yards": 59,
      "punts": 8,
      "punt yards": 345,
      "punt returns": 1,
      "punt return yards": 0,
      "kickoff returns": 6,
      "kickoff return yards": 123,
      "interception returns": 1,
      "interception return yards": 0,
      "3rd down conversions": 3,
      "3rd down attempts": 14,
      "4th down conversions": 0,
      "4th down attempts": 0
    },
    "Washington": {
      "points": 44,
      "1st downs": 24,
      "rushing 1st downs": 15,
      "passing 1st downs": 6,
      "penalty 1st downs": 3,
      "rushing yards": 333,
      "rushing attempts": 58,
      "passing yards": 109,
      "passing attempts": 12,
      "passing completions": 9,
      "passing interceptions": 1,
      "total yards": 442,
      "total plays": 70,
      "fumbles": 3,
      "fumbles lost": 1,
      "penalties": 4,
      "penalty yards": 47,
      "punts": 2,
      "punt yards": 69,
      "punt returns": 5,
      "punt return yards": 55,
      "kickoff returns": 4,
      "kickoff return yards": 161,
      "interception returns": 0,
      "interception return yards": 0,
      "3rd down conversions": 5,
      "3rd down attempts": 11,
      "4th down conversions": 0,
      "4th down attempts": 0
    }
  },
  "LouisianaTech vs Rice": {
    "stadium": "RiceStadium-Houston-TX",
    "LouisianaTech": {
      "points": 42,
      "1st downs": 0,
      "rushing 1st downs": 0,
      "passing 1st downs": 0,
      "penalty 1st downs": 0,
      "rushing yards": 180,
      "rushing attempts": 39,
      "passing yards": 237,
      "passing attempts": 32,
      "passing completions": 21,
      "passing interceptions": 0,
      "total yards": 417,
      "total plays": 71,
      "fumbles": 0,
      "fumbles lost": 0,
      "penalties": 4,
      "penalty yards": 25,
      "punts": 4,
      "punt yards": 156,
      "punt returns": 1,
      "punt return yards": 0,
      "kickoff returns": 1,
      "kickoff return yards": 23,
      "interception returns": 3,
      "interception return yards": 0,
      "3rd down conversions": 0,
      "3rd down attempts": 0,
      "4th down conversions": 0,
      "4th down attempts": 0
    },
    "Rice": {
      "points": 28,
      "1st downs": 0,
      "rushing 1st downs": 0,
      "passing 1st downs": 0,
      "penalty 1st downs": 0,
      "rushing yards": 247,
      "rushing attempts": 46,
      "passing yards": 187,
      "passing attempts": 17,
      "passing completions": 7,
      "passing interceptions": 3,
      "total yards": 434,
      "total plays": 63,
      "fumbles": 0,
      "fumbles lost": 0,
      "penalties": 5,
      "penalty yards": 49,
      "punts": 3,
      "punt yards": 123,
      "punt returns": 0,
      "punt return yards": 0,
      "kickoff returns": 5,
      "kickoff return yards": 73,
      "interception returns": 0,
      "interception return yards": 0,
      "3rd down conversions": 0,
      "3rd down attempts": 0,
      "4th down conversions": 0,
      "4th down attempts": 0
    }
  },
  "MichiganState vs Northwestern": {
    "stadium": "RyanField-Evanston-IL",
    "MichiganState": {
      "points": 31,
      "1st downs": 28,
      "rushing 1st downs": 6,
      "passing 1st downs": 22,
      "penalty 1st downs": 0,
      "rushing yards": 95,
      "rushing attempts": 30,
      "passing yards": 445,
      "passing attempts": 57,
      "passing completions": 39,
      "passing interceptions": 1,
      "total yards": 540,
      "total plays": 87,
      "fumbles": 3,
      "fumbles lost": 1,
      "penalties": 9,
      "penalty yards": 84,
      "punts": 4,
      "punt yards": 167,
      "punt returns": 2,
      "punt return yards": -5,
      "kickoff returns": 2,
      "kickoff return yards": 36,
      "interception returns": 0,
      "interception return yards": 0,
      "3rd down conversions": 8,
      "3rd down attempts": 17,
      "4th down conversions": 2,
      "4th down attempts": 2
    },
    "Northwestern": {
      "points": 39,
      "1st downs": 28,
      "rushing 1st downs": 4,
      "passing 1st downs": 21,
      "penalty 1st downs": 3,
      "rushing yards": 64,
      "rushing attempts": 28,
      "passing yards": 368,
      "passing attempts": 50,
      "passing completions": 34,
      "passing interceptions": 0,
      "total yards": 432,
      "total plays": 78,
      "fumbles": 1,
      "fumbles lost": 1,
      "penalties": 1,
      "penalty yards": 9,
      "punts": 6,
      "punt yards": 222,
      "punt returns": 0,
      "punt return yards": 0,
      "kickoff returns": 2,
      "kickoff return yards": 31,
      "interception returns": 1,
      "interception return yards": 0,
      "3rd down conversions": 7,
      "3rd down attempts": 15,
      "4th down conversions": 1,
      "4th down attempts": 1
    }
  },
  "TCU vs IowaState": {
    "stadium": "JackTriceStadium-Ames-IA",
    "TCU": {
      "points": 7,
      "1st downs": 14,
      "rushing 1st downs": 6,
      "passing 1st downs": 7,
      "penalty 1st downs": 1,
      "rushing yards": 172,
      "rushing attempts": 34,
      "passing yards": 135,
      "passing attempts": 25,
      "passing completions": 12,
      "passing interceptions": 2,
      "total yards": 307,
      "total plays": 59,
      "fumbles": 2,
      "fumbles lost": 1,
      "penalties": 11,
      "penalty yards": 104,
      "punts": 9,
      "punt yards": 383,
      "punt returns": 0,
      "punt return yards": 0,
      "kickoff returns": 3,
      "kickoff return yards": 135,
      "interception returns": 1,
      "interception return yards": 0,
      "3rd down conversions": 4,
      "3rd down attempts": 14,
      "4th down conversions": 0,
      "4th down attempts": 0
    },
    "IowaState": {
      "points": 14,
      "1st downs": 17,
      "rushing 1st downs": 2,
      "passing 1st downs": 11,
      "penalty 1st downs": 4,
      "rushing yards": 53,
      "rushing attempts": 33,
      "passing yards": 202,
      "passing attempts": 35,
      "passing completions": 21,
      "passing interceptions": 1,
      "total yards": 255,
      "total plays": 68,
      "fumbles": 0,
      "fumbles lost": 0,
      "penalties": 4,
      "penalty yards": 35,
      "punts": 8,
      "punt yards": 296,
      "punt returns": 1,
      "punt return yards": 42,
      "kickoff returns": 2,
      "kickoff return yards": 49,
      "interception returns": 2,
      "interception return yards": 70,
      "3rd down conversions": 3,
      "3rd down attempts": 13,
      "4th down conversions": 0,
      "4th down attempts": 0
    }
  },
  "Indiana vs Maryland": {
    "stadium": "CapitalOneFieldatMarylandStadium-CollegePark-MD",
    "Indiana": {
      "points": 39,
      "1st downs": 35,
      "rushing 1st downs": 7,
      "passing 1st downs": 21,
      "penalty 1st downs": 7,
      "rushing yards": 73,
      "rushing attempts": 35,
      "passing yards": 410,
      "passing attempts": 62,
      "passing completions": 43,
      "passing interceptions": 1,
      "total yards": 483,
      "total plays": 97,
      "fumbles": 1,
      "fumbles lost": 0,
      "penalties": 7,
      "penalty yards": 70,
      "punts": 6,
      "punt yards": 236,
      "punt returns": 2,
      "punt return yards": -1,
      "kickoff returns": 5,
      "kickoff return yards": 97,
      "interception returns": 1,
      "interception return yards": 34,
      "3rd down conversions": 13,
      "3rd down attempts": 23,
      "4th down conversions": 0,
      "4th down attempts": 1
    },
    "Maryland": {
      "points": 42,
      "1st downs": 18,
      "rushing 1st downs": 8,
      "passing 1st downs": 6,
      "penalty 1st downs": 4,
      "rushing yards": 174,
      "rushing attempts": 40,
      "passing yards": 171,
      "passing attempts": 16,
      "passing completions": 10,
      "passing interceptions": 1,
      "total yards": 345,
      "total plays": 56,
      "fumbles": 1,
      "fumbles lost": 0,
      "penalties": 12,
      "penalty yards": 133,
      "punts": 5,
      "punt yards": 211,
      "punt returns": 2,
      "punt return yards": 41,
      "kickoff returns": 3,
      "kickoff return yards": 114,
      "interception returns": 1,
      "interception return yards": 18,
      "3rd down conversions": 3,
      "3rd down attempts": 8,
      "4th down conversions": 0,
      "4th down attempts": 0
    }
  },
  "GeorgiaSouthern vs Troy": {
    "stadium": "VeteransMemorialStadium-Troy-AL",
    "GeorgiaSouthern": {
      "points": 16,
      "1st downs": 19,
      "rushing 1st downs": 16,
      "passing 1st downs": 3,
      "penalty 1st downs": 0,
      "rushing yards": 227,
      "rushing attempts": 62,
      "passing yards": 82,
      "passing attempts": 12,
      "passing completions": 6,
      "passing interceptions": 1,
      "total yards": 309,
      "total plays": 74,
      "fumbles": 2,
      "fumbles lost": 0,
      "penalties": 4,
      "penalty yards": 30,
      "punts": 5,
      "punt yards": 179,
      "punt returns": 1,
      "punt return yards": 4,
      "kickoff returns": 7,
      "kickoff return yards": 156,
      "interception returns": 0,
      "interception return yards": 0,
      "3rd down conversions": 10,
      "3rd down attempts": 19,
      "4th down conversions": 2,
      "4th down attempts": 2
    },
    "Troy": {
      "points": 38,
      "1st downs": 16,
      "rushing 1st downs": 8,
      "passing 1st downs": 6,
      "penalty 1st downs": 2,
      "rushing yards": 241,
      "rushing attempts": 30,
      "passing yards": 142,
      "passing attempts": 20,
      "passing completions": 10,
      "passing interceptions": 0,
      "total yards": 383,
      "total plays": 50,
      "fumbles": 0,
      "fumbles lost": 0,
      "penalties": 4,
      "penalty yards": 18,
      "punts": 4,
      "punt yards": 173,
      "punt returns": 1,
      "punt return yards": 32,
      "kickoff returns": 1,
      "kickoff return yards": 29,
      "interception returns": 1,
      "interception return yards": 5,
      "3rd down conversions": 5,
      "3rd down attempts": 11,
      "4th down conversions": 1,
      "4th down attempts": 1
    }
  },
  "Georgia vs Florida": {
    "stadium": "EverBankField-Jacksonville-FL",
    "Georgia": {
      "points": 42,
      "1st downs": 14,
      "rushing 1st downs": 10,
      "passing 1st downs": 4,
      "penalty 1st downs": 0,
      "rushing yards": 292,
      "rushing attempts": 35,
      "passing yards": 101,
      "passing attempts": 7,
      "passing completions": 4,
      "passing interceptions": 1,
      "total yards": 393,
      "total plays": 42,
      "fumbles": 0,
      "fumbles lost": 0,
      "penalties": 7,
      "penalty yards": 40,
      "punts": 4,
      "punt yards": 186,
      "punt returns": 3,
      "punt return yards": 24,
      "kickoff returns": 0,
      "kickoff return yards": 0,
      "interception returns": 1,
      "interception return yards": 13,
      "3rd down conversions": 3,
      "3rd down attempts": 8,
      "4th down conversions": 0,
      "4th down attempts": 0
    },
    "Florida": {
      "points": 7,
      "1st downs": 16,
      "rushing 1st downs": 10,
      "passing 1st downs": 6,
      "penalty 1st downs": 0,
      "rushing yards": 183,
      "rushing attempts": 41,
      "passing yards": 66,
      "passing attempts": 25,
      "passing completions": 10,
      "passing interceptions": 1,
      "total yards": 249,
      "total plays": 66,
      "fumbles": 2,
      "fumbles lost": 1,
      "penalties": 14,
      "penalty yards": 85,
      "punts": 7,
      "punt yards": 381,
      "punt returns": 1,
      "punt return yards": 0,
      "kickoff returns": 3,
      "kickoff return yards": 68,
      "interception returns": 1,
      "interception return yards": 2,
      "3rd down conversions": 4,
      "3rd down attempts": 15,
      "4th down conversions": 0,
      "4th down attempts": 2
    }
  },
  "Houston vs SouthFlorida": {
    "stadium": "RaymondJamesStadium-Tampa-FL",
    "Houston": {
      "points": 28,
      "1st downs": 16,
      "rushing 1st downs": 11,
      "passing 1st downs": 5,
      "penalty 1st downs": 0,
      "rushing yards": 255,
      "rushing attempts": 48,
      "passing yards": 142,
      "passing attempts": 25,
      "passing completions": 14,
      "passing interceptions": 0,
      "total yards": 397,
      "total plays": 73,
      "fumbles": 2,
      "fumbles lost": 1,
      "penalties": 5,
      "penalty yards": 45,
      "punts": 8,
      "punt yards": 384,
      "punt returns": 5,
      "punt return yards": 20,
      "kickoff returns": 3,
      "kickoff return yards": 120,
      "interception returns": 0,
      "interception return yards": 0,
      "3rd down conversions": 4,
      "3rd down attempts": 15,
      "4th down conversions": 1,
      "4th down attempts": 3
    },
    "SouthFlorida": {
      "points": 24,
      "1st downs": 21,
      "rushing 1st downs": 6,
      "passing 1st downs": 14,
      "penalty 1st downs": 1,
      "rushing yards": 137,
      "rushing attempts": 55,
      "passing yards": 325,
      "passing attempts": 38,
      "passing completions": 23,
      "passing interceptions": 0,
      "total yards": 462,
      "total plays": 93,
      "fumbles": 0,
      "fumbles lost": 0,
      "penalties": 5,
      "penalty yards": 35,
      "punts": 9,
      "punt yards": 362,
      "punt returns": 2,
      "punt return yards": 10,
      "kickoff returns": 2,
      "kickoff return yards": 35,
      "interception returns": 0,
      "interception return yards": 0,
      "3rd down conversions": 7,
      "3rd down attempts": 23,
      "4th down conversions": 3,
      "4th down attempts": 5
    }
  },
  "Vanderbilt vs SouthCarolina": {
    "stadium": "WilliamsBriceStadium-Columbia-SC",
    "Vanderbilt": {
      "points": 27,
      "1st downs": 27,
      "rushing 1st downs": 8,
      "passing 1st downs": 15,
      "penalty 1st downs": 4,
      "rushing yards": 107,
      "rushing attempts": 23,
      "passing yards": 333,
      "passing attempts": 49,
      "passing completions": 27,
      "passing interceptions": 1,
      "total yards": 440,
      "total plays": 72,
      "fumbles": 1,
      "fumbles lost": 0,
      "penalties": 10,
      "penalty yards": 100,
      "punts": 4,
      "punt yards": 138,
      "punt returns": 3,
      "punt return yards": 21,
      "kickoff returns": 2,
      "kickoff return yards": 52,
      "interception returns": 0,
      "interception return yards": 0,
      "3rd down conversions": 8,
      "3rd down attempts": 15,
      "4th down conversions": 0,
      "4th down attempts": 2
    },
    "SouthCarolina": {
      "points": 34,
      "1st downs": 26,
      "rushing 1st downs": 14,
      "passing 1st downs": 8,
      "penalty 1st downs": 4,
      "rushing yards": 212,
      "rushing attempts": 37,
      "passing yards": 174,
      "passing attempts": 29,
      "passing completions": 19,
      "passing interceptions": 0,
      "total yards": 386,
      "total plays": 66,
      "fumbles": 0,
      "fumbles lost": 0,
      "penalties": 7,
      "penalty yards": 50,
      "punts": 3,
      "punt yards": 144,
      "punt returns": 0,
      "punt return yards": 0,
      "kickoff returns": 1,
      "kickoff return yards": 23,
      "interception returns": 1,
      "interception return yards": 10,
      "3rd down conversions": 7,
      "3rd down attempts": 14,
      "4th down conversions": 0,
      "4th down attempts": 0
    }
  },
  "FloridaAtlantic vs WesternKentucky": {
    "stadium": "HouchensIndustriesLTSmithStadium-BowlingGreen-KY",
    "FloridaAtlantic": {
      "points": 42,
      "1st downs": 0,
      "rushing 1st downs": 0,
      "passing 1st downs": 0,
      "penalty 1st downs": 0,
      "rushing yards": 368,
      "rushing attempts": 55,
      "passing yards": 93,
      "passing attempts": 24,
      "passing completions": 10,
      "passing interceptions": 1,
      "total yards": 461,
      "total plays": 79,
      "fumbles": 0,
      "fumbles lost": 0,
      "penalties": 9,
      "penalty yards": 75,
      "punts": 4,
      "punt yards": 176,
      "punt returns": 1,
      "punt return yards": 1,
      "kickoff returns": 4,
      "kickoff return yards": 89,
      "interception returns": 2,
      "interception return yards": 0,
      "3rd down conversions": 0,
      "3rd down attempts": 0,
      "4th down conversions": 0,
      "4th down attempts": 0
    },
    "WesternKentucky": {
      "points": 28,
      "1st downs": 0,
      "rushing 1st downs": 0,
      "passing 1st downs": 0,
      "penalty 1st downs": 0,
      "rushing yards": 99,
      "rushing attempts": 33,
      "passing yards": 371,
      "passing attempts": 56,
      "passing completions": 32,
      "passing interceptions": 2,
      "total yards": 470,
      "total plays": 89,
      "fumbles": 0,
      "fumbles lost": 0,
      "penalties": 3,
      "penalty yards": 35,
      "punts": 4,
      "punt yards": 146,
      "punt returns": 2,
      "punt return yards": 5,
      "kickoff returns": 6,
      "kickoff return yards": 102,
      "interception returns": 1,
      "interception return yards": 0,
      "3rd down conversions": 0,
      "3rd down attempts": 0,
      "4th down conversions": 0,
      "4th down attempts": 0
    }
  },
  "LouisianaMonroe vs Idaho": {
    "stadium": "KibbieDome-Moscow-ID",
    "LouisianaMonroe": {
      "points": 23,
      "1st downs": 25,
      "rushing 1st downs": 4,
      "passing 1st downs": 20,
      "penalty 1st downs": 1,
      "rushing yards": 113,
      "rushing attempts": 29,
      "passing yards": 400,
      "passing attempts": 37,
      "passing completions": 24,
      "passing interceptions": 1,
      "total yards": 513,
      "total plays": 66,
      "fumbles": 2,
      "fumbles lost": 1,
      "penalties": 2,
      "penalty yards": 15,
      "punts": 2,
      "punt yards": 86,
      "punt returns": 1,
      "punt return yards": 10,
      "kickoff returns": 3,
      "kickoff return yards": 52,
      "interception returns": 0,
      "interception return yards": 0,
      "3rd down conversions": 7,
      "3rd down attempts": 13,
      "4th down conversions": 0,
      "4th down attempts": 2
    },
    "Idaho": {
      "points": 31,
      "1st downs": 27,
      "rushing 1st downs": 9,
      "passing 1st downs": 17,
      "penalty 1st downs": 1,
      "rushing yards": 158,
      "rushing attempts": 39,
      "passing yards": 360,
      "passing attempts": 42,
      "passing completions": 28,
      "passing interceptions": 0,
      "total yards": 518,
      "total plays": 81,
      "fumbles": 0,
      "fumbles lost": 0,
      "penalties": 5,
      "penalty yards": 56,
      "punts": 4,
      "punt yards": 169,
      "punt returns": 0,
      "punt return yards": 0,
      "kickoff returns": 2,
      "kickoff return yards": 30,
      "interception returns": 1,
      "interception return yards": 7,
      "3rd down conversions": 8,
      "3rd down attempts": 15,
      "4th down conversions": 0,
      "4th down attempts": 1
    }
  },
  "FCS vs UCF": {
    "stadium": "SpectrumStadium-Orlando-FL",
    "FCS": {
      "points": 33,
      "1st downs": 18,
      "rushing 1st downs": 9,
      "passing 1st downs": 7,
      "penalty 1st downs": 2,
      "rushing yards": 144,
      "rushing attempts": 44,
      "passing yards": 209,
      "passing attempts": 19,
      "passing completions": 12,
      "passing interceptions": 1,
      "total yards": 353,
      "total plays": 63,
      "fumbles": 4,
      "fumbles lost": 1,
      "penalties": 11,
      "penalty yards": 108,
      "punts": 3,
      "punt yards": 114,
      "punt returns": 0,
      "punt return yards": 0,
      "kickoff returns": 10,
      "kickoff return yards": 240,
      "interception returns": 0,
      "interception return yards": 0,
      "3rd down conversions": 6,
      "3rd down attempts": 13,
      "4th down conversions": 3,
      "4th down attempts": 4
    },
    "UCF": {
      "points": 73,
      "1st downs": 28,
      "rushing 1st downs": 8,
      "passing 1st downs": 16,
      "penalty 1st downs": 4,
      "rushing yards": 142,
      "rushing attempts": 36,
      "passing yards": 347,
      "passing attempts": 31,
      "passing completions": 28,
      "passing interceptions": 0,
      "total yards": 489,
      "total plays": 67,
      "fumbles": 0,
      "fumbles lost": 0,
      "penalties": 8,
      "penalty yards": 67,
      "punts": 1,
      "punt yards": 42,
      "punt returns": 2,
      "punt return yards": 14,
      "kickoff returns": 4,
      "kickoff return yards": 129,
      "interception returns": 1,
      "interception return yards": 24,
      "3rd down conversions": 4,
      "3rd down attempts": 10,
      "4th down conversions": 3,
      "4th down attempts": 3
    }
  },
  "Utah vs Oregon": {
    "stadium": "AutzenStadium-Eugene-OR",
    "Utah": {
      "points": 20,
      "1st downs": 21,
      "rushing 1st downs": 4,
      "passing 1st downs": 14,
      "penalty 1st downs": 3,
      "rushing yards": 91,
      "rushing attempts": 30,
      "passing yards": 293,
      "passing attempts": 43,
      "passing completions": 25,
      "passing interceptions": 0,
      "total yards": 384,
      "total plays": 73,
      "fumbles": 2,
      "fumbles lost": 1,
      "penalties": 5,
      "penalty yards": 49,
      "punts": 3,
      "punt yards": 112,
      "punt returns": 3,
      "punt return yards": 3,
      "kickoff returns": 3,
      "kickoff return yards": 72,
      "interception returns": 0,
      "interception return yards": 0,
      "3rd down conversions": 4,
      "3rd down attempts": 14,
      "4th down conversions": 1,
      "4th down attempts": 4
    },
    "Oregon": {
      "points": 41,
      "1st downs": 19,
      "rushing 1st downs": 15,
      "passing 1st downs": 3,
      "penalty 1st downs": 1,
      "rushing yards": 347,
      "rushing attempts": 49,
      "passing yards": 69,
      "passing attempts": 13,
      "passing completions": 10,
      "passing interceptions": 0,
      "total yards": 416,
      "total plays": 62,
      "fumbles": 1,
      "fumbles lost": 1,
      "penalties": 8,
      "penalty yards": 60,
      "punts": 4,
      "punt yards": 162,
      "punt returns": 0,
      "punt return yards": 0,
      "kickoff returns": 2,
      "kickoff return yards": 35,
      "interception returns": 0,
      "interception return yards": 0,
      "3rd down conversions": 6,
      "3rd down attempts": 13,
      "4th down conversions": 0,
      "4th down attempts": 0
    }
  },
  "TexasState vs CoastalCarolina": {
    "stadium": "BrooksStadium-Conway-SC",
    "TexasState": {
      "points": 27,
      "1st downs": 34,
      "rushing 1st downs": 18,
      "passing 1st downs": 10,
      "penalty 1st downs": 6,
      "rushing yards": 261,
      "rushing attempts": 51,
      "passing yards": 269,
      "passing attempts": 39,
      "passing completions": 27,
      "passing interceptions": 1,
      "total yards": 530,
      "total plays": 90,
      "fumbles": 2,
      "fumbles lost": 1,
      "penalties": 6,
      "penalty yards": 60,
      "punts": 4,
      "punt yards": 159,
      "punt returns": 5,
      "punt return yards": 29,
      "kickoff returns": 2,
      "kickoff return yards": 33,
      "interception returns": 0,
      "interception return yards": 0,
      "3rd down conversions": 11,
      "3rd down attempts": 19,
      "4th down conversions": 1,
      "4th down attempts": 1
    },
    "CoastalCarolina": {
      "points": 7,
      "1st downs": 9,
      "rushing 1st downs": 2,
      "passing 1st downs": 7,
      "penalty 1st downs": 0,
      "rushing yards": 34,
      "rushing attempts": 20,
      "passing yards": 149,
      "passing attempts": 27,
      "passing completions": 13,
      "passing interceptions": 0,
      "total yards": 183,
      "total plays": 47,
      "fumbles": 2,
      "fumbles lost": 1,
      "penalties": 14,
      "penalty yards": 123,
      "punts": 9,
      "punt yards": 407,
      "punt returns": 1,
      "punt return yards": 0,
      "kickoff returns": 4,
      "kickoff return yards": 79,
      "interception returns": 1,
      "interception return yards": 5,
      "3rd down conversions": 3,
      "3rd down attempts": 13,
      "4th down conversions": 0,
      "4th down attempts": 0
    }
  },
  "Minnesota vs Iowa": {
    "stadium": "KinnickStadium-IowaCity-IA",
    "Minnesota": {
      "points": 10,
      "1st downs": 15,
      "rushing 1st downs": 10,
      "passing 1st downs": 4,
      "penalty 1st downs": 1,
      "rushing yards": 142,
      "rushing attempts": 43,
      "passing yards": 139,
      "passing attempts": 29,
      "passing completions": 9,
      "passing interceptions": 1,
      "total yards": 281,
      "total plays": 72,
      "fumbles": 0,
      "fumbles lost": 0,
      "penalties": 5,
      "penalty yards": 37,
      "punts": 9,
      "punt yards": 352,
      "punt returns": 2,
      "punt return yards": 4,
      "kickoff returns": 4,
      "kickoff return yards": 69,
      "interception returns": 1,
      "interception return yards": 0,
      "3rd down conversions": 4,
      "3rd down attempts": 16,
      "4th down conversions": 0,
      "4th down attempts": 2
    },
    "Iowa": {
      "points": 17,
      "1st downs": 15,
      "rushing 1st downs": 6,
      "passing 1st downs": 7,
      "penalty 1st downs": 2,
      "rushing yards": 125,
      "rushing attempts": 33,
      "passing yards": 190,
      "passing attempts": 27,
      "passing completions": 15,
      "passing interceptions": 1,
      "total yards": 315,
      "total plays": 60,
      "fumbles": 1,
      "fumbles lost": 1,
      "penalties": 6,
      "penalty yards": 50,
      "punts": 9,
      "punt yards": 339,
      "punt returns": 4,
      "punt return yards": 9,
      "kickoff returns": 3,
      "kickoff return yards": 62,
      "interception returns": 1,
      "interception return yards": 0,
      "3rd down conversions": 3,
      "3rd down attempts": 14,
      "4th down conversions": 0,
      "4th down attempts": 0
    }
  },
  "Missouri vs Connecticut": {
    "stadium": "PrattandWhitneyStadiumatRentschlerField-EastHartford-CT",
    "Missouri": {
      "points": 52,
      "1st downs": 31,
      "rushing 1st downs": 12,
      "passing 1st downs": 16,
      "penalty 1st downs": 3,
      "rushing yards": 175,
      "rushing attempts": 34,
      "passing yards": 408,
      "passing attempts": 43,
      "passing completions": 34,
      "passing interceptions": 1,
      "total yards": 583,
      "total plays": 77,
      "fumbles": 0,
      "fumbles lost": 0,
      "penalties": 12,
      "penalty yards": 107,
      "punts": 3,
      "punt yards": 131,
      "punt returns": 4,
      "punt return yards": 3,
      "kickoff returns": 2,
      "kickoff return yards": 28,
      "interception returns": 1,
      "interception return yards": 0,
      "3rd down conversions": 7,
      "3rd down attempts": 12,
      "4th down conversions": 0,
      "4th down attempts": 1
    },
    "Connecticut": {
      "points": 12,
      "1st downs": 23,
      "rushing 1st downs": 11,
      "passing 1st downs": 9,
      "penalty 1st downs": 3,
      "rushing yards": 121,
      "rushing attempts": 41,
      "passing yards": 233,
      "passing attempts": 52,
      "passing completions": 22,
      "passing interceptions": 1,
      "total yards": 354,
      "total plays": 93,
      "fumbles": 1,
      "fumbles lost": 0,
      "penalties": 5,
      "penalty yards": 65,
      "punts": 8,
      "punt yards": 320,
      "punt returns": 1,
      "punt return yards": 3,
      "kickoff returns": 3,
      "kickoff return yards": 55,
      "interception returns": 1,
      "interception return yards": 0,
      "3rd down conversions": 9,
      "3rd down attempts": 23,
      "4th down conversions": 1,
      "4th down attempts": 3
    }
  },
  "OldDominion vs NorthTexas": {
    "stadium": "ApogeeStadium-Denton-TX",
    "OldDominion": {
      "points": 38,
      "1st downs": 21,
      "rushing 1st downs": 12,
      "passing 1st downs": 9,
      "penalty 1st downs": 0,
      "rushing yards": 205,
      "rushing attempts": 48,
      "passing yards": 181,
      "passing attempts": 36,
      "passing completions": 21,
      "passing interceptions": 2,
      "total yards": 386,
      "total plays": 84,
      "fumbles": 1,
      "fumbles lost": 1,
      "penalties": 2,
      "penalty yards": 25,
      "punts": 1,
      "punt yards": 46,
      "punt returns": 0,
      "punt return yards": 0,
      "kickoff returns": 8,
      "kickoff return yards": 290,
      "interception returns": 1,
      "interception return yards": 0,
      "3rd down conversions": 7,
      "3rd down attempts": 17,
      "4th down conversions": 2,
      "4th down attempts": 5
    },
    "NorthTexas": {
      "points": 45,
      "1st downs": 24,
      "rushing 1st downs": 8,
      "passing 1st downs": 15,
      "penalty 1st downs": 1,
      "rushing yards": 151,
      "rushing attempts": 41,
      "passing yards": 309,
      "passing attempts": 36,
      "passing completions": 25,
      "passing interceptions": 1,
      "total yards": 460,
      "total plays": 77,
      "fumbles": 1,
      "fumbles lost": 1,
      "penalties": 3,
      "penalty yards": 45,
      "punts": 4,
      "punt yards": 181,
      "punt returns": 0,
      "punt return yards": 0,
      "kickoff returns": 6,
      "kickoff return yards": 97,
      "interception returns": 2,
      "interception return yards": 1,
      "3rd down conversions": 6,
      "3rd down attempts": 14,
      "4th down conversions": 1,
      "4th down attempts": 2
    }
  },
  "UAB vs SouthernMiss": {
    "stadium": "MMRobertsStadium-Hattiesburg-MS",
    "UAB": {
      "points": 30,
      "1st downs": 0,
      "rushing 1st downs": 0,
      "passing 1st downs": 0,
      "penalty 1st downs": 0,
      "rushing yards": 209,
      "rushing attempts": 49,
      "passing yards": 208,
      "passing attempts": 29,
      "passing completions": 16,
      "passing interceptions": 0,
      "total yards": 417,
      "total plays": 78,
      "fumbles": 0,
      "fumbles lost": 0,
      "penalties": 5,
      "penalty yards": 50,
      "punts": 6,
      "punt yards": 204,
      "punt returns": 3,
      "punt return yards": 34,
      "kickoff returns": 3,
      "kickoff return yards": 58,
      "interception returns": 1,
      "interception return yards": 0,
      "3rd down conversions": 0,
      "3rd down attempts": 0,
      "4th down conversions": 0,
      "4th down attempts": 0
    },
    "SouthernMiss": {
      "points": 12,
      "1st downs": 0,
      "rushing 1st downs": 0,
      "passing 1st downs": 0,
      "penalty 1st downs": 0,
      "rushing yards": 81,
      "rushing attempts": 26,
      "passing yards": 266,
      "passing attempts": 38,
      "passing completions": 19,
      "passing interceptions": 1,
      "total yards": 347,
      "total plays": 64,
      "fumbles": 0,
      "fumbles lost": 0,
      "penalties": 5,
      "penalty yards": 41,
      "punts": 7,
      "punt yards": 289,
      "punt returns": 0,
      "punt return yards": 0,
      "kickoff returns": 5,
      "kickoff return yards": 96,
      "interception returns": 0,
      "interception return yards": 0,
      "3rd down conversions": 0,
      "3rd down attempts": 0,
      "4th down conversions": 0,
      "4th down attempts": 0
    }
  },
  "MississippiState vs TexasAM": {
    "stadium": "KyleField-CollegeStation-TX",
    "MississippiState": {
      "points": 35,
      "1st downs": 19,
      "rushing 1st downs": 11,
      "passing 1st downs": 7,
      "penalty 1st downs": 1,
      "rushing yards": 228,
      "rushing attempts": 52,
      "passing yards": 141,
      "passing attempts": 21,
      "passing completions": 12,
      "passing interceptions": 1,
      "total yards": 369,
      "total plays": 73,
      "fumbles": 2,
      "fumbles lost": 0,
      "penalties": 5,
      "penalty yards": 45,
      "punts": 6,
      "punt yards": 181,
      "punt returns": 2,
      "punt return yards": 7,
      "kickoff returns": 1,
      "kickoff return yards": 29,
      "interception returns": 3,
      "interception return yards": 113,
      "3rd down conversions": 6,
      "3rd down attempts": 14,
      "4th down conversions": 0,
      "4th down attempts": 0
    },
    "TexasAM": {
      "points": 14,
      "1st downs": 15,
      "rushing 1st downs": 6,
      "passing 1st downs": 7,
      "penalty 1st downs": 2,
      "rushing yards": 96,
      "rushing attempts": 28,
      "passing yards": 189,
      "passing attempts": 41,
      "passing completions": 16,
      "passing interceptions": 3,
      "total yards": 285,
      "total plays": 69,
      "fumbles": 0,
      "fumbles lost": 0,
      "penalties": 4,
      "penalty yards": 30,
      "punts": 8,
      "punt yards": 350,
      "punt returns": 2,
      "punt return yards": 29,
      "kickoff returns": 3,
      "kickoff return yards": 55,
      "interception returns": 1,
      "interception return yards": 0,
      "3rd down conversions": 7,
      "3rd down attempts": 17,
      "4th down conversions": 0,
      "4th down attempts": 1
    }
  },
  "Duke vs VirginiaTech": {
    "stadium": "LaneStadium-Blacksburg-VA",
    "Duke": {
      "points": 3,
      "1st downs": 10,
      "rushing 1st downs": 5,
      "passing 1st downs": 3,
      "penalty 1st downs": 2,
      "rushing yards": 111,
      "rushing attempts": 34,
      "passing yards": 82,
      "passing attempts": 24,
      "passing completions": 10,
      "passing interceptions": 1,
      "total yards": 193,
      "total plays": 58,
      "fumbles": 1,
      "fumbles lost": 1,
      "penalties": 7,
      "penalty yards": 53,
      "punts": 7,
      "punt yards": 302,
      "punt returns": 0,
      "punt return yards": 0,
      "kickoff returns": 1,
      "kickoff return yards": 33,
      "interception returns": 0,
      "interception return yards": 0,
      "3rd down conversions": 4,
      "3rd down attempts": 15,
      "4th down conversions": 0,
      "4th down attempts": 2
    },
    "VirginiaTech": {
      "points": 24,
      "1st downs": 23,
      "rushing 1st downs": 11,
      "passing 1st downs": 9,
      "penalty 1st downs": 3,
      "rushing yards": 187,
      "rushing attempts": 48,
      "passing yards": 200,
      "passing attempts": 28,
      "passing completions": 13,
      "passing interceptions": 0,
      "total yards": 387,
      "total plays": 76,
      "fumbles": 0,
      "fumbles lost": 0,
      "penalties": 3,
      "penalty yards": 40,
      "punts": 5,
      "punt yards": 196,
      "punt returns": 5,
      "punt return yards": 40,
      "kickoff returns": 2,
      "kickoff return yards": 51,
      "interception returns": 1,
      "interception return yards": 15,
      "3rd down conversions": 6,
      "3rd down attempts": 16,
      "4th down conversions": 1,
      "4th down attempts": 4
    }
  },
  "Nebraska vs Purdue": {
    "stadium": "RossAdeStadium-WestLafayette-IN",
    "Nebraska": {
      "points": 25,
      "1st downs": 25,
      "rushing 1st downs": 5,
      "passing 1st downs": 16,
      "penalty 1st downs": 4,
      "rushing yards": 40,
      "rushing attempts": 27,
      "passing yards": 431,
      "passing attempts": 50,
      "passing completions": 32,
      "passing interceptions": 0,
      "total yards": 471,
      "total plays": 77,
      "fumbles": 1,
      "fumbles lost": 0,
      "penalties": 9,
      "penalty yards": 95,
      "punts": 4,
      "punt yards": 150,
      "punt returns": 0,
      "punt return yards": 0,
      "kickoff returns": 3,
      "kickoff return yards": 59,
      "interception returns": 0,
      "interception return yards": 0,
      "3rd down conversions": 6,
      "3rd down attempts": 17,
      "4th down conversions": 1,
      "4th down attempts": 3
    },
    "Purdue": {
      "points": 24,
      "1st downs": 20,
      "rushing 1st downs": 8,
      "passing 1st downs": 9,
      "penalty 1st downs": 3,
      "rushing yards": 199,
      "rushing attempts": 38,
      "passing yards": 164,
      "passing attempts": 28,
      "passing completions": 16,
      "passing interceptions": 0,
      "total yards": 363,
      "total plays": 66,
      "fumbles": 0,
      "fumbles lost": 0,
      "penalties": 7,
      "penalty yards": 63,
      "punts": 8,
      "punt yards": 278,
      "punt returns": 0,
      "punt return yards": 0,
      "kickoff returns": 6,
      "kickoff return yards": 120,
      "interception returns": 0,
      "interception return yards": 0,
      "3rd down conversions": 3,
      "3rd down attempts": 13,
      "4th down conversions": 0,
      "4th down attempts": 0
    }
  },
  "Tennessee vs Kentucky": {
    "stadium": "KrogerField-Lexington-KY",
    "Tennessee": {
      "points": 26,
      "1st downs": 27,
      "rushing 1st downs": 13,
      "passing 1st downs": 12,
      "penalty 1st downs": 2,
      "rushing yards": 203,
      "rushing attempts": 55,
      "passing yards": 242,
      "passing attempts": 23,
      "passing completions": 18,
      "passing interceptions": 0,
      "total yards": 445,
      "total plays": 78,
      "fumbles": 0,
      "fumbles lost": 0,
      "penalties": 9,
      "penalty yards": 54,
      "punts": 3,
      "punt yards": 111,
      "punt returns": 2,
      "punt return yards": -2,
      "kickoff returns": 3,
      "kickoff return yards": 26,
      "interception returns": 0,
      "interception return yards": 0,
      "3rd down conversions": 6,
      "3rd down attempts": 16,
      "4th down conversions": 1,
      "4th down attempts": 1
    },
    "Kentucky": {
      "points": 29,
      "1st downs": 17,
      "rushing 1st downs": 13,
      "passing 1st downs": 3,
      "penalty 1st downs": 1,
      "rushing yards": 289,
      "rushing attempts": 36,
      "passing yards": 82,
      "passing attempts": 16,
      "passing completions": 7,
      "passing interceptions": 0,
      "total yards": 371,
      "total plays": 52,
      "fumbles": 4,
      "fumbles lost": 4,
      "penalties": 4,
      "penalty yards": 44,
      "punts": 4,
      "punt yards": 166,
      "punt returns": 0,
      "punt return yards": 0,
      "kickoff returns": 5,
      "kickoff return yards": 123,
      "interception returns": 0,
      "interception return yards": 0,
      "3rd down conversions": 3,
      "3rd down attempts": 7,
      "4th down conversions": 0,
      "4th down attempts": 0
    }
  },
  "NewMexico vs Wyoming": {
    "stadium": "JonahFieldatWarMemorialStadium-Laramie-WY",
    "NewMexico": {
      "points": 3,
      "1st downs": 13,
      "rushing 1st downs": 9,
      "passing 1st downs": 3,
      "penalty 1st downs": 1,
      "rushing yards": 115,
      "rushing attempts": 40,
      "passing yards": 69,
      "passing attempts": 25,
      "passing completions": 10,
      "passing interceptions": 5,
      "total yards": 184,
      "total plays": 65,
      "fumbles": 2,
      "fumbles lost": 2,
      "penalties": 6,
      "penalty yards": 55,
      "punts": 6,
      "punt yards": 322,
      "punt returns": 3,
      "punt return yards": -12,
      "kickoff returns": 6,
      "kickoff return yards": 126,
      "interception returns": 0,
      "interception return yards": 0,
      "3rd down conversions": 6,
      "3rd down attempts": 18,
      "4th down conversions": 1,
      "4th down attempts": 1
    },
    "Wyoming": {
      "points": 42,
      "1st downs": 18,
      "rushing 1st downs": 3,
      "passing 1st downs": 12,
      "penalty 1st downs": 3,
      "rushing yards": 75,
      "rushing attempts": 32,
      "passing yards": 234,
      "passing attempts": 28,
      "passing completions": 16,
      "passing interceptions": 0,
      "total yards": 309,
      "total plays": 60,
      "fumbles": 0,
      "fumbles lost": 0,
      "penalties": 5,
      "penalty yards": 50,
      "punts": 8,
      "punt yards": 326,
      "punt returns": 1,
      "punt return yards": 2,
      "kickoff returns": 0,
      "kickoff return yards": 0,
      "interception returns": 5,
      "interception return yards": 51,
      "3rd down conversions": 4,
      "3rd down attempts": 13,
      "4th down conversions": 0,
      "4th down attempts": 1
    }
  },
  "GeorgiaTech vs Clemson": {
    "stadium": "MemorialStadium-Clemson-SC",
    "GeorgiaTech": {
      "points": 10,
      "1st downs": 10,
      "rushing 1st downs": 7,
      "passing 1st downs": 2,
      "penalty 1st downs": 1,
      "rushing yards": 198,
      "rushing attempts": 43,
      "passing yards": 32,
      "passing attempts": 13,
      "passing completions": 3,
      "passing interceptions": 0,
      "total yards": 230,
      "total plays": 56,
      "fumbles": 3,
      "fumbles lost": 1,
      "penalties": 2,
      "penalty yards": 20,
      "punts": 9,
      "punt yards": 422,
      "punt returns": 2,
      "punt return yards": 12,
      "kickoff returns": 5,
      "kickoff return yards": 82,
      "interception returns": 0,
      "interception return yards": 0,
      "3rd down conversions": 3,
      "3rd down attempts": 15,
      "4th down conversions": 1,
      "4th down attempts": 2
    },
    "Clemson": {
      "points": 24,
      "1st downs": 22,
      "rushing 1st downs": 12,
      "passing 1st downs": 9,
      "penalty 1st downs": 1,
      "rushing yards": 221,
      "rushing attempts": 45,
      "passing yards": 207,
      "passing attempts": 33,
      "passing completions": 22,
      "passing interceptions": 0,
      "total yards": 428,
      "total plays": 78,
      "fumbles": 2,
      "fumbles lost": 1,
      "penalties": 5,
      "penalty yards": 45,
      "punts": 7,
      "punt yards": 272,
      "punt returns": 1,
      "punt return yards": 1,
      "kickoff returns": 3,
      "kickoff return yards": 45,
      "interception returns": 0,
      "interception return yards": 0,
      "3rd down conversions": 7,
      "3rd down attempts": 17,
      "4th down conversions": 0,
      "4th down attempts": 0
    }
  },
  "UTSA vs UTEP": {
    "stadium": "SunBowlStadium-ElPaso-TX",
    "UTSA": {
      "points": 31,
      "1st downs": 0,
      "rushing 1st downs": 0,
      "passing 1st downs": 0,
      "penalty 1st downs": 0,
      "rushing yards": 205,
      "rushing attempts": 42,
      "passing yards": 188,
      "passing attempts": 30,
      "passing completions": 18,
      "passing interceptions": 1,
      "total yards": 393,
      "total plays": 72,
      "fumbles": 0,
      "fumbles lost": 0,
      "penalties": 8,
      "penalty yards": 47,
      "punts": 5,
      "punt yards": 224,
      "punt returns": 3,
      "punt return yards": 49,
      "kickoff returns": 0,
      "kickoff return yards": 0,
      "interception returns": 2,
      "interception return yards": 0,
      "3rd down conversions": 0,
      "3rd down attempts": 0,
      "4th down conversions": 0,
      "4th down attempts": 0
    },
    "UTEP": {
      "points": 14,
      "1st downs": 0,
      "rushing 1st downs": 0,
      "passing 1st downs": 0,
      "penalty 1st downs": 0,
      "rushing yards": 110,
      "rushing attempts": 26,
      "passing yards": 133,
      "passing attempts": 29,
      "passing completions": 8,
      "passing interceptions": 2,
      "total yards": 243,
      "total plays": 55,
      "fumbles": 0,
      "fumbles lost": 0,
      "penalties": 4,
      "penalty yards": 51,
      "punts": 7,
      "punt yards": 295,
      "punt returns": 2,
      "punt return yards": 6,
      "kickoff returns": 4,
      "kickoff return yards": 91,
      "interception returns": 1,
      "interception return yards": 0,
      "3rd down conversions": 0,
      "3rd down attempts": 0,
      "4th down conversions": 0,
      "4th down attempts": 0
    }
  },
  "ArkansasState vs NewMexicoState": {
    "stadium": "AggieMemorialStadium-LasCruces-NM",
    "ArkansasState": {
      "points": 37,
      "1st downs": 0,
      "rushing 1st downs": 0,
      "passing 1st downs": 0,
      "penalty 1st downs": 0,
      "rushing yards": 120,
      "rushing attempts": 40,
      "passing yards": 297,
      "passing attempts": 40,
      "passing completions": 25,
      "passing interceptions": 1,
      "total yards": 417,
      "total plays": 80,
      "fumbles": 0,
      "fumbles lost": 0,
      "penalties": 13,
      "penalty yards": 126,
      "punts": 9,
      "punt yards": 402,
      "punt returns": 9,
      "punt return yards": 114,
      "kickoff returns": 0,
      "kickoff return yards": 0,
      "interception returns": 2,
      "interception return yards": 0,
      "3rd down conversions": 0,
      "3rd down attempts": 0,
      "4th down conversions": 0,
      "4th down attempts": 0
    },
    "NewMexicoState": {
      "points": 21,
      "1st downs": 0,
      "rushing 1st downs": 0,
      "passing 1st downs": 0,
      "penalty 1st downs": 0,
      "rushing yards": 35,
      "rushing attempts": 32,
      "passing yards": 221,
      "passing attempts": 40,
      "passing completions": 20,
      "passing interceptions": 2,
      "total yards": 256,
      "total plays": 72,
      "fumbles": 0,
      "fumbles lost": 0,
      "penalties": 4,
      "penalty yards": 39,
      "punts": 12,
      "punt yards": 506,
      "punt returns": 1,
      "punt return yards": 36,
      "kickoff returns": 1,
      "kickoff return yards": 42,
      "interception returns": 1,
      "interception return yards": 0,
      "3rd down conversions": 0,
      "3rd down attempts": 0,
      "4th down conversions": 0,
      "4th down attempts": 0
    }
  },
  "TexasTech vs Oklahoma": {
    "stadium": "GaylordFamilyOklahomaMemorialStadium-Norman-OK",
    "TexasTech": {
      "points": 27,
      "1st downs": 24,
      "rushing 1st downs": 9,
      "passing 1st downs": 12,
      "penalty 1st downs": 3,
      "rushing yards": 115,
      "rushing attempts": 34,
      "passing yards": 322,
      "passing attempts": 36,
      "passing completions": 22,
      "passing interceptions": 1,
      "total yards": 437,
      "total plays": 70,
      "fumbles": 0,
      "fumbles lost": 0,
      "penalties": 6,
      "penalty yards": 63,
      "punts": 6,
      "punt yards": 235,
      "punt returns": 1,
      "punt return yards": 17,
      "kickoff returns": 3,
      "kickoff return yards": 64,
      "interception returns": 1,
      "interception return yards": 0,
      "3rd down conversions": 5,
      "3rd down attempts": 14,
      "4th down conversions": 1,
      "4th down attempts": 3
    },
    "Oklahoma": {
      "points": 49,
      "1st downs": 32,
      "rushing 1st downs": 14,
      "passing 1st downs": 15,
      "penalty 1st downs": 3,
      "rushing yards": 336,
      "rushing attempts": 47,
      "passing yards": 281,
      "passing attempts": 34,
      "passing completions": 22,
      "passing interceptions": 1,
      "total yards": 617,
      "total plays": 81,
      "fumbles": 1,
      "fumbles lost": 0,
      "penalties": 7,
      "penalty yards": 94,
      "punts": 3,
      "punt yards": 127,
      "punt returns": 0,
      "punt return yards": 0,
      "kickoff returns": 2,
      "kickoff return yards": 50,
      "interception returns": 1,
      "interception return yards": 0,
      "3rd down conversions": 7,
      "3rd down attempts": 13,
      "4th down conversions": 2,
      "4th down attempts": 2
    }
  },
  "WashingtonState vs Arizona": {
    "stadium": "ArizonaStadium-Tucson-AZ",
    "WashingtonState": {
      "points": 37,
      "1st downs": 32,
      "rushing 1st downs": 3,
      "passing 1st downs": 28,
      "penalty 1st downs": 1,
      "rushing yards": 44,
      "rushing attempts": 17,
      "passing yards": 602,
      "passing attempts": 84,
      "passing completions": 58,
      "passing interceptions": 4,
      "total yards": 646,
      "total plays": 101,
      "fumbles": 2,
      "fumbles lost": 0,
      "penalties": 7,
      "penalty yards": 50,
      "punts": 5,
      "punt yards": 213,
      "punt returns": 2,
      "punt return yards": 1,
      "kickoff returns": 1,
      "kickoff return yards": 13,
      "interception returns": 1,
      "interception return yards": 13,
      "3rd down conversions": 4,
      "3rd down attempts": 18,
      "4th down conversions": 3,
      "4th down attempts": 5
    },
    "Arizona": {
      "points": 58,
      "1st downs": 14,
      "rushing 1st downs": 5,
      "passing 1st downs": 8,
      "penalty 1st downs": 1,
      "rushing yards": 310,
      "rushing attempts": 34,
      "passing yards": 275,
      "passing attempts": 17,
      "passing completions": 10,
      "passing interceptions": 1,
      "total yards": 585,
      "total plays": 51,
      "fumbles": 2,
      "fumbles lost": 2,
      "penalties": 2,
      "penalty yards": 20,
      "punts": 5,
      "punt yards": 197,
      "punt returns": 2,
      "punt return yards": 8,
      "kickoff returns": 4,
      "kickoff return yards": 125,
      "interception returns": 4,
      "interception return yards": 83,
      "3rd down conversions": 2,
      "3rd down attempts": 9,
      "4th down conversions": 0,
      "4th down attempts": 0
    }
  },
  "BoiseState vs UtahState": {
    "stadium": "MerlinOlsenFieldatMaverikStadium-Logan-UT",
    "BoiseState": {
      "points": 41,
      "1st downs": 27,
      "rushing 1st downs": 7,
      "passing 1st downs": 17,
      "penalty 1st downs": 3,
      "rushing yards": 163,
      "rushing attempts": 45,
      "passing yards": 370,
      "passing attempts": 34,
      "passing completions": 24,
      "passing interceptions": 0,
      "total yards": 533,
      "total plays": 79,
      "fumbles": 0,
      "fumbles lost": 0,
      "penalties": 9,
      "penalty yards": 72,
      "punts": 5,
      "punt yards": 195,
      "punt returns": 3,
      "punt return yards": 3,
      "kickoff returns": 0,
      "kickoff return yards": 0,
      "interception returns": 0,
      "interception return yards": 0,
      "3rd down conversions": 7,
      "3rd down attempts": 15,
      "4th down conversions": 0,
      "4th down attempts": 0
    },
    "UtahState": {
      "points": 14,
      "1st downs": 13,
      "rushing 1st downs": 4,
      "passing 1st downs": 7,
      "penalty 1st downs": 2,
      "rushing yards": 93,
      "rushing attempts": 27,
      "passing yards": 186,
      "passing attempts": 34,
      "passing completions": 18,
      "passing interceptions": 0,
      "total yards": 279,
      "total plays": 61,
      "fumbles": 0,
      "fumbles lost": 0,
      "penalties": 7,
      "penalty yards": 72,
      "punts": 9,
      "punt yards": 348,
      "punt returns": 3,
      "punt return yards": -3,
      "kickoff returns": 2,
      "kickoff return yards": 52,
      "interception returns": 0,
      "interception return yards": 0,
      "3rd down conversions": 4,
      "3rd down attempts": 15,
      "4th down conversions": 1,
      "4th down attempts": 2
    }
  },
  "UNLV vs FresnoState": {
    "stadium": "BulldogStadiumatJimSweeneyField-Fresno-CA",
    "UNLV": {
      "points": 26,
      "1st downs": 22,
      "rushing 1st downs": 9,
      "passing 1st downs": 10,
      "penalty 1st downs": 3,
      "rushing yards": 173,
      "rushing attempts": 44,
      "passing yards": 155,
      "passing attempts": 29,
      "passing completions": 17,
      "passing interceptions": 0,
      "total yards": 328,
      "total plays": 73,
      "fumbles": 1,
      "fumbles lost": 0,
      "penalties": 5,
      "penalty yards": 35,
      "punts": 3,
      "punt yards": 95,
      "punt returns": 0,
      "punt return yards": 0,
      "kickoff returns": 1,
      "kickoff return yards": 31,
      "interception returns": 0,
      "interception return yards": 0,
      "3rd down conversions": 5,
      "3rd down attempts": 15,
      "4th down conversions": 2,
      "4th down attempts": 2
    },
    "FresnoState": {
      "points": 16,
      "1st downs": 19,
      "rushing 1st downs": 12,
      "passing 1st downs": 7,
      "penalty 1st downs": 0,
      "rushing yards": 140,
      "rushing attempts": 34,
      "passing yards": 152,
      "passing attempts": 27,
      "passing completions": 16,
      "passing interceptions": 0,
      "total yards": 292,
      "total plays": 61,
      "fumbles": 1,
      "fumbles lost": 1,
      "penalties": 5,
      "penalty yards": 40,
      "punts": 2,
      "punt yards": 68,
      "punt returns": 1,
      "punt return yards": 4,
      "kickoff returns": 7,
      "kickoff return yards": 159,
      "interception returns": 0,
      "interception return yards": 0,
      "3rd down conversions": 3,
      "3rd down attempts": 10,
      "4th down conversions": 1,
      "4th down attempts": 4
    }
  },
  "USC vs ArizonaState": {
    "stadium": "SunDevilStadium-Tempe-AZ",
    "USC": {
      "points": 48,
      "1st downs": 29,
      "rushing 1st downs": 16,
      "passing 1st downs": 10,
      "penalty 1st downs": 3,
      "rushing yards": 341,
      "rushing attempts": 46,
      "passing yards": 266,
      "passing attempts": 35,
      "passing completions": 19,
      "passing interceptions": 0,
      "total yards": 607,
      "total plays": 81,
      "fumbles": 1,
      "fumbles lost": 1,
      "penalties": 8,
      "penalty yards": 60,
      "punts": 2,
      "punt yards": 96,
      "punt returns": 3,
      "punt return yards": 22,
      "kickoff returns": 1,
      "kickoff return yards": 17,
      "interception returns": 1,
      "interception return yards": 37,
      "3rd down conversions": 7,
      "3rd down attempts": 16,
      "4th down conversions": 1,
      "4th down attempts": 3
    },
    "ArizonaState": {
      "points": 17,
      "1st downs": 15,
      "rushing 1st downs": 5,
      "passing 1st downs": 9,
      "penalty 1st downs": 1,
      "rushing yards": 79,
      "rushing attempts": 30,
      "passing yards": 278,
      "passing attempts": 31,
      "passing completions": 18,
      "passing interceptions": 1,
      "total yards": 357,
      "total plays": 61,
      "fumbles": 0,
      "fumbles lost": 0,
      "penalties": 10,
      "penalty yards": 99,
      "punts": 8,
      "punt yards": 337,
      "punt returns": 1,
      "punt return yards": 0,
      "kickoff returns": 4,
      "kickoff return yards": 59,
      "interception returns": 0,
      "interception return yards": 0,
      "3rd down conversions": 1,
      "3rd down attempts": 12,
      "4th down conversions": 1,
      "4th down attempts": 2
    }
  },
  "SanDiegoState vs Hawaii": {
    "stadium": "HawaiianTelFederalCreditUnionField-Honolulu-HI",
    "SanDiegoState": {
      "points": 28,
      "1st downs": 21,
      "rushing 1st downs": 14,
      "passing 1st downs": 4,
      "penalty 1st downs": 3,
      "rushing yards": 334,
      "rushing attempts": 53,
      "passing yards": 83,
      "passing attempts": 11,
      "passing completions": 5,
      "passing interceptions": 1,
      "total yards": 417,
      "total plays": 64,
      "fumbles": 1,
      "fumbles lost": 0,
      "penalties": 8,
      "penalty yards": 90,
      "punts": 5,
      "punt yards": 171,
      "punt returns": 5,
      "punt return yards": 40,
      "kickoff returns": 2,
      "kickoff return yards": 32,
      "interception returns": 0,
      "interception return yards": 0,
      "3rd down conversions": 7,
      "3rd down attempts": 13,
      "4th down conversions": 0,
      "4th down attempts": 0
    },
    "Hawaii": {
      "points": 7,
      "1st downs": 12,
      "rushing 1st downs": 1,
      "passing 1st downs": 7,
      "penalty 1st downs": 4,
      "rushing yards": 35,
      "rushing attempts": 23,
      "passing yards": 160,
      "passing attempts": 33,
      "passing completions": 19,
      "passing interceptions": 0,
      "total yards": 195,
      "total plays": 56,
      "fumbles": 0,
      "fumbles lost": 0,
      "penalties": 6,
      "penalty yards": 46,
      "punts": 8,
      "punt yards": 337,
      "punt returns": 1,
      "punt return yards": -3,
      "kickoff returns": 2,
      "kickoff return yards": 43,
      "interception returns": 1,
      "interception return yards": 4,
      "3rd down conversions": 2,
      "3rd down attempts": 14,
      "4th down conversions": 0,
      "4th down attempts": 1
    }
  }
}