{
  "WesternMichigan vs Akron": {
    "stadium": "InfoCisionStadiumSummaField-Akron-OH",
    "WesternMichigan": {
      "points": 58,
      "1st downs": 21,
      "rushing 1st downs": 11,
      "passing 1st downs": 9,
      "penalty 1st downs": 1,
      "rushing yards": 218,
      "rushing attempts": 39,
      "passing yards": 266,
      "passing attempts": 19,
      "passing completions": 13,
      "passing interceptions": 0,
      "total yards": 484,
      "total plays": 58,
      "fumbles": 0,
      "fumbles lost": 0,
      "penalties": 5,
      "penalty yards": 65,
      "punts": 1,
      "punt yards": 38,
      "punt returns": 3,
      "punt return yards": 8,
      "kickoff returns": 4,
      "kickoff return yards": 121,
      "interception returns": 1,
      "interception return yards": 38,
      "3rd down conversions": 5,
      "3rd down attempts": 10,
      "4th down conversions": 2,
      "4th down attempts": 3
    },
    "Akron": {
      "points": 13,
      "1st downs": 15,
      "rushing 1st downs": 7,
      "passing 1st downs": 5,
      "penalty 1st downs": 3,
      "rushing yards": 130,
      "rushing attempts": 32,
      "passing yards": 126,
      "passing attempts": 32,
      "passing completions": 19,
      "passing interceptions": 1,
      "total yards": 256,
      "total plays": 64,
      "fumbles": 1,
      "fumbles lost": 1,
      "penalties": 5,
      "penalty yards": 39,
      "punts": 5,
      "punt yards": 167,
      "punt returns": 0,
      "punt return yards": 0,
      "kickoff returns": 4,
      "kickoff return yards": 79,
      "interception returns": 0,
      "interception return yards": 0,
      "3rd down conversions": 5,
      "3rd down attempts": 15,
      "4th down conversions": 1,
      "4th down attempts": 2
    }
  },
  "EasternMichigan vs KentState": {
    "stadium": "DixStadium-Kent-OH",
    "EasternMichigan": {
      "points": 23,
      "1st downs": 20,
      "rushing 1st downs": 5,
      "passing 1st downs": 12,
      "penalty 1st downs": 3,
      "rushing yards": 61,
      "rushing attempts": 32,
      "passing yards": 241,
      "passing attempts": 35,
      "passing completions": 21,
      "passing interceptions": 2,
      "total yards": 302,
      "total plays": 67,
      "fumbles": 0,
      "fumbles lost": 0,
      "penalties": 2,
      "penalty yards": 30,
      "punts": 2,
      "punt yards": 86,
      "punt returns": 0,
      "punt return yards": 0,
      "kickoff returns": 2,
      "kickoff return yards": 40,
      "interception returns": 1,
      "interception return yards": 43,
      "3rd down conversions": 5,
      "3rd down attempts": 13,
      "4th down conversions": 2,
      "4th down attempts": 3
    },
    "KentState": {
      "points": 27,
      "1st downs": 28,
      "rushing 1st downs": 13,
      "passing 1st downs": 13,
      "penalty 1st downs": 2,
      "rushing yards": 212,
      "rushing attempts": 46,
      "passing yards": 219,
      "passing attempts": 29,
      "passing completions": 21,
      "passing interceptions": 1,
      "total yards": 431,
      "total plays": 75,
      "fumbles": 0,
      "fumbles lost": 0,
      "penalties": 9,
      "penalty yards": 78,
      "punts": 4,
      "punt yards": 155,
      "punt returns": 0,
      "punt return yards": 0,
      "kickoff returns": 2,
      "kickoff return yards": 41,
      "interception returns": 2,
      "interception return yards": 0,
      "3rd down conversions": 4,
      "3rd down attempts": 12,
      "4th down conversions": 2,
      "4th down attempts": 2
    }
  },
  "Ohio vs CentralMichigan": {
    "stadium": "KellyShortsStadium-MountPleasant-MI",
    "Ohio": {
      "points": 27,
      "1st downs": 16,
      "rushing 1st downs": 6,
      "passing 1st downs": 7,
      "penalty 1st downs": 3,
      "rushing yards": 110,
      "rushing attempts": 36,
      "passing yards": 235,
      "passing attempts": 22,
      "passing completions": 13,
      "passing interceptions": 0,
      "total yards": 345,
      "total plays": 58,
      "fumbles": 3,
      "fumbles lost": 2,
      "penalties": 11,
      "penalty yards": 74,
      "punts": 5,
      "punt yards": 179,
      "punt returns": 1,
      "punt return yards": 3,
      "kickoff returns": 5,
      "kickoff return yards": 172,
      "interception returns": 0,
      "interception return yards": 0,
      "3rd down conversions": 4,
      "3rd down attempts": 11,
      "4th down conversions": 0,
      "4th down attempts": 1
    },
    "CentralMichigan": {
      "points": 30,
      "1st downs": 24,
      "rushing 1st downs": 10,
      "passing 1st downs": 13,
      "penalty 1st downs": 1,
      "rushing yards": 184,
      "rushing attempts": 47,
      "passing yards": 243,
      "passing attempts": 41,
      "passing completions": 23,
      "passing interceptions": 0,
      "total yards": 427,
      "total plays": 88,
      "fumbles": 0,
      "fumbles lost": 0,
      "penalties": 6,
      "penalty yards": 64,
      "punts": 5,
      "punt yards": 236,
      "punt returns": 0,
      "punt return yards": 0,
      "kickoff returns": 3,
      "kickoff return yards": 48,
      "interception returns": 0,
      "interception return yards": 0,
      "3rd down conversions": 7,
      "3rd down attempts": 18,
      "4th down conversions": 2,
      "4th down attempts": 5
    }
  },
  "BallState vs MiamiOH": {
    "stadium": "FredCYagerStadium-Oxford-OH",
    "BallState": {
      "points": 31,
      "1st downs": 26,
      "rushing 1st downs": 9,
      "passing 1st downs": 15,
      "penalty 1st downs": 2,
      "rushing yards": 169,
      "rushing attempts": 38,
      "passing yards": 309,
      "passing attempts": 32,
      "passing completions": 19,
      "passing interceptions": 1,
      "total yards": 478,
      "total plays": 70,
      "fumbles": 1,
      "fumbles lost": 0,
      "penalties": 6,
      "penalty yards": 63,
      "punts": 4,
      "punt yards": 174,
      "punt returns": 2,
      "punt return yards": -1,
      "kickoff returns": 6,
      "kickoff return yards": 121,
      "interception returns": 0,
      "interception return yards": 0,
      "3rd down conversions": 9,
      "3rd down attempts": 15,
      "4th down conversions": 0,
      "4th down attempts": 0
    },
    "MiamiOH": {
      "points": 38,
      "1st downs": 26,
      "rushing 1st downs": 7,
      "passing 1st downs": 14,
      "penalty 1st downs": 5,
      "rushing yards": 134,
      "rushing attempts": 42,
      "passing yards": 287,
      "passing attempts": 32,
      "passing completions": 21,
      "passing interceptions": 0,
      "total yards": 421,
      "total plays": 74,
      "fumbles": 2,
      "fumbles lost": 1,
      "penalties": 4,
      "penalty yards": 30,
      "punts": 5,
      "punt yards": 217,
      "punt returns": 0,
      "punt return yards": 0,
      "kickoff returns": 1,
      "kickoff return yards": 21,
      "interception returns": 1,
      "interception return yards": 18,
      "3rd down conversions": 5,
      "3rd down attempts": 13,
      "4th down conversions": 2,
      "4th down attempts": 2
    }
  },
  "Buffalo vs NorthernIllinois": {
    "stadium": "BrighamFieldatHuskieStadium-DeKalb-IL",
    "Buffalo": {
      "points": 49,
      "1st downs": 14,
      "rushing 1st downs": 5,
      "passing 1st downs": 7,
      "penalty 1st downs": 2,
      "rushing yards": 182,
      "rushing attempts": 34,
      "passing yards": 175,
      "passing attempts": 17,
      "passing completions": 11,
      "passing interceptions": 1,
      "total yards": 357,
      "total plays": 51,
      "fumbles": 2,
      "fumbles lost": 1,
      "penalties": 8,
      "penalty yards": 63,
      "punts": 5,
      "punt yards": 158,
      "punt returns": 1,
      "punt return yards": 0,
      "kickoff returns": 2,
      "kickoff return yards": 18,
      "interception returns": 1,
      "interception return yards": 65,
      "3rd down conversions": 3,
      "3rd down attempts": 9,
      "4th down conversions": 0,
      "4th down attempts": 0
    },
    "NorthernIllinois": {
      "points": 30,
      "1st downs": 26,
      "rushing 1st downs": 11,
      "passing 1st downs": 12,
      "penalty 1st downs": 3,
      "rushing yards": 156,
      "rushing attempts": 47,
      "passing yards": 241,
      "passing attempts": 33,
      "passing completions": 19,
      "passing interceptions": 1,
      "total yards": 397,
      "total plays": 80,
      "fumbles": 4,
      "fumbles lost": 4,
      "penalties": 7,
      "penalty yards": 65,
      "punts": 5,
      "punt yards": 215,
      "punt returns": 0,
      "punt return yards": 0,
      "kickoff returns": 5,
      "kickoff return yards": 151,
      "interception returns": 1,
      "interception return yards": 0,
      "3rd down conversions": 5,
      "3rd down attempts": 14,
      "4th down conversions": 1,
      "4th down attempts": 2
    }
  },
  "BowlingGreen vs Toledo": {
    "stadium": "TheGlassBowl-Toledo-OH",
    "BowlingGreen": {
      "points": 3,
      "1st downs": 15,
      "rushing 1st downs": 8,
      "passing 1st downs": 4,
      "penalty 1st downs": 3,
      "rushing yards": 139,
      "rushing attempts": 32,
      "passing yards": 128,
      "passing attempts": 30,
      "passing completions": 8,
      "passing interceptions": 2,
      "total yards": 267,
      "total plays": 62,
      "fumbles": 2,
      "fumbles lost": 1,
      "penalties": 5,
      "penalty yards": 40,
      "punts": 6,
      "punt yards": 231,
      "punt returns": 1,
      "punt return yards": 0,
      "kickoff returns": 2,
      "kickoff return yards": 46,
      "interception returns": 0,
      "interception return yards": 0,
      "3rd down conversions": 3,
      "3rd down attempts": 14,
      "4th down conversions": 0,
      "4th down attempts": 2
    },
    "Toledo": {
      "points": 38,
      "1st downs": 26,
      "rushing 1st downs": 14,
      "passing 1st downs": 10,
      "penalty 1st downs": 2,
      "rushing yards": 310,
      "rushing attempts": 52,
      "passing yards": 214,
      "passing attempts": 32,
      "passing completions": 20,
      "passing interceptions": 0,
      "total yards": 524,
      "total plays": 84,
      "fumbles": 3,
      "fumbles lost": 1,
      "penalties": 12,
      "penalty yards": 71,
      "punts": 5,
      "punt yards": 151,
      "punt returns": 4,
      "punt return yards": 9,
      "kickoff returns": 0,
      "kickoff return yards": 0,
      "interception returns": 2,
      "interception return yards": 19,
      "3rd down conversions": 11,
      "3rd down attempts": 20,
      "4th down conversions": 1,
      "4th down attempts": 3
    }
  },
  "UtahState vs Nevada": {
    "stadium": "MackayStadium-Reno-NV",
    "UtahState": {
      "points": 9,
      "1st downs": 11,
      "rushing 1st downs": 4,
      "passing 1st downs": 5,
      "penalty 1st downs": 2,
      "rushing yards": 109,
      "rushing attempts": 25,
      "passing yards": 101,
      "passing attempts": 34,
      "passing completions": 16,
      "passing interceptions": 0,
      "total yards": 210,
      "total plays": 59,
      "fumbles": 0,
      "fumbles lost": 0,
      "penalties": 5,
      "penalty yards": 52,
      "punts": 10,
      "punt yards": 425,
      "punt returns": 1,
      "punt return yards": 1,
      "kickoff returns": 3,
      "kickoff return yards": 75,
      "interception returns": 0,
      "interception return yards": 0,
      "3rd down conversions": 3,
      "3rd down attempts": 15,
      "4th down conversions": 0,
      "4th down attempts": 1
    },
    "Nevada": {
      "points": 34,
      "1st downs": 27,
      "rushing 1st downs": 6,
      "passing 1st downs": 19,
      "penalty 1st downs": 2,
      "rushing yards": 121,
      "rushing attempts": 28,
      "passing yards": 421,
      "passing attempts": 54,
      "passing completions": 37,
      "passing interceptions": 0,
      "total yards": 542,
      "total plays": 82,
      "fumbles": 1,
      "fumbles lost": 0,
      "penalties": 10,
      "penalty yards": 74,
      "punts": 3,
      "punt yards": 131,
      "punt returns": 2,
      "punt return yards": 2,
      "kickoff returns": 2,
      "kickoff return yards": 47,
      "interception returns": 0,
      "interception return yards": 0,
      "3rd down conversions": 6,
      "3rd down attempts": 16,
      "4th down conversions": 4,
      "4th down attempts": 5
    }
  },
  "Wyoming vs ColoradoState": {
    "stadium": "SonnyLubickFieldatCanvasStadium-FortCollins-CO",
    "Wyoming": {
      "points": 24,
      "1st downs": 23,
      "rushing 1st downs": 9,
      "passing 1st downs": 13,
      "penalty 1st downs": 1,
      "rushing yards": 144,
      "rushing attempts": 48,
      "passing yards": 321,
      "passing attempts": 32,
      "passing completions": 19,
      "passing interceptions": 1,
      "total yards": 465,
      "total plays": 80,
      "fumbles": 2,
      "fumbles lost": 2,
      "penalties": 8,
      "penalty yards": 83,
      "punts": 4,
      "punt yards": 184,
      "punt returns": 3,
      "punt return yards": 9,
      "kickoff returns": 3,
      "kickoff return yards": 44,
      "interception returns": 0,
      "interception return yards": 0,
      "3rd down conversions": 4,
      "3rd down attempts": 15,
      "4th down conversions": 1,
      "4th down attempts": 4
    },
    "ColoradoState": {
      "points": 34,
      "1st downs": 18,
      "rushing 1st downs": 6,
      "passing 1st downs": 9,
      "penalty 1st downs": 3,
      "rushing yards": 87,
      "rushing attempts": 37,
      "passing yards": 255,
      "passing attempts": 26,
      "passing completions": 18,
      "passing interceptions": 0,
      "total yards": 342,
      "total plays": 63,
      "fumbles": 0,
      "fumbles lost": 0,
      "penalties": 6,
      "penalty yards": 50,
      "punts": 5,
      "punt yards": 230,
      "punt returns": 2,
      "punt return yards": 11,
      "kickoff returns": 2,
      "kickoff return yards": 65,
      "interception returns": 1,
      "interception return yards": 30,
      "3rd down conversions": 4,
      "3rd down attempts": 13,
      "4th down conversions": 0,
      "4th down attempts": 1
    }
  },
  "MiamiFL vs NorthCarolinaState": {
    "stadium": "WayneDayFamilyFieldatCarterFinleyStadium-Raleigh-NC",
    "MiamiFL": {
      "points": 44,
      "1st downs": 30,
      "rushing 1st downs": 11,
      "passing 1st downs": 15,
      "penalty 1st downs": 4,
      "rushing yards": 189,
      "rushing attempts": 41,
      "passing yards": 431,
      "passing attempts": 42,
      "passing completions": 32,
      "passing interceptions": 0,
      "total yards": 620,
      "total plays": 83,
      "fumbles": 1,
      "fumbles lost": 0,
      "penalties": 12,
      "penalty yards": 101,
      "punts": 4,
      "punt yards": 173,
      "punt returns": 2,
      "punt return yards": -4,
      "kickoff returns": 6,
      "kickoff return yards": 124,
      "interception returns": 1,
      "interception return yards": 6,
      "3rd down conversions": 7,
      "3rd down attempts": 16,
      "4th down conversions": 1,
      "4th down attempts": 1
    },
    "NorthCarolinaState": {
      "points": 41,
      "1st downs": 24,
      "rushing 1st downs": 6,
      "passing 1st downs": 15,
      "penalty 1st downs": 3,
      "rushing yards": 131,
      "rushing attempts": 34,
      "passing yards": 279,
      "passing attempts": 29,
      "passing completions": 20,
      "passing interceptions": 1,
      "total yards": 410,
      "total plays": 63,
      "fumbles": 1,
      "fumbles lost": 0,
      "penalties": 8,
      "penalty yards": 78,
      "punts": 3,
      "punt yards": 140,
      "punt returns": 0,
      "punt return yards": 0,
      "kickoff returns": 2,
      "kickoff return yards": 105,
      "interception returns": 0,
      "interception return yards": 0,
      "3rd down conversions": 7,
      "3rd down attempts": 12,
      "4th down conversions": 0,
      "4th down attempts": 0
    }
  },
  "SanJoseState vs SanDiegoState": {
    "stadium": "SanDiegoCountyCreditUnionStadium-SanDiego-CA",
    "SanJoseState": {
      "points": 28,
      "1st downs": 16,
      "rushing 1st downs": 6,
      "passing 1st downs": 9,
      "penalty 1st downs": 1,
      "rushing yards": 116,
      "rushing attempts": 29,
      "passing yards": 182,
      "passing attempts": 28,
      "passing completions": 18,
      "passing interceptions": 1,
      "total yards": 298,
      "total plays": 57,
      "fumbles": 1,
      "fumbles lost": 0,
      "penalties": 2,
      "penalty yards": 15,
      "punts": 7,
      "punt yards": 257,
      "punt returns": 1,
      "punt return yards": 19,
      "kickoff returns": 2,
      "kickoff return yards": 59,
      "interception returns": 1,
      "interception return yards": 0,
      "3rd down conversions": 4,
      "3rd down attempts": 11,
      "4th down conversions": 0,
      "4th down attempts": 0
    },
    "SanDiegoState": {
      "points": 17,
      "1st downs": 20,
      "rushing 1st downs": 8,
      "passing 1st downs": 12,
      "penalty 1st downs": 0,
      "rushing yards": 101,
      "rushing attempts": 45,
      "passing yards": 261,
      "passing attempts": 30,
      "passing completions": 21,
      "passing interceptions": 1,
      "total yards": 362,
      "total plays": 75,
      "fumbles": 2,
      "fumbles lost": 2,
      "penalties": 4,
      "penalty yards": 40,
      "punts": 4,
      "punt yards": 183,
      "punt returns": 1,
      "punt return yards": 0,
      "kickoff returns": 5,
      "kickoff return yards": 87,
      "interception returns": 1,
      "interception return yards": 5,
      "3rd down conversions": 6,
      "3rd down attempts": 15,
      "4th down conversions": 1,
      "4th down attempts": 3
    }
  },
  "BrighamYoung vs BoiseState": {
    "stadium": "AlbertsonsStadium-Boise-ID",
    "BrighamYoung": {
      "points": 51,
      "1st downs": 25,
      "rushing 1st downs": 9,
      "passing 1st downs": 14,
      "penalty 1st downs": 2,
      "rushing yards": 214,
      "rushing attempts": 38,
      "passing yards": 359,
      "passing attempts": 27,
      "passing completions": 21,
      "passing interceptions": 0,
      "total yards": 573,
      "total plays": 65,
      "fumbles": 0,
      "fumbles lost": 0,
      "penalties": 4,
      "penalty yards": 33,
      "punts": 2,
      "punt yards": 82,
      "punt returns": 5,
      "punt return yards": 30,
      "kickoff returns": 1,
      "kickoff return yards": 17,
      "interception returns": 1,
      "interception return yards": 6,
      "3rd down conversions": 2,
      "3rd down attempts": 8,
      "4th down conversions": 2,
      "4th down attempts": 3
    },
    "BoiseState": {
      "points": 17,
      "1st downs": 14,
      "rushing 1st downs": 3,
      "passing 1st downs": 10,
      "penalty 1st downs": 1,
      "rushing yards": 61,
      "rushing attempts": 27,
      "passing yards": 249,
      "passing attempts": 38,
      "passing completions": 23,
      "passing interceptions": 1,
      "total yards": 310,
      "total plays": 65,
      "fumbles": 1,
      "fumbles lost": 1,
      "penalties": 4,
      "penalty yards": 48,
      "punts": 7,
      "punt yards": 276,
      "punt returns": 0,
      "punt return yards": 0,
      "kickoff returns": 3,
      "kickoff return yards": 52,
      "interception returns": 0,
      "interception return yards": 0,
      "3rd down conversions": 7,
      "3rd down attempts": 18,
      "4th down conversions": 1,
      "4th down attempts": 1
    }
  },
  "SouthernMethodist vs Temple": {
    "stadium": "LincolnFinancialField-Philadelphia-PA",
    "SouthernMethodist": {
      "points": 47,
      "1st downs": 24,
      "rushing 1st downs": 8,
      "passing 1st downs": 16,
      "penalty 1st downs": 0,
      "rushing yards": 194,
      "rushing attempts": 32,
      "passing yards": 355,
      "passing attempts": 35,
      "passing completions": 24,
      "passing interceptions": 0,
      "total yards": 549,
      "total plays": 67,
      "fumbles": 0,
      "fumbles lost": 0,
      "penalties": 2,
      "penalty yards": 20,
      "punts": 2,
      "punt yards": 87,
      "punt returns": 4,
      "punt return yards": 64,
      "kickoff returns": 1,
      "kickoff return yards": 12,
      "interception returns": 0,
      "interception return yards": 0,
      "3rd down conversions": 6,
      "3rd down attempts": 12,
      "4th down conversions": 1,
      "4th down attempts": 2
    },
    "Temple": {
      "points": 23,
      "1st downs": 19,
      "rushing 1st downs": 9,
      "passing 1st downs": 10,
      "penalty 1st downs": 0,
      "rushing yards": 157,
      "rushing attempts": 43,
      "passing yards": 211,
      "passing attempts": 30,
      "passing completions": 17,
      "passing interceptions": 0,
      "total yards": 368,
      "total plays": 73,
      "fumbles": 0,
      "fumbles lost": 0,
      "penalties": 4,
      "penalty yards": 30,
      "punts": 7,
      "punt yards": 331,
      "punt returns": 1,
      "punt return yards": 12,
      "kickoff returns": 0,
      "kickoff return yards": 0,
      "interception returns": 0,
      "interception return yards": 0,
      "3rd down conversions": 6,
      "3rd down attempts": 17,
      "4th down conversions": 2,
      "4th down attempts": 3
    }
  },
  "ArkansasState vs LouisianaLafayette": {
    "stadium": "CajunField-Lafayette-LA",
    "ArkansasState": {
      "points": 20,
      "1st downs": 24,
      "rushing 1st downs": 13,
      "passing 1st downs": 9,
      "penalty 1st downs": 2,
      "rushing yards": 199,
      "rushing attempts": 44,
      "passing yards": 224,
      "passing attempts": 40,
      "passing completions": 21,
      "passing interceptions": 2,
      "total yards": 423,
      "total plays": 84,
      "fumbles": 0,
      "fumbles lost": 0,
      "penalties": 7,
      "penalty yards": 48,
      "punts": 4,
      "punt yards": 121,
      "punt returns": 0,
      "punt return yards": 0,
      "kickoff returns": 4,
      "kickoff return yards": 69,
      "interception returns": 1,
      "interception return yards": 28,
      "3rd down conversions": 7,
      "3rd down attempts": 18,
      "4th down conversions": 2,
      "4th down attempts": 4
    },
    "LouisianaLafayette": {
      "points": 27,
      "1st downs": 19,
      "rushing 1st downs": 8,
      "passing 1st downs": 9,
      "penalty 1st downs": 2,
      "rushing yards": 196,
      "rushing attempts": 38,
      "passing yards": 244,
      "passing attempts": 29,
      "passing completions": 17,
      "passing interceptions": 1,
      "total yards": 440,
      "total plays": 67,
      "fumbles": 1,
      "fumbles lost": 0,
      "penalties": 5,
      "penalty yards": 72,
      "punts": 2,
      "punt yards": 86,
      "punt returns": 3,
      "punt return yards": -1,
      "kickoff returns": 2,
      "kickoff return yards": 31,
      "interception returns": 2,
      "interception return yards": 16,
      "3rd down conversions": 3,
      "3rd down attempts": 13,
      "4th down conversions": 1,
      "4th down attempts": 4
    }
  },
  "Tulane vs EastCarolina": {
    "stadium": "BagwellFieldatDowdyFicklenStadium-Greenville-NC",
    "Tulane": {
      "points": 38,
      "1st downs": 24,
      "rushing 1st downs": 11,
      "passing 1st downs": 12,
      "penalty 1st downs": 1,
      "rushing yards": 277,
      "rushing attempts": 34,
      "passing yards": 216,
      "passing attempts": 34,
      "passing completions": 22,
      "passing interceptions": 1,
      "total yards": 493,
      "total plays": 68,
      "fumbles": 1,
      "fumbles lost": 0,
      "penalties": 8,
      "penalty yards": 65,
      "punts": 4,
      "punt yards": 177,
      "punt returns": 3,
      "punt return yards": 11,
      "kickoff returns": 1,
      "kickoff return yards": 17,
      "interception returns": 0,
      "interception return yards": 0,
      "3rd down conversions": 5,
      "3rd down attempts": 12,
      "4th down conversions": 0,
      "4th down attempts": 1
    },
    "EastCarolina": {
      "points": 21,
      "1st downs": 20,
      "rushing 1st downs": 5,
      "passing 1st downs": 12,
      "penalty 1st downs": 3,
      "rushing yards": 35,
      "rushing attempts": 29,
      "passing yards": 351,
      "passing attempts": 43,
      "passing completions": 27,
      "passing interceptions": 0,
      "total yards": 386,
      "total plays": 72,
      "fumbles": 2,
      "fumbles lost": 1,
      "penalties": 4,
      "penalty yards": 23,
      "punts": 6,
      "punt yards": 262,
      "punt returns": 0,
      "punt return yards": 0,
      "kickoff returns": 1,
      "kickoff return yards": 30,
      "interception returns": 1,
      "interception return yards": 0,
      "3rd down conversions": 3,
      "3rd down attempts": 15,
      "4th down conversions": 1,
      "4th down attempts": 4
    }
  },
  "WestVirginia vs Texas": {
    "stadium": "DarrellKRoyalTexasMemorialStadium-Austin-TX",
    "WestVirginia": {
      "points": 13,
      "1st downs": 21,
      "rushing 1st downs": 4,
      "passing 1st downs": 15,
      "penalty 1st downs": 2,
      "rushing yards": 43,
      "rushing attempts": 26,
      "passing yards": 317,
      "passing attempts": 50,
      "passing completions": 35,
      "passing interceptions": 0,
      "total yards": 360,
      "total plays": 76,
      "fumbles": 2,
      "fumbles lost": 0,
      "penalties": 6,
      "penalty yards": 50,
      "punts": 5,
      "punt yards": 204,
      "punt returns": 3,
      "punt return yards": 27,
      "kickoff returns": 0,
      "kickoff return yards": 0,
      "interception returns": 0,
      "interception return yards": 0,
      "3rd down conversions": 6,
      "3rd down attempts": 17,
      "4th down conversions": 0,
      "4th down attempts": 3
    },
    "Texas": {
      "points": 17,
      "1st downs": 17,
      "rushing 1st downs": 7,
      "passing 1st downs": 8,
      "penalty 1st downs": 2,
      "rushing yards": 179,
      "rushing attempts": 36,
      "passing yards": 184,
      "passing attempts": 31,
      "passing completions": 15,
      "passing interceptions": 0,
      "total yards": 363,
      "total plays": 67,
      "fumbles": 1,
      "fumbles lost": 0,
      "penalties": 4,
      "penalty yards": 45,
      "punts": 6,
      "punt yards": 260,
      "punt returns": 3,
      "punt return yards": -2,
      "kickoff returns": 2,
      "kickoff return yards": 36,
      "interception returns": 0,
      "interception return yards": 0,
      "3rd down conversions": 8,
      "3rd down attempts": 17,
      "4th down conversions": 0,
      "4th down attempts": 1
    }
  },
  "FCS vs GeorgiaState": {
    "stadium": "CenterParcStadium-Atlanta-GA",
    "FCS": {
      "points": 34,
      "1st downs": 23,
      "rushing 1st downs": 5,
      "passing 1st downs": 15,
      "penalty 1st downs": 3,
      "rushing yards": 85,
      "rushing attempts": 27,
      "passing yards": 339,
      "passing attempts": 42,
      "passing completions": 26,
      "passing interceptions": 1,
      "total yards": 424,
      "total plays": 69,
      "fumbles": 2,
      "fumbles lost": 2,
      "penalties": 1,
      "penalty yards": 17,
      "punts": 3,
      "punt yards": 153,
      "punt returns": 2,
      "punt return yards": -1,
      "kickoff returns": 1,
      "kickoff return yards": 15,
      "interception returns": 0,
      "interception return yards": 0,
      "3rd down conversions": 4,
      "3rd down attempts": 12,
      "4th down conversions": 3,
      "4th down attempts": 5
    },
    "GeorgiaState": {
      "points": 52,
      "1st downs": 23,
      "rushing 1st downs": 14,
      "passing 1st downs": 9,
      "penalty 1st downs": 0,
      "rushing yards": 263,
      "rushing attempts": 49,
      "passing yards": 241,
      "passing attempts": 32,
      "passing completions": 20,
      "passing interceptions": 0,
      "total yards": 504,
      "total plays": 81,
      "fumbles": 1,
      "fumbles lost": 1,
      "penalties": 5,
      "penalty yards": 59,
      "punts": 4,
      "punt yards": 166,
      "punt returns": 0,
      "punt return yards": 0,
      "kickoff returns": 2,
      "kickoff return yards": 45,
      "interception returns": 1,
      "interception return yards": 2,
      "3rd down conversions": 10,
      "3rd down attempts": 17,
      "4th down conversions": 2,
      "4th down attempts": 2
    }
  },
  "Liberty vs VirginiaTech": {
    "stadium": "LaneStadium-Blacksburg-VA",
    "Liberty": {
      "points": 38,
      "1st downs": 29,
      "rushing 1st downs": 18,
      "passing 1st downs": 9,
      "penalty 1st downs": 2,
      "rushing yards": 249,
      "rushing attempts": 50,
      "passing yards": 217,
      "passing attempts": 30,
      "passing completions": 20,
      "passing interceptions": 0,
      "total yards": 466,
      "total plays": 80,
      "fumbles": 4,
      "fumbles lost": 2,
      "penalties": 8,
      "penalty yards": 50,
      "punts": 2,
      "punt yards": 88,
      "punt returns": 1,
      "punt return yards": -1,
      "kickoff returns": 3,
      "kickoff return yards": 37,
      "interception returns": 0,
      "interception return yards": 0,
      "3rd down conversions": 6,
      "3rd down attempts": 13,
      "4th down conversions": 4,
      "4th down attempts": 4
    },
    "VirginiaTech": {
      "points": 35,
      "1st downs": 24,
      "rushing 1st downs": 10,
      "passing 1st downs": 12,
      "penalty 1st downs": 2,
      "rushing yards": 201,
      "rushing attempts": 31,
      "passing yards": 217,
      "passing attempts": 27,
      "passing completions": 20,
      "passing interceptions": 0,
      "total yards": 418,
      "total plays": 58,
      "fumbles": 2,
      "fumbles lost": 1,
      "penalties": 5,
      "penalty yards": 45,
      "punts": 2,
      "punt yards": 102,
      "punt returns": 2,
      "punt return yards": 17,
      "kickoff returns": 1,
      "kickoff return yards": 0,
      "interception returns": 0,
      "interception return yards": 0,
      "3rd down conversions": 4,
      "3rd down attempts": 10,
      "4th down conversions": 2,
      "4th down attempts": 2
    }
  },
  "NorthCarolina vs Duke": {
    "stadium": "BrooksFieldatWallaceWadeStadium-Durham-NC",
    "NorthCarolina": {
      "points": 56,
      "1st downs": 30,
      "rushing 1st downs": 16,
      "passing 1st downs": 13,
      "penalty 1st downs": 1,
      "rushing yards": 338,
      "rushing attempts": 47,
      "passing yards": 235,
      "passing attempts": 28,
      "passing completions": 19,
      "passing interceptions": 1,
      "total yards": 573,
      "total plays": 75,
      "fumbles": 0,
      "fumbles lost": 0,
      "penalties": 6,
      "penalty yards": 80,
      "punts": 2,
      "punt yards": 85,
      "punt returns": 2,
      "punt return yards": 15,
      "kickoff returns": 1,
      "kickoff return yards": 5,
      "interception returns": 1,
      "interception return yards": 43,
      "3rd down conversions": 6,
      "3rd down attempts": 12,
      "4th down conversions": 4,
      "4th down attempts": 4
    },
    "Duke": {
      "points": 24,
      "1st downs": 26,
      "rushing 1st downs": 10,
      "passing 1st downs": 11,
      "penalty 1st downs": 5,
      "rushing yards": 185,
      "rushing attempts": 42,
      "passing yards": 226,
      "passing attempts": 32,
      "passing completions": 18,
      "passing interceptions": 1,
      "total yards": 411,
      "total plays": 74,
      "fumbles": 2,
      "fumbles lost": 1,
      "penalties": 7,
      "penalty yards": 63,
      "punts": 4,
      "punt yards": 175,
      "punt returns": 2,
      "punt return yards": 20,
      "kickoff returns": 0,
      "kickoff return yards": 0,
      "interception returns": 1,
      "interception return yards": 0,
      "3rd down conversions": 6,
      "3rd down attempts": 15,
      "4th down conversions": 2,
      "4th down attempts": 4
    }
  },
  "SouthFlorida vs Memphis": {
    "stadium": "LibertyBowlMemorialStadium-Memphis-TN",
    "SouthFlorida": {
      "points": 33,
      "1st downs": 16,
      "rushing 1st downs": 7,
      "passing 1st downs": 9,
      "penalty 1st downs": 0,
      "rushing yards": 113,
      "rushing attempts": 33,
      "passing yards": 217,
      "passing attempts": 29,
      "passing completions": 20,
      "passing interceptions": 0,
      "total yards": 330,
      "total plays": 62,
      "fumbles": 0,
      "fumbles lost": 0,
      "penalties": 4,
      "penalty yards": 38,
      "punts": 5,
      "punt yards": 227,
      "punt returns": 2,
      "punt return yards": 9,
      "kickoff returns": 4,
      "kickoff return yards": 47,
      "interception returns": 1,
      "interception return yards": 51,
      "3rd down conversions": 2,
      "3rd down attempts": 12,
      "4th down conversions": 0,
      "4th down attempts": 1
    },
    "Memphis": {
      "points": 34,
      "1st downs": 24,
      "rushing 1st downs": 6,
      "passing 1st downs": 15,
      "penalty 1st downs": 3,
      "rushing yards": 98,
      "rushing attempts": 33,
      "passing yards": 437,
      "passing attempts": 50,
      "passing completions": 30,
      "passing interceptions": 1,
      "total yards": 535,
      "total plays": 83,
      "fumbles": 1,
      "fumbles lost": 0,
      "penalties": 6,
      "penalty yards": 53,
      "punts": 3,
      "punt yards": 128,
      "punt returns": 3,
      "punt return yards": 3,
      "kickoff returns": 3,
      "kickoff return yards": 73,
      "interception returns": 0,
      "interception return yards": 0,
      "3rd down conversions": 10,
      "3rd down attempts": 19,
      "4th down conversions": 1,
      "4th down attempts": 4
    }
  },
  "Nebraska vs Northwestern": {
    "stadium": "RyanField-Evanston-IL",
    "Nebraska": {
      "points": 13,
      "1st downs": 28,
      "rushing 1st downs": 14,
      "passing 1st downs": 10,
      "penalty 1st downs": 4,
      "rushing yards": 224,
      "rushing attempts": 43,
      "passing yards": 218,
      "passing attempts": 45,
      "passing completions": 24,
      "passing interceptions": 2,
      "total yards": 442,
      "total plays": 88,
      "fumbles": 2,
      "fumbles lost": 0,
      "penalties": 9,
      "penalty yards": 55,
      "punts": 5,
      "punt yards": 202,
      "punt returns": 2,
      "punt return yards": -3,
      "kickoff returns": 1,
      "kickoff return yards": 11,
      "interception returns": 2,
      "interception return yards": 45,
      "3rd down conversions": 4,
      "3rd down attempts": 16,
      "4th down conversions": 2,
      "4th down attempts": 3
    },
    "Northwestern": {
      "points": 21,
      "1st downs": 14,
      "rushing 1st downs": 5,
      "passing 1st downs": 9,
      "penalty 1st downs": 0,
      "rushing yards": 148,
      "rushing attempts": 38,
      "passing yards": 169,
      "passing attempts": 27,
      "passing completions": 16,
      "passing interceptions": 2,
      "total yards": 317,
      "total plays": 65,
      "fumbles": 1,
      "fumbles lost": 0,
      "penalties": 8,
      "penalty yards": 64,
      "punts": 6,
      "punt yards": 261,
      "punt returns": 2,
      "punt return yards": 44,
      "kickoff returns": 1,
      "kickoff return yards": 36,
      "interception returns": 2,
      "interception return yards": 5,
      "3rd down conversions": 7,
      "3rd down attempts": 16,
      "4th down conversions": 1,
      "4th down attempts": 1
    }
  },
  "Michigan vs Indiana": {
    "stadium": "MemorialStadiumBloomington-IN-Bloomington",
    "Michigan": {
      "points": 21,
      "1st downs": 17,
      "rushing 1st downs": 1,
      "passing 1st downs": 15,
      "penalty 1st downs": 1,
      "rushing yards": 13,
      "rushing attempts": 18,
      "passing yards": 344,
      "passing attempts": 34,
      "passing completions": 18,
      "passing interceptions": 2,
      "total yards": 357,
      "total plays": 52,
      "fumbles": 0,
      "fumbles lost": 0,
      "penalties": 8,
      "penalty yards": 89,
      "punts": 7,
      "punt yards": 375,
      "punt returns": 2,
      "punt return yards": 14,
      "kickoff returns": 3,
      "kickoff return yards": 59,
      "interception returns": 0,
      "interception return yards": 0,
      "3rd down conversions": 3,
      "3rd down attempts": 11,
      "4th down conversions": 0,
      "4th down attempts": 0
    },
    "Indiana": {
      "points": 38,
      "1st downs": 28,
      "rushing 1st downs": 7,
      "passing 1st downs": 18,
      "penalty 1st downs": 3,
      "rushing yards": 118,
      "rushing attempts": 38,
      "passing yards": 342,
      "passing attempts": 50,
      "passing completions": 30,
      "passing interceptions": 0,
      "total yards": 460,
      "total plays": 88,
      "fumbles": 0,
      "fumbles lost": 0,
      "penalties": 4,
      "penalty yards": 50,
      "punts": 5,
      "punt yards": 231,
      "punt returns": 1,
      "punt return yards": 5,
      "kickoff returns": 0,
      "kickoff return yards": 0,
      "interception returns": 2,
      "interception return yards": 60,
      "3rd down conversions": 9,
      "3rd down attempts": 18,
      "4th down conversions": 2,
      "4th down attempts": 2
    }
  },
  "MichiganState vs Iowa": {
    "stadium": "KinnickStadium-IowaCity-IA",
    "MichiganState": {
      "points": 7,
      "1st downs": 10,
      "rushing 1st downs": 1,
      "passing 1st downs": 9,
      "penalty 1st downs": 0,
      "rushing yards": 59,
      "rushing attempts": 32,
      "passing yards": 227,
      "passing attempts": 38,
      "passing completions": 17,
      "passing interceptions": 3,
      "total yards": 286,
      "total plays": 70,
      "fumbles": 1,
      "fumbles lost": 0,
      "penalties": 8,
      "penalty yards": 55,
      "punts": 10,
      "punt yards": 405,
      "punt returns": 0,
      "punt return yards": 0,
      "kickoff returns": 3,
      "kickoff return yards": 40,
      "interception returns": 0,
      "interception return yards": 0,
      "3rd down conversions": 7,
      "3rd down attempts": 20,
      "4th down conversions": 0,
      "4th down attempts": 1
    },
    "Iowa": {
      "points": 49,
      "1st downs": 19,
      "rushing 1st downs": 7,
      "passing 1st downs": 10,
      "penalty 1st downs": 2,
      "rushing yards": 226,
      "rushing attempts": 41,
      "passing yards": 179,
      "passing attempts": 29,
      "passing completions": 16,
      "passing interceptions": 0,
      "total yards": 405,
      "total plays": 70,
      "fumbles": 1,
      "fumbles lost": 0,
      "penalties": 6,
      "penalty yards": 35,
      "punts": 7,
      "punt yards": 321,
      "punt returns": 5,
      "punt return yards": 105,
      "kickoff returns": 0,
      "kickoff return yards": 0,
      "interception returns": 3,
      "interception return yards": 66,
      "3rd down conversions": 5,
      "3rd down attempts": 15,
      "4th down conversions": 1,
      "4th down attempts": 1
    }
  },
  "ArizonaState vs USC": {
    "stadium": "UnitedAirlinesFieldatLAMemorialColiseum-LosAngeles-CA",
    "ArizonaState": {
      "points": 27,
      "1st downs": 20,
      "rushing 1st downs": 12,
      "passing 1st downs": 5,
      "penalty 1st downs": 3,
      "rushing yards": 258,
      "rushing attempts": 38,
      "passing yards": 134,
      "passing attempts": 23,
      "passing completions": 11,
      "passing interceptions": 0,
      "total yards": 392,
      "total plays": 61,
      "fumbles": 3,
      "fumbles lost": 3,
      "penalties": 4,
      "penalty yards": 34,
      "punts": 5,
      "punt yards": 258,
      "punt returns": 1,
      "punt return yards": 2,
      "kickoff returns": 0,
      "kickoff return yards": 0,
      "interception returns": 1,
      "interception return yards": 0,
      "3rd down conversions": 6,
      "3rd down attempts": 14,
      "4th down conversions": 0,
      "4th down attempts": 1
    },
    "USC": {
      "points": 28,
      "1st downs": 28,
      "rushing 1st downs": 12,
      "passing 1st downs": 16,
      "penalty 1st downs": 0,
      "rushing yards": 175,
      "rushing attempts": 40,
      "passing yards": 381,
      "passing attempts": 55,
      "passing completions": 40,
      "passing interceptions": 1,
      "total yards": 556,
      "total plays": 95,
      "fumbles": 3,
      "fumbles lost": 3,
      "penalties": 5,
      "penalty yards": 59,
      "punts": 3,
      "punt yards": 138,
      "punt returns": 2,
      "punt return yards": 15,
      "kickoff returns": 5,
      "kickoff return yards": 95,
      "interception returns": 0,
      "interception return yards": 0,
      "3rd down conversions": 7,
      "3rd down attempts": 19,
      "4th down conversions": 5,
      "4th down attempts": 8
    }
  },
  "Troy vs GeorgiaSouthern": {
    "stadium": "AllenEPaulsonStadium-Statesboro-GA",
    "Troy": {
      "points": 13,
      "1st downs": 14,
      "rushing 1st downs": 2,
      "passing 1st downs": 11,
      "penalty 1st downs": 1,
      "rushing yards": 34,
      "rushing attempts": 14,
      "passing yards": 201,
      "passing attempts": 47,
      "passing completions": 21,
      "passing interceptions": 2,
      "total yards": 235,
      "total plays": 61,
      "fumbles": 0,
      "fumbles lost": 0,
      "penalties": 3,
      "penalty yards": 27,
      "punts": 6,
      "punt yards": 292,
      "punt returns": 3,
      "punt return yards": 3,
      "kickoff returns": 4,
      "kickoff return yards": 70,
      "interception returns": 1,
      "interception return yards": 44,
      "3rd down conversions": 5,
      "3rd down attempts": 16,
      "4th down conversions": 0,
      "4th down attempts": 1
    },
    "GeorgiaSouthern": {
      "points": 20,
      "1st downs": 20,
      "rushing 1st downs": 15,
      "passing 1st downs": 4,
      "penalty 1st downs": 1,
      "rushing yards": 326,
      "rushing attempts": 61,
      "passing yards": 85,
      "passing attempts": 13,
      "passing completions": 12,
      "passing interceptions": 1,
      "total yards": 411,
      "total plays": 74,
      "fumbles": 1,
      "fumbles lost": 0,
      "penalties": 6,
      "penalty yards": 60,
      "punts": 5,
      "punt yards": 209,
      "punt returns": 1,
      "punt return yards": 9,
      "kickoff returns": 0,
      "kickoff return yards": 0,
      "interception returns": 2,
      "interception return yards": 15,
      "3rd down conversions": 5,
      "3rd down attempts": 15,
      "4th down conversions": 0,
      "4th down attempts": 1
    }
  },
  "BostonCollege vs Syracuse": {
    "stadium": "CarrierDome-Syracuse-NY",
    "BostonCollege": {
      "points": 16,
      "1st downs": 22,
      "rushing 1st downs": 13,
      "passing 1st downs": 7,
      "penalty 1st downs": 2,
      "rushing yards": 191,
      "rushing attempts": 47,
      "passing yards": 208,
      "passing attempts": 29,
      "passing completions": 20,
      "passing interceptions": 0,
      "total yards": 399,
      "total plays": 76,
      "fumbles": 0,
      "fumbles lost": 0,
      "penalties": 7,
      "penalty yards": 65,
      "punts": 4,
      "punt yards": 178,
      "punt returns": 3,
      "punt return yards": 15,
      "kickoff returns": 0,
      "kickoff return yards": 0,
      "interception returns": 1,
      "interception return yards": 2,
      "3rd down conversions": 10,
      "3rd down attempts": 19,
      "4th down conversions": 0,
      "4th down attempts": 0
    },
    "Syracuse": {
      "points": 13,
      "1st downs": 14,
      "rushing 1st downs": 4,
      "passing 1st downs": 8,
      "penalty 1st downs": 2,
      "rushing yards": 52,
      "rushing attempts": 21,
      "passing yards": 188,
      "passing attempts": 30,
      "passing completions": 19,
      "passing interceptions": 1,
      "total yards": 240,
      "total plays": 51,
      "fumbles": 1,
      "fumbles lost": 1,
      "penalties": 7,
      "penalty yards": 69,
      "punts": 5,
      "punt yards": 226,
      "punt returns": 1,
      "punt return yards": 24,
      "kickoff returns": 3,
      "kickoff return yards": 71,
      "interception returns": 0,
      "interception return yards": 0,
      "3rd down conversions": 3,
      "3rd down attempts": 11,
      "4th down conversions": 0,
      "4th down attempts": 0
    }
  },
  "Massachusetts vs Marshall": {
    "stadium": "JoanCEdwardsStadium-Huntington-WV",
    "Massachusetts": {
      "points": 10,
      "1st downs": 12,
      "rushing 1st downs": 5,
      "passing 1st downs": 5,
      "penalty 1st downs": 2,
      "rushing yards": 41,
      "rushing attempts": 29,
      "passing yards": 149,
      "passing attempts": 26,
      "passing completions": 17,
      "passing interceptions": 0,
      "total yards": 190,
      "total plays": 55,
      "fumbles": 3,
      "fumbles lost": 1,
      "penalties": 5,
      "penalty yards": 68,
      "punts": 7,
      "punt yards": 305,
      "punt returns": 0,
      "punt return yards": 0,
      "kickoff returns": 4,
      "kickoff return yards": 37,
      "interception returns": 0,
      "interception return yards": 0,
      "3rd down conversions": 4,
      "3rd down attempts": 14,
      "4th down conversions": 1,
      "4th down attempts": 2
    },
    "Marshall": {
      "points": 51,
      "1st downs": 33,
      "rushing 1st downs": 16,
      "passing 1st downs": 12,
      "penalty 1st downs": 5,
      "rushing yards": 267,
      "rushing attempts": 41,
      "passing yards": 228,
      "passing attempts": 32,
      "passing completions": 21,
      "passing interceptions": 0,
      "total yards": 495,
      "total plays": 73,
      "fumbles": 0,
      "fumbles lost": 0,
      "penalties": 4,
      "penalty yards": 43,
      "punts": 2,
      "punt yards": 87,
      "punt returns": 1,
      "punt return yards": 7,
      "kickoff returns": 2,
      "kickoff return yards": 21,
      "interception returns": 0,
      "interception return yards": 0,
      "3rd down conversions": 6,
      "3rd down attempts": 12,
      "4th down conversions": 1,
      "4th down attempts": 2
    }
  },
  "AppalachianState vs TexasState": {
    "stadium": "JimWackerFieldatBobcatStadium-SanMarcos-TX",
    "AppalachianState": {
      "points": 38,
      "1st downs": 22,
      "rushing 1st downs": 14,
      "passing 1st downs": 8,
      "penalty 1st downs": 0,
      "rushing yards": 258,
      "rushing attempts": 43,
      "passing yards": 168,
      "passing attempts": 28,
      "passing completions": 18,
      "passing interceptions": 0,
      "total yards": 426,
      "total plays": 71,
      "fumbles": 2,
      "fumbles lost": 0,
      "penalties": 11,
      "penalty yards": 94,
      "punts": 5,
      "punt yards": 220,
      "punt returns": 1,
      "punt return yards": 21,
      "kickoff returns": 1,
      "kickoff return yards": 27,
      "interception returns": 2,
      "interception return yards": 49,
      "3rd down conversions": 9,
      "3rd down attempts": 16,
      "4th down conversions": 1,
      "4th down attempts": 1
    },
    "TexasState": {
      "points": 17,
      "1st downs": 21,
      "rushing 1st downs": 9,
      "passing 1st downs": 8,
      "penalty 1st downs": 4,
      "rushing yards": 215,
      "rushing attempts": 30,
      "passing yards": 205,
      "passing attempts": 38,
      "passing completions": 21,
      "passing interceptions": 2,
      "total yards": 420,
      "total plays": 68,
      "fumbles": 0,
      "fumbles lost": 0,
      "penalties": 6,
      "penalty yards": 72,
      "punts": 4,
      "punt yards": 163,
      "punt returns": 3,
      "punt return yards": -1,
      "kickoff returns": 4,
      "kickoff return yards": 69,
      "interception returns": 0,
      "interception return yards": 0,
      "3rd down conversions": 4,
      "3rd down attempts": 12,
      "4th down conversions": 0,
      "4th down attempts": 3
    }
  },
  "FCS vs SouthernMiss": {
    "stadium": "MMRobertsStadium-Hattiesburg-MS",
    "FCS": {
      "points": 13,
      "1st downs": 11,
      "rushing 1st downs": 1,
      "passing 1st downs": 8,
      "penalty 1st downs": 2,
      "rushing yards": 23,
      "rushing attempts": 23,
      "passing yards": 152,
      "passing attempts": 29,
      "passing completions": 22,
      "passing interceptions": 1,
      "total yards": 175,
      "total plays": 52,
      "fumbles": 2,
      "fumbles lost": 0,
      "penalties": 4,
      "penalty yards": 30,
      "punts": 6,
      "punt yards": 292,
      "punt returns": 0,
      "punt return yards": 0,
      "kickoff returns": 2,
      "kickoff return yards": 30,
      "interception returns": 2,
      "interception return yards": 9,
      "3rd down conversions": 3,
      "3rd down attempts": 12,
      "4th down conversions": 0,
      "4th down attempts": 0
    },
    "SouthernMiss": {
      "points": 24,
      "1st downs": 23,
      "rushing 1st downs": 14,
      "passing 1st downs": 8,
      "penalty 1st downs": 1,
      "rushing yards": 245,
      "rushing attempts": 42,
      "passing yards": 100,
      "passing attempts": 20,
      "passing completions": 12,
      "passing interceptions": 2,
      "total yards": 345,
      "total plays": 62,
      "fumbles": 2,
      "fumbles lost": 2,
      "penalties": 5,
      "penalty yards": 41,
      "punts": 2,
      "punt yards": 81,
      "punt returns": 2,
      "punt return yards": 24,
      "kickoff returns": 3,
      "kickoff return yards": 55,
      "interception returns": 1,
      "interception return yards": 0,
      "3rd down conversions": 4,
      "3rd down attempts": 11,
      "4th down conversions": 3,
      "4th down attempts": 3
    }
  },
  "Kansas vs Oklahoma": {
    "stadium": "GaylordFamilyOklahomaMemorialStadium-Norman-OK",
    "Kansas": {
      "points": 9,
      "1st downs": 16,
      "rushing 1st downs": 8,
      "passing 1st downs": 7,
      "penalty 1st downs": 1,
      "rushing yards": 95,
      "rushing attempts": 42,
      "passing yards": 151,
      "passing attempts": 35,
      "passing completions": 14,
      "passing interceptions": 2,
      "total yards": 246,
      "total plays": 77,
      "fumbles": 1,
      "fumbles lost": 0,
      "penalties": 9,
      "penalty yards": 55,
      "punts": 9,
      "punt yards": 331,
      "punt returns": 0,
      "punt return yards": 0,
      "kickoff returns": 7,
      "kickoff return yards": 154,
      "interception returns": 1,
      "interception return yards": 0,
      "3rd down conversions": 4,
      "3rd down attempts": 19,
      "4th down conversions": 2,
      "4th down attempts": 4
    },
    "Oklahoma": {
      "points": 62,
      "1st downs": 31,
      "rushing 1st downs": 13,
      "passing 1st downs": 17,
      "penalty 1st downs": 1,
      "rushing yards": 200,
      "rushing attempts": 31,
      "passing yards": 340,
      "passing attempts": 36,
      "passing completions": 22,
      "passing interceptions": 1,
      "total yards": 540,
      "total plays": 67,
      "fumbles": 2,
      "fumbles lost": 1,
      "penalties": 5,
      "penalty yards": 45,
      "punts": 2,
      "punt yards": 75,
      "punt returns": 2,
      "punt return yards": 6,
      "kickoff returns": 0,
      "kickoff return yards": 0,
      "interception returns": 2,
      "interception return yards": 37,
      "3rd down conversions": 3,
      "3rd down attempts": 8,
      "4th down conversions": 1,
      "4th down attempts": 1
    }
  },
  "Vanderbilt vs MississippiState": {
    "stadium": "DavisWadeStadiumatScottField-Starkville-MS",
    "Vanderbilt": {
      "points": 17,
      "1st downs": 30,
      "rushing 1st downs": 9,
      "passing 1st downs": 16,
      "penalty 1st downs": 5,
      "rushing yards": 142,
      "rushing attempts": 36,
      "passing yards": 336,
      "passing attempts": 46,
      "passing completions": 31,
      "passing interceptions": 3,
      "total yards": 478,
      "total plays": 82,
      "fumbles": 3,
      "fumbles lost": 2,
      "penalties": 6,
      "penalty yards": 52,
      "punts": 1,
      "punt yards": 29,
      "punt returns": 2,
      "punt return yards": 23,
      "kickoff returns": 0,
      "kickoff return yards": 0,
      "interception returns": 0,
      "interception return yards": 0,
      "3rd down conversions": 8,
      "3rd down attempts": 15,
      "4th down conversions": 2,
      "4th down attempts": 3
    },
    "MississippiState": {
      "points": 24,
      "1st downs": 14,
      "rushing 1st downs": 3,
      "passing 1st downs": 9,
      "penalty 1st downs": 2,
      "rushing yards": 0,
      "rushing attempts": 11,
      "passing yards": 226,
      "passing attempts": 46,
      "passing completions": 35,
      "passing interceptions": 0,
      "total yards": 204,
      "total plays": 57,
      "fumbles": 0,
      "fumbles lost": 0,
      "penalties": 8,
      "penalty yards": 92,
      "punts": 7,
      "punt yards": 319,
      "punt returns": 0,
      "punt return yards": 0,
      "kickoff returns": 1,
      "kickoff return yards": 32,
      "interception returns": 3,
      "interception return yards": 55,
      "3rd down conversions": 4,
      "3rd down attempts": 13,
      "4th down conversions": 0,
      "4th down attempts": 0
    }
  },
  "TexasTech vs TCU": {
    "stadium": "AmonGCarterStadium-FortWorth-TX",
    "TexasTech": {
      "points": 18,
      "1st downs": 15,
      "rushing 1st downs": 5,
      "passing 1st downs": 9,
      "penalty 1st downs": 1,
      "rushing yards": 77,
      "rushing attempts": 26,
      "passing yards": 234,
      "passing attempts": 41,
      "passing completions": 23,
      "passing interceptions": 1,
      "total yards": 311,
      "total plays": 67,
      "fumbles": 0,
      "fumbles lost": 0,
      "penalties": 6,
      "penalty yards": 60,
      "punts": 7,
      "punt yards": 330,
      "punt returns": 2,
      "punt return yards": -12,
      "kickoff returns": 1,
      "kickoff return yards": 26,
      "interception returns": 1,
      "interception return yards": 0,
      "3rd down conversions": 2,
      "3rd down attempts": 16,
      "4th down conversions": 2,
      "4th down attempts": 3
    },
    "TCU": {
      "points": 34,
      "1st downs": 15,
      "rushing 1st downs": 8,
      "passing 1st downs": 4,
      "penalty 1st downs": 3,
      "rushing yards": 270,
      "rushing attempts": 49,
      "passing yards": 73,
      "passing attempts": 23,
      "passing completions": 11,
      "passing interceptions": 1,
      "total yards": 343,
      "total plays": 72,
      "fumbles": 2,
      "fumbles lost": 0,
      "penalties": 7,
      "penalty yards": 75,
      "punts": 5,
      "punt yards": 227,
      "punt returns": 6,
      "punt return yards": 85,
      "kickoff returns": 2,
      "kickoff return yards": 38,
      "interception returns": 1,
      "interception return yards": 0,
      "3rd down conversions": 7,
      "3rd down attempts": 17,
      "4th down conversions": 1,
      "4th down attempts": 2
    }
  },
  "Florida vs Georgia": {
    "stadium": "TIAABankField-Jacksonville-FL",
    "Florida": {
      "points": 44,
      "1st downs": 29,
      "rushing 1st downs": 5,
      "passing 1st downs": 22,
      "penalty 1st downs": 2,
      "rushing yards": 97,
      "rushing attempts": 37,
      "passing yards": 474,
      "passing attempts": 43,
      "passing completions": 30,
      "passing interceptions": 1,
      "total yards": 571,
      "total plays": 80,
      "fumbles": 0,
      "fumbles lost": 0,
      "penalties": 3,
      "penalty yards": 15,
      "punts": 3,
      "punt yards": 135,
      "punt returns": 1,
      "punt return yards": 0,
      "kickoff returns": 0,
      "kickoff return yards": 0,
      "interception returns": 3,
      "interception return yards": 39,
      "3rd down conversions": 7,
      "3rd down attempts": 16,
      "4th down conversions": 0,
      "4th down attempts": 1
    },
    "Georgia": {
      "points": 28,
      "1st downs": 12,
      "rushing 1st downs": 7,
      "passing 1st downs": 5,
      "penalty 1st downs": 0,
      "rushing yards": 165,
      "rushing attempts": 29,
      "passing yards": 112,
      "passing attempts": 29,
      "passing completions": 9,
      "passing interceptions": 3,
      "total yards": 277,
      "total plays": 58,
      "fumbles": 2,
      "fumbles lost": 0,
      "penalties": 3,
      "penalty yards": 35,
      "punts": 7,
      "punt yards": 306,
      "punt returns": 1,
      "punt return yards": 9,
      "kickoff returns": 4,
      "kickoff return yards": 119,
      "interception returns": 1,
      "interception return yards": 37,
      "3rd down conversions": 2,
      "3rd down attempts": 13,
      "4th down conversions": 1,
      "4th down attempts": 3
    }
  },
  "Houston vs Cincinnati": {
    "stadium": "NippertStadium-Cincinnati-OH",
    "Houston": {
      "points": 10,
      "1st downs": 15,
      "rushing 1st downs": 6,
      "passing 1st downs": 8,
      "penalty 1st downs": 1,
      "rushing yards": 93,
      "rushing attempts": 28,
      "passing yards": 189,
      "passing attempts": 34,
      "passing completions": 20,
      "passing interceptions": 1,
      "total yards": 282,
      "total plays": 62,
      "fumbles": 1,
      "fumbles lost": 1,
      "penalties": 5,
      "penalty yards": 37,
      "punts": 7,
      "punt yards": 276,
      "punt returns": 1,
      "punt return yards": 13,
      "kickoff returns": 3,
      "kickoff return yards": 67,
      "interception returns": 1,
      "interception return yards": 0,
      "3rd down conversions": 5,
      "3rd down attempts": 15,
      "4th down conversions": 2,
      "4th down attempts": 2
    },
    "Cincinnati": {
      "points": 38,
      "1st downs": 24,
      "rushing 1st downs": 15,
      "passing 1st downs": 8,
      "penalty 1st downs": 1,
      "rushing yards": 342,
      "rushing attempts": 39,
      "passing yards": 168,
      "passing attempts": 30,
      "passing completions": 20,
      "passing interceptions": 1,
      "total yards": 510,
      "total plays": 69,
      "fumbles": 1,
      "fumbles lost": 0,
      "penalties": 5,
      "penalty yards": 35,
      "punts": 4,
      "punt yards": 174,
      "punt returns": 0,
      "punt return yards": 0,
      "kickoff returns": 1,
      "kickoff return yards": 45,
      "interception returns": 1,
      "interception return yards": 2,
      "3rd down conversions": 5,
      "3rd down attempts": 12,
      "4th down conversions": 2,
      "4th down attempts": 2
    }
  },
  "Minnesota vs Illinois": {
    "stadium": "MemorialStadiumChampaign-IL-Champaign",
    "Minnesota": {
      "points": 41,
      "1st downs": 30,
      "rushing 1st downs": 15,
      "passing 1st downs": 12,
      "penalty 1st downs": 3,
      "rushing yards": 325,
      "rushing attempts": 47,
      "passing yards": 216,
      "passing attempts": 27,
      "passing completions": 17,
      "passing interceptions": 1,
      "total yards": 541,
      "total plays": 74,
      "fumbles": 1,
      "fumbles lost": 1,
      "penalties": 2,
      "penalty yards": 22,
      "punts": 2,
      "punt yards": 51,
      "punt returns": 1,
      "punt return yards": 8,
      "kickoff returns": 1,
      "kickoff return yards": 27,
      "interception returns": 0,
      "interception return yards": 0,
      "3rd down conversions": 8,
      "3rd down attempts": 10,
      "4th down conversions": 0,
      "4th down attempts": 0
    },
    "Illinois": {
      "points": 14,
      "1st downs": 14,
      "rushing 1st downs": 9,
      "passing 1st downs": 4,
      "penalty 1st downs": 1,
      "rushing yards": 181,
      "rushing attempts": 36,
      "passing yards": 106,
      "passing attempts": 17,
      "passing completions": 6,
      "passing interceptions": 0,
      "total yards": 287,
      "total plays": 53,
      "fumbles": 2,
      "fumbles lost": 0,
      "penalties": 12,
      "penalty yards": 120,
      "punts": 8,
      "punt yards": 336,
      "punt returns": 0,
      "punt return yards": 0,
      "kickoff returns": 3,
      "kickoff return yards": 53,
      "interception returns": 1,
      "interception return yards": 0,
      "3rd down conversions": 3,
      "3rd down attempts": 12,
      "4th down conversions": 1,
      "4th down attempts": 1
    }
  },
  "Maryland vs PennState": {
    "stadium": "BeaverStadium-UniversityPark-PA",
    "Maryland": {
      "points": 35,
      "1st downs": 16,
      "rushing 1st downs": 6,
      "passing 1st downs": 10,
      "penalty 1st downs": 0,
      "rushing yards": 123,
      "rushing attempts": 35,
      "passing yards": 282,
      "passing attempts": 26,
      "passing completions": 18,
      "passing interceptions": 0,
      "total yards": 405,
      "total plays": 61,
      "fumbles": 0,
      "fumbles lost": 0,
      "penalties": 8,
      "penalty yards": 55,
      "punts": 7,
      "punt yards": 254,
      "punt returns": 0,
      "punt return yards": 0,
      "kickoff returns": 0,
      "kickoff return yards": 0,
      "interception returns": 2,
      "interception return yards": 0,
      "3rd down conversions": 9,
      "3rd down attempts": 16,
      "4th down conversions": 0,
      "4th down attempts": 0
    },
    "PennState": {
      "points": 19,
      "1st downs": 30,
      "rushing 1st downs": 8,
      "passing 1st downs": 19,
      "penalty 1st downs": 3,
      "rushing yards": 94,
      "rushing attempts": 36,
      "passing yards": 340,
      "passing attempts": 57,
      "passing completions": 27,
      "passing interceptions": 2,
      "total yards": 434,
      "total plays": 93,
      "fumbles": 1,
      "fumbles lost": 1,
      "penalties": 4,
      "penalty yards": 25,
      "punts": 4,
      "punt yards": 162,
      "punt returns": 1,
      "punt return yards": 11,
      "kickoff returns": 3,
      "kickoff return yards": 66,
      "interception returns": 0,
      "interception return yards": 0,
      "3rd down conversions": 9,
      "3rd down attempts": 20,
      "4th down conversions": 2,
      "4th down attempts": 4
    }
  },
  "FresnoState vs UNLV": {
    "stadium": "AllegiantStadium-LasVegas-NV",
    "FresnoState": {
      "points": 40,
      "1st downs": 23,
      "rushing 1st downs": 13,
      "passing 1st downs": 8,
      "penalty 1st downs": 2,
      "rushing yards": 243,
      "rushing attempts": 36,
      "passing yards": 244,
      "passing attempts": 35,
      "passing completions": 20,
      "passing interceptions": 0,
      "total yards": 487,
      "total plays": 71,
      "fumbles": 1,
      "fumbles lost": 1,
      "penalties": 8,
      "penalty yards": 65,
      "punts": 5,
      "punt yards": 184,
      "punt returns": 0,
      "punt return yards": 0,
      "kickoff returns": 5,
      "kickoff return yards": 98,
      "interception returns": 2,
      "interception return yards": 18,
      "3rd down conversions": 4,
      "3rd down attempts": 12,
      "4th down conversions": 1,
      "4th down attempts": 1
    },
    "UNLV": {
      "points": 27,
      "1st downs": 19,
      "rushing 1st downs": 11,
      "passing 1st downs": 8,
      "penalty 1st downs": 0,
      "rushing yards": 242,
      "rushing attempts": 46,
      "passing yards": 160,
      "passing attempts": 31,
      "passing completions": 15,
      "passing interceptions": 2,
      "total yards": 402,
      "total plays": 77,
      "fumbles": 1,
      "fumbles lost": 1,
      "penalties": 5,
      "penalty yards": 40,
      "punts": 4,
      "punt yards": 161,
      "punt returns": 2,
      "punt return yards": 18,
      "kickoff returns": 8,
      "kickoff return yards": 152,
      "interception returns": 0,
      "interception return yards": 0,
      "3rd down conversions": 11,
      "3rd down attempts": 20,
      "4th down conversions": 2,
      "4th down attempts": 2
    }
  },
  "Pittsburgh vs FloridaState": {
    "stadium": "BobbyBowdenFieldatDoakCampbellStadium-Tallahassee-FL",
    "Pittsburgh": {
      "points": 41,
      "1st downs": 16,
      "rushing 1st downs": 7,
      "passing 1st downs": 8,
      "penalty 1st downs": 1,
      "rushing yards": 150,
      "rushing attempts": 37,
      "passing yards": 208,
      "passing attempts": 27,
      "passing completions": 21,
      "passing interceptions": 0,
      "total yards": 358,
      "total plays": 64,
      "fumbles": 1,
      "fumbles lost": 0,
      "penalties": 9,
      "penalty yards": 105,
      "punts": 5,
      "punt yards": 255,
      "punt returns": 4,
      "punt return yards": 33,
      "kickoff returns": 1,
      "kickoff return yards": 19,
      "interception returns": 3,
      "interception return yards": 53,
      "3rd down conversions": 7,
      "3rd down attempts": 15,
      "4th down conversions": 0,
      "4th down attempts": 0
    },
    "FloridaState": {
      "points": 17,
      "1st downs": 18,
      "rushing 1st downs": 8,
      "passing 1st downs": 5,
      "penalty 1st downs": 5,
      "rushing yards": 143,
      "rushing attempts": 35,
      "passing yards": 147,
      "passing attempts": 41,
      "passing completions": 23,
      "passing interceptions": 3,
      "total yards": 290,
      "total plays": 76,
      "fumbles": 2,
      "fumbles lost": 0,
      "penalties": 8,
      "penalty yards": 57,
      "punts": 6,
      "punt yards": 269,
      "punt returns": 0,
      "punt return yards": 0,
      "kickoff returns": 2,
      "kickoff return yards": 32,
      "interception returns": 0,
      "interception return yards": 0,
      "3rd down conversions": 7,
      "3rd down attempts": 18,
      "4th down conversions": 1,
      "4th down attempts": 3
    }
  },
  "OklahomaState vs KansasState": {
    "stadium": "BillSnyderFamilyFootballStadium-Manhattan-KS",
    "OklahomaState": {
      "points": 20,
      "1st downs": 14,
      "rushing 1st downs": 8,
      "passing 1st downs": 5,
      "penalty 1st downs": 1,
      "rushing yards": 148,
      "rushing attempts": 40,
      "passing yards": 108,
      "passing attempts": 23,
      "passing completions": 14,
      "passing interceptions": 0,
      "total yards": 256,
      "total plays": 63,
      "fumbles": 1,
      "fumbles lost": 0,
      "penalties": 6,
      "penalty yards": 65,
      "punts": 8,
      "punt yards": 309,
      "punt returns": 1,
      "punt return yards": 3,
      "kickoff returns": 2,
      "kickoff return yards": 6,
      "interception returns": 1,
      "interception return yards": 13,
      "3rd down conversions": 4,
      "3rd down attempts": 15,
      "4th down conversions": 0,
      "4th down attempts": 0
    },
    "KansasState": {
      "points": 18,
      "1st downs": 15,
      "rushing 1st downs": 9,
      "passing 1st downs": 5,
      "penalty 1st downs": 1,
      "rushing yards": 227,
      "rushing attempts": 44,
      "passing yards": 143,
      "passing attempts": 22,
      "passing completions": 10,
      "passing interceptions": 1,
      "total yards": 370,
      "total plays": 66,
      "fumbles": 2,
      "fumbles lost": 1,
      "penalties": 6,
      "penalty yards": 50,
      "punts": 7,
      "punt yards": 284,
      "punt returns": 1,
      "punt return yards": 10,
      "kickoff returns": 1,
      "kickoff return yards": 24,
      "interception returns": 0,
      "interception return yards": 0,
      "3rd down conversions": 8,
      "3rd down attempts": 18,
      "4th down conversions": 0,
      "4th down attempts": 0
    }
  },
  "WesternKentucky vs FloridaAtlantic": {
    "stadium": "FAUStadium-BocaRaton-FL",
    "WesternKentucky": {
      "points": 6,
      "1st downs": 16,
      "rushing 1st downs": 9,
      "passing 1st downs": 7,
      "penalty 1st downs": 0,
      "rushing yards": 94,
      "rushing attempts": 27,
      "passing yards": 163,
      "passing attempts": 40,
      "passing completions": 19,
      "passing interceptions": 0,
      "total yards": 257,
      "total plays": 67,
      "fumbles": 0,
      "fumbles lost": 0,
      "penalties": 6,
      "penalty yards": 50,
      "punts": 5,
      "punt yards": 213,
      "punt returns": 1,
      "punt return yards": 0,
      "kickoff returns": 0,
      "kickoff return yards": 0,
      "interception returns": 1,
      "interception return yards": 24,
      "3rd down conversions": 7,
      "3rd down attempts": 17,
      "4th down conversions": 1,
      "4th down attempts": 2
    },
    "FloridaAtlantic": {
      "points": 10,
      "1st downs": 18,
      "rushing 1st downs": 11,
      "passing 1st downs": 6,
      "penalty 1st downs": 1,
      "rushing yards": 165,
      "rushing attempts": 45,
      "passing yards": 108,
      "passing attempts": 17,
      "passing completions": 7,
      "passing interceptions": 1,
      "total yards": 273,
      "total plays": 62,
      "fumbles": 0,
      "fumbles lost": 0,
      "penalties": 2,
      "penalty yards": 25,
      "punts": 5,
      "punt yards": 229,
      "punt returns": 1,
      "punt return yards": 17,
      "kickoff returns": 1,
      "kickoff return yards": 13,
      "interception returns": 0,
      "interception return yards": 0,
      "3rd down conversions": 5,
      "3rd down attempts": 13,
      "4th down conversions": 2,
      "4th down attempts": 2
    }
  },
  "TexasAM vs SouthCarolina": {
    "stadium": "WilliamsBriceStadium-Columbia-SC",
    "TexasAM": {
      "points": 48,
      "1st downs": 26,
      "rushing 1st downs": 16,
      "passing 1st downs": 10,
      "penalty 1st downs": 0,
      "rushing yards": 264,
      "rushing attempts": 45,
      "passing yards": 266,
      "passing attempts": 27,
      "passing completions": 17,
      "passing interceptions": 0,
      "total yards": 530,
      "total plays": 72,
      "fumbles": 0,
      "fumbles lost": 0,
      "penalties": 2,
      "penalty yards": 25,
      "punts": 2,
      "punt yards": 98,
      "punt returns": 3,
      "punt return yards": 3,
      "kickoff returns": 0,
      "kickoff return yards": 0,
      "interception returns": 2,
      "interception return yards": 13,
      "3rd down conversions": 12,
      "3rd down attempts": 16,
      "4th down conversions": 1,
      "4th down attempts": 2
    },
    "SouthCarolina": {
      "points": 3,
      "1st downs": 9,
      "rushing 1st downs": 1,
      "passing 1st downs": 7,
      "penalty 1st downs": 1,
      "rushing yards": 50,
      "rushing attempts": 25,
      "passing yards": 100,
      "passing attempts": 28,
      "passing completions": 12,
      "passing interceptions": 2,
      "total yards": 150,
      "total plays": 53,
      "fumbles": 1,
      "fumbles lost": 0,
      "penalties": 1,
      "penalty yards": 5,
      "punts": 5,
      "punt yards": 206,
      "punt returns": 1,
      "punt return yards": -6,
      "kickoff returns": 2,
      "kickoff return yards": 33,
      "interception returns": 0,
      "interception return yards": 0,
      "3rd down conversions": 3,
      "3rd down attempts": 14,
      "4th down conversions": 2,
      "4th down attempts": 3
    }
  },
  "Baylor vs IowaState": {
    "stadium": "JackTriceStadium-Ames-IA",
    "Baylor": {
      "points": 31,
      "1st downs": 17,
      "rushing 1st downs": 5,
      "passing 1st downs": 12,
      "penalty 1st downs": 0,
      "rushing yards": 71,
      "rushing attempts": 27,
      "passing yards": 295,
      "passing attempts": 33,
      "passing completions": 22,
      "passing interceptions": 2,
      "total yards": 366,
      "total plays": 60,
      "fumbles": 0,
      "fumbles lost": 0,
      "penalties": 7,
      "penalty yards": 65,
      "punts": 4,
      "punt yards": 184,
      "punt returns": 1,
      "punt return yards": 2,
      "kickoff returns": 5,
      "kickoff return yards": 98,
      "interception returns": 3,
      "interception return yards": 86,
      "3rd down conversions": 4,
      "3rd down attempts": 11,
      "4th down conversions": 1,
      "4th down attempts": 1
    },
    "IowaState": {
      "points": 38,
      "1st downs": 23,
      "rushing 1st downs": 10,
      "passing 1st downs": 12,
      "penalty 1st downs": 1,
      "rushing yards": 198,
      "rushing attempts": 41,
      "passing yards": 164,
      "passing attempts": 24,
      "passing completions": 15,
      "passing interceptions": 3,
      "total yards": 362,
      "total plays": 65,
      "fumbles": 1,
      "fumbles lost": 1,
      "penalties": 1,
      "penalty yards": 5,
      "punts": 2,
      "punt yards": 75,
      "punt returns": 2,
      "punt return yards": 12,
      "kickoff returns": 2,
      "kickoff return yards": 88,
      "interception returns": 2,
      "interception return yards": 0,
      "3rd down conversions": 7,
      "3rd down attempts": 13,
      "4th down conversions": 0,
      "4th down attempts": 0
    }
  },
  "UCLA vs Colorado": {
    "stadium": "FolsomField-Boulder-CO",
    "UCLA": {
      "points": 42,
      "1st downs": 23,
      "rushing 1st downs": 5,
      "passing 1st downs": 13,
      "penalty 1st downs": 5,
      "rushing yards": 175,
      "rushing attempts": 25,
      "passing yards": 303,
      "passing attempts": 40,
      "passing completions": 20,
      "passing interceptions": 1,
      "total yards": 478,
      "total plays": 65,
      "fumbles": 3,
      "fumbles lost": 3,
      "penalties": 9,
      "penalty yards": 69,
      "punts": 3,
      "punt yards": 143,
      "punt returns": 1,
      "punt return yards": 1,
      "kickoff returns": 1,
      "kickoff return yards": 9,
      "interception returns": 0,
      "interception return yards": 0,
      "3rd down conversions": 7,
      "3rd down attempts": 12,
      "4th down conversions": 0,
      "4th down attempts": 2
    },
    "Colorado": {
      "points": 48,
      "1st downs": 26,
      "rushing 1st downs": 13,
      "passing 1st downs": 12,
      "penalty 1st downs": 1,
      "rushing yards": 264,
      "rushing attempts": 59,
      "passing yards": 261,
      "passing attempts": 33,
      "passing completions": 22,
      "passing interceptions": 0,
      "total yards": 525,
      "total plays": 92,
      "fumbles": 0,
      "fumbles lost": 0,
      "penalties": 9,
      "penalty yards": 90,
      "punts": 3,
      "punt yards": 123,
      "punt returns": 1,
      "punt return yards": 6,
      "kickoff returns": 4,
      "kickoff return yards": 68,
      "interception returns": 1,
      "interception return yards": 14,
      "3rd down conversions": 9,
      "3rd down attempts": 19,
      "4th down conversions": 0,
      "4th down attempts": 1
    }
  },
  "Tennessee vs Arkansas": {
    "stadium": "DonaldWReynoldsRazorbackStadium-Fayetteville-AR",
    "Tennessee": {
      "points": 13,
      "1st downs": 19,
      "rushing 1st downs": 11,
      "passing 1st downs": 6,
      "penalty 1st downs": 2,
      "rushing yards": 185,
      "rushing attempts": 50,
      "passing yards": 107,
      "passing attempts": 21,
      "passing completions": 11,
      "passing interceptions": 2,
      "total yards": 292,
      "total plays": 71,
      "fumbles": 1,
      "fumbles lost": 0,
      "penalties": 3,
      "penalty yards": 30,
      "punts": 6,
      "punt yards": 274,
      "punt returns": 1,
      "punt return yards": 1,
      "kickoff returns": 0,
      "kickoff return yards": 0,
      "interception returns": 0,
      "interception return yards": 0,
      "3rd down conversions": 5,
      "3rd down attempts": 15,
      "4th down conversions": 0,
      "4th down attempts": 1
    },
    "Arkansas": {
      "points": 24,
      "1st downs": 21,
      "rushing 1st downs": 13,
      "passing 1st downs": 7,
      "penalty 1st downs": 1,
      "rushing yards": 198,
      "rushing attempts": 45,
      "passing yards": 215,
      "passing attempts": 25,
      "passing completions": 18,
      "passing interceptions": 0,
      "total yards": 413,
      "total plays": 70,
      "fumbles": 4,
      "fumbles lost": 0,
      "penalties": 2,
      "penalty yards": 20,
      "punts": 6,
      "punt yards": 225,
      "punt returns": 1,
      "punt return yards": 4,
      "kickoff returns": 1,
      "kickoff return yards": 26,
      "interception returns": 2,
      "interception return yards": 0,
      "3rd down conversions": 9,
      "3rd down attempts": 17,
      "4th down conversions": 0,
      "4th down attempts": 0
    }
  },
  "Clemson vs NotreDame": {
    "stadium": "NotreDameStadium-SouthBend-IN",
    "Clemson": {
      "points": 40,
      "1st downs": 22,
      "rushing 1st downs": 4,
      "passing 1st downs": 16,
      "penalty 1st downs": 2,
      "rushing yards": 34,
      "rushing attempts": 33,
      "passing yards": 439,
      "passing attempts": 44,
      "passing completions": 29,
      "passing interceptions": 0,
      "total yards": 473,
      "total plays": 77,
      "fumbles": 3,
      "fumbles lost": 3,
      "penalties": 4,
      "penalty yards": 46,
      "punts": 3,
      "punt yards": 125,
      "punt returns": 0,
      "punt return yards": 0,
      "kickoff returns": 5,
      "kickoff return yards": 81,
      "interception returns": 0,
      "interception return yards": 0,
      "3rd down conversions": 4,
      "3rd down attempts": 15,
      "4th down conversions": 1,
      "4th down attempts": 2
    },
    "NotreDame": {
      "points": 47,
      "1st downs": 22,
      "rushing 1st downs": 5,
      "passing 1st downs": 15,
      "penalty 1st downs": 2,
      "rushing yards": 208,
      "rushing attempts": 40,
      "passing yards": 310,
      "passing attempts": 39,
      "passing completions": 22,
      "passing interceptions": 0,
      "total yards": 518,
      "total plays": 79,
      "fumbles": 1,
      "fumbles lost": 1,
      "penalties": 7,
      "penalty yards": 50,
      "punts": 3,
      "punt yards": 123,
      "punt returns": 1,
      "punt return yards": 5,
      "kickoff returns": 0,
      "kickoff return yards": 0,
      "interception returns": 0,
      "interception return yards": 0,
      "3rd down conversions": 10,
      "3rd down attempts": 19,
      "4th down conversions": 0,
      "4th down attempts": 1
    }
  },
  "Rutgers vs OhioState": {
    "stadium": "OhioStadium-Columbus-OH",
    "Rutgers": {
      "points": 27,
      "1st downs": 22,
      "rushing 1st downs": 5,
      "passing 1st downs": 14,
      "penalty 1st downs": 3,
      "rushing yards": 141,
      "rushing attempts": 32,
      "passing yards": 232,
      "passing attempts": 49,
      "passing completions": 34,
      "passing interceptions": 0,
      "total yards": 373,
      "total plays": 81,
      "fumbles": 2,
      "fumbles lost": 2,
      "penalties": 9,
      "penalty yards": 83,
      "punts": 5,
      "punt yards": 233,
      "punt returns": 1,
      "punt return yards": 58,
      "kickoff returns": 5,
      "kickoff return yards": 85,
      "interception returns": 0,
      "interception return yards": 0,
      "3rd down conversions": 7,
      "3rd down attempts": 17,
      "4th down conversions": 4,
      "4th down attempts": 4
    },
    "OhioState": {
      "points": 49,
      "1st downs": 25,
      "rushing 1st downs": 8,
      "passing 1st downs": 13,
      "penalty 1st downs": 4,
      "rushing yards": 203,
      "rushing attempts": 37,
      "passing yards": 314,
      "passing attempts": 28,
      "passing completions": 24,
      "passing interceptions": 0,
      "total yards": 517,
      "total plays": 65,
      "fumbles": 1,
      "fumbles lost": 1,
      "penalties": 9,
      "penalty yards": 74,
      "punts": 4,
      "punt yards": 158,
      "punt returns": 3,
      "punt return yards": 13,
      "kickoff returns": 3,
      "kickoff return yards": 43,
      "interception returns": 0,
      "interception return yards": 0,
      "3rd down conversions": 7,
      "3rd down attempts": 12,
      "4th down conversions": 1,
      "4th down attempts": 1
    }
  },
  "Stanford vs Oregon": {
    "stadium": "AutzenStadium-Eugene-OR",
    "Stanford": {
      "points": 14,
      "1st downs": 16,
      "rushing 1st downs": 5,
      "passing 1st downs": 8,
      "penalty 1st downs": 3,
      "rushing yards": 197,
      "rushing attempts": 31,
      "passing yards": 216,
      "passing attempts": 26,
      "passing completions": 16,
      "passing interceptions": 0,
      "total yards": 413,
      "total plays": 57,
      "fumbles": 1,
      "fumbles lost": 0,
      "penalties": 10,
      "penalty yards": 100,
      "punts": 2,
      "punt yards": 74,
      "punt returns": 0,
      "punt return yards": 0,
      "kickoff returns": 4,
      "kickoff return yards": 98,
      "interception returns": 1,
      "interception return yards": 0,
      "3rd down conversions": 4,
      "3rd down attempts": 13,
      "4th down conversions": 2,
      "4th down attempts": 2
    },
    "Oregon": {
      "points": 35,
      "1st downs": 29,
      "rushing 1st downs": 15,
      "passing 1st downs": 10,
      "penalty 1st downs": 4,
      "rushing yards": 269,
      "rushing attempts": 40,
      "passing yards": 227,
      "passing attempts": 26,
      "passing completions": 17,
      "passing interceptions": 1,
      "total yards": 496,
      "total plays": 66,
      "fumbles": 1,
      "fumbles lost": 1,
      "penalties": 6,
      "penalty yards": 43,
      "punts": 1,
      "punt yards": 51,
      "punt returns": 0,
      "punt return yards": 0,
      "kickoff returns": 2,
      "kickoff return yards": 35,
      "interception returns": 0,
      "interception return yards": 0,
      "3rd down conversions": 9,
      "3rd down attempts": 11,
      "4th down conversions": 0,
      "4th down attempts": 0
    }
  },
  "SouthAlabama vs CoastalCarolina": {
    "stadium": "BrooksStadium-Conway-SC",
    "SouthAlabama": {
      "points": 6,
      "1st downs": 16,
      "rushing 1st downs": 7,
      "passing 1st downs": 8,
      "penalty 1st downs": 1,
      "rushing yards": 93,
      "rushing attempts": 38,
      "passing yards": 243,
      "passing attempts": 31,
      "passing completions": 23,
      "passing interceptions": 0,
      "total yards": 336,
      "total plays": 69,
      "fumbles": 2,
      "fumbles lost": 2,
      "penalties": 5,
      "penalty yards": 45,
      "punts": 2,
      "punt yards": 89,
      "punt returns": 0,
      "punt return yards": 0,
      "kickoff returns": 0,
      "kickoff return yards": 0,
      "interception returns": 0,
      "interception return yards": 0,
      "3rd down conversions": 2,
      "3rd down attempts": 15,
      "4th down conversions": 3,
      "4th down attempts": 7
    },
    "CoastalCarolina": {
      "points": 23,
      "1st downs": 18,
      "rushing 1st downs": 8,
      "passing 1st downs": 10,
      "penalty 1st downs": 0,
      "rushing yards": 236,
      "rushing attempts": 33,
      "passing yards": 209,
      "passing attempts": 25,
      "passing completions": 17,
      "passing interceptions": 0,
      "total yards": 445,
      "total plays": 58,
      "fumbles": 2,
      "fumbles lost": 2,
      "penalties": 2,
      "penalty yards": 20,
      "punts": 2,
      "punt yards": 74,
      "punt returns": 1,
      "punt return yards": 1,
      "kickoff returns": 2,
      "kickoff return yards": 54,
      "interception returns": 0,
      "interception return yards": 0,
      "3rd down conversions": 3,
      "3rd down attempts": 11,
      "4th down conversions": 1,
      "4th down attempts": 2
    }
  },
  "WashingtonState vs OregonState": {
    "stadium": "ReserStadium-Corvallis-OR",
    "WashingtonState": {
      "points": 38,
      "1st downs": 21,
      "rushing 1st downs": 9,
      "passing 1st downs": 11,
      "penalty 1st downs": 1,
      "rushing yards": 229,
      "rushing attempts": 30,
      "passing yards": 227,
      "passing attempts": 33,
      "passing completions": 18,
      "passing interceptions": 1,
      "total yards": 456,
      "total plays": 63,
      "fumbles": 1,
      "fumbles lost": 0,
      "penalties": 5,
      "penalty yards": 44,
      "punts": 4,
      "punt yards": 171,
      "punt returns": 0,
      "punt return yards": 0,
      "kickoff returns": 2,
      "kickoff return yards": 27,
      "interception returns": 0,
      "interception return yards": 0,
      "3rd down conversions": 4,
      "3rd down attempts": 10,
      "4th down conversions": 1,
      "4th down attempts": 1
    },
    "OregonState": {
      "points": 28,
      "1st downs": 29,
      "rushing 1st downs": 9,
      "passing 1st downs": 18,
      "penalty 1st downs": 2,
      "rushing yards": 122,
      "rushing attempts": 31,
      "passing yards": 329,
      "passing attempts": 49,
      "passing completions": 34,
      "passing interceptions": 0,
      "total yards": 451,
      "total plays": 80,
      "fumbles": 1,
      "fumbles lost": 0,
      "penalties": 4,
      "penalty yards": 45,
      "punts": 6,
      "punt yards": 210,
      "punt returns": 1,
      "punt return yards": 2,
      "kickoff returns": 5,
      "kickoff return yards": 107,
      "interception returns": 1,
      "interception return yards": 0,
      "3rd down conversions": 8,
      "3rd down attempts": 16,
      "4th down conversions": 1,
      "4th down attempts": 1
    }
  },
  "NewMexico vs Hawaii": {
    "stadium": "AlohaStadium-Honolulu-HI",
    "NewMexico": {
      "points": 33,
      "1st downs": 24,
      "rushing 1st downs": 13,
      "passing 1st downs": 9,
      "penalty 1st downs": 2,
      "rushing yards": 279,
      "rushing attempts": 38,
      "passing yards": 220,
      "passing attempts": 37,
      "passing completions": 19,
      "passing interceptions": 1,
      "total yards": 499,
      "total plays": 75,
      "fumbles": 1,
      "fumbles lost": 0,
      "penalties": 7,
      "penalty yards": 57,
      "punts": 4,
      "punt yards": 183,
      "punt returns": 2,
      "punt return yards": 8,
      "kickoff returns": 5,
      "kickoff return yards": 97,
      "interception returns": 2,
      "interception return yards": 28,
      "3rd down conversions": 5,
      "3rd down attempts": 15,
      "4th down conversions": 1,
      "4th down attempts": 1
    },
    "Hawaii": {
      "points": 39,
      "1st downs": 24,
      "rushing 1st downs": 8,
      "passing 1st downs": 14,
      "penalty 1st downs": 2,
      "rushing yards": 93,
      "rushing attempts": 28,
      "passing yards": 410,
      "passing attempts": 44,
      "passing completions": 33,
      "passing interceptions": 2,
      "total yards": 503,
      "total plays": 72,
      "fumbles": 1,
      "fumbles lost": 1,
      "penalties": 3,
      "penalty yards": 30,
      "punts": 4,
      "punt yards": 171,
      "punt returns": 1,
      "punt return yards": 9,
      "kickoff returns": 4,
      "kickoff return yards": 78,
      "interception returns": 1,
      "interception return yards": 0,
      "3rd down conversions": 5,
      "3rd down attempts": 13,
      "4th down conversions": 1,
      "4th down attempts": 1
    }
  }
}