{
  "LouisianaTech vs NorthTexas": {
    "stadium": "ApogeeStadium-Denton-TX",
    "LouisianaTech": {
      "points": 42,
      "1st downs": 24,
      "rushing 1st downs": 11,
      "passing 1st downs": 10,
      "penalty 1st downs": 3,
      "rushing yards": 183,
      "rushing attempts": 50,
      "passing yards": 158,
      "passing attempts": 31,
      "passing completions": 19,
      "passing interceptions": 1,
      "total yards": 341,
      "total plays": 81,
      "fumbles": 0,
      "fumbles lost": 0,
      "penalties": 4,
      "penalty yards": 33,
      "punts": 5,
      "punt yards": 175,
      "punt returns": 0,
      "punt return yards": 0,
      "kickoff returns": 6,
      "kickoff return yards": 117,
      "interception returns": 1,
      "interception return yards": 6,
      "3rd down conversions": 8,
      "3rd down attempts": 17,
      "4th down conversions": 3,
      "4th down attempts": 3
    },
    "NorthTexas": {
      "points": 31,
      "1st downs": 19,
      "rushing 1st downs": 8,
      "passing 1st downs": 10,
      "penalty 1st downs": 1,
      "rushing yards": 155,
      "rushing attempts": 41,
      "passing yards": 231,
      "passing attempts": 30,
      "passing completions": 17,
      "passing interceptions": 1,
      "total yards": 386,
      "total plays": 71,
      "fumbles": 0,
      "fumbles lost": 0,
      "penalties": 11,
      "penalty yards": 82,
      "punts": 2,
      "punt yards": 75,
      "punt returns": 1,
      "punt return yards": 0,
      "kickoff returns": 6,
      "kickoff return yards": 128,
      "interception returns": 1,
      "interception return yards": 19,
      "3rd down conversions": 6,
      "3rd down attempts": 14,
      "4th down conversions": 1,
      "4th down attempts": 4
    }
  },
  "AirForce vs UtahState": {
    "stadium": "MerlinOlsenFieldatMaverikStadium-Logan-UT",
    "AirForce": {
      "points": 35,
      "1st downs": 24,
      "rushing 1st downs": 17,
      "passing 1st downs": 6,
      "penalty 1st downs": 1,
      "rushing yards": 334,
      "rushing attempts": 55,
      "passing yards": 127,
      "passing attempts": 9,
      "passing completions": 7,
      "passing interceptions": 0,
      "total yards": 461,
      "total plays": 64,
      "fumbles": 0,
      "fumbles lost": 0,
      "penalties": 6,
      "penalty yards": 67,
      "punts": 1,
      "punt yards": 44,
      "punt returns": 1,
      "punt return yards": 5,
      "kickoff returns": 0,
      "kickoff return yards": 0,
      "interception returns": 2,
      "interception return yards": 6,
      "3rd down conversions": 5,
      "3rd down attempts": 10,
      "4th down conversions": 3,
      "4th down attempts": 4
    },
    "UtahState": {
      "points": 7,
      "1st downs": 14,
      "rushing 1st downs": 4,
      "passing 1st downs": 8,
      "penalty 1st downs": 2,
      "rushing yards": 109,
      "rushing attempts": 26,
      "passing yards": 123,
      "passing attempts": 32,
      "passing completions": 17,
      "passing interceptions": 2,
      "total yards": 232,
      "total plays": 58,
      "fumbles": 0,
      "fumbles lost": 0,
      "penalties": 6,
      "penalty yards": 65,
      "punts": 3,
      "punt yards": 133,
      "punt returns": 1,
      "punt return yards": 3,
      "kickoff returns": 5,
      "kickoff return yards": 118,
      "interception returns": 0,
      "interception return yards": 0,
      "3rd down conversions": 9,
      "3rd down attempts": 15,
      "4th down conversions": 0,
      "4th down attempts": 2
    }
  },
  "LouisianaLafayette vs AppalachianState": {
    "stadium": "KiddBrewerStadium-Boone-NC",
    "LouisianaLafayette": {
      "points": 24,
      "1st downs": 18,
      "rushing 1st downs": 13,
      "passing 1st downs": 4,
      "penalty 1st downs": 1,
      "rushing yards": 122,
      "rushing attempts": 45,
      "passing yards": 101,
      "passing attempts": 24,
      "passing completions": 8,
      "passing interceptions": 0,
      "total yards": 223,
      "total plays": 69,
      "fumbles": 3,
      "fumbles lost": 1,
      "penalties": 2,
      "penalty yards": 20,
      "punts": 2,
      "punt yards": 79,
      "punt returns": 1,
      "punt return yards": 3,
      "kickoff returns": 4,
      "kickoff return yards": 49,
      "interception returns": 2,
      "interception return yards": 0,
      "3rd down conversions": 6,
      "3rd down attempts": 15,
      "4th down conversions": 2,
      "4th down attempts": 6
    },
    "AppalachianState": {
      "points": 21,
      "1st downs": 19,
      "rushing 1st downs": 14,
      "passing 1st downs": 4,
      "penalty 1st downs": 1,
      "rushing yards": 198,
      "rushing attempts": 49,
      "passing yards": 92,
      "passing attempts": 21,
      "passing completions": 10,
      "passing interceptions": 2,
      "total yards": 290,
      "total plays": 70,
      "fumbles": 1,
      "fumbles lost": 1,
      "penalties": 5,
      "penalty yards": 46,
      "punts": 1,
      "punt yards": 48,
      "punt returns": 2,
      "punt return yards": 46,
      "kickoff returns": 6,
      "kickoff return yards": 121,
      "interception returns": 0,
      "interception return yards": 0,
      "3rd down conversions": 9,
      "3rd down attempts": 16,
      "4th down conversions": 2,
      "4th down attempts": 3
    }
  },
  "Texas vs KansasState": {
    "stadium": "BillSnyderFamilyFootballStadium-Manhattan-KS",
    "Texas": {
      "points": 69,
      "1st downs": 26,
      "rushing 1st downs": 13,
      "passing 1st downs": 13,
      "penalty 1st downs": 0,
      "rushing yards": 334,
      "rushing attempts": 33,
      "passing yards": 274,
      "passing attempts": 27,
      "passing completions": 20,
      "passing interceptions": 0,
      "total yards": 608,
      "total plays": 60,
      "fumbles": 0,
      "fumbles lost": 0,
      "penalties": 4,
      "penalty yards": 55,
      "punts": 2,
      "punt yards": 91,
      "punt returns": 1,
      "punt return yards": 10,
      "kickoff returns": 4,
      "kickoff return yards": 164,
      "interception returns": 2,
      "interception return yards": 21,
      "3rd down conversions": 3,
      "3rd down attempts": 8,
      "4th down conversions": 0,
      "4th down attempts": 0
    },
    "KansasState": {
      "points": 31,
      "1st downs": 24,
      "rushing 1st downs": 13,
      "passing 1st downs": 9,
      "penalty 1st downs": 2,
      "rushing yards": 274,
      "rushing attempts": 46,
      "passing yards": 174,
      "passing attempts": 27,
      "passing completions": 16,
      "passing interceptions": 2,
      "total yards": 448,
      "total plays": 73,
      "fumbles": 1,
      "fumbles lost": 1,
      "penalties": 3,
      "penalty yards": 21,
      "punts": 3,
      "punt yards": 128,
      "punt returns": 0,
      "punt return yards": 0,
      "kickoff returns": 5,
      "kickoff return yards": 111,
      "interception returns": 0,
      "interception return yards": 0,
      "3rd down conversions": 4,
      "3rd down attempts": 11,
      "4th down conversions": 0,
      "4th down attempts": 1
    }
  },
  "TexasAM vs Auburn": {
    "stadium": "JordanHareStadium-Auburn-AL",
    "TexasAM": {
      "points": 31,
      "1st downs": 29,
      "rushing 1st downs": 18,
      "passing 1st downs": 11,
      "penalty 1st downs": 0,
      "rushing yards": 313,
      "rushing attempts": 47,
      "passing yards": 196,
      "passing attempts": 23,
      "passing completions": 18,
      "passing interceptions": 0,
      "total yards": 509,
      "total plays": 70,
      "fumbles": 1,
      "fumbles lost": 0,
      "penalties": 4,
      "penalty yards": 39,
      "punts": 2,
      "punt yards": 64,
      "punt returns": 0,
      "punt return yards": 0,
      "kickoff returns": 0,
      "kickoff return yards": 0,
      "interception returns": 0,
      "interception return yards": 0,
      "3rd down conversions": 7,
      "3rd down attempts": 11,
      "4th down conversions": 0,
      "4th down attempts": 0
    },
    "Auburn": {
      "points": 20,
      "1st downs": 16,
      "rushing 1st downs": 9,
      "passing 1st downs": 7,
      "penalty 1st downs": 0,
      "rushing yards": 196,
      "rushing attempts": 30,
      "passing yards": 144,
      "passing attempts": 24,
      "passing completions": 15,
      "passing interceptions": 0,
      "total yards": 340,
      "total plays": 54,
      "fumbles": 0,
      "fumbles lost": 0,
      "penalties": 1,
      "penalty yards": 5,
      "punts": 3,
      "punt yards": 129,
      "punt returns": 0,
      "punt return yards": 0,
      "kickoff returns": 1,
      "kickoff return yards": 28,
      "interception returns": 0,
      "interception return yards": 0,
      "3rd down conversions": 4,
      "3rd down attempts": 10,
      "4th down conversions": 0,
      "4th down attempts": 1
    }
  },
  "Kansas vs TexasTech": {
    "stadium": "JonesATTStadium-Lubbock-TX",
    "Kansas": {
      "points": 13,
      "1st downs": 14,
      "rushing 1st downs": 7,
      "passing 1st downs": 5,
      "penalty 1st downs": 2,
      "rushing yards": 112,
      "rushing attempts": 44,
      "passing yards": 102,
      "passing attempts": 29,
      "passing completions": 17,
      "passing interceptions": 0,
      "total yards": 214,
      "total plays": 73,
      "fumbles": 1,
      "fumbles lost": 0,
      "penalties": 5,
      "penalty yards": 51,
      "punts": 7,
      "punt yards": 268,
      "punt returns": 1,
      "punt return yards": -2,
      "kickoff returns": 2,
      "kickoff return yards": 34,
      "interception returns": 1,
      "interception return yards": 0,
      "3rd down conversions": 4,
      "3rd down attempts": 18,
      "4th down conversions": 1,
      "4th down attempts": 5
    },
    "TexasTech": {
      "points": 16,
      "1st downs": 17,
      "rushing 1st downs": 11,
      "passing 1st downs": 4,
      "penalty 1st downs": 2,
      "rushing yards": 293,
      "rushing attempts": 43,
      "passing yards": 117,
      "passing attempts": 26,
      "passing completions": 15,
      "passing interceptions": 1,
      "total yards": 410,
      "total plays": 69,
      "fumbles": 3,
      "fumbles lost": 3,
      "penalties": 7,
      "penalty yards": 80,
      "punts": 2,
      "punt yards": 107,
      "punt returns": 4,
      "punt return yards": 52,
      "kickoff returns": 1,
      "kickoff return yards": 28,
      "interception returns": 0,
      "interception return yards": 0,
      "3rd down conversions": 3,
      "3rd down attempts": 15,
      "4th down conversions": 2,
      "4th down attempts": 2
    }
  },
  "OklahomaState vs TCU": {
    "stadium": "AmonGCarterStadium-FortWorth-TX",
    "OklahomaState": {
      "points": 22,
      "1st downs": 16,
      "rushing 1st downs": 5,
      "passing 1st downs": 10,
      "penalty 1st downs": 1,
      "rushing yards": 148,
      "rushing attempts": 40,
      "passing yards": 270,
      "passing attempts": 36,
      "passing completions": 16,
      "passing interceptions": 1,
      "total yards": 418,
      "total plays": 76,
      "fumbles": 0,
      "fumbles lost": 0,
      "penalties": 5,
      "penalty yards": 50,
      "punts": 9,
      "punt yards": 348,
      "punt returns": 2,
      "punt return yards": -1,
      "kickoff returns": 3,
      "kickoff return yards": 81,
      "interception returns": 1,
      "interception return yards": 0,
      "3rd down conversions": 7,
      "3rd down attempts": 19,
      "4th down conversions": 0,
      "4th down attempts": 1
    },
    "TCU": {
      "points": 29,
      "1st downs": 21,
      "rushing 1st downs": 13,
      "passing 1st downs": 7,
      "penalty 1st downs": 1,
      "rushing yards": 236,
      "rushing attempts": 52,
      "passing yards": 265,
      "passing attempts": 26,
      "passing completions": 12,
      "passing interceptions": 1,
      "total yards": 501,
      "total plays": 78,
      "fumbles": 5,
      "fumbles lost": 4,
      "penalties": 4,
      "penalty yards": 40,
      "punts": 7,
      "punt yards": 300,
      "punt returns": 2,
      "punt return yards": -3,
      "kickoff returns": 1,
      "kickoff return yards": 0,
      "interception returns": 1,
      "interception return yards": 0,
      "3rd down conversions": 7,
      "3rd down attempts": 17,
      "4th down conversions": 2,
      "4th down attempts": 2
    }
  },
  "Nebraska vs Purdue": {
    "stadium": "RossAdeStadium-WestLafayette-IN",
    "Nebraska": {
      "points": 37,
      "1st downs": 20,
      "rushing 1st downs": 5,
      "passing 1st downs": 12,
      "penalty 1st downs": 3,
      "rushing yards": 111,
      "rushing attempts": 40,
      "passing yards": 253,
      "passing attempts": 31,
      "passing completions": 24,
      "passing interceptions": 0,
      "total yards": 364,
      "total plays": 71,
      "fumbles": 1,
      "fumbles lost": 0,
      "penalties": 9,
      "penalty yards": 107,
      "punts": 3,
      "punt yards": 121,
      "punt returns": 2,
      "punt return yards": 66,
      "kickoff returns": 2,
      "kickoff return yards": 38,
      "interception returns": 0,
      "interception return yards": 0,
      "3rd down conversions": 6,
      "3rd down attempts": 15,
      "4th down conversions": 0,
      "4th down attempts": 1
    },
    "Purdue": {
      "points": 27,
      "1st downs": 19,
      "rushing 1st downs": 1,
      "passing 1st downs": 15,
      "penalty 1st downs": 3,
      "rushing yards": 0,
      "rushing attempts": 17,
      "passing yards": 334,
      "passing attempts": 47,
      "passing completions": 33,
      "passing interceptions": 0,
      "total yards": 332,
      "total plays": 64,
      "fumbles": 1,
      "fumbles lost": 0,
      "penalties": 11,
      "penalty yards": 126,
      "punts": 5,
      "punt yards": 161,
      "punt returns": 2,
      "punt return yards": 12,
      "kickoff returns": 4,
      "kickoff return yards": 116,
      "interception returns": 0,
      "interception return yards": 0,
      "3rd down conversions": 3,
      "3rd down attempts": 13,
      "4th down conversions": 1,
      "4th down attempts": 3
    }
  },
  "PennState vs Rutgers": {
    "stadium": "SHIStadium-Piscataway-NJ",
    "PennState": {
      "points": 23,
      "1st downs": 23,
      "rushing 1st downs": 14,
      "passing 1st downs": 7,
      "penalty 1st downs": 2,
      "rushing yards": 248,
      "rushing attempts": 57,
      "passing yards": 133,
      "passing attempts": 22,
      "passing completions": 15,
      "passing interceptions": 1,
      "total yards": 381,
      "total plays": 79,
      "fumbles": 2,
      "fumbles lost": 1,
      "penalties": 2,
      "penalty yards": 20,
      "punts": 3,
      "punt yards": 113,
      "punt returns": 1,
      "punt return yards": 2,
      "kickoff returns": 1,
      "kickoff return yards": 4,
      "interception returns": 0,
      "interception return yards": 0,
      "3rd down conversions": 4,
      "3rd down attempts": 15,
      "4th down conversions": 1,
      "4th down attempts": 3
    },
    "Rutgers": {
      "points": 7,
      "1st downs": 12,
      "rushing 1st downs": 6,
      "passing 1st downs": 5,
      "penalty 1st downs": 1,
      "rushing yards": 83,
      "rushing attempts": 32,
      "passing yards": 122,
      "passing attempts": 32,
      "passing completions": 18,
      "passing interceptions": 0,
      "total yards": 205,
      "total plays": 64,
      "fumbles": 1,
      "fumbles lost": 1,
      "penalties": 3,
      "penalty yards": 30,
      "punts": 7,
      "punt yards": 292,
      "punt returns": 1,
      "punt return yards": 4,
      "kickoff returns": 2,
      "kickoff return yards": 24,
      "interception returns": 1,
      "interception return yards": 0,
      "3rd down conversions": 3,
      "3rd down attempts": 15,
      "4th down conversions": 1,
      "4th down attempts": 4
    }
  },
  "OhioState vs MichiganState": {
    "stadium": "SpartanStadium-EastLansing-MI",
    "OhioState": {
      "points": 52,
      "1st downs": 26,
      "rushing 1st downs": 12,
      "passing 1st downs": 9,
      "penalty 1st downs": 5,
      "rushing yards": 322,
      "rushing attempts": 48,
      "passing yards": 199,
      "passing attempts": 24,
      "passing completions": 17,
      "passing interceptions": 0,
      "total yards": 521,
      "total plays": 72,
      "fumbles": 2,
      "fumbles lost": 1,
      "penalties": 7,
      "penalty yards": 63,
      "punts": 5,
      "punt yards": 267,
      "punt returns": 2,
      "punt return yards": 9,
      "kickoff returns": 1,
      "kickoff return yards": 18,
      "interception returns": 2,
      "interception return yards": 0,
      "3rd down conversions": 6,
      "3rd down attempts": 12,
      "4th down conversions": 0,
      "4th down attempts": 0
    },
    "MichiganState": {
      "points": 12,
      "1st downs": 13,
      "rushing 1st downs": 2,
      "passing 1st downs": 10,
      "penalty 1st downs": 1,
      "rushing yards": 81,
      "rushing attempts": 28,
      "passing yards": 180,
      "passing attempts": 36,
      "passing completions": 21,
      "passing interceptions": 2,
      "total yards": 261,
      "total plays": 64,
      "fumbles": 2,
      "fumbles lost": 2,
      "penalties": 10,
      "penalty yards": 101,
      "punts": 10,
      "punt yards": 435,
      "punt returns": 0,
      "punt return yards": 0,
      "kickoff returns": 4,
      "kickoff return yards": 100,
      "interception returns": 0,
      "interception return yards": 0,
      "3rd down conversions": 3,
      "3rd down attempts": 17,
      "4th down conversions": 1,
      "4th down attempts": 2
    }
  },
  "Toledo vs NorthernIllinois": {
    "stadium": "BrighamFieldatHuskieStadium-DeKalb-IL",
    "Toledo": {
      "points": 41,
      "1st downs": 34,
      "rushing 1st downs": 10,
      "passing 1st downs": 21,
      "penalty 1st downs": 3,
      "rushing yards": 178,
      "rushing attempts": 37,
      "passing yards": 432,
      "passing attempts": 44,
      "passing completions": 29,
      "passing interceptions": 2,
      "total yards": 610,
      "total plays": 81,
      "fumbles": 2,
      "fumbles lost": 0,
      "penalties": 11,
      "penalty yards": 112,
      "punts": 0,
      "punt yards": 0,
      "punt returns": 2,
      "punt return yards": 9,
      "kickoff returns": 5,
      "kickoff return yards": 76,
      "interception returns": 0,
      "interception return yards": 0,
      "3rd down conversions": 3,
      "3rd down attempts": 9,
      "4th down conversions": 3,
      "4th down attempts": 4
    },
    "NorthernIllinois": {
      "points": 24,
      "1st downs": 21,
      "rushing 1st downs": 5,
      "passing 1st downs": 12,
      "penalty 1st downs": 4,
      "rushing yards": 109,
      "rushing attempts": 28,
      "passing yards": 273,
      "passing attempts": 39,
      "passing completions": 19,
      "passing interceptions": 0,
      "total yards": 382,
      "total plays": 67,
      "fumbles": 1,
      "fumbles lost": 1,
      "penalties": 8,
      "penalty yards": 77,
      "punts": 4,
      "punt yards": 161,
      "punt returns": 0,
      "punt return yards": 0,
      "kickoff returns": 7,
      "kickoff return yards": 140,
      "interception returns": 2,
      "interception return yards": 8,
      "3rd down conversions": 4,
      "3rd down attempts": 14,
      "4th down conversions": 1,
      "4th down attempts": 2
    }
  },
  "Rice vs Marshall": {
    "stadium": "JoanCEdwardsStadium-Huntington-WV",
    "Rice": {
      "points": 20,
      "1st downs": 17,
      "rushing 1st downs": 10,
      "passing 1st downs": 3,
      "penalty 1st downs": 4,
      "rushing yards": 127,
      "rushing attempts": 46,
      "passing yards": 86,
      "passing attempts": 14,
      "passing completions": 10,
      "passing interceptions": 0,
      "total yards": 213,
      "total plays": 60,
      "fumbles": 2,
      "fumbles lost": 1,
      "penalties": 5,
      "penalty yards": 35,
      "punts": 4,
      "punt yards": 158,
      "punt returns": 1,
      "punt return yards": 16,
      "kickoff returns": 0,
      "kickoff return yards": 0,
      "interception returns": 5,
      "interception return yards": 77,
      "3rd down conversions": 5,
      "3rd down attempts": 13,
      "4th down conversions": 1,
      "4th down attempts": 1
    },
    "Marshall": {
      "points": 0,
      "1st downs": 19,
      "rushing 1st downs": 7,
      "passing 1st downs": 11,
      "penalty 1st downs": 1,
      "rushing yards": 80,
      "rushing attempts": 28,
      "passing yards": 165,
      "passing attempts": 35,
      "passing completions": 18,
      "passing interceptions": 5,
      "total yards": 245,
      "total plays": 63,
      "fumbles": 1,
      "fumbles lost": 0,
      "penalties": 8,
      "penalty yards": 80,
      "punts": 2,
      "punt yards": 66,
      "punt returns": 2,
      "punt return yards": -1,
      "kickoff returns": 5,
      "kickoff return yards": 76,
      "interception returns": 0,
      "interception return yards": 0,
      "3rd down conversions": 4,
      "3rd down attempts": 12,
      "4th down conversions": 0,
      "4th down attempts": 3
    }
  },
  "FCS vs NorthCarolina": {
    "stadium": "KenanMemorialStadium-ChapelHill-NC",
    "FCS": {
      "points": 9,
      "1st downs": 13,
      "rushing 1st downs": 8,
      "passing 1st downs": 5,
      "penalty 1st downs": 0,
      "rushing yards": 137,
      "rushing attempts": 40,
      "passing yards": 116,
      "passing attempts": 19,
      "passing completions": 11,
      "passing interceptions": 0,
      "total yards": 253,
      "total plays": 59,
      "fumbles": 3,
      "fumbles lost": 1,
      "penalties": 5,
      "penalty yards": 45,
      "punts": 6,
      "punt yards": 205,
      "punt returns": 0,
      "punt return yards": 0,
      "kickoff returns": 3,
      "kickoff return yards": 65,
      "interception returns": 1,
      "interception return yards": 24,
      "3rd down conversions": 5,
      "3rd down attempts": 14,
      "4th down conversions": 0,
      "4th down attempts": 2
    },
    "NorthCarolina": {
      "points": 49,
      "1st downs": 31,
      "rushing 1st downs": 14,
      "passing 1st downs": 16,
      "penalty 1st downs": 1,
      "rushing yards": 231,
      "rushing attempts": 38,
      "passing yards": 309,
      "passing attempts": 29,
      "passing completions": 24,
      "passing interceptions": 1,
      "total yards": 540,
      "total plays": 67,
      "fumbles": 3,
      "fumbles lost": 2,
      "penalties": 3,
      "penalty yards": 35,
      "punts": 2,
      "punt yards": 83,
      "punt returns": 2,
      "punt return yards": 32,
      "kickoff returns": 2,
      "kickoff return yards": 39,
      "interception returns": 0,
      "interception return yards": 0,
      "3rd down conversions": 5,
      "3rd down attempts": 8,
      "4th down conversions": 1,
      "4th down attempts": 1
    }
  },
  "Memphis vs Tulane": {
    "stadium": "YulmanStadium-NewOrleans-LA",
    "Memphis": {
      "points": 21,
      "1st downs": 20,
      "rushing 1st downs": 4,
      "passing 1st downs": 11,
      "penalty 1st downs": 5,
      "rushing yards": 45,
      "rushing attempts": 28,
      "passing yards": 255,
      "passing attempts": 39,
      "passing completions": 20,
      "passing interceptions": 2,
      "total yards": 300,
      "total plays": 67,
      "fumbles": 2,
      "fumbles lost": 0,
      "penalties": 4,
      "penalty yards": 29,
      "punts": 4,
      "punt yards": 178,
      "punt returns": 2,
      "punt return yards": 18,
      "kickoff returns": 5,
      "kickoff return yards": 107,
      "interception returns": 1,
      "interception return yards": 31,
      "3rd down conversions": 5,
      "3rd down attempts": 14,
      "4th down conversions": 0,
      "4th down attempts": 2
    },
    "Tulane": {
      "points": 35,
      "1st downs": 26,
      "rushing 1st downs": 13,
      "passing 1st downs": 12,
      "penalty 1st downs": 1,
      "rushing yards": 165,
      "rushing attempts": 45,
      "passing yards": 254,
      "passing attempts": 34,
      "passing completions": 21,
      "passing interceptions": 1,
      "total yards": 419,
      "total plays": 79,
      "fumbles": 2,
      "fumbles lost": 0,
      "penalties": 9,
      "penalty yards": 84,
      "punts": 5,
      "punt yards": 216,
      "punt returns": 2,
      "punt return yards": 15,
      "kickoff returns": 2,
      "kickoff return yards": 43,
      "interception returns": 2,
      "interception return yards": 3,
      "3rd down conversions": 2,
      "3rd down attempts": 10,
      "4th down conversions": 3,
      "4th down attempts": 3
    }
  },
  "Arkansas vs Missouri": {
    "stadium": "FaurotFieldatMemorialStadium-Columbia-MO",
    "Arkansas": {
      "points": 48,
      "1st downs": 34,
      "rushing 1st downs": 21,
      "passing 1st downs": 10,
      "penalty 1st downs": 3,
      "rushing yards": 292,
      "rushing attempts": 50,
      "passing yards": 274,
      "passing attempts": 34,
      "passing completions": 18,
      "passing interceptions": 0,
      "total yards": 566,
      "total plays": 84,
      "fumbles": 2,
      "fumbles lost": 0,
      "penalties": 11,
      "penalty yards": 95,
      "punts": 5,
      "punt yards": 207,
      "punt returns": 1,
      "punt return yards": 0,
      "kickoff returns": 1,
      "kickoff return yards": 7,
      "interception returns": 0,
      "interception return yards": 0,
      "3rd down conversions": 6,
      "3rd down attempts": 14,
      "4th down conversions": 3,
      "4th down attempts": 3
    },
    "Missouri": {
      "points": 50,
      "1st downs": 37,
      "rushing 1st downs": 12,
      "passing 1st downs": 20,
      "penalty 1st downs": 5,
      "rushing yards": 273,
      "rushing attempts": 38,
      "passing yards": 380,
      "passing attempts": 49,
      "passing completions": 32,
      "passing interceptions": 0,
      "total yards": 653,
      "total plays": 87,
      "fumbles": 1,
      "fumbles lost": 0,
      "penalties": 8,
      "penalty yards": 57,
      "punts": 2,
      "punt yards": 79,
      "punt returns": 0,
      "punt return yards": 0,
      "kickoff returns": 2,
      "kickoff return yards": 32,
      "interception returns": 0,
      "interception return yards": 0,
      "3rd down conversions": 9,
      "3rd down attempts": 15,
      "4th down conversions": 0,
      "4th down attempts": 0
    }
  },
  "BowlingGreen vs Akron": {
    "stadium": "InfoCisionStadiumSummaField-Akron-OH",
    "BowlingGreen": {
      "points": 3,
      "1st downs": 13,
      "rushing 1st downs": 8,
      "passing 1st downs": 5,
      "penalty 1st downs": 0,
      "rushing yards": 160,
      "rushing attempts": 38,
      "passing yards": 135,
      "passing attempts": 27,
      "passing completions": 14,
      "passing interceptions": 1,
      "total yards": 295,
      "total plays": 65,
      "fumbles": 2,
      "fumbles lost": 2,
      "penalties": 3,
      "penalty yards": 35,
      "punts": 3,
      "punt yards": 79,
      "punt returns": 3,
      "punt return yards": 33,
      "kickoff returns": 4,
      "kickoff return yards": 101,
      "interception returns": 0,
      "interception return yards": 0,
      "3rd down conversions": 7,
      "3rd down attempts": 16,
      "4th down conversions": 0,
      "4th down attempts": 2
    },
    "Akron": {
      "points": 31,
      "1st downs": 15,
      "rushing 1st downs": 8,
      "passing 1st downs": 5,
      "penalty 1st downs": 2,
      "rushing yards": 195,
      "rushing attempts": 39,
      "passing yards": 87,
      "passing attempts": 17,
      "passing completions": 9,
      "passing interceptions": 0,
      "total yards": 282,
      "total plays": 56,
      "fumbles": 2,
      "fumbles lost": 0,
      "penalties": 3,
      "penalty yards": 12,
      "punts": 5,
      "punt yards": 185,
      "punt returns": 2,
      "punt return yards": -9,
      "kickoff returns": 1,
      "kickoff return yards": 14,
      "interception returns": 1,
      "interception return yards": 44,
      "3rd down conversions": 5,
      "3rd down attempts": 13,
      "4th down conversions": 0,
      "4th down attempts": 1
    }
  },
  "BallState vs CentralMichigan": {
    "stadium": "KellyShortsStadium-MountPleasant-MI",
    "BallState": {
      "points": 45,
      "1st downs": 28,
      "rushing 1st downs": 11,
      "passing 1st downs": 16,
      "penalty 1st downs": 1,
      "rushing yards": 153,
      "rushing attempts": 52,
      "passing yards": 366,
      "passing attempts": 43,
      "passing completions": 26,
      "passing interceptions": 1,
      "total yards": 519,
      "total plays": 95,
      "fumbles": 0,
      "fumbles lost": 0,
      "penalties": 3,
      "penalty yards": 18,
      "punts": 4,
      "punt yards": 117,
      "punt returns": 1,
      "punt return yards": 0,
      "kickoff returns": 3,
      "kickoff return yards": 49,
      "interception returns": 2,
      "interception return yards": 0,
      "3rd down conversions": 13,
      "3rd down attempts": 21,
      "4th down conversions": 1,
      "4th down attempts": 2
    },
    "CentralMichigan": {
      "points": 20,
      "1st downs": 17,
      "rushing 1st downs": 9,
      "passing 1st downs": 8,
      "penalty 1st downs": 0,
      "rushing yards": 154,
      "rushing attempts": 36,
      "passing yards": 188,
      "passing attempts": 30,
      "passing completions": 20,
      "passing interceptions": 2,
      "total yards": 342,
      "total plays": 66,
      "fumbles": 2,
      "fumbles lost": 2,
      "penalties": 6,
      "penalty yards": 58,
      "punts": 6,
      "punt yards": 258,
      "punt returns": 1,
      "punt return yards": 0,
      "kickoff returns": 5,
      "kickoff return yards": 76,
      "interception returns": 1,
      "interception return yards": 0,
      "3rd down conversions": 4,
      "3rd down attempts": 14,
      "4th down conversions": 2,
      "4th down attempts": 4
    }
  },
  "EasternMichigan vs WesternMichigan": {
    "stadium": "WaldoStadium-Kalamazoo-MI",
    "EasternMichigan": {
      "points": 53,
      "1st downs": 24,
      "rushing 1st downs": 9,
      "passing 1st downs": 13,
      "penalty 1st downs": 2,
      "rushing yards": 218,
      "rushing attempts": 46,
      "passing yards": 315,
      "passing attempts": 30,
      "passing completions": 19,
      "passing interceptions": 0,
      "total yards": 533,
      "total plays": 76,
      "fumbles": 1,
      "fumbles lost": 0,
      "penalties": 5,
      "penalty yards": 40,
      "punts": 1,
      "punt yards": 38,
      "punt returns": 0,
      "punt return yards": 0,
      "kickoff returns": 3,
      "kickoff return yards": 44,
      "interception returns": 0,
      "interception return yards": 0,
      "3rd down conversions": 9,
      "3rd down attempts": 16,
      "4th down conversions": 2,
      "4th down attempts": 2
    },
    "WesternMichigan": {
      "points": 42,
      "1st downs": 23,
      "rushing 1st downs": 14,
      "passing 1st downs": 8,
      "penalty 1st downs": 1,
      "rushing yards": 225,
      "rushing attempts": 38,
      "passing yards": 288,
      "passing attempts": 26,
      "passing completions": 18,
      "passing interceptions": 0,
      "total yards": 513,
      "total plays": 64,
      "fumbles": 4,
      "fumbles lost": 3,
      "penalties": 13,
      "penalty yards": 93,
      "punts": 1,
      "punt yards": 34,
      "punt returns": 1,
      "punt return yards": -1,
      "kickoff returns": 8,
      "kickoff return yards": 71,
      "interception returns": 0,
      "interception return yards": 0,
      "3rd down conversions": 5,
      "3rd down attempts": 8,
      "4th down conversions": 1,
      "4th down attempts": 1
    }
  },
  "Troy vs SouthAlabama": {
    "stadium": "HancockWhitneyStadium-Mobile-AL",
    "Troy": {
      "points": 29,
      "1st downs": 25,
      "rushing 1st downs": 8,
      "passing 1st downs": 16,
      "penalty 1st downs": 1,
      "rushing yards": 117,
      "rushing attempts": 35,
      "passing yards": 297,
      "passing attempts": 42,
      "passing completions": 34,
      "passing interceptions": 1,
      "total yards": 414,
      "total plays": 77,
      "fumbles": 0,
      "fumbles lost": 0,
      "penalties": 1,
      "penalty yards": 10,
      "punts": 1,
      "punt yards": 44,
      "punt returns": 1,
      "punt return yards": 11,
      "kickoff returns": 1,
      "kickoff return yards": 32,
      "interception returns": 1,
      "interception return yards": 0,
      "3rd down conversions": 11,
      "3rd down attempts": 16,
      "4th down conversions": 0,
      "4th down attempts": 2
    },
    "SouthAlabama": {
      "points": 0,
      "1st downs": 17,
      "rushing 1st downs": 7,
      "passing 1st downs": 10,
      "penalty 1st downs": 0,
      "rushing yards": 57,
      "rushing attempts": 30,
      "passing yards": 182,
      "passing attempts": 37,
      "passing completions": 21,
      "passing interceptions": 1,
      "total yards": 239,
      "total plays": 67,
      "fumbles": 1,
      "fumbles lost": 1,
      "penalties": 1,
      "penalty yards": 10,
      "punts": 3,
      "punt yards": 118,
      "punt returns": 0,
      "punt return yards": 0,
      "kickoff returns": 2,
      "kickoff return yards": 39,
      "interception returns": 1,
      "interception return yards": 0,
      "3rd down conversions": 5,
      "3rd down attempts": 15,
      "4th down conversions": 1,
      "4th down attempts": 6
    }
  },
  "Syracuse vs NotreDame": {
    "stadium": "NotreDameStadium-SouthBend-IN",
    "Syracuse": {
      "points": 21,
      "1st downs": 15,
      "rushing 1st downs": 7,
      "passing 1st downs": 7,
      "penalty 1st downs": 1,
      "rushing yards": 229,
      "rushing attempts": 35,
      "passing yards": 185,
      "passing attempts": 30,
      "passing completions": 18,
      "passing interceptions": 1,
      "total yards": 414,
      "total plays": 65,
      "fumbles": 4,
      "fumbles lost": 3,
      "penalties": 8,
      "penalty yards": 90,
      "punts": 7,
      "punt yards": 298,
      "punt returns": 0,
      "punt return yards": 0,
      "kickoff returns": 0,
      "kickoff return yards": 0,
      "interception returns": 1,
      "interception return yards": 11,
      "3rd down conversions": 5,
      "3rd down attempts": 14,
      "4th down conversions": 1,
      "4th down attempts": 1
    },
    "NotreDame": {
      "points": 45,
      "1st downs": 26,
      "rushing 1st downs": 9,
      "passing 1st downs": 15,
      "penalty 1st downs": 2,
      "rushing yards": 283,
      "rushing attempts": 40,
      "passing yards": 285,
      "passing attempts": 37,
      "passing completions": 24,
      "passing interceptions": 1,
      "total yards": 568,
      "total plays": 77,
      "fumbles": 1,
      "fumbles lost": 1,
      "penalties": 4,
      "penalty yards": 40,
      "punts": 4,
      "punt yards": 153,
      "punt returns": 2,
      "punt return yards": 12,
      "kickoff returns": 3,
      "kickoff return yards": 73,
      "interception returns": 1,
      "interception return yards": 13,
      "3rd down conversions": 7,
      "3rd down attempts": 15,
      "4th down conversions": 1,
      "4th down attempts": 2
    }
  },
  "FCS vs ArkansasState": {
    "stadium": "CentennialBankStadium-Jonesboro-AR",
    "FCS": {
      "points": 15,
      "1st downs": 18,
      "rushing 1st downs": 8,
      "passing 1st downs": 10,
      "penalty 1st downs": 0,
      "rushing yards": 110,
      "rushing attempts": 36,
      "passing yards": 213,
      "passing attempts": 35,
      "passing completions": 21,
      "passing interceptions": 0,
      "total yards": 323,
      "total plays": 71,
      "fumbles": 0,
      "fumbles lost": 0,
      "penalties": 6,
      "penalty yards": 41,
      "punts": 5,
      "punt yards": 202,
      "punt returns": 0,
      "punt return yards": 0,
      "kickoff returns": 5,
      "kickoff return yards": 129,
      "interception returns": 1,
      "interception return yards": 32,
      "3rd down conversions": 1,
      "3rd down attempts": 13,
      "4th down conversions": 1,
      "4th down attempts": 5
    },
    "ArkansasState": {
      "points": 48,
      "1st downs": 20,
      "rushing 1st downs": 4,
      "passing 1st downs": 14,
      "penalty 1st downs": 2,
      "rushing yards": 78,
      "rushing attempts": 32,
      "passing yards": 511,
      "passing attempts": 32,
      "passing completions": 17,
      "passing interceptions": 1,
      "total yards": 589,
      "total plays": 64,
      "fumbles": 0,
      "fumbles lost": 0,
      "penalties": 3,
      "penalty yards": 12,
      "punts": 2,
      "punt yards": 86,
      "punt returns": 0,
      "punt return yards": 0,
      "kickoff returns": 2,
      "kickoff return yards": 32,
      "interception returns": 0,
      "interception return yards": 0,
      "3rd down conversions": 10,
      "3rd down attempts": 17,
      "4th down conversions": 0,
      "4th down attempts": 1
    }
  },
  "WestVirginia vs IowaState": {
    "stadium": "JackTriceStadium-Ames-IA",
    "WestVirginia": {
      "points": 6,
      "1st downs": 16,
      "rushing 1st downs": 6,
      "passing 1st downs": 9,
      "penalty 1st downs": 1,
      "rushing yards": 54,
      "rushing attempts": 25,
      "passing yards": 209,
      "passing attempts": 41,
      "passing completions": 21,
      "passing interceptions": 0,
      "total yards": 263,
      "total plays": 66,
      "fumbles": 0,
      "fumbles lost": 0,
      "penalties": 7,
      "penalty yards": 65,
      "punts": 4,
      "punt yards": 166,
      "punt returns": 1,
      "punt return yards": 10,
      "kickoff returns": 7,
      "kickoff return yards": 128,
      "interception returns": 0,
      "interception return yards": 0,
      "3rd down conversions": 7,
      "3rd down attempts": 17,
      "4th down conversions": 1,
      "4th down attempts": 3
    },
    "IowaState": {
      "points": 42,
      "1st downs": 26,
      "rushing 1st downs": 12,
      "passing 1st downs": 11,
      "penalty 1st downs": 3,
      "rushing yards": 236,
      "rushing attempts": 44,
      "passing yards": 247,
      "passing attempts": 23,
      "passing completions": 20,
      "passing interceptions": 0,
      "total yards": 483,
      "total plays": 67,
      "fumbles": 1,
      "fumbles lost": 0,
      "penalties": 6,
      "penalty yards": 65,
      "punts": 2,
      "punt yards": 55,
      "punt returns": 1,
      "punt return yards": -3,
      "kickoff returns": 2,
      "kickoff return yards": 18,
      "interception returns": 0,
      "interception return yards": 0,
      "3rd down conversions": 8,
      "3rd down attempts": 12,
      "4th down conversions": 2,
      "4th down attempts": 2
    }
  },
  "Florida vs Tennessee": {
    "stadium": "NeylandStadium-Knoxville-TN",
    "Florida": {
      "points": 31,
      "1st downs": 24,
      "rushing 1st downs": 1,
      "passing 1st downs": 21,
      "penalty 1st downs": 2,
      "rushing yards": 19,
      "rushing attempts": 17,
      "passing yards": 433,
      "passing attempts": 49,
      "passing completions": 35,
      "passing interceptions": 0,
      "total yards": 452,
      "total plays": 66,
      "fumbles": 0,
      "fumbles lost": 0,
      "penalties": 8,
      "penalty yards": 85,
      "punts": 4,
      "punt yards": 163,
      "punt returns": 0,
      "punt return yards": 0,
      "kickoff returns": 0,
      "kickoff return yards": 0,
      "interception returns": 0,
      "interception return yards": 0,
      "3rd down conversions": 6,
      "3rd down attempts": 13,
      "4th down conversions": 0,
      "4th down attempts": 1
    },
    "Tennessee": {
      "points": 19,
      "1st downs": 24,
      "rushing 1st downs": 8,
      "passing 1st downs": 13,
      "penalty 1st downs": 3,
      "rushing yards": 94,
      "rushing attempts": 39,
      "passing yards": 240,
      "passing attempts": 37,
      "passing completions": 27,
      "passing interceptions": 0,
      "total yards": 334,
      "total plays": 76,
      "fumbles": 0,
      "fumbles lost": 0,
      "penalties": 5,
      "penalty yards": 40,
      "punts": 7,
      "punt yards": 286,
      "punt returns": 0,
      "punt return yards": 0,
      "kickoff returns": 4,
      "kickoff return yards": 69,
      "interception returns": 0,
      "interception return yards": 0,
      "3rd down conversions": 4,
      "3rd down attempts": 15,
      "4th down conversions": 3,
      "4th down attempts": 4
    }
  },
  "BostonCollege vs Virginia": {
    "stadium": "ScottStadium-Charlottesville-VA",
    "BostonCollege": {
      "points": 32,
      "1st downs": 23,
      "rushing 1st downs": 4,
      "passing 1st downs": 18,
      "penalty 1st downs": 1,
      "rushing yards": 0,
      "rushing attempts": 20,
      "passing yards": 520,
      "passing attempts": 46,
      "passing completions": 32,
      "passing interceptions": 3,
      "total yards": 513,
      "total plays": 66,
      "fumbles": 2,
      "fumbles lost": 0,
      "penalties": 9,
      "penalty yards": 75,
      "punts": 5,
      "punt yards": 207,
      "punt returns": 2,
      "punt return yards": 17,
      "kickoff returns": 4,
      "kickoff return yards": 59,
      "interception returns": 1,
      "interception return yards": 12,
      "3rd down conversions": 5,
      "3rd down attempts": 12,
      "4th down conversions": 1,
      "4th down attempts": 2
    },
    "Virginia": {
      "points": 43,
      "1st downs": 24,
      "rushing 1st downs": 13,
      "passing 1st downs": 9,
      "penalty 1st downs": 2,
      "rushing yards": 262,
      "rushing attempts": 42,
      "passing yards": 287,
      "passing attempts": 27,
      "passing completions": 19,
      "passing interceptions": 1,
      "total yards": 549,
      "total plays": 69,
      "fumbles": 0,
      "fumbles lost": 0,
      "penalties": 10,
      "penalty yards": 95,
      "punts": 4,
      "punt yards": 153,
      "punt returns": 4,
      "punt return yards": 14,
      "kickoff returns": 3,
      "kickoff return yards": 119,
      "interception returns": 3,
      "interception return yards": 6,
      "3rd down conversions": 4,
      "3rd down attempts": 12,
      "4th down conversions": 0,
      "4th down attempts": 0
    }
  },
  "Indiana vs Wisconsin": {
    "stadium": "CampRandallStadium-Madison-WI",
    "Indiana": {
      "points": 14,
      "1st downs": 15,
      "rushing 1st downs": 6,
      "passing 1st downs": 6,
      "penalty 1st downs": 3,
      "rushing yards": 87,
      "rushing attempts": 31,
      "passing yards": 130,
      "passing attempts": 22,
      "passing completions": 13,
      "passing interceptions": 0,
      "total yards": 217,
      "total plays": 53,
      "fumbles": 1,
      "fumbles lost": 1,
      "penalties": 1,
      "penalty yards": 15,
      "punts": 5,
      "punt yards": 201,
      "punt returns": 1,
      "punt return yards": 5,
      "kickoff returns": 0,
      "kickoff return yards": 0,
      "interception returns": 1,
      "interception return yards": 20,
      "3rd down conversions": 4,
      "3rd down attempts": 10,
      "4th down conversions": 0,
      "4th down attempts": 0
    },
    "Wisconsin": {
      "points": 6,
      "1st downs": 19,
      "rushing 1st downs": 8,
      "passing 1st downs": 10,
      "penalty 1st downs": 1,
      "rushing yards": 140,
      "rushing attempts": 35,
      "passing yards": 202,
      "passing attempts": 34,
      "passing completions": 20,
      "passing interceptions": 1,
      "total yards": 342,
      "total plays": 69,
      "fumbles": 1,
      "fumbles lost": 1,
      "penalties": 8,
      "penalty yards": 81,
      "punts": 3,
      "punt yards": 113,
      "punt returns": 0,
      "punt return yards": 0,
      "kickoff returns": 2,
      "kickoff return yards": 37,
      "interception returns": 0,
      "interception return yards": 0,
      "3rd down conversions": 8,
      "3rd down attempts": 16,
      "4th down conversions": 0,
      "4th down attempts": 1
    }
  },
  "Iowa vs Illinois": {
    "stadium": "MemorialStadiumChampaign-IL-Champaign",
    "Iowa": {
      "points": 35,
      "1st downs": 22,
      "rushing 1st downs": 9,
      "passing 1st downs": 13,
      "penalty 1st downs": 0,
      "rushing yards": 204,
      "rushing attempts": 38,
      "passing yards": 220,
      "passing attempts": 28,
      "passing completions": 18,
      "passing interceptions": 0,
      "total yards": 424,
      "total plays": 66,
      "fumbles": 1,
      "fumbles lost": 0,
      "penalties": 3,
      "penalty yards": 22,
      "punts": 5,
      "punt yards": 210,
      "punt returns": 5,
      "punt return yards": 29,
      "kickoff returns": 2,
      "kickoff return yards": 24,
      "interception returns": 0,
      "interception return yards": 0,
      "3rd down conversions": 4,
      "3rd down attempts": 12,
      "4th down conversions": 1,
      "4th down attempts": 1
    },
    "Illinois": {
      "points": 21,
      "1st downs": 20,
      "rushing 1st downs": 9,
      "passing 1st downs": 11,
      "penalty 1st downs": 0,
      "rushing yards": 149,
      "rushing attempts": 38,
      "passing yards": 199,
      "passing attempts": 35,
      "passing completions": 17,
      "passing interceptions": 0,
      "total yards": 348,
      "total plays": 73,
      "fumbles": 0,
      "fumbles lost": 0,
      "penalties": 3,
      "penalty yards": 30,
      "punts": 7,
      "punt yards": 266,
      "punt returns": 1,
      "punt return yards": 4,
      "kickoff returns": 2,
      "kickoff return yards": 22,
      "interception returns": 0,
      "interception return yards": 0,
      "3rd down conversions": 9,
      "3rd down attempts": 18,
      "4th down conversions": 1,
      "4th down attempts": 2
    }
  },
  "Tulsa vs Navy": {
    "stadium": "NavyMarineCorpsMemorialStadium-Annapolis-MD",
    "Tulsa": {
      "points": 19,
      "1st downs": 15,
      "rushing 1st downs": 9,
      "passing 1st downs": 6,
      "penalty 1st downs": 0,
      "rushing yards": 128,
      "rushing attempts": 43,
      "passing yards": 168,
      "passing attempts": 25,
      "passing completions": 10,
      "passing interceptions": 0,
      "total yards": 296,
      "total plays": 68,
      "fumbles": 2,
      "fumbles lost": 1,
      "penalties": 6,
      "penalty yards": 60,
      "punts": 4,
      "punt yards": 167,
      "punt returns": 1,
      "punt return yards": 7,
      "kickoff returns": 1,
      "kickoff return yards": 16,
      "interception returns": 0,
      "interception return yards": 0,
      "3rd down conversions": 6,
      "3rd down attempts": 17,
      "4th down conversions": 1,
      "4th down attempts": 2
    },
    "Navy": {
      "points": 6,
      "1st downs": 13,
      "rushing 1st downs": 10,
      "passing 1st downs": 2,
      "penalty 1st downs": 1,
      "rushing yards": 126,
      "rushing attempts": 53,
      "passing yards": 27,
      "passing attempts": 11,
      "passing completions": 4,
      "passing interceptions": 0,
      "total yards": 153,
      "total plays": 64,
      "fumbles": 1,
      "fumbles lost": 1,
      "penalties": 6,
      "penalty yards": 46,
      "punts": 8,
      "punt yards": 259,
      "punt returns": 2,
      "punt return yards": -2,
      "kickoff returns": 5,
      "kickoff return yards": 115,
      "interception returns": 0,
      "interception return yards": 0,
      "3rd down conversions": 6,
      "3rd down attempts": 17,
      "4th down conversions": 1,
      "4th down attempts": 2
    }
  },
  "GeorgiaTech vs NorthCarolinaState": {
    "stadium": "WayneDayFamilyFieldatCarterFinleyStadium-Raleigh-NC",
    "GeorgiaTech": {
      "points": 13,
      "1st downs": 23,
      "rushing 1st downs": 14,
      "passing 1st downs": 8,
      "penalty 1st downs": 1,
      "rushing yards": 261,
      "rushing attempts": 51,
      "passing yards": 151,
      "passing attempts": 27,
      "passing completions": 13,
      "passing interceptions": 0,
      "total yards": 412,
      "total plays": 78,
      "fumbles": 3,
      "fumbles lost": 0,
      "penalties": 12,
      "penalty yards": 111,
      "punts": 4,
      "punt yards": 188,
      "punt returns": 1,
      "punt return yards": 0,
      "kickoff returns": 0,
      "kickoff return yards": 0,
      "interception returns": 0,
      "interception return yards": 0,
      "3rd down conversions": 10,
      "3rd down attempts": 19,
      "4th down conversions": 0,
      "4th down attempts": 3
    },
    "NorthCarolinaState": {
      "points": 23,
      "1st downs": 24,
      "rushing 1st downs": 4,
      "passing 1st downs": 16,
      "penalty 1st downs": 4,
      "rushing yards": 88,
      "rushing attempts": 32,
      "passing yards": 309,
      "passing attempts": 36,
      "passing completions": 23,
      "passing interceptions": 0,
      "total yards": 397,
      "total plays": 68,
      "fumbles": 0,
      "fumbles lost": 0,
      "penalties": 7,
      "penalty yards": 78,
      "punts": 3,
      "punt yards": 115,
      "punt returns": 3,
      "punt return yards": 17,
      "kickoff returns": 4,
      "kickoff return yards": 82,
      "interception returns": 0,
      "interception return yards": 0,
      "3rd down conversions": 5,
      "3rd down attempts": 12,
      "4th down conversions": 0,
      "4th down attempts": 1
    }
  },
  "Stanford vs Washington": {
    "stadium": "AlaskaAirlinesFieldatHuskyStadium-Seattle-WA",
    "Stanford": {
      "points": 31,
      "1st downs": 23,
      "rushing 1st downs": 9,
      "passing 1st downs": 14,
      "penalty 1st downs": 0,
      "rushing yards": 191,
      "rushing attempts": 40,
      "passing yards": 252,
      "passing attempts": 31,
      "passing completions": 20,
      "passing interceptions": 0,
      "total yards": 443,
      "total plays": 71,
      "fumbles": 1,
      "fumbles lost": 1,
      "penalties": 3,
      "penalty yards": 25,
      "punts": 1,
      "punt yards": 48,
      "punt returns": 0,
      "punt return yards": 0,
      "kickoff returns": 5,
      "kickoff return yards": 136,
      "interception returns": 0,
      "interception return yards": 0,
      "3rd down conversions": 10,
      "3rd down attempts": 13,
      "4th down conversions": 2,
      "4th down attempts": 2
    },
    "Washington": {
      "points": 26,
      "1st downs": 19,
      "rushing 1st downs": 8,
      "passing 1st downs": 10,
      "penalty 1st downs": 1,
      "rushing yards": 117,
      "rushing attempts": 34,
      "passing yards": 254,
      "passing attempts": 23,
      "passing completions": 15,
      "passing interceptions": 0,
      "total yards": 371,
      "total plays": 57,
      "fumbles": 0,
      "fumbles lost": 0,
      "penalties": 4,
      "penalty yards": 30,
      "punts": 2,
      "punt yards": 80,
      "punt returns": 1,
      "punt return yards": 0,
      "kickoff returns": 2,
      "kickoff return yards": 37,
      "interception returns": 0,
      "interception return yards": 0,
      "3rd down conversions": 6,
      "3rd down attempts": 10,
      "4th down conversions": 0,
      "4th down attempts": 0
    }
  },
  "BrighamYoung vs CoastalCarolina": {
    "stadium": "BrooksStadium-Conway-SC",
    "BrighamYoung": {
      "points": 17,
      "1st downs": 21,
      "rushing 1st downs": 8,
      "passing 1st downs": 12,
      "penalty 1st downs": 1,
      "rushing yards": 165,
      "rushing attempts": 26,
      "passing yards": 240,
      "passing attempts": 32,
      "passing completions": 19,
      "passing interceptions": 1,
      "total yards": 405,
      "total plays": 58,
      "fumbles": 3,
      "fumbles lost": 1,
      "penalties": 3,
      "penalty yards": 20,
      "punts": 4,
      "punt yards": 163,
      "punt returns": 2,
      "punt return yards": 10,
      "kickoff returns": 4,
      "kickoff return yards": 89,
      "interception returns": 0,
      "interception return yards": 0,
      "3rd down conversions": 4,
      "3rd down attempts": 10,
      "4th down conversions": 0,
      "4th down attempts": 1
    },
    "CoastalCarolina": {
      "points": 22,
      "1st downs": 22,
      "rushing 1st downs": 18,
      "passing 1st downs": 4,
      "penalty 1st downs": 0,
      "rushing yards": 281,
      "rushing attempts": 54,
      "passing yards": 85,
      "passing attempts": 15,
      "passing completions": 10,
      "passing interceptions": 0,
      "total yards": 366,
      "total plays": 69,
      "fumbles": 1,
      "fumbles lost": 1,
      "penalties": 4,
      "penalty yards": 40,
      "punts": 5,
      "punt yards": 200,
      "punt returns": 1,
      "punt return yards": 5,
      "kickoff returns": 0,
      "kickoff return yards": 0,
      "interception returns": 1,
      "interception return yards": 42,
      "3rd down conversions": 6,
      "3rd down attempts": 13,
      "4th down conversions": 1,
      "4th down attempts": 1
    }
  },
  "FloridaAtlantic vs GeorgiaSouthern": {
    "stadium": "AllenEPaulsonStadium-Statesboro-GA",
    "FloridaAtlantic": {
      "points": 3,
      "1st downs": 16,
      "rushing 1st downs": 5,
      "passing 1st downs": 10,
      "penalty 1st downs": 1,
      "rushing yards": 133,
      "rushing attempts": 29,
      "passing yards": 189,
      "passing attempts": 28,
      "passing completions": 14,
      "passing interceptions": 2,
      "total yards": 322,
      "total plays": 57,
      "fumbles": 2,
      "fumbles lost": 2,
      "penalties": 5,
      "penalty yards": 30,
      "punts": 2,
      "punt yards": 83,
      "punt returns": 0,
      "punt return yards": 0,
      "kickoff returns": 5,
      "kickoff return yards": 89,
      "interception returns": 0,
      "interception return yards": 0,
      "3rd down conversions": 2,
      "3rd down attempts": 10,
      "4th down conversions": 0,
      "4th down attempts": 3
    },
    "GeorgiaSouthern": {
      "points": 20,
      "1st downs": 18,
      "rushing 1st downs": 15,
      "passing 1st downs": 3,
      "penalty 1st downs": 0,
      "rushing yards": 269,
      "rushing attempts": 59,
      "passing yards": 70,
      "passing attempts": 12,
      "passing completions": 3,
      "passing interceptions": 0,
      "total yards": 339,
      "total plays": 71,
      "fumbles": 2,
      "fumbles lost": 0,
      "penalties": 3,
      "penalty yards": 35,
      "punts": 2,
      "punt yards": 84,
      "punt returns": 1,
      "punt return yards": 49,
      "kickoff returns": 1,
      "kickoff return yards": 18,
      "interception returns": 2,
      "interception return yards": 0,
      "3rd down conversions": 6,
      "3rd down attempts": 14,
      "4th down conversions": 1,
      "4th down attempts": 3
    }
  },
  "SanJoseState vs Hawaii": {
    "stadium": "AlohaStadium-Honolulu-HI",
    "SanJoseState": {
      "points": 35,
      "1st downs": 21,
      "rushing 1st downs": 14,
      "passing 1st downs": 7,
      "penalty 1st downs": 0,
      "rushing yards": 288,
      "rushing attempts": 46,
      "passing yards": 180,
      "passing attempts": 25,
      "passing completions": 12,
      "passing interceptions": 1,
      "total yards": 468,
      "total plays": 71,
      "fumbles": 0,
      "fumbles lost": 0,
      "penalties": 5,
      "penalty yards": 58,
      "punts": 5,
      "punt yards": 227,
      "punt returns": 2,
      "punt return yards": 29,
      "kickoff returns": 1,
      "kickoff return yards": 20,
      "interception returns": 1,
      "interception return yards": 0,
      "3rd down conversions": 5,
      "3rd down attempts": 12,
      "4th down conversions": 2,
      "4th down attempts": 2
    },
    "Hawaii": {
      "points": 24,
      "1st downs": 22,
      "rushing 1st downs": 6,
      "passing 1st downs": 14,
      "penalty 1st downs": 2,
      "rushing yards": 101,
      "rushing attempts": 26,
      "passing yards": 238,
      "passing attempts": 44,
      "passing completions": 28,
      "passing interceptions": 1,
      "total yards": 339,
      "total plays": 70,
      "fumbles": 0,
      "fumbles lost": 0,
      "penalties": 5,
      "penalty yards": 30,
      "punts": 7,
      "punt yards": 302,
      "punt returns": 1,
      "punt return yards": 0,
      "kickoff returns": 5,
      "kickoff return yards": 89,
      "interception returns": 1,
      "interception return yards": 0,
      "3rd down conversions": 5,
      "3rd down attempts": 16,
      "4th down conversions": 3,
      "4th down attempts": 3
    }
  },
  "ColoradoState vs SanDiegoState": {
    "stadium": "SanDiegoCountyCreditUnionStadium-SanDiego-CA",
    "ColoradoState": {
      "points": 17,
      "1st downs": 15,
      "rushing 1st downs": 7,
      "passing 1st downs": 7,
      "penalty 1st downs": 1,
      "rushing yards": 121,
      "rushing attempts": 38,
      "passing yards": 144,
      "passing attempts": 28,
      "passing completions": 13,
      "passing interceptions": 2,
      "total yards": 265,
      "total plays": 66,
      "fumbles": 0,
      "fumbles lost": 0,
      "penalties": 5,
      "penalty yards": 36,
      "punts": 8,
      "punt yards": 389,
      "punt returns": 2,
      "punt return yards": 17,
      "kickoff returns": 4,
      "kickoff return yards": 115,
      "interception returns": 0,
      "interception return yards": 0,
      "3rd down conversions": 4,
      "3rd down attempts": 16,
      "4th down conversions": 1,
      "4th down attempts": 1
    },
    "SanDiegoState": {
      "points": 29,
      "1st downs": 17,
      "rushing 1st downs": 7,
      "passing 1st downs": 9,
      "penalty 1st downs": 1,
      "rushing yards": 117,
      "rushing attempts": 48,
      "passing yards": 130,
      "passing attempts": 24,
      "passing completions": 14,
      "passing interceptions": 0,
      "total yards": 247,
      "total plays": 72,
      "fumbles": 1,
      "fumbles lost": 0,
      "penalties": 3,
      "penalty yards": 24,
      "punts": 7,
      "punt yards": 270,
      "punt returns": 5,
      "punt return yards": 94,
      "kickoff returns": 4,
      "kickoff return yards": 173,
      "interception returns": 2,
      "interception return yards": 15,
      "3rd down conversions": 4,
      "3rd down attempts": 16,
      "4th down conversions": 2,
      "4th down attempts": 2
    }
  },
  "Oregon vs California": {
    "stadium": "CaliforniaMemorialStadium-Berkeley-CA",
    "Oregon": {
      "points": 17,
      "1st downs": 19,
      "rushing 1st downs": 8,
      "passing 1st downs": 9,
      "penalty 1st downs": 2,
      "rushing yards": 137,
      "rushing attempts": 34,
      "passing yards": 231,
      "passing attempts": 26,
      "passing completions": 14,
      "passing interceptions": 0,
      "total yards": 368,
      "total plays": 60,
      "fumbles": 3,
      "fumbles lost": 2,
      "penalties": 9,
      "penalty yards": 60,
      "punts": 6,
      "punt yards": 289,
      "punt returns": 1,
      "punt return yards": -2,
      "kickoff returns": 2,
      "kickoff return yards": 32,
      "interception returns": 0,
      "interception return yards": 0,
      "3rd down conversions": 4,
      "3rd down attempts": 12,
      "4th down conversions": 0,
      "4th down attempts": 1
    },
    "California": {
      "points": 21,
      "1st downs": 18,
      "rushing 1st downs": 5,
      "passing 1st downs": 10,
      "penalty 1st downs": 3,
      "rushing yards": 88,
      "rushing attempts": 47,
      "passing yards": 183,
      "passing attempts": 32,
      "passing completions": 20,
      "passing interceptions": 0,
      "total yards": 271,
      "total plays": 79,
      "fumbles": 0,
      "fumbles lost": 0,
      "penalties": 4,
      "penalty yards": 33,
      "punts": 7,
      "punt yards": 295,
      "punt returns": 4,
      "punt return yards": 40,
      "kickoff returns": 0,
      "kickoff return yards": 0,
      "interception returns": 0,
      "interception return yards": 0,
      "3rd down conversions": 7,
      "3rd down attempts": 21,
      "4th down conversions": 2,
      "4th down attempts": 3
    }
  },
  "Colorado vs Arizona": {
    "stadium": "ArizonaStadium-Tucson-AZ",
    "Colorado": {
      "points": 24,
      "1st downs": 18,
      "rushing 1st downs": 10,
      "passing 1st downs": 6,
      "penalty 1st downs": 2,
      "rushing yards": 407,
      "rushing attempts": 46,
      "passing yards": 92,
      "passing attempts": 20,
      "passing completions": 12,
      "passing interceptions": 2,
      "total yards": 499,
      "total plays": 66,
      "fumbles": 1,
      "fumbles lost": 1,
      "penalties": 5,
      "penalty yards": 47,
      "punts": 5,
      "punt yards": 225,
      "punt returns": 2,
      "punt return yards": 31,
      "kickoff returns": 0,
      "kickoff return yards": 0,
      "interception returns": 1,
      "interception return yards": 2,
      "3rd down conversions": 5,
      "3rd down attempts": 11,
      "4th down conversions": 0,
      "4th down attempts": 0
    },
    "Arizona": {
      "points": 13,
      "1st downs": 23,
      "rushing 1st downs": 11,
      "passing 1st downs": 8,
      "penalty 1st downs": 4,
      "rushing yards": 268,
      "rushing attempts": 43,
      "passing yards": 154,
      "passing attempts": 32,
      "passing completions": 19,
      "passing interceptions": 1,
      "total yards": 422,
      "total plays": 75,
      "fumbles": 0,
      "fumbles lost": 0,
      "penalties": 6,
      "penalty yards": 56,
      "punts": 7,
      "punt yards": 330,
      "punt returns": 1,
      "punt return yards": 33,
      "kickoff returns": 2,
      "kickoff return yards": 33,
      "interception returns": 2,
      "interception return yards": 15,
      "3rd down conversions": 3,
      "3rd down attempts": 14,
      "4th down conversions": 0,
      "4th down attempts": 2
    }
  },
  "SouthCarolina vs Kentucky": {
    "stadium": "KrogerField-Lexington-KY",
    "SouthCarolina": {
      "points": 18,
      "1st downs": 21,
      "rushing 1st downs": 14,
      "passing 1st downs": 6,
      "penalty 1st downs": 1,
      "rushing yards": 297,
      "rushing attempts": 44,
      "passing yards": 107,
      "passing attempts": 27,
      "passing completions": 12,
      "passing interceptions": 1,
      "total yards": 404,
      "total plays": 71,
      "fumbles": 4,
      "fumbles lost": 3,
      "penalties": 6,
      "penalty yards": 75,
      "punts": 3,
      "punt yards": 131,
      "punt returns": 1,
      "punt return yards": 2,
      "kickoff returns": 2,
      "kickoff return yards": 75,
      "interception returns": 0,
      "interception return yards": 0,
      "3rd down conversions": 4,
      "3rd down attempts": 14,
      "4th down conversions": 2,
      "4th down attempts": 2
    },
    "Kentucky": {
      "points": 41,
      "1st downs": 24,
      "rushing 1st downs": 13,
      "passing 1st downs": 9,
      "penalty 1st downs": 2,
      "rushing yards": 291,
      "rushing attempts": 45,
      "passing yards": 201,
      "passing attempts": 26,
      "passing completions": 17,
      "passing interceptions": 0,
      "total yards": 492,
      "total plays": 71,
      "fumbles": 1,
      "fumbles lost": 0,
      "penalties": 5,
      "penalty yards": 60,
      "punts": 4,
      "punt yards": 180,
      "punt returns": 0,
      "punt return yards": 0,
      "kickoff returns": 2,
      "kickoff return yards": 29,
      "interception returns": 1,
      "interception return yards": 0,
      "3rd down conversions": 5,
      "3rd down attempts": 14,
      "4th down conversions": 2,
      "4th down attempts": 3
    }
  },
  "Clemson vs VirginiaTech": {
    "stadium": "LaneStadium-Blacksburg-VA",
    "Clemson": {
      "points": 45,
      "1st downs": 19,
      "rushing 1st downs": 12,
      "passing 1st downs": 7,
      "penalty 1st downs": 0,
      "rushing yards": 238,
      "rushing attempts": 30,
      "passing yards": 195,
      "passing attempts": 22,
      "passing completions": 12,
      "passing interceptions": 1,
      "total yards": 433,
      "total plays": 52,
      "fumbles": 0,
      "fumbles lost": 0,
      "penalties": 4,
      "penalty yards": 30,
      "punts": 4,
      "punt yards": 112,
      "punt returns": 1,
      "punt return yards": 7,
      "kickoff returns": 0,
      "kickoff return yards": 0,
      "interception returns": 0,
      "interception return yards": 0,
      "3rd down conversions": 3,
      "3rd down attempts": 9,
      "4th down conversions": 0,
      "4th down attempts": 0
    },
    "VirginiaTech": {
      "points": 10,
      "1st downs": 18,
      "rushing 1st downs": 9,
      "passing 1st downs": 8,
      "penalty 1st downs": 1,
      "rushing yards": 131,
      "rushing attempts": 45,
      "passing yards": 202,
      "passing attempts": 19,
      "passing completions": 15,
      "passing interceptions": 0,
      "total yards": 333,
      "total plays": 64,
      "fumbles": 4,
      "fumbles lost": 3,
      "penalties": 2,
      "penalty yards": 25,
      "punts": 4,
      "punt yards": 164,
      "punt returns": 1,
      "punt return yards": 14,
      "kickoff returns": 1,
      "kickoff return yards": 22,
      "interception returns": 1,
      "interception return yards": 0,
      "3rd down conversions": 4,
      "3rd down attempts": 11,
      "4th down conversions": 0,
      "4th down attempts": 1
    }
  },
  "Baylor vs Oklahoma": {
    "stadium": "GaylordFamilyOklahomaMemorialStadium-Norman-OK",
    "Baylor": {
      "points": 14,
      "1st downs": 19,
      "rushing 1st downs": 4,
      "passing 1st downs": 13,
      "penalty 1st downs": 2,
      "rushing yards": 25,
      "rushing attempts": 26,
      "passing yards": 263,
      "passing attempts": 56,
      "passing completions": 30,
      "passing interceptions": 2,
      "total yards": 288,
      "total plays": 82,
      "fumbles": 0,
      "fumbles lost": 0,
      "penalties": 8,
      "penalty yards": 63,
      "punts": 5,
      "punt yards": 216,
      "punt returns": 2,
      "punt return yards": 8,
      "kickoff returns": 4,
      "kickoff return yards": 64,
      "interception returns": 1,
      "interception return yards": 0,
      "3rd down conversions": 6,
      "3rd down attempts": 21,
      "4th down conversions": 6,
      "4th down attempts": 8
    },
    "Oklahoma": {
      "points": 27,
      "1st downs": 16,
      "rushing 1st downs": 3,
      "passing 1st downs": 11,
      "penalty 1st downs": 2,
      "rushing yards": 76,
      "rushing attempts": 31,
      "passing yards": 193,
      "passing attempts": 28,
      "passing completions": 20,
      "passing interceptions": 1,
      "total yards": 269,
      "total plays": 59,
      "fumbles": 0,
      "fumbles lost": 0,
      "penalties": 8,
      "penalty yards": 62,
      "punts": 6,
      "punt yards": 223,
      "punt returns": 1,
      "punt return yards": 7,
      "kickoff returns": 0,
      "kickoff return yards": 0,
      "interception returns": 2,
      "interception return yards": 42,
      "3rd down conversions": 5,
      "3rd down attempts": 13,
      "4th down conversions": 0,
      "4th down attempts": 0
    }
  },
  "Alabama vs LSU": {
    "stadium": "TigerStadium-BatonRouge-LA",
    "Alabama": {
      "points": 55,
      "1st downs": 32,
      "rushing 1st downs": 16,
      "passing 1st downs": 14,
      "penalty 1st downs": 2,
      "rushing yards": 265,
      "rushing attempts": 43,
      "passing yards": 385,
      "passing attempts": 29,
      "passing completions": 20,
      "passing interceptions": 0,
      "total yards": 650,
      "total plays": 72,
      "fumbles": 1,
      "fumbles lost": 1,
      "penalties": 4,
      "penalty yards": 43,
      "punts": 1,
      "punt yards": 33,
      "punt returns": 0,
      "punt return yards": 0,
      "kickoff returns": 0,
      "kickoff return yards": 0,
      "interception returns": 0,
      "interception return yards": 0,
      "3rd down conversions": 4,
      "3rd down attempts": 9,
      "4th down conversions": 1,
      "4th down attempts": 1
    },
    "LSU": {
      "points": 17,
      "1st downs": 21,
      "rushing 1st downs": 7,
      "passing 1st downs": 12,
      "penalty 1st downs": 2,
      "rushing yards": 98,
      "rushing attempts": 27,
      "passing yards": 254,
      "passing attempts": 45,
      "passing completions": 25,
      "passing interceptions": 0,
      "total yards": 352,
      "total plays": 72,
      "fumbles": 4,
      "fumbles lost": 1,
      "penalties": 4,
      "penalty yards": 30,
      "punts": 6,
      "punt yards": 206,
      "punt returns": 0,
      "punt return yards": 0,
      "kickoff returns": 4,
      "kickoff return yards": 54,
      "interception returns": 0,
      "interception return yards": 0,
      "3rd down conversions": 5,
      "3rd down attempts": 16,
      "4th down conversions": 1,
      "4th down attempts": 3
    }
  },
  "MiamiFL vs Duke": {
    "stadium": "BrooksFieldatWallaceWadeStadium-Durham-NC",
    "MiamiFL": {
      "points": 48,
      "1st downs": 24,
      "rushing 1st downs": 13,
      "passing 1st downs": 10,
      "penalty 1st downs": 1,
      "rushing yards": 220,
      "rushing attempts": 42,
      "passing yards": 304,
      "passing attempts": 26,
      "passing completions": 17,
      "passing interceptions": 0,
      "total yards": 524,
      "total plays": 68,
      "fumbles": 3,
      "fumbles lost": 1,
      "penalties": 3,
      "penalty yards": 45,
      "punts": 2,
      "punt yards": 83,
      "punt returns": 3,
      "punt return yards": 13,
      "kickoff returns": 0,
      "kickoff return yards": 0,
      "interception returns": 1,
      "interception return yards": -3,
      "3rd down conversions": 4,
      "3rd down attempts": 10,
      "4th down conversions": 1,
      "4th down attempts": 1
    },
    "Duke": {
      "points": 0,
      "1st downs": 14,
      "rushing 1st downs": 8,
      "passing 1st downs": 5,
      "penalty 1st downs": 1,
      "rushing yards": 56,
      "rushing attempts": 33,
      "passing yards": 121,
      "passing attempts": 31,
      "passing completions": 25,
      "passing interceptions": 1,
      "total yards": 177,
      "total plays": 64,
      "fumbles": 4,
      "fumbles lost": 4,
      "penalties": 6,
      "penalty yards": 55,
      "punts": 7,
      "punt yards": 312,
      "punt returns": 0,
      "punt return yards": 0,
      "kickoff returns": 3,
      "kickoff return yards": 68,
      "interception returns": 0,
      "interception return yards": 0,
      "3rd down conversions": 5,
      "3rd down attempts": 15,
      "4th down conversions": 1,
      "4th down attempts": 2
    }
  },
  "FresnoState vs Nevada": {
    "stadium": "MackayStadium-Reno-NV",
    "FresnoState": {
      "points": 26,
      "1st downs": 30,
      "rushing 1st downs": 7,
      "passing 1st downs": 23,
      "penalty 1st downs": 0,
      "rushing yards": 114,
      "rushing attempts": 40,
      "passing yards": 485,
      "passing attempts": 65,
      "passing completions": 41,
      "passing interceptions": 0,
      "total yards": 599,
      "total plays": 105,
      "fumbles": 3,
      "fumbles lost": 2,
      "penalties": 4,
      "penalty yards": 33,
      "punts": 2,
      "punt yards": 72,
      "punt returns": 1,
      "punt return yards": 5,
      "kickoff returns": 3,
      "kickoff return yards": 61,
      "interception returns": 2,
      "interception return yards": 36,
      "3rd down conversions": 9,
      "3rd down attempts": 21,
      "4th down conversions": 3,
      "4th down attempts": 7
    },
    "Nevada": {
      "points": 37,
      "1st downs": 14,
      "rushing 1st downs": 3,
      "passing 1st downs": 10,
      "penalty 1st downs": 1,
      "rushing yards": 62,
      "rushing attempts": 22,
      "passing yards": 354,
      "passing attempts": 39,
      "passing completions": 23,
      "passing interceptions": 2,
      "total yards": 416,
      "total plays": 61,
      "fumbles": 2,
      "fumbles lost": 1,
      "penalties": 5,
      "penalty yards": 47,
      "punts": 5,
      "punt yards": 190,
      "punt returns": 1,
      "punt return yards": 4,
      "kickoff returns": 4,
      "kickoff return yards": 74,
      "interception returns": 0,
      "interception return yards": 0,
      "3rd down conversions": 6,
      "3rd down attempts": 14,
      "4th down conversions": 1,
      "4th down attempts": 1
    }
  },
  "Wyoming vs NewMexico": {
    "stadium": "DreamstyleStadium-Albuquerque-NM",
    "Wyoming": {
      "points": 16,
      "1st downs": 12,
      "rushing 1st downs": 9,
      "passing 1st downs": 2,
      "penalty 1st downs": 1,
      "rushing yards": 283,
      "rushing attempts": 38,
      "passing yards": 91,
      "passing attempts": 17,
      "passing completions": 5,
      "passing interceptions": 2,
      "total yards": 374,
      "total plays": 55,
      "fumbles": 1,
      "fumbles lost": 1,
      "penalties": 2,
      "penalty yards": 20,
      "punts": 4,
      "punt yards": 140,
      "punt returns": 0,
      "punt return yards": 0,
      "kickoff returns": 4,
      "kickoff return yards": 107,
      "interception returns": 1,
      "interception return yards": 0,
      "3rd down conversions": 1,
      "3rd down attempts": 11,
      "4th down conversions": 1,
      "4th down attempts": 3
    },
    "NewMexico": {
      "points": 17,
      "1st downs": 16,
      "rushing 1st downs": 11,
      "passing 1st downs": 4,
      "penalty 1st downs": 1,
      "rushing yards": 223,
      "rushing attempts": 50,
      "passing yards": 92,
      "passing attempts": 18,
      "passing completions": 11,
      "passing interceptions": 1,
      "total yards": 315,
      "total plays": 68,
      "fumbles": 1,
      "fumbles lost": 1,
      "penalties": 5,
      "penalty yards": 50,
      "punts": 6,
      "punt yards": 226,
      "punt returns": 0,
      "punt return yards": 0,
      "kickoff returns": 4,
      "kickoff return yards": 136,
      "interception returns": 2,
      "interception return yards": 5,
      "3rd down conversions": 5,
      "3rd down attempts": 15,
      "4th down conversions": 0,
      "4th down attempts": 1
    }
  },
  "OregonState vs Utah": {
    "stadium": "RiceEcclesStadium-SaltLakeCity-UT",
    "OregonState": {
      "points": 24,
      "1st downs": 22,
      "rushing 1st downs": 7,
      "passing 1st downs": 8,
      "penalty 1st downs": 7,
      "rushing yards": 133,
      "rushing attempts": 31,
      "passing yards": 202,
      "passing attempts": 38,
      "passing completions": 20,
      "passing interceptions": 1,
      "total yards": 335,
      "total plays": 69,
      "fumbles": 1,
      "fumbles lost": 0,
      "penalties": 5,
      "penalty yards": 35,
      "punts": 4,
      "punt yards": 187,
      "punt returns": 1,
      "punt return yards": 5,
      "kickoff returns": 6,
      "kickoff return yards": 131,
      "interception returns": 0,
      "interception return yards": 0,
      "3rd down conversions": 2,
      "3rd down attempts": 13,
      "4th down conversions": 1,
      "4th down attempts": 3
    },
    "Utah": {
      "points": 30,
      "1st downs": 21,
      "rushing 1st downs": 13,
      "passing 1st downs": 8,
      "penalty 1st downs": 0,
      "rushing yards": 229,
      "rushing attempts": 44,
      "passing yards": 174,
      "passing attempts": 27,
      "passing completions": 18,
      "passing interceptions": 0,
      "total yards": 403,
      "total plays": 71,
      "fumbles": 0,
      "fumbles lost": 0,
      "penalties": 11,
      "penalty yards": 96,
      "punts": 3,
      "punt yards": 131,
      "punt returns": 1,
      "punt return yards": 64,
      "kickoff returns": 0,
      "kickoff return yards": 0,
      "interception returns": 1,
      "interception return yards": 35,
      "3rd down conversions": 7,
      "3rd down attempts": 15,
      "4th down conversions": 1,
      "4th down attempts": 2
    }
  },
  "UCLA vs ArizonaState": {
    "stadium": "SunDevilStadium-Tempe-AZ",
    "UCLA": {
      "points": 25,
      "1st downs": 22,
      "rushing 1st downs": 10,
      "passing 1st downs": 8,
      "penalty 1st downs": 4,
      "rushing yards": 171,
      "rushing attempts": 39,
      "passing yards": 192,
      "passing attempts": 24,
      "passing completions": 18,
      "passing interceptions": 0,
      "total yards": 363,
      "total plays": 63,
      "fumbles": 0,
      "fumbles lost": 0,
      "penalties": 5,
      "penalty yards": 37,
      "punts": 4,
      "punt yards": 142,
      "punt returns": 0,
      "punt return yards": 0,
      "kickoff returns": 1,
      "kickoff return yards": 12,
      "interception returns": 1,
      "interception return yards": 21,
      "3rd down conversions": 5,
      "3rd down attempts": 13,
      "4th down conversions": 1,
      "4th down attempts": 1
    },
    "ArizonaState": {
      "points": 18,
      "1st downs": 25,
      "rushing 1st downs": 11,
      "passing 1st downs": 13,
      "penalty 1st downs": 1,
      "rushing yards": 165,
      "rushing attempts": 35,
      "passing yards": 277,
      "passing attempts": 36,
      "passing completions": 22,
      "passing interceptions": 1,
      "total yards": 442,
      "total plays": 71,
      "fumbles": 3,
      "fumbles lost": 1,
      "penalties": 12,
      "penalty yards": 83,
      "punts": 3,
      "punt yards": 138,
      "punt returns": 1,
      "punt return yards": 4,
      "kickoff returns": 5,
      "kickoff return yards": 137,
      "interception returns": 0,
      "interception return yards": 0,
      "3rd down conversions": 6,
      "3rd down attempts": 11,
      "4th down conversions": 0,
      "4th down attempts": 1
    }
  },
  "WesternKentucky vs Charlotte": {
    "stadium": "JerryRichardsonStadium-Charlotte-NC",
    "WesternKentucky": {
      "points": 37,
      "1st downs": 21,
      "rushing 1st downs": 12,
      "passing 1st downs": 8,
      "penalty 1st downs": 1,
      "rushing yards": 218,
      "rushing attempts": 37,
      "passing yards": 218,
      "passing attempts": 27,
      "passing completions": 18,
      "passing interceptions": 0,
      "total yards": 436,
      "total plays": 64,
      "fumbles": 2,
      "fumbles lost": 0,
      "penalties": 4,
      "penalty yards": 28,
      "punts": 3,
      "punt yards": 138,
      "punt returns": 1,
      "punt return yards": 5,
      "kickoff returns": 2,
      "kickoff return yards": 0,
      "interception returns": 0,
      "interception return yards": 0,
      "3rd down conversions": 6,
      "3rd down attempts": 13,
      "4th down conversions": 0,
      "4th down attempts": 1
    },
    "Charlotte": {
      "points": 19,
      "1st downs": 19,
      "rushing 1st downs": 8,
      "passing 1st downs": 10,
      "penalty 1st downs": 1,
      "rushing yards": 90,
      "rushing attempts": 33,
      "passing yards": 219,
      "passing attempts": 35,
      "passing completions": 15,
      "passing interceptions": 0,
      "total yards": 309,
      "total plays": 68,
      "fumbles": 1,
      "fumbles lost": 1,
      "penalties": 6,
      "penalty yards": 48,
      "punts": 6,
      "punt yards": 289,
      "punt returns": 1,
      "punt return yards": 8,
      "kickoff returns": 4,
      "kickoff return yards": 79,
      "interception returns": 0,
      "interception return yards": 0,
      "3rd down conversions": 3,
      "3rd down attempts": 14,
      "4th down conversions": 2,
      "4th down attempts": 4
    }
  },
  "WashingtonState vs USC": {
    "stadium": "UnitedAirlinesFieldatLAMemorialColiseum-LosAngeles-CA",
    "WashingtonState": {
      "points": 13,
      "1st downs": 20,
      "rushing 1st downs": 7,
      "passing 1st downs": 10,
      "penalty 1st downs": 3,
      "rushing yards": 73,
      "rushing attempts": 27,
      "passing yards": 190,
      "passing attempts": 39,
      "passing completions": 26,
      "passing interceptions": 2,
      "total yards": 263,
      "total plays": 66,
      "fumbles": 1,
      "fumbles lost": 1,
      "penalties": 3,
      "penalty yards": 15,
      "punts": 4,
      "punt yards": 153,
      "punt returns": 0,
      "punt return yards": 0,
      "kickoff returns": 2,
      "kickoff return yards": 25,
      "interception returns": 0,
      "interception return yards": 0,
      "3rd down conversions": 5,
      "3rd down attempts": 13,
      "4th down conversions": 2,
      "4th down attempts": 3
    },
    "USC": {
      "points": 38,
      "1st downs": 15,
      "rushing 1st downs": 0,
      "passing 1st downs": 15,
      "penalty 1st downs": 0,
      "rushing yards": 5,
      "rushing attempts": 20,
      "passing yards": 282,
      "passing attempts": 33,
      "passing completions": 26,
      "passing interceptions": 0,
      "total yards": 287,
      "total plays": 53,
      "fumbles": 2,
      "fumbles lost": 0,
      "penalties": 5,
      "penalty yards": 50,
      "punts": 2,
      "punt yards": 80,
      "punt returns": 2,
      "punt return yards": 13,
      "kickoff returns": 0,
      "kickoff return yards": 0,
      "interception returns": 2,
      "interception return yards": 36,
      "3rd down conversions": 6,
      "3rd down attempts": 11,
      "4th down conversions": 1,
      "4th down attempts": 1
    }
  }
}