{
  "games": [
    {"game": {
      "away": {
        "conferenceNames": {
          "conferenceDisplay": "Sun Belt Conference",
          "conferenceDivision": "fbs",
          "conferenceName": "Sun Belt",
          "conferenceSeo": "sun-belt"
        },
        "description": "(3-4)",
        "names": {
          "char6": "ULL",
          "full": "University of Louisiana at Lafayette",
          "seo": "la-lafayette",
          "short": "Louisiana"
        },
        "rank": "",
        "score": "3",
        "seed": "",
        "winner": false
      },
      "bracketId": "",
      "bracketRegion": "",
      "bracketRound": "",
      "contestClock": "0:00",
      "currentPeriod": "Final",
      "finalMessage": "Final",
      "gameID": "cb11f302-4346-4334-bc8b-ae2f792a6c3c",
      "gameState": "final",
      "home": {
        "conferenceNames": {
          "conferenceDisplay": "Sun Belt Conference",
          "conferenceDivision": "fbs",
          "conferenceName": "Sun Belt",
          "conferenceSeo": "sun-belt"
        },
        "description": "(4-2)",
        "names": {
          "char6": "ARK ST",
          "full": "Arkansas State University",
          "seo": "arkansas-st",
          "short": "Arkansas St."
        },
        "rank": "",
        "score": "47",
        "seed": "",
        "winner": true
      },
      "liveVideoEnabled": false,
      "network": "",
      "startDate": "10-19-2017",
      "startTime": "07:30PM ET",
      "startTimeEpoch": "1508455800",
      "title": "Arkansas St. Louisiana",
      "url": "/game/football/fbs/2017/10/19/la-lafayette-arkansas-st",
      "videoState": ""
    }},
    {"game": {
      "away": {
        "conferenceNames": {
          "conferenceDisplay": "American Athletic Conference",
          "conferenceDivision": "fbs",
          "conferenceName": "AAC",
          "conferenceSeo": "american-athletic"
        },
        "description": "(6-1)",
        "names": {
          "char6": "MEM",
          "full": "University of Memphis",
          "seo": "memphis",
          "short": "Memphis"
        },
        "rank": "25",
        "score": "42",
        "seed": "",
        "winner": true
      },
      "bracketId": "",
      "bracketRegion": "",
      "bracketRound": "",
      "contestClock": "0:00",
      "currentPeriod": "Final",
      "finalMessage": "Final",
      "gameID": "802eb576-dfa6-432b-bdf7-136f0c22ab2c",
      "gameState": "final",
      "home": {
        "conferenceNames": {
          "conferenceDisplay": "American Athletic Conference",
          "conferenceDivision": "fbs",
          "conferenceName": "AAC",
          "conferenceSeo": "american-athletic"
        },
        "description": "(4-3)",
        "names": {
          "char6": "HOU",
          "full": "University of Houston",
          "seo": "houston",
          "short": "Houston"
        },
        "rank": "",
        "score": "38",
        "seed": "",
        "winner": false
      },
      "liveVideoEnabled": false,
      "network": "",
      "startDate": "10-19-2017",
      "startTime": "08:00PM ET",
      "startTimeEpoch": "1508457600",
      "title": "Houston Memphis",
      "url": "/game/football/fbs/2017/10/19/memphis-houston",
      "videoState": ""
    }},
    {"game": {
      "away": {
        "conferenceNames": {
          "conferenceDisplay": "Conference USA",
          "conferenceDivision": "fbs",
          "conferenceName": "C-USA",
          "conferenceSeo": "conference-usa"
        },
        "description": "(5-2)",
        "names": {
          "char6": "W KY",
          "full": "Western Kentucky University",
          "seo": "western-ky",
          "short": "Western Ky."
        },
        "rank": "",
        "score": "35",
        "seed": "",
        "winner": true
      },
      "bracketId": "",
      "bracketRegion": "",
      "bracketRound": "",
      "contestClock": "0:00",
      "currentPeriod": "Final",
      "finalMessage": "Final",
      "gameID": "3b25eb0f-ca74-4ced-9e90-f4c1355feb5a",
      "gameState": "final",
      "home": {
        "conferenceNames": {
          "conferenceDisplay": "Conference USA",
          "conferenceDivision": "fbs",
          "conferenceName": "C-USA",
          "conferenceSeo": "conference-usa"
        },
        "description": "(2-5)",
        "names": {
          "char6": "ODU",
          "full": "Old Dominion University",
          "seo": "old-dominion",
          "short": "Old Dominion"
        },
        "rank": "",
        "score": "31",
        "seed": "",
        "winner": false
      },
      "liveVideoEnabled": false,
      "network": "",
      "startDate": "10-20-2017",
      "startTime": "06:00PM ET",
      "startTimeEpoch": "1508536800",
      "title": "Old Dominion Western Ky.",
      "url": "/game/football/fbs/2017/10/20/western-ky-old-dominion",
      "videoState": ""
    }},
    {"game": {
      "away": {
        "conferenceNames": {
          "conferenceDisplay": "Conference USA",
          "conferenceDivision": "fbs",
          "conferenceName": "C-USA",
          "conferenceSeo": "conference-usa"
        },
        "description": "(6-1)",
        "names": {
          "char6": "MARSH",
          "full": "Marshall University",
          "seo": "marshall",
          "short": "Marshall"
        },
        "rank": "",
        "score": "38",
        "seed": "",
        "winner": true
      },
      "bracketId": "",
      "bracketRegion": "",
      "bracketRound": "",
      "contestClock": "0:00",
      "currentPeriod": "Final",
      "finalMessage": "Final",
      "gameID": "68be5a36-4426-4d69-8a7c-8dbd176e2781",
      "gameState": "final",
      "home": {
        "conferenceNames": {
          "conferenceDisplay": "Conference USA",
          "conferenceDivision": "fbs",
          "conferenceName": "C-USA",
          "conferenceSeo": "conference-usa"
        },
        "description": "(3-5)",
        "names": {
          "char6": "MIDTEN",
          "full": "Middle Tennessee State University",
          "seo": "middle-tenn",
          "short": "Middle Tenn."
        },
        "rank": "",
        "score": "10",
        "seed": "",
        "winner": false
      },
      "liveVideoEnabled": false,
      "network": "",
      "startDate": "10-20-2017",
      "startTime": "07:00PM ET",
      "startTimeEpoch": "1508540400",
      "title": "Middle Tenn. Marshall",
      "url": "/game/football/fbs/2017/10/20/marshall-middle-tenn",
      "videoState": ""
    }},
    {"game": {
      "away": {
        "conferenceNames": {
          "conferenceDisplay": "Mountain West Conference",
          "conferenceDivision": "fbs",
          "conferenceName": "MWC",
          "conferenceSeo": "mountain-west"
        },
        "description": "(3-4)",
        "names": {
          "char6": "AIRFOR",
          "full": "U.S. Air Force Academy",
          "seo": "air-force",
          "short": "Air Force"
        },
        "rank": "",
        "score": "45",
        "seed": "",
        "winner": true
      },
      "bracketId": "",
      "bracketRegion": "",
      "bracketRound": "",
      "contestClock": "0:00",
      "currentPeriod": "Final",
      "finalMessage": "Final",
      "gameID": "d15183a9-19e4-4b35-b6ab-1dfbcbc8afe8",
      "gameState": "final",
      "home": {
        "conferenceNames": {
          "conferenceDisplay": "Mountain West Conference",
          "conferenceDivision": "fbs",
          "conferenceName": "MWC",
          "conferenceSeo": "mountain-west"
        },
        "description": "(1-7)",
        "names": {
          "char6": "NEVADA",
          "full": "University of Nevada",
          "seo": "nevada",
          "short": "Nevada"
        },
        "rank": "",
        "score": "42",
        "seed": "",
        "winner": false
      },
      "liveVideoEnabled": false,
      "network": "",
      "startDate": "10-20-2017",
      "startTime": "09:30PM ET",
      "startTimeEpoch": "1508549400",
      "title": "Nevada Air Force",
      "url": "/game/football/fbs/2017/10/20/air-force-nevada",
      "videoState": ""
    }},
    {"game": {
      "away": {
        "conferenceNames": {
          "conferenceDisplay": "Mountain West Conference",
          "conferenceDivision": "fbs",
          "conferenceName": "MWC",
          "conferenceSeo": "mountain-west"
        },
        "description": "(6-2)",
        "names": {
          "char6": "CO ST",
          "full": "Colorado State University",
          "seo": "colorado-st",
          "short": "Colorado St."
        },
        "rank": "",
        "score": "27",
        "seed": "",
        "winner": true
      },
      "bracketId": "",
      "bracketRegion": "",
      "bracketRound": "",
      "contestClock": "0:00",
      "currentPeriod": "Final",
      "finalMessage": "Final",
      "gameID": "0a6312fa-b797-4fa9-8104-aeb64d2bf677",
      "gameState": "final",
      "home": {
        "conferenceNames": {
          "conferenceDisplay": "Mountain West Conference",
          "conferenceDivision": "fbs",
          "conferenceName": "MWC",
          "conferenceSeo": "mountain-west"
        },
        "description": "(3-4)",
        "names": {
          "char6": "N MEX",
          "full": "University of New Mexico",
          "seo": "new-mexico",
          "short": "New Mexico"
        },
        "rank": "",
        "score": "24",
        "seed": "",
        "winner": false
      },
      "liveVideoEnabled": false,
      "network": "",
      "startDate": "10-20-2017",
      "startTime": "10:15PM ET",
      "startTimeEpoch": "1508552100",
      "title": "New Mexico Colorado St.",
      "url": "/game/football/fbs/2017/10/20/colorado-st-new-mexico",
      "videoState": ""
    }},
    {"game": {
      "away": {
        "conferenceNames": {
          "conferenceDisplay": "American Athletic Conference",
          "conferenceDivision": "fbs",
          "conferenceName": "AAC",
          "conferenceSeo": "american-athletic"
        },
        "description": "(2-6)",
        "names": {
          "char6": "TULSA",
          "full": "University of Tulsa",
          "seo": "tulsa",
          "short": "Tulsa"
        },
        "rank": "",
        "score": "14",
        "seed": "",
        "winner": false
      },
      "bracketId": "",
      "bracketRegion": "",
      "bracketRound": "",
      "contestClock": "0:00",
      "currentPeriod": "Final",
      "finalMessage": "Final",
      "gameID": "0a56b574-4c6e-4f3a-8f22-c5f733a29b6e",
      "gameState": "final",
      "home": {
        "conferenceNames": {
          "conferenceDisplay": "American Athletic Conference",
          "conferenceDivision": "fbs",
          "conferenceName": "AAC",
          "conferenceSeo": "american-athletic"
        },
        "description": "(3-4)",
        "names": {
          "char6": "UCONN",
          "full": "University of Connecticut",
          "seo": "uconn",
          "short": "UConn"
        },
        "rank": "",
        "score": "20",
        "seed": "",
        "winner": true
      },
      "liveVideoEnabled": false,
      "network": "",
      "startDate": "10-21-2017",
      "startTime": "12:00PM ET",
      "startTimeEpoch": "1508601600",
      "title": "UConn Tulsa",
      "url": "/game/football/fbs/2017/10/21/tulsa-uconn",
      "videoState": ""
    }},
    {"game": {
      "away": {
        "conferenceNames": {
          "conferenceDisplay": "Mid-American Conference",
          "conferenceDivision": "fbs",
          "conferenceName": "MAC",
          "conferenceSeo": "mid-american"
        },
        "description": "(4-4)",
        "names": {
          "char6": "AKRON",
          "full": "University of Akron",
          "seo": "akron",
          "short": "Akron"
        },
        "rank": "",
        "score": "21",
        "seed": "",
        "winner": false
      },
      "bracketId": "",
      "bracketRegion": "",
      "bracketRound": "",
      "contestClock": "0:00",
      "currentPeriod": "Final",
      "finalMessage": "Final",
      "gameID": "6e4be3ef-1fd6-4039-82ad-abdcc059502e",
      "gameState": "final",
      "home": {
        "conferenceNames": {
          "conferenceDisplay": "Mid-American Conference",
          "conferenceDivision": "fbs",
          "conferenceName": "MAC",
          "conferenceSeo": "mid-american"
        },
        "description": "(6-1)",
        "names": {
          "char6": "TOLEDO",
          "full": "University of Toledo",
          "seo": "toledo",
          "short": "Toledo"
        },
        "rank": "",
        "score": "48",
        "seed": "",
        "winner": true
      },
      "liveVideoEnabled": false,
      "network": "",
      "startDate": "10-21-2017",
      "startTime": "12:00PM ET",
      "startTimeEpoch": "1508601600",
      "title": "Toledo Akron",
      "url": "/game/football/fbs/2017/10/21/akron-toledo",
      "videoState": ""
    }},
    {"game": {
      "away": {
        "conferenceNames": {
          "conferenceDisplay": "Big 12 Conference",
          "conferenceDivision": "fbs",
          "conferenceName": "Big 12",
          "conferenceSeo": "big-12"
        },
        "description": "(6-1)",
        "names": {
          "char6": "OKLAST",
          "full": "Oklahoma State University",
          "seo": "oklahoma-st",
          "short": "Oklahoma St."
        },
        "rank": "10",
        "score": "13",
        "seed": "",
        "winner": true
      },
      "bracketId": "",
      "bracketRegion": "",
      "bracketRound": "",
      "contestClock": "",
      "currentPeriod": "Final (OT)",
      "finalMessage": "Final (OT)",
      "gameID": "9c75111f-417e-415e-b2b4-2608e0fc3363",
      "gameState": "final",
      "home": {
        "conferenceNames": {
          "conferenceDisplay": "Big 12 Conference",
          "conferenceDivision": "fbs",
          "conferenceName": "Big 12",
          "conferenceSeo": "big-12"
        },
        "description": "(3-4)",
        "names": {
          "char6": "TEXAS",
          "full": "University of Texas at Austin",
          "seo": "texas",
          "short": "Texas"
        },
        "rank": "",
        "score": "10",
        "seed": "",
        "winner": false
      },
      "liveVideoEnabled": false,
      "network": "",
      "startDate": "10-21-2017",
      "startTime": "12:00PM ET",
      "startTimeEpoch": "1508601600",
      "title": "Texas Oklahoma St.",
      "url": "/game/football/fbs/2017/10/21/oklahoma-st-texas",
      "videoState": ""
    }},
    {"game": {
      "away": {
        "conferenceNames": {
          "conferenceDisplay": "Atlantic Coast Conference",
          "conferenceDivision": "fbs",
          "conferenceName": "ACC",
          "conferenceSeo": "atlantic-coast"
        },
        "description": "(5-3)",
        "names": {
          "char6": "LOUIS",
          "full": "University of Louisville",
          "seo": "louisville",
          "short": "Louisville"
        },
        "rank": "",
        "score": "31",
        "seed": "",
        "winner": true
      },
      "bracketId": "",
      "bracketRegion": "",
      "bracketRound": "",
      "contestClock": "0:00",
      "currentPeriod": "Final",
      "finalMessage": "Final",
      "gameID": "bc5af75b-c414-4baf-980e-ba94b258ec6f",
      "gameState": "final",
      "home": {
        "conferenceNames": {
          "conferenceDisplay": "Atlantic Coast Conference",
          "conferenceDivision": "fbs",
          "conferenceName": "ACC",
          "conferenceSeo": "atlantic-coast"
        },
        "description": "(2-4)",
        "names": {
          "char6": "FSU",
          "full": "Florida State University",
          "seo": "florida-st",
          "short": "Florida St."
        },
        "rank": "",
        "score": "28",
        "seed": "",
        "winner": false
      },
      "liveVideoEnabled": false,
      "network": "",
      "startDate": "10-21-2017",
      "startTime": "12:00PM ET",
      "startTimeEpoch": "1508601600",
      "title": "Florida St. Louisville",
      "url": "/game/football/fbs/2017/10/21/louisville-florida-st",
      "videoState": ""
    }},
    {"game": {
      "away": {
        "conferenceNames": {
          "conferenceDisplay": "Big 12 Conference",
          "conferenceDivision": "fbs",
          "conferenceName": "Big 12",
          "conferenceSeo": "big-12"
        },
        "description": "(5-2)",
        "names": {
          "char6": "IOWAST",
          "full": "Iowa State University",
          "seo": "iowa-st",
          "short": "Iowa St."
        },
        "rank": "",
        "score": "31",
        "seed": "",
        "winner": true
      },
      "bracketId": "",
      "bracketRegion": "",
      "bracketRound": "",
      "contestClock": "0:00",
      "currentPeriod": "Final",
      "finalMessage": "Final",
      "gameID": "1a3b2f18-68f4-46c1-bf48-64e5aa32c69a",
      "gameState": "final",
      "home": {
        "conferenceNames": {
          "conferenceDisplay": "Big 12 Conference",
          "conferenceDivision": "fbs",
          "conferenceName": "Big 12",
          "conferenceSeo": "big-12"
        },
        "description": "(4-3)",
        "names": {
          "char6": "TXTECH",
          "full": "Texas Tech University",
          "seo": "texas-tech",
          "short": "Texas Tech"
        },
        "rank": "",
        "score": "13",
        "seed": "",
        "winner": false
      },
      "liveVideoEnabled": false,
      "network": "",
      "startDate": "10-21-2017",
      "startTime": "12:00PM ET",
      "startTimeEpoch": "1508601600",
      "title": "Texas Tech Iowa St.",
      "url": "/game/football/fbs/2017/10/21/iowa-st-texas-tech",
      "videoState": ""
    }},
    {"game": {
      "away": {
        "conferenceNames": {
          "conferenceDisplay": "Big Ten Conference",
          "conferenceDivision": "fbs",
          "conferenceName": "Big Ten",
          "conferenceSeo": "big-ten"
        },
        "description": "(4-3)",
        "names": {
          "char6": "IOWA",
          "full": "University of Iowa",
          "seo": "iowa",
          "short": "Iowa"
        },
        "rank": "",
        "score": "10",
        "seed": "",
        "winner": false
      },
      "bracketId": "",
      "bracketRegion": "",
      "bracketRound": "",
      "contestClock": "",
      "currentPeriod": "Final (OT)",
      "finalMessage": "Final (OT)",
      "gameID": "7f4dcf47-9d9a-4038-a6f0-d32aafa84c87",
      "gameState": "final",
      "home": {
        "conferenceNames": {
          "conferenceDisplay": "Big Ten Conference",
          "conferenceDivision": "fbs",
          "conferenceName": "Big Ten",
          "conferenceSeo": "big-ten"
        },
        "description": "(4-3)",
        "names": {
          "char6": "NWSTRN",
          "full": "Northwestern University",
          "seo": "northwestern",
          "short": "Northwestern"
        },
        "rank": "",
        "score": "17",
        "seed": "",
        "winner": true
      },
      "liveVideoEnabled": false,
      "network": "",
      "startDate": "10-21-2017",
      "startTime": "12:00PM ET",
      "startTimeEpoch": "1508601600",
      "title": "Northwestern Iowa",
      "url": "/game/football/fbs/2017/10/21/iowa-northwestern",
      "videoState": ""
    }},
    {"game": {
      "away": {
        "conferenceNames": {
          "conferenceDisplay": "Big Ten Conference",
          "conferenceDivision": "fbs",
          "conferenceName": "Big Ten",
          "conferenceSeo": "big-ten"
        },
        "description": "(3-4)",
        "names": {
          "char6": "MD",
          "full": "University of Maryland, College Park",
          "seo": "maryland",
          "short": "Maryland"
        },
        "rank": "",
        "score": "13",
        "seed": "",
        "winner": false
      },
      "bracketId": "",
      "bracketRegion": "",
      "bracketRound": "",
      "contestClock": "0:00",
      "currentPeriod": "Final",
      "finalMessage": "Final",
      "gameID": "1c449c19-d7dd-4f49-9d9d-5d6d490b043b",
      "gameState": "final",
      "home": {
        "conferenceNames": {
          "conferenceDisplay": "Big Ten Conference",
          "conferenceDivision": "fbs",
          "conferenceName": "Big Ten",
          "conferenceSeo": "big-ten"
        },
        "description": "(7-0)",
        "names": {
          "char6": "WISC",
          "full": "University of Wisconsin, Madison",
          "seo": "wisconsin",
          "short": "Wisconsin"
        },
        "rank": "5",
        "score": "38",
        "seed": "",
        "winner": true
      },
      "liveVideoEnabled": false,
      "network": "",
      "startDate": "10-21-2017",
      "startTime": "12:00PM ET",
      "startTimeEpoch": "1508601600",
      "title": "Wisconsin Maryland",
      "url": "/game/football/fbs/2017/10/21/maryland-wisconsin",
      "videoState": ""
    }},
    {"game": {
      "away": {
        "conferenceNames": {
          "conferenceDisplay": "American Athletic Conference",
          "conferenceDivision": "fbs",
          "conferenceName": "AAC",
          "conferenceSeo": "american-athletic"
        },
        "description": "(3-5)",
        "names": {
          "char6": "TEMPLE",
          "full": "Temple University",
          "seo": "temple",
          "short": "Temple"
        },
        "rank": "",
        "score": "28",
        "seed": "",
        "winner": false
      },
      "bracketId": "",
      "bracketRegion": "",
      "bracketRound": "",
      "contestClock": "",
      "currentPeriod": "Final (OT)",
      "finalMessage": "Final (OT)",
      "gameID": "404b94f2-1f99-494f-abae-3496e762e45d",
      "gameState": "final",
      "home": {
        "conferenceNames": {
          "conferenceDisplay": "FBS Independent",
          "conferenceDivision": "fbs",
          "conferenceName": "IND",
          "conferenceSeo": "fbs-independent"
        },
        "description": "(6-2)",
        "names": {
          "char6": "ARMY",
          "full": "U.S. Military Academy",
          "seo": "army",
          "short": "Army"
        },
        "rank": "",
        "score": "31",
        "seed": "",
        "winner": true
      },
      "liveVideoEnabled": false,
      "network": "",
      "startDate": "10-21-2017",
      "startTime": "12:00PM ET",
      "startTimeEpoch": "1508601600",
      "title": "Army Temple",
      "url": "/game/football/fbs/2017/10/21/temple-army",
      "videoState": ""
    }},
    {"game": {
      "away": {
        "conferenceNames": {
          "conferenceDisplay": "Big Ten Conference",
          "conferenceDivision": "fbs",
          "conferenceName": "Big Ten",
          "conferenceSeo": "big-ten"
        },
        "description": "(3-4)",
        "names": {
          "char6": "PURDUE",
          "full": "Purdue University",
          "seo": "purdue",
          "short": "Purdue"
        },
        "rank": "",
        "score": "12",
        "seed": "",
        "winner": false
      },
      "bracketId": "",
      "bracketRegion": "",
      "bracketRound": "",
      "contestClock": "0:00",
      "currentPeriod": "Final",
      "finalMessage": "Final",
      "gameID": "71a4bc09-b1f5-4911-bd7d-c999247ae136",
      "gameState": "final",
      "home": {
        "conferenceNames": {
          "conferenceDisplay": "Big Ten Conference",
          "conferenceDivision": "fbs",
          "conferenceName": "Big Ten",
          "conferenceSeo": "big-ten"
        },
        "description": "(3-4)",
        "names": {
          "char6": "RUTGER",
          "full": "Rutgers, State Univ of New Jersey, New Brunswick",
          "seo": "rutgers",
          "short": "Rutgers"
        },
        "rank": "",
        "score": "14",
        "seed": "",
        "winner": true
      },
      "liveVideoEnabled": false,
      "network": "",
      "startDate": "10-21-2017",
      "startTime": "12:00PM ET",
      "startTimeEpoch": "1508601600",
      "title": "Rutgers Purdue",
      "url": "/game/football/fbs/2017/10/21/purdue-rutgers",
      "videoState": ""
    }},
    {"game": {
      "away": {
        "conferenceNames": {
          "conferenceDisplay": "Big Sky Conference",
          "conferenceDivision": "fcs",
          "conferenceName": "Big Sky",
          "conferenceSeo": "big-sky"
        },
        "description": "(2-5)",
        "names": {
          "char6": "IDAHO",
          "full": "University of Idaho",
          "seo": "idaho",
          "short": "Idaho"
        },
        "rank": "",
        "score": "21",
        "seed": "",
        "winner": false
      },
      "bracketId": "",
      "bracketRegion": "",
      "bracketRound": "",
      "contestClock": "0:00",
      "currentPeriod": "Final",
      "finalMessage": "Final",
      "gameID": "eb0f29ea-d260-4a5b-9689-3f9652ca98a1",
      "gameState": "final",
      "home": {
        "conferenceNames": {
          "conferenceDisplay": "Southeastern Conference",
          "conferenceDivision": "fbs",
          "conferenceName": "SEC",
          "conferenceSeo": "southeastern"
        },
        "description": "(2-5)",
        "names": {
          "char6": "MIZZOU",
          "full": "University of Missouri, Columbia",
          "seo": "missouri",
          "short": "Missouri"
        },
        "rank": "",
        "score": "68",
        "seed": "",
        "winner": true
      },
      "liveVideoEnabled": false,
      "network": "",
      "startDate": "10-21-2017",
      "startTime": "12:00PM ET",
      "startTimeEpoch": "1508601600",
      "title": "Missouri Idaho",
      "url": "/game/football/fbs/2017/10/21/idaho-missouri",
      "videoState": ""
    }},
    {"game": {
      "away": {
        "conferenceNames": {
          "conferenceDisplay": "Atlantic Coast Conference",
          "conferenceDivision": "fbs",
          "conferenceName": "ACC",
          "conferenceSeo": "atlantic-coast"
        },
        "description": "(3-5)",
        "names": {
          "char6": "PITT",
          "full": "University of Pittsburgh",
          "seo": "pittsburgh",
          "short": "Pittsburgh"
        },
        "rank": "",
        "score": "24",
        "seed": "",
        "winner": true
      },
      "bracketId": "",
      "bracketRegion": "",
      "bracketRound": "",
      "contestClock": "0:00",
      "currentPeriod": "Final",
      "finalMessage": "Final",
      "gameID": "7e4cccd6-13ad-413f-9dc0-5d36142a0fc0",
      "gameState": "final",
      "home": {
        "conferenceNames": {
          "conferenceDisplay": "Atlantic Coast Conference",
          "conferenceDivision": "fbs",
          "conferenceName": "ACC",
          "conferenceSeo": "atlantic-coast"
        },
        "description": "(4-4)",
        "names": {
          "char6": "DUKE",
          "full": "Duke University",
          "seo": "duke",
          "short": "Duke"
        },
        "rank": "",
        "score": "17",
        "seed": "",
        "winner": false
      },
      "liveVideoEnabled": false,
      "network": "",
      "startDate": "10-21-2017",
      "startTime": "12:20PM ET",
      "startTimeEpoch": "1508602800",
      "title": "Duke Pittsburgh",
      "url": "/game/football/fbs/2017/10/21/pittsburgh-duke",
      "videoState": ""
    }},
    {"game": {
      "away": {
        "conferenceNames": {
          "conferenceDisplay": "Atlantic Coast Conference",
          "conferenceDivision": "fbs",
          "conferenceName": "ACC",
          "conferenceSeo": "atlantic-coast"
        },
        "description": "(4-4)",
        "names": {
          "char6": "BC",
          "full": "Boston College",
          "seo": "boston-college",
          "short": "Boston College"
        },
        "rank": "",
        "score": "41",
        "seed": "",
        "winner": true
      },
      "bracketId": "",
      "bracketRegion": "",
      "bracketRound": "",
      "contestClock": "0:00",
      "currentPeriod": "Final",
      "finalMessage": "Final",
      "gameID": "241612fc-e8a8-4213-a5ea-8570372f8f8e",
      "gameState": "final",
      "home": {
        "conferenceNames": {
          "conferenceDisplay": "Atlantic Coast Conference",
          "conferenceDivision": "fbs",
          "conferenceName": "ACC",
          "conferenceSeo": "atlantic-coast"
        },
        "description": "(5-2)",
        "names": {
          "char6": "UVA",
          "full": "University of Virginia",
          "seo": "virginia",
          "short": "Virginia"
        },
        "rank": "",
        "score": "10",
        "seed": "",
        "winner": false
      },
      "liveVideoEnabled": false,
      "network": "",
      "startDate": "10-21-2017",
      "startTime": "12:30PM ET",
      "startTimeEpoch": "1508603400",
      "title": "Virginia Boston College",
      "url": "/game/football/fbs/2017/10/21/boston-college-virginia",
      "videoState": ""
    }},
    {"game": {
      "away": {
        "conferenceNames": {
          "conferenceDisplay": "Mid-American Conference",
          "conferenceDivision": "fbs",
          "conferenceName": "MAC",
          "conferenceSeo": "mid-american"
        },
        "description": "(2-6)",
        "names": {
          "char6": "KENT",
          "full": "Kent State University",
          "seo": "kent-st",
          "short": "Kent St."
        },
        "rank": "",
        "score": "3",
        "seed": "",
        "winner": false
      },
      "bracketId": "",
      "bracketRegion": "",
      "bracketRound": "",
      "contestClock": "0:00",
      "currentPeriod": "Final",
      "finalMessage": "Final",
      "gameID": "f0f70270-786e-4ffe-b885-5555c95899e1",
      "gameState": "final",
      "home": {
        "conferenceNames": {
          "conferenceDisplay": "Mid-American Conference",
          "conferenceDivision": "fbs",
          "conferenceName": "MAC",
          "conferenceSeo": "mid-american"
        },
        "description": "(6-2)",
        "names": {
          "char6": "OHIO",
          "full": "Ohio University",
          "seo": "ohio",
          "short": "Ohio"
        },
        "rank": "",
        "score": "48",
        "seed": "",
        "winner": true
      },
      "liveVideoEnabled": false,
      "network": "",
      "startDate": "10-21-2017",
      "startTime": "02:00PM ET",
      "startTimeEpoch": "1508608800",
      "title": "Ohio Kent St.",
      "url": "/game/football/fbs/2017/10/21/kent-st-ohio",
      "videoState": ""
    }},
    {"game": {
      "away": {
        "conferenceNames": {
          "conferenceDisplay": "Mid-American Conference",
          "conferenceDivision": "fbs",
          "conferenceName": "MAC",
          "conferenceSeo": "mid-american"
        },
        "description": "(5-2)",
        "names": {
          "char6": "NIU",
          "full": "Northern Illinois University",
          "seo": "northern-ill",
          "short": "Northern Ill."
        },
        "rank": "",
        "score": "48",
        "seed": "",
        "winner": true
      },
      "bracketId": "",
      "bracketRegion": "",
      "bracketRound": "",
      "contestClock": "0:00",
      "currentPeriod": "Final",
      "finalMessage": "Final",
      "gameID": "ececf782-e890-461e-94f8-6c5df83de98a",
      "gameState": "final",
      "home": {
        "conferenceNames": {
          "conferenceDisplay": "Mid-American Conference",
          "conferenceDivision": "fbs",
          "conferenceName": "MAC",
          "conferenceSeo": "mid-american"
        },
        "description": "(1-7)",
        "names": {
          "char6": "BGSU",
          "full": "Bowling Green State University",
          "seo": "bowling-green",
          "short": "Bowling Green"
        },
        "rank": "",
        "score": "17",
        "seed": "",
        "winner": false
      },
      "liveVideoEnabled": false,
      "network": "",
      "startDate": "10-21-2017",
      "startTime": "02:00PM ET",
      "startTimeEpoch": "1508608800",
      "title": "Bowling Green Northern Ill.",
      "url": "/game/football/fbs/2017/10/21/northern-ill-bowling-green",
      "videoState": ""
    }},
    {"game": {
      "away": {
        "conferenceNames": {
          "conferenceDisplay": "Mid-American Conference",
          "conferenceDivision": "fbs",
          "conferenceName": "MAC",
          "conferenceSeo": "mid-american"
        },
        "description": "(5-3)",
        "names": {
          "char6": "W MICH",
          "full": "Western Michigan University",
          "seo": "western-mich",
          "short": "Western Mich."
        },
        "rank": "",
        "score": "20",
        "seed": "",
        "winner": true
      },
      "bracketId": "",
      "bracketRegion": "",
      "bracketRound": "",
      "contestClock": "",
      "currentPeriod": "Final (OT)",
      "finalMessage": "Final (OT)",
      "gameID": "97781192-c023-4fb0-9098-f2ff449a933b",
      "gameState": "final",
      "home": {
        "conferenceNames": {
          "conferenceDisplay": "Mid-American Conference",
          "conferenceDivision": "fbs",
          "conferenceName": "MAC",
          "conferenceSeo": "mid-american"
        },
        "description": "(2-5)",
        "names": {
          "char6": "E MICH",
          "full": "Eastern Michigan University",
          "seo": "eastern-mich",
          "short": "Eastern Mich."
        },
        "rank": "",
        "score": "17",
        "seed": "",
        "winner": false
      },
      "liveVideoEnabled": false,
      "network": "",
      "startDate": "10-21-2017",
      "startTime": "02:00PM ET",
      "startTimeEpoch": "1508608800",
      "title": "Eastern Mich. Western Mich.",
      "url": "/game/football/fbs/2017/10/21/western-mich-eastern-mich",
      "videoState": ""
    }},
    {"game": {
      "away": {
        "conferenceNames": {
          "conferenceDisplay": "Sun Belt Conference",
          "conferenceDivision": "fbs",
          "conferenceName": "Sun Belt",
          "conferenceSeo": "sun-belt"
        },
        "description": "(5-2)",
        "names": {
          "char6": "TROY",
          "full": "Troy University",
          "seo": "troy",
          "short": "Troy"
        },
        "rank": "",
        "score": "34",
        "seed": "",
        "winner": true
      },
      "bracketId": "",
      "bracketRegion": "",
      "bracketRound": "",
      "contestClock": "0:00",
      "currentPeriod": "Final",
      "finalMessage": "Final",
      "gameID": "feb95334-aa22-467a-89d4-af0c85545bac",
      "gameState": "final",
      "home": {
        "conferenceNames": {
          "conferenceDisplay": "Sun Belt Conference",
          "conferenceDivision": "fbs",
          "conferenceName": "Sun Belt",
          "conferenceSeo": "sun-belt"
        },
        "description": "(3-3)",
        "names": {
          "char6": "GA ST",
          "full": "Georgia State University",
          "seo": "georgia-st",
          "short": "Georgia St."
        },
        "rank": "",
        "score": "10",
        "seed": "",
        "winner": false
      },
      "liveVideoEnabled": false,
      "network": "",
      "startDate": "10-21-2017",
      "startTime": "02:00PM ET",
      "startTimeEpoch": "1508608800",
      "title": "Georgia St. Troy",
      "url": "/game/football/fbs/2017/10/21/troy-georgia-st",
      "videoState": ""
    }},
    {"game": {
      "away": {
        "conferenceNames": {
          "conferenceDisplay": "Mid-American Conference",
          "conferenceDivision": "fbs",
          "conferenceName": "MAC",
          "conferenceSeo": "mid-american"
        },
        "description": "(3-5)",
        "names": {
          "char6": "BUFF",
          "full": "University at Buffalo, the State University of New York",
          "seo": "buffalo",
          "short": "Buffalo"
        },
        "rank": "",
        "score": "14",
        "seed": "",
        "winner": false
      },
      "bracketId": "",
      "bracketRegion": "",
      "bracketRound": "",
      "contestClock": "0:00",
      "currentPeriod": "Final",
      "finalMessage": "Final",
      "gameID": "c5fb5755-fee9-40b2-b20d-3603bc7779c2",
      "gameState": "final",
      "home": {
        "conferenceNames": {
          "conferenceDisplay": "Mid-American Conference",
          "conferenceDivision": "fbs",
          "conferenceName": "MAC",
          "conferenceSeo": "mid-american"
        },
        "description": "(3-5)",
        "names": {
          "char6": "MIA OH",
          "full": "Miami University (Ohio)",
          "seo": "miami-oh",
          "short": "Miami (OH)"
        },
        "rank": "",
        "score": "24",
        "seed": "",
        "winner": true
      },
      "liveVideoEnabled": false,
      "network": "",
      "startDate": "10-21-2017",
      "startTime": "02:30PM ET",
      "startTimeEpoch": "1508610600",
      "title": "Miami (OH) Buffalo",
      "url": "/game/football/fbs/2017/10/21/buffalo-miami-oh",
      "videoState": ""
    }},
    {"game": {
      "away": {
        "conferenceNames": {
          "conferenceDisplay": "Mid-American Conference",
          "conferenceDivision": "fbs",
          "conferenceName": "MAC",
          "conferenceSeo": "mid-american"
        },
        "description": "(4-4)",
        "names": {
          "char6": "C MICH",
          "full": "Central Michigan University",
          "seo": "central-mich",
          "short": "Central Mich."
        },
        "rank": "",
        "score": "56",
        "seed": "",
        "winner": true
      },
      "bracketId": "",
      "bracketRegion": "",
      "bracketRound": "",
      "contestClock": "0:00",
      "currentPeriod": "Final",
      "finalMessage": "Final",
      "gameID": "44f804ce-7e11-43f3-be08-1b5e050a2eed",
      "gameState": "final",
      "home": {
        "conferenceNames": {
          "conferenceDisplay": "Mid-American Conference",
          "conferenceDivision": "fbs",
          "conferenceName": "MAC",
          "conferenceSeo": "mid-american"
        },
        "description": "(2-5)",
        "names": {
          "char6": "BALLST",
          "full": "Ball State University",
          "seo": "ball-st",
          "short": "Ball St."
        },
        "rank": "",
        "score": "9",
        "seed": "",
        "winner": false
      },
      "liveVideoEnabled": false,
      "network": "",
      "startDate": "10-21-2017",
      "startTime": "03:00PM ET",
      "startTimeEpoch": "1508612400",
      "title": "Ball St. Central Mich.",
      "url": "/game/football/fbs/2017/10/21/central-mich-ball-st",
      "videoState": ""
    }},
    {"game": {
      "away": {
        "conferenceNames": {
          "conferenceDisplay": "Atlantic Coast Conference",
          "conferenceDivision": "fbs",
          "conferenceName": "ACC",
          "conferenceSeo": "atlantic-coast"
        },
        "description": "(1-7)",
        "names": {
          "char6": "UNC",
          "full": "University of North Carolina, Chapel Hill",
          "seo": "north-carolina",
          "short": "North Carolina"
        },
        "rank": "",
        "score": "7",
        "seed": "",
        "winner": false
      },
      "bracketId": "",
      "bracketRegion": "",
      "bracketRound": "",
      "contestClock": "0:00",
      "currentPeriod": "Final",
      "finalMessage": "Final",
      "gameID": "7f4df119-33a0-4cb9-be65-3cc0639e1ba2",
      "gameState": "final",
      "home": {
        "conferenceNames": {
          "conferenceDisplay": "Atlantic Coast Conference",
          "conferenceDivision": "fbs",
          "conferenceName": "ACC",
          "conferenceSeo": "atlantic-coast"
        },
        "description": "(6-1)",
        "names": {
          "char6": "VATECH",
          "full": "Virginia Polytechnic Institute & State University",
          "seo": "virginia-tech",
          "short": "Virginia Tech"
        },
        "rank": "14",
        "score": "59",
        "seed": "",
        "winner": true
      },
      "liveVideoEnabled": false,
      "network": "",
      "startDate": "10-21-2017",
      "startTime": "03:30PM ET",
      "startTimeEpoch": "1508614200",
      "title": "Virginia Tech North Carolina",
      "url": "/game/football/fbs/2017/10/21/north-carolina-virginia-tech",
      "videoState": ""
    }},
    {"game": {
      "away": {
        "conferenceNames": {
          "conferenceDisplay": "Atlantic Coast Conference",
          "conferenceDivision": "fbs",
          "conferenceName": "ACC",
          "conferenceSeo": "atlantic-coast"
        },
        "description": "(4-4)",
        "names": {
          "char6": "SYR",
          "full": "Syracuse University",
          "seo": "syracuse",
          "short": "Syracuse"
        },
        "rank": "",
        "score": "19",
        "seed": "",
        "winner": false
      },
      "bracketId": "",
      "bracketRegion": "",
      "bracketRound": "",
      "contestClock": "0:00",
      "currentPeriod": "Final",
      "finalMessage": "Final",
      "gameID": "c3582c7e-5327-4c5d-906b-cee1a91ce58c",
      "gameState": "final",
      "home": {
        "conferenceNames": {
          "conferenceDisplay": "Atlantic Coast Conference",
          "conferenceDivision": "fbs",
          "conferenceName": "ACC",
          "conferenceSeo": "atlantic-coast"
        },
        "description": "(6-0)",
        "names": {
          "char6": "MIAMI",
          "full": "University of Miami (Florida)",
          "seo": "miami-fl",
          "short": "Miami (FL)"
        },
        "rank": "8",
        "score": "27",
        "seed": "",
        "winner": true
      },
      "liveVideoEnabled": false,
      "network": "",
      "startDate": "10-21-2017",
      "startTime": "03:30PM ET",
      "startTimeEpoch": "1508614200",
      "title": "Miami (FL) Syracuse",
      "url": "/game/football/fbs/2017/10/21/syracuse-miami-fl",
      "videoState": ""
    }},
    {"game": {
      "away": {
        "conferenceNames": {
          "conferenceDisplay": "Southeastern Conference",
          "conferenceDivision": "fbs",
          "conferenceName": "SEC",
          "conferenceSeo": "southeastern"
        },
        "description": "(3-4)",
        "names": {
          "char6": "TENN",
          "full": "University of Tennessee, Knoxville",
          "seo": "tennessee",
          "short": "Tennessee"
        },
        "rank": "",
        "score": "7",
        "seed": "",
        "winner": false
      },
      "bracketId": "",
      "bracketRegion": "",
      "bracketRound": "",
      "contestClock": "0:00",
      "currentPeriod": "Final",
      "finalMessage": "Final",
      "gameID": "31738361-3272-44eb-a7a4-892653ed2be7",
      "gameState": "final",
      "home": {
        "conferenceNames": {
          "conferenceDisplay": "Southeastern Conference",
          "conferenceDivision": "fbs",
          "conferenceName": "SEC",
          "conferenceSeo": "southeastern"
        },
        "description": "(8-0)",
        "names": {
          "char6": "ALA",
          "full": "University of Alabama",
          "seo": "alabama",
          "short": "Alabama"
        },
        "rank": "1",
        "score": "45",
        "seed": "",
        "winner": true
      },
      "liveVideoEnabled": false,
      "network": "",
      "startDate": "10-21-2017",
      "startTime": "03:30PM ET",
      "startTimeEpoch": "1508614200",
      "title": "Alabama Tennessee",
      "url": "/game/football/fbs/2017/10/21/tennessee-alabama",
      "videoState": ""
    }},
    {"game": {
      "away": {
        "conferenceNames": {
          "conferenceDisplay": "Big Ten Conference",
          "conferenceDivision": "fbs",
          "conferenceName": "Big Ten",
          "conferenceSeo": "big-ten"
        },
        "description": "(3-4)",
        "names": {
          "char6": "IND",
          "full": "Indiana University, Bloomington",
          "seo": "indiana",
          "short": "Indiana"
        },
        "rank": "",
        "score": "9",
        "seed": "",
        "winner": false
      },
      "bracketId": "",
      "bracketRegion": "",
      "bracketRound": "",
      "contestClock": "0:00",
      "currentPeriod": "Final",
      "finalMessage": "Final",
      "gameID": "dd7c674f-6a4d-44e3-bff7-3bc1d0867e85",
      "gameState": "final",
      "home": {
        "conferenceNames": {
          "conferenceDisplay": "Big Ten Conference",
          "conferenceDivision": "fbs",
          "conferenceName": "Big Ten",
          "conferenceSeo": "big-ten"
        },
        "description": "(6-1)",
        "names": {
          "char6": "MICHST",
          "full": "Michigan State University",
          "seo": "michigan-st",
          "short": "Michigan St."
        },
        "rank": "18",
        "score": "17",
        "seed": "",
        "winner": true
      },
      "liveVideoEnabled": false,
      "network": "",
      "startDate": "10-21-2017",
      "startTime": "03:30PM ET",
      "startTimeEpoch": "1508614200",
      "title": "Michigan St. Indiana",
      "url": "/game/football/fbs/2017/10/21/indiana-michigan-st",
      "videoState": ""
    }},
    {"game": {
      "away": {
        "conferenceNames": {
          "conferenceDisplay": "Pac-12 Conference",
          "conferenceDivision": "fbs",
          "conferenceName": "Pac-12",
          "conferenceSeo": "pac-12"
        },
        "description": "(4-3)",
        "names": {
          "char6": "AZ ST",
          "full": "Arizona State University",
          "seo": "arizona-st",
          "short": "Arizona St."
        },
        "rank": "",
        "score": "30",
        "seed": "",
        "winner": true
      },
      "bracketId": "",
      "bracketRegion": "",
      "bracketRound": "",
      "contestClock": "0:00",
      "currentPeriod": "Final",
      "finalMessage": "Final",
      "gameID": "8f323522-a9e9-417f-a9bd-79d68e4f4855",
      "gameState": "final",
      "home": {
        "conferenceNames": {
          "conferenceDisplay": "Pac-12 Conference",
          "conferenceDivision": "fbs",
          "conferenceName": "Pac-12",
          "conferenceSeo": "pac-12"
        },
        "description": "(4-3)",
        "names": {
          "char6": "UTAH",
          "full": "University of Utah",
          "seo": "utah",
          "short": "Utah"
        },
        "rank": "",
        "score": "10",
        "seed": "",
        "winner": false
      },
      "liveVideoEnabled": false,
      "network": "",
      "startDate": "10-21-2017",
      "startTime": "03:30PM ET",
      "startTimeEpoch": "1508614200",
      "title": "Utah Arizona St.",
      "url": "/game/football/fbs/2017/10/21/arizona-st-utah",
      "videoState": ""
    }},
    {"game": {
      "away": {
        "conferenceNames": {
          "conferenceDisplay": "Sun Belt Conference",
          "conferenceDivision": "fbs",
          "conferenceName": "Sun Belt",
          "conferenceSeo": "sun-belt"
        },
        "description": "(0-6)",
        "names": {
          "char6": "GA SOU",
          "full": "Georgia Southern University",
          "seo": "ga-southern",
          "short": "Ga. Southern"
        },
        "rank": "",
        "score": "20",
        "seed": "",
        "winner": false
      },
      "bracketId": "",
      "bracketRegion": "",
      "bracketRound": "",
      "contestClock": "0:00",
      "currentPeriod": "Final",
      "finalMessage": "Final",
      "gameID": "cf57c011-3b9d-4a4e-9d4b-fd67e1fb74bf",
      "gameState": "final",
      "home": {
        "conferenceNames": {
          "conferenceDisplay": "FBS Independent",
          "conferenceDivision": "fbs",
          "conferenceName": "IND",
          "conferenceSeo": "fbs-independent"
        },
        "description": "(1-6)",
        "names": {
          "char6": "UMASS",
          "full": "University of Massachusetts, Amherst",
          "seo": "massachusetts",
          "short": "Massachusetts"
        },
        "rank": "",
        "score": "55",
        "seed": "",
        "winner": true
      },
      "liveVideoEnabled": false,
      "network": "",
      "startDate": "10-21-2017",
      "startTime": "03:30PM ET",
      "startTimeEpoch": "1508614200",
      "title": "Massachusetts Ga. Southern",
      "url": "/game/football/fbs/2017/10/21/ga-southern-massachusetts",
      "videoState": ""
    }},
    {"game": {
      "away": {
        "conferenceNames": {
          "conferenceDisplay": "Big Ten Conference",
          "conferenceDivision": "fbs",
          "conferenceName": "Big Ten",
          "conferenceSeo": "big-ten"
        },
        "description": "(2-5)",
        "names": {
          "char6": "ILL",
          "full": "University of Illinois, Champaign",
          "seo": "illinois",
          "short": "Illinois"
        },
        "rank": "",
        "score": "17",
        "seed": "",
        "winner": false
      },
      "bracketId": "",
      "bracketRegion": "",
      "bracketRound": "",
      "contestClock": "0:00",
      "currentPeriod": "Final",
      "finalMessage": "Final",
      "gameID": "3815de0c-af4d-4b5f-8669-6afbfcfbdef6",
      "gameState": "final",
      "home": {
        "conferenceNames": {
          "conferenceDisplay": "Big Ten Conference",
          "conferenceDivision": "fbs",
          "conferenceName": "Big Ten",
          "conferenceSeo": "big-ten"
        },
        "description": "(4-3)",
        "names": {
          "char6": "MINN",
          "full": "University of Minnesota, Twin Cities",
          "seo": "minnesota",
          "short": "Minnesota"
        },
        "rank": "",
        "score": "24",
        "seed": "",
        "winner": true
      },
      "liveVideoEnabled": false,
      "network": "",
      "startDate": "10-21-2017",
      "startTime": "03:30PM ET",
      "startTimeEpoch": "1508614200",
      "title": "Minnesota Illinois",
      "url": "/game/football/fbs/2017/10/21/illinois-minnesota",
      "videoState": ""
    }},
    {"game": {
      "away": {
        "conferenceNames": {
          "conferenceDisplay": "Sun Belt Conference",
          "conferenceDivision": "fbs",
          "conferenceName": "Sun Belt",
          "conferenceSeo": "sun-belt"
        },
        "description": "(1-6)",
        "names": {
          "char6": "CO CAR",
          "full": "Coastal Carolina University",
          "seo": "coastal-caro",
          "short": "Coastal Caro."
        },
        "rank": "",
        "score": "29",
        "seed": "",
        "winner": false
      },
      "bracketId": "",
      "bracketRegion": "",
      "bracketRound": "",
      "contestClock": "0:00",
      "currentPeriod": "Final",
      "finalMessage": "Final",
      "gameID": "1947b187-8da9-4ddd-8814-9e065fe1d6ee",
      "gameState": "final",
      "home": {
        "conferenceNames": {
          "conferenceDisplay": "Sun Belt Conference",
          "conferenceDivision": "fbs",
          "conferenceName": "Sun Belt",
          "conferenceSeo": "sun-belt"
        },
        "description": "(5-2)",
        "names": {
          "char6": "APP ST",
          "full": "Appalachian State University",
          "seo": "appalachian-st",
          "short": "Appalachian St."
        },
        "rank": "",
        "score": "37",
        "seed": "",
        "winner": true
      },
      "liveVideoEnabled": false,
      "network": "",
      "startDate": "10-21-2017",
      "startTime": "03:30PM ET",
      "startTimeEpoch": "1508614200",
      "title": "Appalachian St. Coastal Caro.",
      "url": "/game/football/fbs/2017/10/21/coastal-caro-appalachian-st",
      "videoState": ""
    }},
    {"game": {
      "away": {
        "conferenceNames": {
          "conferenceDisplay": "American Athletic Conference",
          "conferenceDivision": "fbs",
          "conferenceName": "AAC",
          "conferenceSeo": "american-athletic"
        },
        "description": "(6-0)",
        "names": {
          "char6": "UCF",
          "full": "University of Central Florida",
          "seo": "ucf",
          "short": "UCF"
        },
        "rank": "20",
        "score": "31",
        "seed": "",
        "winner": true
      },
      "bracketId": "",
      "bracketRegion": "",
      "bracketRound": "",
      "contestClock": "0:00",
      "currentPeriod": "Final",
      "finalMessage": "Final",
      "gameID": "74f7a6ad-ef8f-46f1-b357-560a8e95e748",
      "gameState": "final",
      "home": {
        "conferenceNames": {
          "conferenceDisplay": "American Athletic Conference",
          "conferenceDivision": "fbs",
          "conferenceName": "AAC",
          "conferenceSeo": "american-athletic"
        },
        "description": "(5-2)",
        "names": {
          "char6": "NAVY",
          "full": "U.S. Naval Academy",
          "seo": "navy",
          "short": "Navy"
        },
        "rank": "",
        "score": "21",
        "seed": "",
        "winner": false
      },
      "liveVideoEnabled": false,
      "network": "",
      "startDate": "10-21-2017",
      "startTime": "03:30PM ET",
      "startTimeEpoch": "1508614200",
      "title": "Navy UCF",
      "url": "/game/football/fbs/2017/10/21/ucf-navy",
      "videoState": ""
    }},
    {"game": {
      "away": {
        "conferenceNames": {
          "conferenceDisplay": "Southeastern Conference",
          "conferenceDivision": "fbs",
          "conferenceName": "SEC",
          "conferenceSeo": "southeastern"
        },
        "description": "(5-2)",
        "names": {
          "char6": "UK",
          "full": "University of Kentucky",
          "seo": "kentucky",
          "short": "Kentucky"
        },
        "rank": "",
        "score": "7",
        "seed": "",
        "winner": false
      },
      "bracketId": "",
      "bracketRegion": "",
      "bracketRound": "",
      "contestClock": "0:00",
      "currentPeriod": "Final",
      "finalMessage": "Final",
      "gameID": "c8facff6-3afd-498b-b8eb-cd9e6c82cf1f",
      "gameState": "final",
      "home": {
        "conferenceNames": {
          "conferenceDisplay": "Southeastern Conference",
          "conferenceDivision": "fbs",
          "conferenceName": "SEC",
          "conferenceSeo": "southeastern"
        },
        "description": "(5-2)",
        "names": {
          "char6": "MISSST",
          "full": "Mississippi State University",
          "seo": "mississippi-st",
          "short": "Mississippi St."
        },
        "rank": "",
        "score": "45",
        "seed": "",
        "winner": true
      },
      "liveVideoEnabled": false,
      "network": "",
      "startDate": "10-21-2017",
      "startTime": "04:00PM ET",
      "startTimeEpoch": "1508616000",
      "title": "Mississippi St. Kentucky",
      "url": "/game/football/fbs/2017/10/21/kentucky-mississippi-st",
      "videoState": ""
    }},
    {"game": {
      "away": {
        "conferenceNames": {
          "conferenceDisplay": "Pac-12 Conference",
          "conferenceDivision": "fbs",
          "conferenceName": "Pac-12",
          "conferenceSeo": "pac-12"
        },
        "description": "(4-4)",
        "names": {
          "char6": "OREGN",
          "full": "University of Oregon",
          "seo": "oregon",
          "short": "Oregon"
        },
        "rank": "",
        "score": "14",
        "seed": "",
        "winner": false
      },
      "bracketId": "",
      "bracketRegion": "",
      "bracketRound": "",
      "contestClock": "0:00",
      "currentPeriod": "Final",
      "finalMessage": "Final",
      "gameID": "b2ecd0dd-1a87-48ec-8a1f-b4fbaf038874",
      "gameState": "final",
      "home": {
        "conferenceNames": {
          "conferenceDisplay": "Pac-12 Conference",
          "conferenceDivision": "fbs",
          "conferenceName": "Pac-12",
          "conferenceSeo": "pac-12"
        },
        "description": "(4-3)",
        "names": {
          "char6": "UCLA",
          "full": "University of California, Los Angeles",
          "seo": "ucla",
          "short": "UCLA"
        },
        "rank": "",
        "score": "31",
        "seed": "",
        "winner": true
      },
      "liveVideoEnabled": false,
      "network": "",
      "startDate": "10-21-2017",
      "startTime": "04:00PM ET",
      "startTimeEpoch": "1508616000",
      "title": "UCLA Oregon",
      "url": "/game/football/fbs/2017/10/21/oregon-ucla",
      "videoState": ""
    }},
    {"game": {
      "away": {
        "conferenceNames": {
          "conferenceDisplay": "Big 12 Conference",
          "conferenceDivision": "fbs",
          "conferenceName": "Big 12",
          "conferenceSeo": "big-12"
        },
        "description": "(6-1)",
        "names": {
          "char6": "OKLA",
          "full": "University of Oklahoma",
          "seo": "oklahoma",
          "short": "Oklahoma"
        },
        "rank": "9",
        "score": "42",
        "seed": "",
        "winner": true
      },
      "bracketId": "",
      "bracketRegion": "",
      "bracketRound": "",
      "contestClock": "0:00",
      "currentPeriod": "Final",
      "finalMessage": "Final",
      "gameID": "821c3019-20e7-4d66-996d-62d738aebf2b",
      "gameState": "final",
      "home": {
        "conferenceNames": {
          "conferenceDisplay": "Big 12 Conference",
          "conferenceDivision": "fbs",
          "conferenceName": "Big 12",
          "conferenceSeo": "big-12"
        },
        "description": "(3-4)",
        "names": {
          "char6": "KAN ST",
          "full": "Kansas State University",
          "seo": "kansas-st",
          "short": "Kansas St."
        },
        "rank": "",
        "score": "35",
        "seed": "",
        "winner": false
      },
      "liveVideoEnabled": false,
      "network": "",
      "startDate": "10-21-2017",
      "startTime": "04:00PM ET",
      "startTimeEpoch": "1508616000",
      "title": "Kansas St. Oklahoma",
      "url": "/game/football/fbs/2017/10/21/oklahoma-kansas-st",
      "videoState": ""
    }},
    {"game": {
      "away": {
        "conferenceNames": {
          "conferenceDisplay": "American Athletic Conference",
          "conferenceDivision": "fbs",
          "conferenceName": "AAC",
          "conferenceSeo": "american-athletic"
        },
        "description": "(5-2)",
        "names": {
          "char6": "SMU",
          "full": "Southern Methodist University",
          "seo": "smu",
          "short": "SMU"
        },
        "rank": "",
        "score": "31",
        "seed": "",
        "winner": true
      },
      "bracketId": "",
      "bracketRegion": "",
      "bracketRound": "",
      "contestClock": "",
      "currentPeriod": "Final (OT)",
      "finalMessage": "Final (OT)",
      "gameID": "2255b6c8-ac51-47a2-aaab-1dacc0841ec4",
      "gameState": "final",
      "home": {
        "conferenceNames": {
          "conferenceDisplay": "American Athletic Conference",
          "conferenceDivision": "fbs",
          "conferenceName": "AAC",
          "conferenceSeo": "american-athletic"
        },
        "description": "(2-6)",
        "names": {
          "char6": "CINCY",
          "full": "University of Cincinnati",
          "seo": "cincinnati",
          "short": "Cincinnati"
        },
        "rank": "",
        "score": "28",
        "seed": "",
        "winner": false
      },
      "liveVideoEnabled": false,
      "network": "",
      "startDate": "10-21-2017",
      "startTime": "04:00PM ET",
      "startTimeEpoch": "1508616000",
      "title": "Cincinnati SMU",
      "url": "/game/football/fbs/2017/10/21/smu-cincinnati",
      "videoState": ""
    }},
    {"game": {
      "away": {
        "conferenceNames": {
          "conferenceDisplay": "Sun Belt Conference",
          "conferenceDivision": "fbs",
          "conferenceName": "Sun Belt",
          "conferenceSeo": "sun-belt"
        },
        "description": "(3-4)",
        "names": {
          "char6": "LA MON",
          "full": "University of Louisiana at Monroe",
          "seo": "la-monroe",
          "short": "La.-Monroe"
        },
        "rank": "",
        "score": "23",
        "seed": "",
        "winner": false
      },
      "bracketId": "",
      "bracketRegion": "",
      "bracketRound": "",
      "contestClock": "0:00",
      "currentPeriod": "Final",
      "finalMessage": "Final",
      "gameID": "16b30b2a-f7f7-4246-99f7-1a1024aa8523",
      "gameState": "final",
      "home": {
        "conferenceNames": {
          "conferenceDisplay": "Sun Belt Conference",
          "conferenceDivision": "fbs",
          "conferenceName": "Sun Belt",
          "conferenceSeo": "sun-belt"
        },
        "description": "(3-4)",
        "names": {
          "char6": "S ALA",
          "full": "University of South Alabama",
          "seo": "south-ala",
          "short": "South Ala."
        },
        "rank": "",
        "score": "33",
        "seed": "",
        "winner": true
      },
      "liveVideoEnabled": false,
      "network": "",
      "startDate": "10-21-2017",
      "startTime": "05:00PM ET",
      "startTimeEpoch": "1508619600",
      "title": "South Ala. La.-Monroe",
      "url": "/game/football/fbs/2017/10/21/la-monroe-south-ala",
      "videoState": ""
    }},
    {"game": {
      "away": {
        "conferenceNames": {
          "conferenceDisplay": "Conference USA",
          "conferenceDivision": "fbs",
          "conferenceName": "C-USA",
          "conferenceSeo": "conference-usa"
        },
        "description": "(4-3)",
        "names": {
          "char6": "NO TEX",
          "full": "University of North Texas",
          "seo": "north-texas",
          "short": "North Texas"
        },
        "rank": "",
        "score": "31",
        "seed": "",
        "winner": false
      },
      "bracketId": "",
      "bracketRegion": "",
      "bracketRound": "",
      "contestClock": "0:00",
      "currentPeriod": "Final",
      "finalMessage": "Final",
      "gameID": "fc10951f-4ff2-4fc1-9eb8-60d61e757eb8",
      "gameState": "final",
      "home": {
        "conferenceNames": {
          "conferenceDisplay": "Conference USA",
          "conferenceDivision": "fbs",
          "conferenceName": "C-USA",
          "conferenceSeo": "conference-usa"
        },
        "description": "(4-3)",
        "names": {
          "char6": "FAU",
          "full": "Florida Atlantic University",
          "seo": "fla-atlantic",
          "short": "Fla. Atlantic"
        },
        "rank": "",
        "score": "69",
        "seed": "",
        "winner": true
      },
      "liveVideoEnabled": false,
      "network": "",
      "startDate": "10-21-2017",
      "startTime": "05:00PM ET",
      "startTimeEpoch": "1508619600",
      "title": "Fla. Atlantic North Texas",
      "url": "/game/football/fbs/2017/10/21/north-texas-fla-atlantic",
      "videoState": ""
    }},
    {"game": {
      "away": {
        "conferenceNames": {
          "conferenceDisplay": "Mountain West Conference",
          "conferenceDivision": "fbs",
          "conferenceName": "MWC",
          "conferenceSeo": "mountain-west"
        },
        "description": "(4-4)",
        "names": {
          "char6": "UT ST",
          "full": "Utah State University",
          "seo": "utah-st",
          "short": "Utah St."
        },
        "rank": "",
        "score": "52",
        "seed": "",
        "winner": true
      },
      "bracketId": "",
      "bracketRegion": "",
      "bracketRound": "",
      "contestClock": "0:00",
      "currentPeriod": "Final",
      "finalMessage": "Final",
      "gameID": "653973c0-50d9-4af3-b1fb-a2b2b609636d",
      "gameState": "final",
      "home": {
        "conferenceNames": {
          "conferenceDisplay": "Mountain West Conference",
          "conferenceDivision": "fbs",
          "conferenceName": "MWC",
          "conferenceSeo": "mountain-west"
        },
        "description": "(2-5)",
        "names": {
          "char6": "UNLV",
          "full": "University of Nevada, Las Vegas",
          "seo": "unlv",
          "short": "UNLV"
        },
        "rank": "",
        "score": "28",
        "seed": "",
        "winner": false
      },
      "liveVideoEnabled": false,
      "network": "",
      "startDate": "10-21-2017",
      "startTime": "06:00PM ET",
      "startTimeEpoch": "1508623200",
      "title": "UNLV Utah St.",
      "url": "/game/football/fbs/2017/10/21/utah-st-unlv",
      "videoState": ""
    }},
    {"game": {
      "away": {
        "conferenceNames": {
          "conferenceDisplay": "Conference USA",
          "conferenceDivision": "fbs",
          "conferenceName": "C-USA",
          "conferenceSeo": "conference-usa"
        },
        "description": "(4-3)",
        "names": {
          "char6": "UAB",
          "full": "University of Alabama at Birmingham",
          "seo": "uab",
          "short": "UAB"
        },
        "rank": "",
        "score": "24",
        "seed": "",
        "winner": false
      },
      "bracketId": "",
      "bracketRegion": "",
      "bracketRound": "",
      "contestClock": "",
      "currentPeriod": "Final (OT)",
      "finalMessage": "Final (OT)",
      "gameID": "6e3ca775-9fc2-466a-8a9a-95690e4b5277",
      "gameState": "final",
      "home": {
        "conferenceNames": {
          "conferenceDisplay": "Conference USA",
          "conferenceDivision": "fbs",
          "conferenceName": "C-USA",
          "conferenceSeo": "conference-usa"
        },
        "description": "(1-7)",
        "names": {
          "char6": "CHAR",
          "full": "University of North Carolina, Charlotte",
          "seo": "charlotte",
          "short": "Charlotte"
        },
        "rank": "",
        "score": "25",
        "seed": "",
        "winner": true
      },
      "liveVideoEnabled": false,
      "network": "",
      "startDate": "10-21-2017",
      "startTime": "06:30PM ET",
      "startTimeEpoch": "1508625000",
      "title": "Charlotte UAB",
      "url": "/game/football/fbs/2017/10/21/uab-charlotte",
      "videoState": ""
    }},
    {"game": {
      "away": {
        "conferenceNames": {
          "conferenceDisplay": "FBS Independent",
          "conferenceDivision": "fbs",
          "conferenceName": "IND",
          "conferenceSeo": "fbs-independent"
        },
        "description": "(1-7)",
        "names": {
          "char6": "BYU",
          "full": "Brigham Young University",
          "seo": "byu",
          "short": "BYU"
        },
        "rank": "",
        "score": "17",
        "seed": "",
        "winner": false
      },
      "bracketId": "",
      "bracketRegion": "",
      "bracketRound": "",
      "contestClock": "0:00",
      "currentPeriod": "Final",
      "finalMessage": "Final",
      "gameID": "9f1a7147-fcff-4d6e-a668-5b4794986286",
      "gameState": "final",
      "home": {
        "conferenceNames": {
          "conferenceDisplay": "American Athletic Conference",
          "conferenceDivision": "fbs",
          "conferenceName": "AAC",
          "conferenceSeo": "american-athletic"
        },
        "description": "(2-6)",
        "names": {
          "char6": "E CAR",
          "full": "East Carolina University",
          "seo": "east-carolina",
          "short": "East Carolina"
        },
        "rank": "",
        "score": "33",
        "seed": "",
        "winner": true
      },
      "liveVideoEnabled": false,
      "network": "",
      "startDate": "10-21-2017",
      "startTime": "07:00PM ET",
      "startTimeEpoch": "1508626800",
      "title": "East Carolina BYU",
      "url": "/game/football/fbs/2017/10/21/byu-east-carolina",
      "videoState": ""
    }},
    {"game": {
      "away": {
        "conferenceNames": {
          "conferenceDisplay": "Conference USA",
          "conferenceDivision": "fbs",
          "conferenceName": "C-USA",
          "conferenceSeo": "conference-usa"
        },
        "description": "(1-6)",
        "names": {
          "char6": "RICE",
          "full": "Rice University",
          "seo": "rice",
          "short": "Rice"
        },
        "rank": "",
        "score": "7",
        "seed": "",
        "winner": false
      },
      "bracketId": "",
      "bracketRegion": "",
      "bracketRound": "",
      "contestClock": "0:00",
      "currentPeriod": "Final",
      "finalMessage": "Final",
      "gameID": "247aa33a-3d05-4c85-a316-eaea1668e6c8",
      "gameState": "final",
      "home": {
        "conferenceNames": {
          "conferenceDisplay": "Conference USA",
          "conferenceDivision": "fbs",
          "conferenceName": "C-USA",
          "conferenceSeo": "conference-usa"
        },
        "description": "(4-2)",
        "names": {
          "char6": "UTSA",
          "full": "University of Texas at San Antonio",
          "seo": "utsa",
          "short": "UTSA"
        },
        "rank": "",
        "score": "20",
        "seed": "",
        "winner": true
      },
      "liveVideoEnabled": false,
      "network": "",
      "startDate": "10-21-2017",
      "startTime": "07:00PM ET",
      "startTimeEpoch": "1508626800",
      "title": "UTSA Rice",
      "url": "/game/football/fbs/2017/10/21/rice-utsa",
      "videoState": ""
    }},
    {"game": {
      "away": {
        "conferenceNames": {
          "conferenceDisplay": "Conference USA",
          "conferenceDivision": "fbs",
          "conferenceName": "C-USA",
          "conferenceSeo": "conference-usa"
        },
        "description": "(5-2)",
        "names": {
          "char6": "S MISS",
          "full": "University of Southern Mississippi",
          "seo": "southern-miss",
          "short": "Southern Miss."
        },
        "rank": "",
        "score": "34",
        "seed": "",
        "winner": true
      },
      "bracketId": "",
      "bracketRegion": "",
      "bracketRound": "",
      "contestClock": "",
      "currentPeriod": "Final (2OT)",
      "finalMessage": "Final (2OT)",
      "gameID": "39f2ea08-df68-4cb5-85f5-c7fe49bb0d96",
      "gameState": "final",
      "home": {
        "conferenceNames": {
          "conferenceDisplay": "Conference USA",
          "conferenceDivision": "fbs",
          "conferenceName": "C-USA",
          "conferenceSeo": "conference-usa"
        },
        "description": "(3-4)",
        "names": {
          "char6": "LATECH",
          "full": "Louisiana Tech University",
          "seo": "louisiana-tech",
          "short": "Louisiana Tech"
        },
        "rank": "",
        "score": "27",
        "seed": "",
        "winner": false
      },
      "liveVideoEnabled": false,
      "network": "",
      "startDate": "10-21-2017",
      "startTime": "07:00PM ET",
      "startTimeEpoch": "1508626800",
      "title": "Louisiana Tech Southern Miss.",
      "url": "/game/football/fbs/2017/10/21/southern-miss-louisiana-tech",
      "videoState": ""
    }},
    {"game": {
      "away": {
        "conferenceNames": {
          "conferenceDisplay": "American Athletic Conference",
          "conferenceDivision": "fbs",
          "conferenceName": "AAC",
          "conferenceSeo": "american-athletic"
        },
        "description": "(7-0)",
        "names": {
          "char6": "USF",
          "full": "University of South Florida",
          "seo": "south-fla",
          "short": "South Fla."
        },
        "rank": "16",
        "score": "34",
        "seed": "",
        "winner": true
      },
      "bracketId": "",
      "bracketRegion": "",
      "bracketRound": "",
      "contestClock": "0:00",
      "currentPeriod": "Final",
      "finalMessage": "Final",
      "gameID": "64ae76ef-390c-4617-85fc-b156d78faa39",
      "gameState": "final",
      "home": {
        "conferenceNames": {
          "conferenceDisplay": "American Athletic Conference",
          "conferenceDivision": "fbs",
          "conferenceName": "AAC",
          "conferenceSeo": "american-athletic"
        },
        "description": "(3-4)",
        "names": {
          "char6": "TULANE",
          "full": "Tulane University",
          "seo": "tulane",
          "short": "Tulane"
        },
        "rank": "",
        "score": "28",
        "seed": "",
        "winner": false
      },
      "liveVideoEnabled": false,
      "network": "",
      "startDate": "10-21-2017",
      "startTime": "07:00PM ET",
      "startTimeEpoch": "1508626800",
      "title": "Tulane South Fla.",
      "url": "/game/football/fbs/2017/10/21/south-fla-tulane",
      "videoState": ""
    }},
    {"game": {
      "away": {
        "conferenceNames": {
          "conferenceDisplay": "Southeastern Conference",
          "conferenceDivision": "fbs",
          "conferenceName": "SEC",
          "conferenceSeo": "southeastern"
        },
        "description": "(6-2)",
        "names": {
          "char6": "LSU",
          "full": "Louisiana State University",
          "seo": "lsu",
          "short": "LSU"
        },
        "rank": "24",
        "score": "40",
        "seed": "",
        "winner": true
      },
      "bracketId": "",
      "bracketRegion": "",
      "bracketRound": "",
      "contestClock": "0:00",
      "currentPeriod": "Final",
      "finalMessage": "Final",
      "gameID": "73ddf28e-d1d9-495e-b5d1-e852c1d68032",
      "gameState": "final",
      "home": {
        "conferenceNames": {
          "conferenceDisplay": "Southeastern Conference",
          "conferenceDivision": "fbs",
          "conferenceName": "SEC",
          "conferenceSeo": "southeastern"
        },
        "description": "(3-4)",
        "names": {
          "char6": "MISS",
          "full": "University of Mississippi",
          "seo": "ole-miss",
          "short": "Ole Miss"
        },
        "rank": "",
        "score": "24",
        "seed": "",
        "winner": false
      },
      "liveVideoEnabled": false,
      "network": "",
      "startDate": "10-21-2017",
      "startTime": "07:15PM ET",
      "startTimeEpoch": "1508627700",
      "title": "Ole Miss LSU",
      "url": "/game/football/fbs/2017/10/21/lsu-ole-miss",
      "videoState": ""
    }},
    {"game": {
      "away": {
        "conferenceNames": {
          "conferenceDisplay": "Pac-12 Conference",
          "conferenceDivision": "fbs",
          "conferenceName": "Pac-12",
          "conferenceSeo": "pac-12"
        },
        "description": "(6-2)",
        "names": {
          "char6": "USC",
          "full": "University of Southern California",
          "seo": "southern-california",
          "short": "Southern California"
        },
        "rank": "11",
        "score": "14",
        "seed": "",
        "winner": false
      },
      "bracketId": "",
      "bracketRegion": "",
      "bracketRound": "",
      "contestClock": "0:00",
      "currentPeriod": "Final",
      "finalMessage": "Final",
      "gameID": "219ce610-fb53-425b-b62d-08f262a61292",
      "gameState": "final",
      "home": {
        "conferenceNames": {
          "conferenceDisplay": "FBS Independent",
          "conferenceDivision": "fbs",
          "conferenceName": "IND",
          "conferenceSeo": "fbs-independent"
        },
        "description": "(6-1)",
        "names": {
          "char6": "N DAME",
          "full": "University of Notre Dame",
          "seo": "notre-dame",
          "short": "Notre Dame"
        },
        "rank": "13",
        "score": "49",
        "seed": "",
        "winner": true
      },
      "liveVideoEnabled": false,
      "network": "",
      "startDate": "10-21-2017",
      "startTime": "07:30PM ET",
      "startTimeEpoch": "1508628600",
      "title": "Notre Dame Southern California",
      "url": "/game/football/fbs/2017/10/21/southern-california-notre-dame",
      "videoState": ""
    }},
    {"game": {
      "away": {
        "conferenceNames": {
          "conferenceDisplay": "Atlantic Coast Conference",
          "conferenceDivision": "fbs",
          "conferenceName": "ACC",
          "conferenceSeo": "atlantic-coast"
        },
        "description": "(4-3)",
        "names": {
          "char6": "WAKE",
          "full": "Wake Forest University",
          "seo": "wake-forest",
          "short": "Wake Forest"
        },
        "rank": "",
        "score": "24",
        "seed": "",
        "winner": false
      },
      "bracketId": "",
      "bracketRegion": "",
      "bracketRound": "",
      "contestClock": "0:00",
      "currentPeriod": "Final",
      "finalMessage": "Final",
      "gameID": "3391e164-4918-4b73-b954-485a036d93df",
      "gameState": "final",
      "home": {
        "conferenceNames": {
          "conferenceDisplay": "Atlantic Coast Conference",
          "conferenceDivision": "fbs",
          "conferenceName": "ACC",
          "conferenceSeo": "atlantic-coast"
        },
        "description": "(4-2)",
        "names": {
          "char6": "GATECH",
          "full": "Georgia Institute of Technology",
          "seo": "georgia-tech",
          "short": "Georgia Tech"
        },
        "rank": "",
        "score": "38",
        "seed": "",
        "winner": true
      },
      "liveVideoEnabled": false,
      "network": "",
      "startDate": "10-21-2017",
      "startTime": "07:30PM ET",
      "startTimeEpoch": "1508628600",
      "title": "Georgia Tech Wake Forest",
      "url": "/game/football/fbs/2017/10/21/wake-forest-georgia-tech",
      "videoState": ""
    }},
    {"game": {
      "away": {
        "conferenceNames": {
          "conferenceDisplay": "Southeastern Conference",
          "conferenceDivision": "fbs",
          "conferenceName": "SEC",
          "conferenceSeo": "southeastern"
        },
        "description": "(6-2)",
        "names": {
          "char6": "AUBURN",
          "full": "Auburn University",
          "seo": "auburn",
          "short": "Auburn"
        },
        "rank": "21",
        "score": "52",
        "seed": "",
        "winner": true
      },
      "bracketId": "",
      "bracketRegion": "",
      "bracketRound": "",
      "contestClock": "0:00",
      "currentPeriod": "Final",
      "finalMessage": "Final",
      "gameID": "79377f3f-c115-46c0-9a80-569f66a56ad0",
      "gameState": "final",
      "home": {
        "conferenceNames": {
          "conferenceDisplay": "Southeastern Conference",
          "conferenceDivision": "fbs",
          "conferenceName": "SEC",
          "conferenceSeo": "southeastern"
        },
        "description": "(2-5)",
        "names": {
          "char6": "ARK",
          "full": "University of Arkansas, Fayetteville",
          "seo": "arkansas",
          "short": "Arkansas"
        },
        "rank": "",
        "score": "20",
        "seed": "",
        "winner": false
      },
      "liveVideoEnabled": false,
      "network": "",
      "startDate": "10-21-2017",
      "startTime": "07:30PM ET",
      "startTimeEpoch": "1508628600",
      "title": "Arkansas Auburn",
      "url": "/game/football/fbs/2017/10/21/auburn-arkansas",
      "videoState": ""
    }},
    {"game": {
      "away": {
        "conferenceNames": {
          "conferenceDisplay": "Big Ten Conference",
          "conferenceDivision": "fbs",
          "conferenceName": "Big Ten",
          "conferenceSeo": "big-ten"
        },
        "description": "(5-2)",
        "names": {
          "char6": "MICH",
          "full": "University of Michigan",
          "seo": "michigan",
          "short": "Michigan"
        },
        "rank": "19",
        "score": "13",
        "seed": "",
        "winner": false
      },
      "bracketId": "",
      "bracketRegion": "",
      "bracketRound": "",
      "contestClock": "0:00",
      "currentPeriod": "Final",
      "finalMessage": "Final",
      "gameID": "7c97d32c-cf9f-4603-ae70-6d3e96cc94bc",
      "gameState": "final",
      "home": {
        "conferenceNames": {
          "conferenceDisplay": "Big Ten Conference",
          "conferenceDivision": "fbs",
          "conferenceName": "Big Ten",
          "conferenceSeo": "big-ten"
        },
        "description": "(7-0)",
        "names": {
          "char6": "PENNST",
          "full": "Pennsylvania State University",
          "seo": "penn-st",
          "short": "Penn St."
        },
        "rank": "2",
        "score": "42",
        "seed": "",
        "winner": true
      },
      "liveVideoEnabled": false,
      "network": "",
      "startDate": "10-21-2017",
      "startTime": "07:30PM ET",
      "startTimeEpoch": "1508628600",
      "title": "Penn St. Michigan",
      "url": "/game/football/fbs/2017/10/21/michigan-penn-st",
      "videoState": ""
    }},
    {"game": {
      "away": {
        "conferenceNames": {
          "conferenceDisplay": "Big 12 Conference",
          "conferenceDivision": "fbs",
          "conferenceName": "Big 12",
          "conferenceSeo": "big-12"
        },
        "description": "(5-2)",
        "names": {
          "char6": "WVU",
          "full": "West Virginia University",
          "seo": "west-virginia",
          "short": "West Virginia"
        },
        "rank": "23",
        "score": "38",
        "seed": "",
        "winner": true
      },
      "bracketId": "",
      "bracketRegion": "",
      "bracketRound": "",
      "contestClock": "0:00",
      "currentPeriod": "Final",
      "finalMessage": "Final",
      "gameID": "13eb6a77-d82a-47ee-8b08-a4682e3de83f",
      "gameState": "final",
      "home": {
        "conferenceNames": {
          "conferenceDisplay": "Big 12 Conference",
          "conferenceDivision": "fbs",
          "conferenceName": "Big 12",
          "conferenceSeo": "big-12"
        },
        "description": "(0-7)",
        "names": {
          "char6": "BAYLOR",
          "full": "Baylor University",
          "seo": "baylor",
          "short": "Baylor"
        },
        "rank": "",
        "score": "36",
        "seed": "",
        "winner": false
      },
      "liveVideoEnabled": false,
      "network": "",
      "startDate": "10-21-2017",
      "startTime": "08:00PM ET",
      "startTimeEpoch": "1508630400",
      "title": "Baylor West Virginia",
      "url": "/game/football/fbs/2017/10/21/west-virginia-baylor",
      "videoState": ""
    }},
    {"game": {
      "away": {
        "conferenceNames": {
          "conferenceDisplay": "Big 12 Conference",
          "conferenceDivision": "fbs",
          "conferenceName": "Big 12",
          "conferenceSeo": "big-12"
        },
        "description": "(1-6)",
        "names": {
          "char6": "KANSAS",
          "full": "University of Kansas",
          "seo": "kansas",
          "short": "Kansas"
        },
        "rank": "",
        "score": "0",
        "seed": "",
        "winner": false
      },
      "bracketId": "",
      "bracketRegion": "",
      "bracketRound": "",
      "contestClock": "0:00",
      "currentPeriod": "Final",
      "finalMessage": "Final",
      "gameID": "5ebaa84c-2b52-44f4-bc00-cf28b6823483",
      "gameState": "final",
      "home": {
        "conferenceNames": {
          "conferenceDisplay": "Big 12 Conference",
          "conferenceDivision": "fbs",
          "conferenceName": "Big 12",
          "conferenceSeo": "big-12"
        },
        "description": "(7-0)",
        "names": {
          "char6": "TCU",
          "full": "Texas Christian University",
          "seo": "tcu",
          "short": "TCU"
        },
        "rank": "4",
        "score": "43",
        "seed": "",
        "winner": true
      },
      "liveVideoEnabled": false,
      "network": "",
      "startDate": "10-21-2017",
      "startTime": "08:00PM ET",
      "startTimeEpoch": "1508630400",
      "title": "TCU Kansas",
      "url": "/game/football/fbs/2017/10/21/kansas-tcu",
      "videoState": ""
    }},
    {"game": {
      "away": {
        "conferenceNames": {
          "conferenceDisplay": "Pac-12 Conference",
          "conferenceDivision": "fbs",
          "conferenceName": "Pac-12",
          "conferenceSeo": "pac-12"
        },
        "description": "(5-2)",
        "names": {
          "char6": "ARIZ",
          "full": "University of Arizona",
          "seo": "arizona",
          "short": "Arizona"
        },
        "rank": "",
        "score": "45",
        "seed": "",
        "winner": true
      },
      "bracketId": "",
      "bracketRegion": "",
      "bracketRound": "",
      "contestClock": "",
      "currentPeriod": "Final (2OT)",
      "finalMessage": "Final (2OT)",
      "gameID": "c97e480c-79de-43f8-82ea-7b420ed0b28f",
      "gameState": "final",
      "home": {
        "conferenceNames": {
          "conferenceDisplay": "Pac-12 Conference",
          "conferenceDivision": "fbs",
          "conferenceName": "Pac-12",
          "conferenceSeo": "pac-12"
        },
        "description": "(4-4)",
        "names": {
          "char6": "CAL",
          "full": "University of California, Berkeley",
          "seo": "california",
          "short": "California"
        },
        "rank": "",
        "score": "44",
        "seed": "",
        "winner": false
      },
      "liveVideoEnabled": false,
      "network": "",
      "startDate": "10-21-2017",
      "startTime": "08:00PM ET",
      "startTimeEpoch": "1508630400",
      "title": "California Arizona",
      "url": "/game/football/fbs/2017/10/21/arizona-california",
      "videoState": ""
    }},
    {"game": {
      "away": {
        "conferenceNames": {
          "conferenceDisplay": "Mountain West Conference",
          "conferenceDivision": "fbs",
          "conferenceName": "MWC",
          "conferenceSeo": "mountain-west"
        },
        "description": "(4-3)",
        "names": {
          "char6": "WYO",
          "full": "University of Wyoming",
          "seo": "wyoming",
          "short": "Wyoming"
        },
        "rank": "",
        "score": "14",
        "seed": "",
        "winner": false
      },
      "bracketId": "",
      "bracketRegion": "",
      "bracketRound": "",
      "contestClock": "0:00",
      "currentPeriod": "Final",
      "finalMessage": "Final",
      "gameID": "768cbafd-ad0b-4d22-8e5f-06574ef9fe34",
      "gameState": "final",
      "home": {
        "conferenceNames": {
          "conferenceDisplay": "Mountain West Conference",
          "conferenceDivision": "fbs",
          "conferenceName": "MWC",
          "conferenceSeo": "mountain-west"
        },
        "description": "(5-2)",
        "names": {
          "char6": "BOISE",
          "full": "Boise State University",
          "seo": "boise-st",
          "short": "Boise St."
        },
        "rank": "",
        "score": "24",
        "seed": "",
        "winner": true
      },
      "liveVideoEnabled": false,
      "network": "",
      "startDate": "10-21-2017",
      "startTime": "10:15PM ET",
      "startTimeEpoch": "1508638500",
      "title": "Boise St. Wyoming",
      "url": "/game/football/fbs/2017/10/21/wyoming-boise-st",
      "videoState": ""
    }},
    {"game": {
      "away": {
        "conferenceNames": {
          "conferenceDisplay": "Mountain West Conference",
          "conferenceDivision": "fbs",
          "conferenceName": "MWC",
          "conferenceSeo": "mountain-west"
        },
        "description": "(5-2)",
        "names": {
          "char6": "FRESNO",
          "full": "California State University, Fresno",
          "seo": "fresno-st",
          "short": "Fresno St."
        },
        "rank": "",
        "score": "27",
        "seed": "",
        "winner": true
      },
      "bracketId": "",
      "bracketRegion": "",
      "bracketRound": "",
      "contestClock": "0:00",
      "currentPeriod": "Final",
      "finalMessage": "Final",
      "gameID": "fec34489-b561-4036-a96c-6a41d8581bfe",
      "gameState": "final",
      "home": {
        "conferenceNames": {
          "conferenceDisplay": "Mountain West Conference",
          "conferenceDivision": "fbs",
          "conferenceName": "MWC",
          "conferenceSeo": "mountain-west"
        },
        "description": "(6-2)",
        "names": {
          "char6": "SDSU",
          "full": "San Diego State University",
          "seo": "san-diego-st",
          "short": "San Diego St."
        },
        "rank": "",
        "score": "3",
        "seed": "",
        "winner": false
      },
      "liveVideoEnabled": false,
      "network": "",
      "startDate": "10-21-2017",
      "startTime": "10:30PM ET",
      "startTimeEpoch": "1508639400",
      "title": "San Diego St. Fresno St.",
      "url": "/game/football/fbs/2017/10/21/fresno-st-san-diego-st",
      "videoState": ""
    }},
    {"game": {
      "away": {
        "conferenceNames": {
          "conferenceDisplay": "Pac-12 Conference",
          "conferenceDivision": "fbs",
          "conferenceName": "Pac-12",
          "conferenceSeo": "pac-12"
        },
        "description": "(4-4)",
        "names": {
          "char6": "COLO",
          "full": "University of Colorado, Boulder",
          "seo": "colorado",
          "short": "Colorado"
        },
        "rank": "",
        "score": "0",
        "seed": "",
        "winner": false
      },
      "bracketId": "",
      "bracketRegion": "",
      "bracketRound": "",
      "contestClock": "0:00",
      "currentPeriod": "Final",
      "finalMessage": "Final",
      "gameID": "cecb091e-b7d3-45f1-bff9-3d6320bc2edc",
      "gameState": "final",
      "home": {
        "conferenceNames": {
          "conferenceDisplay": "Pac-12 Conference",
          "conferenceDivision": "fbs",
          "conferenceName": "Pac-12",
          "conferenceSeo": "pac-12"
        },
        "description": "(7-1)",
        "names": {
          "char6": "WASHST",
          "full": "Washington State University",
          "seo": "washington-st",
          "short": "Washington St."
        },
        "rank": "15",
        "score": "28",
        "seed": "",
        "winner": true
      },
      "liveVideoEnabled": false,
      "network": "",
      "startDate": "10-21-2017",
      "startTime": "10:45PM ET",
      "startTimeEpoch": "1508640300",
      "title": "Washington St. Colorado",
      "url": "/game/football/fbs/2017/10/21/colorado-washington-st",
      "videoState": ""
    }}
  ],
  "inputMD5Sum": "7addde1029c9ca11b082c5b7a223efe2",
  "updated_at": "10-10-2018 16:42:34"
}