{
  "games": [
    {"game": {
      "away": {
        "conferenceNames": {
          "conferenceDisplay": "American Athletic Conference",
          "conferenceDivision": "fbs",
          "conferenceName": "AAC",
          "conferenceSeo": "american-athletic"
        },
        "description": "(1-5)",
        "names": {
          "char6": "SMU",
          "full": "Southern Methodist University",
          "seo": "smu",
          "short": "SMU"
        },
        "rank": "",
        "score": "28",
        "seed": "",
        "winner": false
      },
      "bracketId": "",
      "bracketRegion": "",
      "bracketRound": "",
      "contestClock": "0:00",
      "currentPeriod": "Final",
      "finalMessage": "Final",
      "gameID": "0c7c77be-b899-4e99-880d-567f95855983",
      "gameState": "final",
      "home": {
        "conferenceNames": {
          "conferenceDisplay": "American Athletic Conference",
          "conferenceDivision": "fbs",
          "conferenceName": "AAC",
          "conferenceSeo": "american-athletic"
        },
        "description": "(5-0)",
        "names": {
          "char6": "HOU",
          "full": "University of Houston",
          "seo": "houston",
          "short": "Houston"
        },
        "rank": "",
        "score": "49",
        "seed": "",
        "winner": true
      },
      "liveVideoEnabled": false,
      "network": "",
      "startDate": "10-08-2015",
      "startTime": "08:00PM ET",
      "startTimeEpoch": "1444348800",
      "title": "Houston SMU",
      "url": "/game/football/fbs/2015/10/08/smu-houston",
      "videoState": ""
    }},
    {"game": {
      "away": {
        "conferenceNames": {
          "conferenceDisplay": "Pac-12 Conference",
          "conferenceDivision": "fbs",
          "conferenceName": "Pac-12",
          "conferenceSeo": "pac-12"
        },
        "description": "(3-2)",
        "names": {
          "char6": "WASH",
          "full": "University of Washington",
          "seo": "washington",
          "short": "Washington"
        },
        "rank": "",
        "score": "17",
        "seed": "",
        "winner": true
      },
      "bracketId": "",
      "bracketRegion": "",
      "bracketRound": "",
      "contestClock": "0:00",
      "currentPeriod": "Final",
      "finalMessage": "Final",
      "gameID": "a8f3cff0-0bf4-4656-b557-bec5a4f533ee",
      "gameState": "final",
      "home": {
        "conferenceNames": {
          "conferenceDisplay": "Pac-12 Conference",
          "conferenceDivision": "fbs",
          "conferenceName": "Pac-12",
          "conferenceSeo": "pac-12"
        },
        "description": "(3-2)",
        "names": {
          "char6": "USC",
          "full": "University of Southern California",
          "seo": "southern-california",
          "short": "Southern California"
        },
        "rank": "17",
        "score": "12",
        "seed": "",
        "winner": false
      },
      "liveVideoEnabled": false,
      "network": "",
      "startDate": "10-08-2015",
      "startTime": "09:00PM ET",
      "startTimeEpoch": "1444352400",
      "title": "Southern California Washington",
      "url": "/game/football/fbs/2015/10/08/washington-southern-california",
      "videoState": ""
    }},
    {"game": {
      "away": {
        "conferenceNames": {
          "conferenceDisplay": "Conference USA",
          "conferenceDivision": "fbs",
          "conferenceName": "C-USA",
          "conferenceSeo": "conference-usa"
        },
        "description": "(3-3)",
        "names": {
          "char6": "S MISS",
          "full": "University of Southern Mississippi",
          "seo": "southern-miss",
          "short": "Southern Miss."
        },
        "rank": "",
        "score": "10",
        "seed": "",
        "winner": false
      },
      "bracketId": "",
      "bracketRegion": "",
      "bracketRound": "",
      "contestClock": "0:00",
      "currentPeriod": "Final",
      "finalMessage": "Final",
      "gameID": "26176384-5463-4a46-8f13-78d127f80293",
      "gameState": "final",
      "home": {
        "conferenceNames": {
          "conferenceDisplay": "Conference USA",
          "conferenceDivision": "fbs",
          "conferenceName": "C-USA",
          "conferenceSeo": "conference-usa"
        },
        "description": "(5-1)",
        "names": {
          "char6": "MARSH",
          "full": "Marshall University",
          "seo": "marshall",
          "short": "Marshall"
        },
        "rank": "",
        "score": "31",
        "seed": "",
        "winner": true
      },
      "liveVideoEnabled": false,
      "network": "",
      "startDate": "10-09-2015",
      "startTime": "07:00PM ET",
      "startTimeEpoch": "1444431600",
      "title": "Marshall Southern Miss.",
      "url": "/game/football/fbs/2015/10/09/southern-miss-marshall",
      "videoState": ""
    }},
    {"game": {
      "away": {
        "conferenceNames": {
          "conferenceDisplay": "Atlantic Coast Conference",
          "conferenceDivision": "fbs",
          "conferenceName": "ACC",
          "conferenceSeo": "atlantic-coast"
        },
        "description": "(4-2)",
        "names": {
          "char6": "NC ST",
          "full": "North Carolina State University",
          "seo": "north-carolina-st",
          "short": "North Carolina St."
        },
        "rank": "",
        "score": "13",
        "seed": "",
        "winner": false
      },
      "bracketId": "",
      "bracketRegion": "",
      "bracketRound": "",
      "contestClock": "0:00",
      "currentPeriod": "Final",
      "finalMessage": "Final",
      "gameID": "e97debcf-9088-4e48-94af-653738c799fc",
      "gameState": "final",
      "home": {
        "conferenceNames": {
          "conferenceDisplay": "Atlantic Coast Conference",
          "conferenceDivision": "fbs",
          "conferenceName": "ACC",
          "conferenceSeo": "atlantic-coast"
        },
        "description": "(3-3)",
        "names": {
          "char6": "VATECH",
          "full": "Virginia Polytechnic Institute & State University",
          "seo": "virginia-tech",
          "short": "Virginia Tech"
        },
        "rank": "",
        "score": "28",
        "seed": "",
        "winner": true
      },
      "liveVideoEnabled": false,
      "network": "",
      "startDate": "10-09-2015",
      "startTime": "08:00PM ET",
      "startTimeEpoch": "1444435200",
      "title": "Virginia Tech North Carolina St.",
      "url": "/game/football/fbs/2015/10/09/north-carolina-st-virginia-tech",
      "videoState": ""
    }},
    {"game": {
      "away": {
        "conferenceNames": {
          "conferenceDisplay": "Big Ten Conference",
          "conferenceDivision": "fbs",
          "conferenceName": "Big Ten",
          "conferenceSeo": "big-ten"
        },
        "description": "(2-4)",
        "names": {
          "char6": "MD",
          "full": "University of Maryland, College Park",
          "seo": "maryland",
          "short": "Maryland"
        },
        "rank": "",
        "score": "28",
        "seed": "",
        "winner": false
      },
      "bracketId": "",
      "bracketRegion": "",
      "bracketRound": "",
      "contestClock": "0:00",
      "currentPeriod": "Final",
      "finalMessage": "Final",
      "gameID": "ee992641-f1ca-411b-91af-684704b56142",
      "gameState": "final",
      "home": {
        "conferenceNames": {
          "conferenceDisplay": "Big Ten Conference",
          "conferenceDivision": "fbs",
          "conferenceName": "Big Ten",
          "conferenceSeo": "big-ten"
        },
        "description": "(6-0)",
        "names": {
          "char6": "OHIOST",
          "full": "The Ohio State University",
          "seo": "ohio-st",
          "short": "Ohio St."
        },
        "rank": "1",
        "score": "49",
        "seed": "",
        "winner": true
      },
      "liveVideoEnabled": false,
      "network": "",
      "startDate": "10-10-2015",
      "startTime": "12:00PM ET",
      "startTimeEpoch": "1444492800",
      "title": "Ohio St. Maryland",
      "url": "/game/football/fbs/2015/10/10/maryland-ohio-st",
      "videoState": ""
    }},
    {"game": {
      "away": {
        "conferenceNames": {
          "conferenceDisplay": "Big Ten Conference",
          "conferenceDivision": "fbs",
          "conferenceName": "Big Ten",
          "conferenceSeo": "big-ten"
        },
        "description": "(4-2)",
        "names": {
          "char6": "ILL",
          "full": "University of Illinois, Champaign",
          "seo": "illinois",
          "short": "Illinois"
        },
        "rank": "",
        "score": "20",
        "seed": "",
        "winner": false
      },
      "bracketId": "",
      "bracketRegion": "",
      "bracketRound": "",
      "contestClock": "0:00",
      "currentPeriod": "Final",
      "finalMessage": "Final",
      "gameID": "b685774a-da6f-42e7-abd0-5f794268fde0",
      "gameState": "final",
      "home": {
        "conferenceNames": {
          "conferenceDisplay": "Big Ten Conference",
          "conferenceDivision": "fbs",
          "conferenceName": "Big Ten",
          "conferenceSeo": "big-ten"
        },
        "description": "(6-0)",
        "names": {
          "char6": "IOWA",
          "full": "University of Iowa",
          "seo": "iowa",
          "short": "Iowa"
        },
        "rank": "22",
        "score": "29",
        "seed": "",
        "winner": true
      },
      "liveVideoEnabled": false,
      "network": "",
      "startDate": "10-10-2015",
      "startTime": "12:00PM ET",
      "startTimeEpoch": "1444492800",
      "title": "Iowa Illinois",
      "url": "/game/football/fbs/2015/10/10/illinois-iowa",
      "videoState": ""
    }},
    {"game": {
      "away": {
        "conferenceNames": {
          "conferenceDisplay": "Sun Belt Conference",
          "conferenceDivision": "fbs",
          "conferenceName": "Sun Belt",
          "conferenceSeo": "sun-belt"
        },
        "description": "(0-5)",
        "names": {
          "char6": "NM ST",
          "full": "New Mexico State University",
          "seo": "new-mexico-st",
          "short": "New Mexico St."
        },
        "rank": "",
        "score": "3",
        "seed": "",
        "winner": false
      },
      "bracketId": "",
      "bracketRegion": "",
      "bracketRound": "",
      "contestClock": "0:00",
      "currentPeriod": "Final",
      "finalMessage": "Final",
      "gameID": "643e93c1-17dd-421a-bd4b-574c8296db3b",
      "gameState": "final",
      "home": {
        "conferenceNames": {
          "conferenceDisplay": "Southeastern Conference",
          "conferenceDivision": "fbs",
          "conferenceName": "SEC",
          "conferenceSeo": "southeastern"
        },
        "description": "(5-1)",
        "names": {
          "char6": "MISS",
          "full": "University of Mississippi",
          "seo": "ole-miss",
          "short": "Ole Miss"
        },
        "rank": "14",
        "score": "52",
        "seed": "",
        "winner": true
      },
      "liveVideoEnabled": false,
      "network": "",
      "startDate": "10-10-2015",
      "startTime": "12:00PM ET",
      "startTimeEpoch": "1444492800",
      "title": "Ole Miss New Mexico St.",
      "url": "/game/football/fbs/2015/10/10/new-mexico-st-ole-miss",
      "videoState": ""
    }},
    {"game": {
      "away": {
        "conferenceNames": {
          "conferenceDisplay": "Big Ten Conference",
          "conferenceDivision": "fbs",
          "conferenceName": "Big Ten",
          "conferenceSeo": "big-ten"
        },
        "description": "(4-2)",
        "names": {
          "char6": "IND",
          "full": "Indiana University, Bloomington",
          "seo": "indiana",
          "short": "Indiana"
        },
        "rank": "",
        "score": "7",
        "seed": "",
        "winner": false
      },
      "bracketId": "",
      "bracketRegion": "",
      "bracketRound": "",
      "contestClock": "0:00",
      "currentPeriod": "Final",
      "finalMessage": "Final",
      "gameID": "cf8ad56a-ccf0-4569-b438-54b5ed5eb137",
      "gameState": "final",
      "home": {
        "conferenceNames": {
          "conferenceDisplay": "Big Ten Conference",
          "conferenceDivision": "fbs",
          "conferenceName": "Big Ten",
          "conferenceSeo": "big-ten"
        },
        "description": "(5-1)",
        "names": {
          "char6": "PENNST",
          "full": "Pennsylvania State University",
          "seo": "penn-st",
          "short": "Penn St."
        },
        "rank": "",
        "score": "29",
        "seed": "",
        "winner": true
      },
      "liveVideoEnabled": false,
      "network": "",
      "startDate": "10-10-2015",
      "startTime": "12:00PM ET",
      "startTimeEpoch": "1444492800",
      "title": "Penn St. Indiana",
      "url": "/game/football/fbs/2015/10/10/indiana-penn-st",
      "videoState": ""
    }},
    {"game": {
      "away": {
        "conferenceNames": {
          "conferenceDisplay": "Big 12 Conference",
          "conferenceDivision": "fbs",
          "conferenceName": "Big 12",
          "conferenceSeo": "big-12"
        },
        "description": "(5-0)",
        "names": {
          "char6": "BAYLOR",
          "full": "Baylor University",
          "seo": "baylor",
          "short": "Baylor"
        },
        "rank": "3",
        "score": "66",
        "seed": "",
        "winner": true
      },
      "bracketId": "",
      "bracketRegion": "",
      "bracketRound": "",
      "contestClock": "0:00",
      "currentPeriod": "Final",
      "finalMessage": "Final",
      "gameID": "a0d007b9-b05b-4393-a43d-bd58c3363ef2",
      "gameState": "final",
      "home": {
        "conferenceNames": {
          "conferenceDisplay": "Big 12 Conference",
          "conferenceDivision": "fbs",
          "conferenceName": "Big 12",
          "conferenceSeo": "big-12"
        },
        "description": "(0-5)",
        "names": {
          "char6": "KANSAS",
          "full": "University of Kansas",
          "seo": "kansas",
          "short": "Kansas"
        },
        "rank": "",
        "score": "7",
        "seed": "",
        "winner": false
      },
      "liveVideoEnabled": false,
      "network": "",
      "startDate": "10-10-2015",
      "startTime": "12:00PM ET",
      "startTimeEpoch": "1444492800",
      "title": "Kansas Baylor",
      "url": "/game/football/fbs/2015/10/10/baylor-kansas",
      "videoState": ""
    }},
    {"game": {
      "away": {
        "conferenceNames": {
          "conferenceDisplay": "Big 12 Conference",
          "conferenceDivision": "fbs",
          "conferenceName": "Big 12",
          "conferenceSeo": "big-12"
        },
        "description": "(4-1)",
        "names": {
          "char6": "OKLA",
          "full": "University of Oklahoma",
          "seo": "oklahoma",
          "short": "Oklahoma"
        },
        "rank": "10",
        "score": "17",
        "seed": "",
        "winner": false
      },
      "bracketId": "",
      "bracketRegion": "",
      "bracketRound": "",
      "contestClock": "0:00",
      "currentPeriod": "Final",
      "finalMessage": "Final",
      "gameID": "ecabe1db-5063-4f3e-89cb-4eb8d2c8002f",
      "gameState": "final",
      "home": {
        "conferenceNames": {
          "conferenceDisplay": "Big 12 Conference",
          "conferenceDivision": "fbs",
          "conferenceName": "Big 12",
          "conferenceSeo": "big-12"
        },
        "description": "(2-4)",
        "names": {
          "char6": "TEXAS",
          "full": "University of Texas at Austin",
          "seo": "texas",
          "short": "Texas"
        },
        "rank": "",
        "score": "24",
        "seed": "",
        "winner": true
      },
      "liveVideoEnabled": false,
      "network": "",
      "startDate": "10-10-2015",
      "startTime": "12:00PM ET",
      "startTimeEpoch": "1444492800",
      "title": "Texas Oklahoma",
      "url": "/game/football/fbs/2015/10/10/oklahoma-texas",
      "videoState": ""
    }},
    {"game": {
      "away": {
        "conferenceNames": {
          "conferenceDisplay": "Conference USA",
          "conferenceDivision": "fbs",
          "conferenceName": "C-USA",
          "conferenceSeo": "conference-usa"
        },
        "description": "(2-4)",
        "names": {
          "char6": "UTEP",
          "full": "University of Texas at El Paso",
          "seo": "utep",
          "short": "UTEP"
        },
        "rank": "",
        "score": "12",
        "seed": "",
        "winner": false
      },
      "bracketId": "",
      "bracketRegion": "",
      "bracketRound": "",
      "contestClock": "0:00",
      "currentPeriod": "Final",
      "finalMessage": "Final",
      "gameID": "0827e7a1-3dd7-4e0a-a1b1-5d55a1a0825b",
      "gameState": "final",
      "home": {
        "conferenceNames": {
          "conferenceDisplay": "Conference USA",
          "conferenceDivision": "fbs",
          "conferenceName": "C-USA",
          "conferenceSeo": "conference-usa"
        },
        "description": "(3-3)",
        "names": {
          "char6": "FIU",
          "full": "Florida International University",
          "seo": "fiu",
          "short": "FIU"
        },
        "rank": "",
        "score": "52",
        "seed": "",
        "winner": true
      },
      "liveVideoEnabled": false,
      "network": "",
      "startDate": "10-10-2015",
      "startTime": "12:00PM ET",
      "startTimeEpoch": "1444492800",
      "title": "FIU UTEP",
      "url": "/game/football/fbs/2015/10/10/utep-fiu",
      "videoState": ""
    }},
    {"game": {
      "away": {
        "conferenceNames": {
          "conferenceDisplay": "Conference USA",
          "conferenceDivision": "fbs",
          "conferenceName": "C-USA",
          "conferenceSeo": "conference-usa"
        },
        "description": "(2-4)",
        "names": {
          "char6": "MIDTEN",
          "full": "Middle Tennessee State University",
          "seo": "middle-tenn",
          "short": "Middle Tenn."
        },
        "rank": "",
        "score": "28",
        "seed": "",
        "winner": false
      },
      "bracketId": "",
      "bracketRegion": "",
      "bracketRound": "",
      "contestClock": "0:00",
      "currentPeriod": "Final",
      "finalMessage": "Final",
      "gameID": "e1c52643-0491-4085-add2-aa461f2d9b15",
      "gameState": "final",
      "home": {
        "conferenceNames": {
          "conferenceDisplay": "Conference USA",
          "conferenceDivision": "fbs",
          "conferenceName": "C-USA",
          "conferenceSeo": "conference-usa"
        },
        "description": "(5-1)",
        "names": {
          "char6": "W KY",
          "full": "Western Kentucky University",
          "seo": "western-ky",
          "short": "Western Ky."
        },
        "rank": "",
        "score": "58",
        "seed": "",
        "winner": true
      },
      "liveVideoEnabled": false,
      "network": "",
      "startDate": "10-10-2015",
      "startTime": "12:00PM ET",
      "startTimeEpoch": "1444492800",
      "title": "Western Ky. Middle Tenn.",
      "url": "/game/football/fbs/2015/10/10/middle-tenn-western-ky",
      "videoState": ""
    }},
    {"game": {
      "away": {
        "conferenceNames": {
          "conferenceDisplay": "Mid-American Conference",
          "conferenceDivision": "fbs",
          "conferenceName": "MAC",
          "conferenceSeo": "mid-american"
        },
        "description": "(2-4)",
        "names": {
          "char6": "C MICH",
          "full": "Central Michigan University",
          "seo": "central-mich",
          "short": "Central Mich."
        },
        "rank": "",
        "score": "39",
        "seed": "",
        "winner": false
      },
      "bracketId": "",
      "bracketRegion": "",
      "bracketRound": "",
      "contestClock": "0:00",
      "currentPeriod": "Final",
      "finalMessage": "Final",
      "gameID": "b592c357-eec8-4220-bdb9-839facbf86a6",
      "gameState": "final",
      "home": {
        "conferenceNames": {
          "conferenceDisplay": "Mid-American Conference",
          "conferenceDivision": "fbs",
          "conferenceName": "MAC",
          "conferenceSeo": "mid-american"
        },
        "description": "(2-3)",
        "names": {
          "char6": "W MICH",
          "full": "Western Michigan University",
          "seo": "western-mich",
          "short": "Western Mich."
        },
        "rank": "",
        "score": "41",
        "seed": "",
        "winner": true
      },
      "liveVideoEnabled": false,
      "network": "",
      "startDate": "10-10-2015",
      "startTime": "12:00PM ET",
      "startTimeEpoch": "1444492800",
      "title": "Western Mich. Central Mich.",
      "url": "/game/football/fbs/2015/10/10/central-mich-western-mich",
      "videoState": ""
    }},
    {"game": {
      "away": {
        "conferenceNames": {
          "conferenceDisplay": "American Athletic Conference",
          "conferenceDivision": "fbs",
          "conferenceName": "AAC",
          "conferenceSeo": "american-athletic"
        },
        "description": "(2-3)",
        "names": {
          "char6": "TULANE",
          "full": "Tulane University",
          "seo": "tulane",
          "short": "Tulane"
        },
        "rank": "",
        "score": "10",
        "seed": "",
        "winner": false
      },
      "bracketId": "",
      "bracketRegion": "",
      "bracketRound": "",
      "contestClock": "0:00",
      "currentPeriod": "Final",
      "finalMessage": "Final",
      "gameID": "934b71de-a6b4-48bc-b0d8-b061f6a42b8e",
      "gameState": "final",
      "home": {
        "conferenceNames": {
          "conferenceDisplay": "American Athletic Conference",
          "conferenceDivision": "fbs",
          "conferenceName": "AAC",
          "conferenceSeo": "american-athletic"
        },
        "description": "(5-0)",
        "names": {
          "char6": "TEMPLE",
          "full": "Temple University",
          "seo": "temple",
          "short": "Temple"
        },
        "rank": "",
        "score": "49",
        "seed": "",
        "winner": true
      },
      "liveVideoEnabled": false,
      "network": "",
      "startDate": "10-10-2015",
      "startTime": "12:00PM ET",
      "startTimeEpoch": "1444492800",
      "title": "Temple Tulane",
      "url": "/game/football/fbs/2015/10/10/tulane-temple",
      "videoState": ""
    }},
    {"game": {
      "away": {
        "conferenceNames": {
          "conferenceDisplay": "Atlantic Coast Conference",
          "conferenceDivision": "fbs",
          "conferenceName": "ACC",
          "conferenceSeo": "atlantic-coast"
        },
        "description": "(5-1)",
        "names": {
          "char6": "DUKE",
          "full": "Duke University",
          "seo": "duke",
          "short": "Duke"
        },
        "rank": "",
        "score": "44",
        "seed": "",
        "winner": true
      },
      "bracketId": "",
      "bracketRegion": "",
      "bracketRound": "",
      "contestClock": "0:00",
      "currentPeriod": "Final",
      "finalMessage": "Final",
      "gameID": "84d4b64e-708c-441e-9b96-d58b0d694897",
      "gameState": "final",
      "home": {
        "conferenceNames": {
          "conferenceDisplay": "FBS Independent",
          "conferenceDivision": "fbs",
          "conferenceName": "IND",
          "conferenceSeo": "fbs-independent"
        },
        "description": "(1-5)",
        "names": {
          "char6": "ARMY",
          "full": "U.S. Military Academy",
          "seo": "army",
          "short": "Army"
        },
        "rank": "",
        "score": "3",
        "seed": "",
        "winner": false
      },
      "liveVideoEnabled": false,
      "network": "",
      "startDate": "10-10-2015",
      "startTime": "12:00PM ET",
      "startTimeEpoch": "1444492800",
      "title": "Army Duke",
      "url": "/game/football/fbs/2015/10/10/duke-army",
      "videoState": ""
    }},
    {"game": {
      "away": {
        "conferenceNames": {
          "conferenceDisplay": "Atlantic Coast Conference",
          "conferenceDivision": "fbs",
          "conferenceName": "ACC",
          "conferenceSeo": "atlantic-coast"
        },
        "description": "(1-4)",
        "names": {
          "char6": "UVA",
          "full": "University of Virginia",
          "seo": "virginia",
          "short": "Virginia"
        },
        "rank": "",
        "score": "19",
        "seed": "",
        "winner": false
      },
      "bracketId": "",
      "bracketRegion": "",
      "bracketRound": "",
      "contestClock": "0:00",
      "currentPeriod": "Final",
      "finalMessage": "Final",
      "gameID": "4aba9dae-fe0b-4d51-ac44-5500c54765b5",
      "gameState": "final",
      "home": {
        "conferenceNames": {
          "conferenceDisplay": "Atlantic Coast Conference",
          "conferenceDivision": "fbs",
          "conferenceName": "ACC",
          "conferenceSeo": "atlantic-coast"
        },
        "description": "(4-1)",
        "names": {
          "char6": "PITT",
          "full": "University of Pittsburgh",
          "seo": "pittsburgh",
          "short": "Pittsburgh"
        },
        "rank": "",
        "score": "26",
        "seed": "",
        "winner": true
      },
      "liveVideoEnabled": false,
      "network": "",
      "startDate": "10-10-2015",
      "startTime": "12:30PM ET",
      "startTimeEpoch": "1444494600",
      "title": "Pittsburgh Virginia",
      "url": "/game/football/fbs/2015/10/10/virginia-pittsburgh",
      "videoState": ""
    }},
    {"game": {
      "away": {
        "conferenceNames": {
          "conferenceDisplay": "FBS Independent",
          "conferenceDivision": "fbs",
          "conferenceName": "IND",
          "conferenceSeo": "fbs-independent"
        },
        "description": "(1-4)",
        "names": {
          "char6": "UMASS",
          "full": "University of Massachusetts, Amherst",
          "seo": "massachusetts",
          "short": "Massachusetts"
        },
        "rank": "",
        "score": "38",
        "seed": "",
        "winner": false
      },
      "bracketId": "",
      "bracketRegion": "",
      "bracketRound": "",
      "contestClock": "0:00",
      "currentPeriod": "Final",
      "finalMessage": "Final",
      "gameID": "d8a6e535-e733-4751-a1bb-934e27919366",
      "gameState": "final",
      "home": {
        "conferenceNames": {
          "conferenceDisplay": "Mid-American Conference",
          "conferenceDivision": "fbs",
          "conferenceName": "MAC",
          "conferenceSeo": "mid-american"
        },
        "description": "(4-2)",
        "names": {
          "char6": "BGSU",
          "full": "Bowling Green State University",
          "seo": "bowling-green",
          "short": "Bowling Green"
        },
        "rank": "",
        "score": "62",
        "seed": "",
        "winner": true
      },
      "liveVideoEnabled": false,
      "network": "",
      "startDate": "10-10-2015",
      "startTime": "02:00PM ET",
      "startTimeEpoch": "1444500000",
      "title": "Bowling Green Massachusetts",
      "url": "/game/football/fbs/2015/10/10/massachusetts-bowling-green",
      "videoState": ""
    }},
    {"game": {
      "away": {
        "conferenceNames": {
          "conferenceDisplay": "Mid-American Conference",
          "conferenceDivision": "fbs",
          "conferenceName": "MAC",
          "conferenceSeo": "mid-american"
        },
        "description": "(1-5)",
        "names": {
          "char6": "MIA OH",
          "full": "Miami University (Ohio)",
          "seo": "miami-oh",
          "short": "Miami (OH)"
        },
        "rank": "",
        "score": "3",
        "seed": "",
        "winner": false
      },
      "bracketId": "",
      "bracketRegion": "",
      "bracketRound": "",
      "contestClock": "0:00",
      "currentPeriod": "Final",
      "finalMessage": "Final",
      "gameID": "a27cd455-c076-4728-b4d2-2ba5cbbf21d6",
      "gameState": "final",
      "home": {
        "conferenceNames": {
          "conferenceDisplay": "Mid-American Conference",
          "conferenceDivision": "fbs",
          "conferenceName": "MAC",
          "conferenceSeo": "mid-american"
        },
        "description": "(5-1)",
        "names": {
          "char6": "OHIO",
          "full": "Ohio University",
          "seo": "ohio",
          "short": "Ohio"
        },
        "rank": "",
        "score": "34",
        "seed": "",
        "winner": true
      },
      "liveVideoEnabled": false,
      "network": "",
      "startDate": "10-10-2015",
      "startTime": "02:00PM ET",
      "startTimeEpoch": "1444500000",
      "title": "Ohio Miami (OH)",
      "url": "/game/football/fbs/2015/10/10/miami-oh-ohio",
      "videoState": ""
    }},
    {"game": {
      "away": {
        "conferenceNames": {
          "conferenceDisplay": "Conference USA",
          "conferenceDivision": "fbs",
          "conferenceName": "C-USA",
          "conferenceSeo": "conference-usa"
        },
        "description": "(3-3)",
        "names": {
          "char6": "RICE",
          "full": "Rice University",
          "seo": "rice",
          "short": "Rice"
        },
        "rank": "",
        "score": "27",
        "seed": "",
        "winner": true
      },
      "bracketId": "",
      "bracketRegion": "",
      "bracketRound": "",
      "contestClock": "0:00",
      "currentPeriod": "Final",
      "finalMessage": "Final",
      "gameID": "b65f4cd9-eb31-47c0-8af3-065cc9a3280c",
      "gameState": "final",
      "home": {
        "conferenceNames": {
          "conferenceDisplay": "Conference USA",
          "conferenceDivision": "fbs",
          "conferenceName": "C-USA",
          "conferenceSeo": "conference-usa"
        },
        "description": "(1-4)",
        "names": {
          "char6": "FAU",
          "full": "Florida Atlantic University",
          "seo": "fla-atlantic",
          "short": "Fla. Atlantic"
        },
        "rank": "",
        "score": "26",
        "seed": "",
        "winner": false
      },
      "liveVideoEnabled": false,
      "network": "",
      "startDate": "10-10-2015",
      "startTime": "02:30PM ET",
      "startTimeEpoch": "1444501800",
      "title": "Fla. Atlantic Rice",
      "url": "/game/football/fbs/2015/10/10/rice-fla-atlantic",
      "videoState": ""
    }},
    {"game": {
      "away": {
        "conferenceNames": {
          "conferenceDisplay": "Mid-American Conference",
          "conferenceDivision": "fbs",
          "conferenceName": "MAC",
          "conferenceSeo": "mid-american"
        },
        "description": "(2-4)",
        "names": {
          "char6": "KENT",
          "full": "Kent State University",
          "seo": "kent-st",
          "short": "Kent St."
        },
        "rank": "",
        "score": "7",
        "seed": "",
        "winner": false
      },
      "bracketId": "",
      "bracketRegion": "",
      "bracketRound": "",
      "contestClock": "0:00",
      "currentPeriod": "Final",
      "finalMessage": "Final",
      "gameID": "d7fb0927-55ba-46e1-8846-d549105d111c",
      "gameState": "final",
      "home": {
        "conferenceNames": {
          "conferenceDisplay": "Mid-American Conference",
          "conferenceDivision": "fbs",
          "conferenceName": "MAC",
          "conferenceSeo": "mid-american"
        },
        "description": "(5-0)",
        "names": {
          "char6": "TOLEDO",
          "full": "University of Toledo",
          "seo": "toledo",
          "short": "Toledo"
        },
        "rank": "24",
        "score": "38",
        "seed": "",
        "winner": true
      },
      "liveVideoEnabled": false,
      "network": "",
      "startDate": "10-10-2015",
      "startTime": "03:00PM ET",
      "startTimeEpoch": "1444503600",
      "title": "Toledo Kent St.",
      "url": "/game/football/fbs/2015/10/10/kent-st-toledo",
      "videoState": ""
    }},
    {"game": {
      "away": {
        "conferenceNames": {
          "conferenceDisplay": "Mid-American Conference",
          "conferenceDivision": "fbs",
          "conferenceName": "MAC",
          "conferenceSeo": "mid-american"
        },
        "description": "(3-3)",
        "names": {
          "char6": "AKRON",
          "full": "University of Akron",
          "seo": "akron",
          "short": "Akron"
        },
        "rank": "",
        "score": "47",
        "seed": "",
        "winner": true
      },
      "bracketId": "",
      "bracketRegion": "",
      "bracketRound": "",
      "contestClock": "0:00",
      "currentPeriod": "Final",
      "finalMessage": "Final",
      "gameID": "8267e91b-9c87-4894-aefe-4f138f0eee31",
      "gameState": "final",
      "home": {
        "conferenceNames": {
          "conferenceDisplay": "Mid-American Conference",
          "conferenceDivision": "fbs",
          "conferenceName": "MAC",
          "conferenceSeo": "mid-american"
        },
        "description": "(1-5)",
        "names": {
          "char6": "E MICH",
          "full": "Eastern Michigan University",
          "seo": "eastern-mich",
          "short": "Eastern Mich."
        },
        "rank": "",
        "score": "21",
        "seed": "",
        "winner": false
      },
      "liveVideoEnabled": false,
      "network": "",
      "startDate": "10-10-2015",
      "startTime": "03:00PM ET",
      "startTimeEpoch": "1444503600",
      "title": "Eastern Mich. Akron",
      "url": "/game/football/fbs/2015/10/10/akron-eastern-mich",
      "videoState": ""
    }},
    {"game": {
      "away": {
        "conferenceNames": {
          "conferenceDisplay": "Atlantic Coast Conference",
          "conferenceDivision": "fbs",
          "conferenceName": "ACC",
          "conferenceSeo": "atlantic-coast"
        },
        "description": "(3-3)",
        "names": {
          "char6": "WAKE",
          "full": "Wake Forest University",
          "seo": "wake-forest",
          "short": "Wake Forest"
        },
        "rank": "",
        "score": "3",
        "seed": "",
        "winner": true
      },
      "bracketId": "",
      "bracketRegion": "",
      "bracketRound": "",
      "contestClock": "0:00",
      "currentPeriod": "Final",
      "finalMessage": "Final",
      "gameID": "efb6ba34-8a2a-4fd5-8dea-fe028fda2c00",
      "gameState": "final",
      "home": {
        "conferenceNames": {
          "conferenceDisplay": "Atlantic Coast Conference",
          "conferenceDivision": "fbs",
          "conferenceName": "ACC",
          "conferenceSeo": "atlantic-coast"
        },
        "description": "(3-3)",
        "names": {
          "char6": "BC",
          "full": "Boston College",
          "seo": "boston-college",
          "short": "Boston College"
        },
        "rank": "",
        "score": "0",
        "seed": "",
        "winner": false
      },
      "liveVideoEnabled": false,
      "network": "",
      "startDate": "10-10-2015",
      "startTime": "03:00PM ET",
      "startTimeEpoch": "1444503600",
      "title": "Boston College Wake Forest",
      "url": "/game/football/fbs/2015/10/10/wake-forest-boston-college",
      "videoState": ""
    }},
    {"game": {
      "away": {
        "conferenceNames": {
          "conferenceDisplay": "Mid-American Conference",
          "conferenceDivision": "fbs",
          "conferenceName": "MAC",
          "conferenceSeo": "mid-american"
        },
        "description": "(2-4)",
        "names": {
          "char6": "BALLST",
          "full": "Ball State University",
          "seo": "ball-st",
          "short": "Ball St."
        },
        "rank": "",
        "score": "41",
        "seed": "",
        "winner": false
      },
      "bracketId": "",
      "bracketRegion": "",
      "bracketRound": "",
      "contestClock": "0:00",
      "currentPeriod": "Final",
      "finalMessage": "Final",
      "gameID": "ae7adb8a-d114-49f7-bf1b-42a3b623c261",
      "gameState": "final",
      "home": {
        "conferenceNames": {
          "conferenceDisplay": "Mid-American Conference",
          "conferenceDivision": "fbs",
          "conferenceName": "MAC",
          "conferenceSeo": "mid-american"
        },
        "description": "(3-3)",
        "names": {
          "char6": "NIU",
          "full": "Northern Illinois University",
          "seo": "northern-ill",
          "short": "Northern Ill."
        },
        "rank": "",
        "score": "59",
        "seed": "",
        "winner": true
      },
      "liveVideoEnabled": false,
      "network": "",
      "startDate": "10-10-2015",
      "startTime": "03:30PM ET",
      "startTimeEpoch": "1444505400",
      "title": "Northern Ill. Ball St.",
      "url": "/game/football/fbs/2015/10/10/ball-st-northern-ill",
      "videoState": ""
    }},
    {"game": {
      "away": {
        "conferenceNames": {
          "conferenceDisplay": "Sun Belt Conference",
          "conferenceDivision": "fbs",
          "conferenceName": "Sun Belt",
          "conferenceSeo": "sun-belt"
        },
        "description": "(4-1)",
        "names": {
          "char6": "APP ST",
          "full": "Appalachian State University",
          "seo": "appalachian-st",
          "short": "Appalachian St."
        },
        "rank": "",
        "score": "37",
        "seed": "",
        "winner": true
      },
      "bracketId": "",
      "bracketRegion": "",
      "bracketRound": "",
      "contestClock": "0:00",
      "currentPeriod": "Final",
      "finalMessage": "Final",
      "gameID": "6e278ab4-1fb1-460a-b4b9-f1cb5d64e447",
      "gameState": "final",
      "home": {
        "conferenceNames": {
          "conferenceDisplay": "Sun Belt Conference",
          "conferenceDivision": "fbs",
          "conferenceName": "Sun Belt",
          "conferenceSeo": "sun-belt"
        },
        "description": "(1-4)",
        "names": {
          "char6": "GA ST",
          "full": "Georgia State University",
          "seo": "georgia-st",
          "short": "Georgia St."
        },
        "rank": "",
        "score": "3",
        "seed": "",
        "winner": false
      },
      "liveVideoEnabled": false,
      "network": "",
      "startDate": "10-10-2015",
      "startTime": "03:30PM ET",
      "startTimeEpoch": "1444505400",
      "title": "Georgia St. Appalachian St.",
      "url": "/game/football/fbs/2015/10/10/appalachian-st-georgia-st",
      "videoState": ""
    }},
    {"game": {
      "away": {
        "conferenceNames": {
          "conferenceDisplay": "Big 12 Conference",
          "conferenceDivision": "fbs",
          "conferenceName": "Big 12",
          "conferenceSeo": "big-12"
        },
        "description": "(2-3)",
        "names": {
          "char6": "IOWAST",
          "full": "Iowa State University",
          "seo": "iowa-st",
          "short": "Iowa St."
        },
        "rank": "",
        "score": "31",
        "seed": "",
        "winner": false
      },
      "bracketId": "",
      "bracketRegion": "",
      "bracketRound": "",
      "contestClock": "0:00",
      "currentPeriod": "Final",
      "finalMessage": "Final",
      "gameID": "38c3d38d-522e-409e-b41f-65cdd34cc122",
      "gameState": "final",
      "home": {
        "conferenceNames": {
          "conferenceDisplay": "Big 12 Conference",
          "conferenceDivision": "fbs",
          "conferenceName": "Big 12",
          "conferenceSeo": "big-12"
        },
        "description": "(4-2)",
        "names": {
          "char6": "TXTECH",
          "full": "Texas Tech University",
          "seo": "texas-tech",
          "short": "Texas Tech"
        },
        "rank": "",
        "score": "66",
        "seed": "",
        "winner": true
      },
      "liveVideoEnabled": false,
      "network": "",
      "startDate": "10-10-2015",
      "startTime": "03:30PM ET",
      "startTimeEpoch": "1444505400",
      "title": "Texas Tech Iowa St.",
      "url": "/game/football/fbs/2015/10/10/iowa-st-texas-tech",
      "videoState": ""
    }},
    {"game": {
      "away": {
        "conferenceNames": {
          "conferenceDisplay": "Big Ten Conference",
          "conferenceDivision": "fbs",
          "conferenceName": "Big Ten",
          "conferenceSeo": "big-ten"
        },
        "description": "(5-1)",
        "names": {
          "char6": "NWSTRN",
          "full": "Northwestern University",
          "seo": "northwestern",
          "short": "Northwestern"
        },
        "rank": "13",
        "score": "0",
        "seed": "",
        "winner": false
      },
      "bracketId": "",
      "bracketRegion": "",
      "bracketRound": "",
      "contestClock": "0:00",
      "currentPeriod": "Final",
      "finalMessage": "Final",
      "gameID": "890f824f-d5b1-4488-98fe-cbd5d0638632",
      "gameState": "final",
      "home": {
        "conferenceNames": {
          "conferenceDisplay": "Big Ten Conference",
          "conferenceDivision": "fbs",
          "conferenceName": "Big Ten",
          "conferenceSeo": "big-ten"
        },
        "description": "(5-1)",
        "names": {
          "char6": "MICH",
          "full": "University of Michigan",
          "seo": "michigan",
          "short": "Michigan"
        },
        "rank": "18",
        "score": "38",
        "seed": "",
        "winner": true
      },
      "liveVideoEnabled": false,
      "network": "",
      "startDate": "10-10-2015",
      "startTime": "03:30PM ET",
      "startTimeEpoch": "1444505400",
      "title": "Michigan Northwestern",
      "url": "/game/football/fbs/2015/10/10/northwestern-michigan",
      "videoState": ""
    }},
    {"game": {
      "away": {
        "conferenceNames": {
          "conferenceDisplay": "Big Ten Conference",
          "conferenceDivision": "fbs",
          "conferenceName": "Big Ten",
          "conferenceSeo": "big-ten"
        },
        "description": "(4-2)",
        "names": {
          "char6": "MINN",
          "full": "University of Minnesota, Twin Cities",
          "seo": "minnesota",
          "short": "Minnesota"
        },
        "rank": "",
        "score": "41",
        "seed": "",
        "winner": true
      },
      "bracketId": "",
      "bracketRegion": "",
      "bracketRound": "",
      "contestClock": "0:00",
      "currentPeriod": "Final",
      "finalMessage": "Final",
      "gameID": "d3ac6183-d593-4a55-ab14-cce6d030bc52",
      "gameState": "final",
      "home": {
        "conferenceNames": {
          "conferenceDisplay": "Big Ten Conference",
          "conferenceDivision": "fbs",
          "conferenceName": "Big Ten",
          "conferenceSeo": "big-ten"
        },
        "description": "(1-5)",
        "names": {
          "char6": "PURDUE",
          "full": "Purdue University",
          "seo": "purdue",
          "short": "Purdue"
        },
        "rank": "",
        "score": "13",
        "seed": "",
        "winner": false
      },
      "liveVideoEnabled": false,
      "network": "",
      "startDate": "10-10-2015",
      "startTime": "03:30PM ET",
      "startTimeEpoch": "1444505400",
      "title": "Purdue Minnesota",
      "url": "/game/football/fbs/2015/10/10/minnesota-purdue",
      "videoState": ""
    }},
    {"game": {
      "away": {
        "conferenceNames": {
          "conferenceDisplay": "Big Ten Conference",
          "conferenceDivision": "fbs",
          "conferenceName": "Big Ten",
          "conferenceSeo": "big-ten"
        },
        "description": "(4-2)",
        "names": {
          "char6": "WISC",
          "full": "University of Wisconsin, Madison",
          "seo": "wisconsin",
          "short": "Wisconsin"
        },
        "rank": "",
        "score": "23",
        "seed": "",
        "winner": true
      },
      "bracketId": "",
      "bracketRegion": "",
      "bracketRound": "",
      "contestClock": "0:00",
      "currentPeriod": "Final",
      "finalMessage": "Final",
      "gameID": "cfe0585e-0b26-45fb-ab5e-15b91204674f",
      "gameState": "final",
      "home": {
        "conferenceNames": {
          "conferenceDisplay": "Big Ten Conference",
          "conferenceDivision": "fbs",
          "conferenceName": "Big Ten",
          "conferenceSeo": "big-ten"
        },
        "description": "(2-4)",
        "names": {
          "char6": "NEB",
          "full": "University of Nebraska, Lincoln",
          "seo": "nebraska",
          "short": "Nebraska"
        },
        "rank": "",
        "score": "21",
        "seed": "",
        "winner": false
      },
      "liveVideoEnabled": false,
      "network": "",
      "startDate": "10-10-2015",
      "startTime": "03:30PM ET",
      "startTimeEpoch": "1444505400",
      "title": "Nebraska Wisconsin",
      "url": "/game/football/fbs/2015/10/10/wisconsin-nebraska",
      "videoState": ""
    }},
    {"game": {
      "away": {
        "conferenceNames": {
          "conferenceDisplay": "Southeastern Conference",
          "conferenceDivision": "fbs",
          "conferenceName": "SEC",
          "conferenceSeo": "southeastern"
        },
        "description": "(4-2)",
        "names": {
          "char6": "UGA",
          "full": "University of Georgia",
          "seo": "georgia",
          "short": "Georgia"
        },
        "rank": "19",
        "score": "31",
        "seed": "",
        "winner": false
      },
      "bracketId": "",
      "bracketRegion": "",
      "bracketRound": "",
      "contestClock": "0:00",
      "currentPeriod": "Final",
      "finalMessage": "Final",
      "gameID": "a4da5f79-810f-4349-bd62-d2ae00081f35",
      "gameState": "final",
      "home": {
        "conferenceNames": {
          "conferenceDisplay": "Southeastern Conference",
          "conferenceDivision": "fbs",
          "conferenceName": "SEC",
          "conferenceSeo": "southeastern"
        },
        "description": "(3-3)",
        "names": {
          "char6": "TENN",
          "full": "University of Tennessee, Knoxville",
          "seo": "tennessee",
          "short": "Tennessee"
        },
        "rank": "",
        "score": "38",
        "seed": "",
        "winner": true
      },
      "liveVideoEnabled": false,
      "network": "",
      "startDate": "10-10-2015",
      "startTime": "03:30PM ET",
      "startTimeEpoch": "1444505400",
      "title": "Tennessee Georgia",
      "url": "/game/football/fbs/2015/10/10/georgia-tennessee",
      "videoState": ""
    }},
    {"game": {
      "away": {
        "conferenceNames": {
          "conferenceDisplay": "Southeastern Conference",
          "conferenceDivision": "fbs",
          "conferenceName": "SEC",
          "conferenceSeo": "southeastern"
        },
        "description": "(5-0)",
        "names": {
          "char6": "LSU",
          "full": "Louisiana State University",
          "seo": "lsu",
          "short": "LSU"
        },
        "rank": "7",
        "score": "45",
        "seed": "",
        "winner": true
      },
      "bracketId": "",
      "bracketRegion": "",
      "bracketRound": "",
      "contestClock": "0:00",
      "currentPeriod": "Final",
      "finalMessage": "Final",
      "gameID": "a12ada8e-fddf-4d06-b8fe-20be4709a399",
      "gameState": "final",
      "home": {
        "conferenceNames": {
          "conferenceDisplay": "Southeastern Conference",
          "conferenceDivision": "fbs",
          "conferenceName": "SEC",
          "conferenceSeo": "southeastern"
        },
        "description": "(2-4)",
        "names": {
          "char6": "S CAR",
          "full": "University of South Carolina, Columbia",
          "seo": "south-carolina",
          "short": "South Carolina"
        },
        "rank": "",
        "score": "24",
        "seed": "",
        "winner": false
      },
      "liveVideoEnabled": false,
      "network": "",
      "startDate": "10-10-2015",
      "startTime": "03:30PM ET",
      "startTimeEpoch": "1444505400",
      "title": "South Carolina LSU",
      "url": "/game/football/fbs/2015/10/10/lsu-south-carolina",
      "videoState": ""
    }},
    {"game": {
      "away": {
        "conferenceNames": {
          "conferenceDisplay": "Atlantic Coast Conference",
          "conferenceDivision": "fbs",
          "conferenceName": "ACC",
          "conferenceSeo": "atlantic-coast"
        },
        "description": "(3-2)",
        "names": {
          "char6": "SYR",
          "full": "Syracuse University",
          "seo": "syracuse",
          "short": "Syracuse"
        },
        "rank": "",
        "score": "24",
        "seed": "",
        "winner": false
      },
      "bracketId": "",
      "bracketRegion": "",
      "bracketRound": "",
      "contestClock": "0:00",
      "currentPeriod": "Final",
      "finalMessage": "Final",
      "gameID": "096f61a6-7ef5-47c4-bc21-70021f09c770",
      "gameState": "final",
      "home": {
        "conferenceNames": {
          "conferenceDisplay": "American Athletic Conference",
          "conferenceDivision": "fbs",
          "conferenceName": "AAC",
          "conferenceSeo": "american-athletic"
        },
        "description": "(2-3)",
        "names": {
          "char6": "USF",
          "full": "University of South Florida",
          "seo": "south-fla",
          "short": "South Fla."
        },
        "rank": "",
        "score": "45",
        "seed": "",
        "winner": true
      },
      "liveVideoEnabled": false,
      "network": "",
      "startDate": "10-10-2015",
      "startTime": "03:30PM ET",
      "startTimeEpoch": "1444505400",
      "title": "South Fla. Syracuse",
      "url": "/game/football/fbs/2015/10/10/syracuse-south-fla",
      "videoState": ""
    }},
    {"game": {
      "away": {
        "conferenceNames": {
          "conferenceDisplay": "Atlantic Coast Conference",
          "conferenceDivision": "fbs",
          "conferenceName": "ACC",
          "conferenceSeo": "atlantic-coast"
        },
        "description": "(2-4)",
        "names": {
          "char6": "GATECH",
          "full": "Georgia Institute of Technology",
          "seo": "georgia-tech",
          "short": "Georgia Tech"
        },
        "rank": "",
        "score": "24",
        "seed": "",
        "winner": false
      },
      "bracketId": "",
      "bracketRegion": "",
      "bracketRound": "",
      "contestClock": "0:00",
      "currentPeriod": "Final",
      "finalMessage": "Final",
      "gameID": "ac5bfc22-b286-4d35-ac29-4d7d37ad32e3",
      "gameState": "final",
      "home": {
        "conferenceNames": {
          "conferenceDisplay": "Atlantic Coast Conference",
          "conferenceDivision": "fbs",
          "conferenceName": "ACC",
          "conferenceSeo": "atlantic-coast"
        },
        "description": "(5-0)",
        "names": {
          "char6": "CLEM",
          "full": "Clemson University",
          "seo": "clemson",
          "short": "Clemson"
        },
        "rank": "6",
        "score": "43",
        "seed": "",
        "winner": true
      },
      "liveVideoEnabled": false,
      "network": "",
      "startDate": "10-10-2015",
      "startTime": "03:30PM ET",
      "startTimeEpoch": "1444505400",
      "title": "Clemson Georgia Tech",
      "url": "/game/football/fbs/2015/10/10/georgia-tech-clemson",
      "videoState": ""
    }},
    {"game": {
      "away": {
        "conferenceNames": {
          "conferenceDisplay": "American Athletic Conference",
          "conferenceDivision": "fbs",
          "conferenceName": "AAC",
          "conferenceSeo": "american-athletic"
        },
        "description": "(4-1)",
        "names": {
          "char6": "NAVY",
          "full": "U.S. Naval Academy",
          "seo": "navy",
          "short": "Navy"
        },
        "rank": "",
        "score": "24",
        "seed": "",
        "winner": false
      },
      "bracketId": "",
      "bracketRegion": "",
      "bracketRound": "",
      "contestClock": "0:00",
      "currentPeriod": "Final",
      "finalMessage": "Final",
      "gameID": "c1af1288-4c30-475e-8567-cfb38dafa4c6",
      "gameState": "final",
      "home": {
        "conferenceNames": {
          "conferenceDisplay": "FBS Independent",
          "conferenceDivision": "fbs",
          "conferenceName": "IND",
          "conferenceSeo": "fbs-independent"
        },
        "description": "(5-1)",
        "names": {
          "char6": "N DAME",
          "full": "University of Notre Dame",
          "seo": "notre-dame",
          "short": "Notre Dame"
        },
        "rank": "15",
        "score": "41",
        "seed": "",
        "winner": true
      },
      "liveVideoEnabled": false,
      "network": "",
      "startDate": "10-10-2015",
      "startTime": "03:30PM ET",
      "startTimeEpoch": "1444505400",
      "title": "Notre Dame Navy",
      "url": "/game/football/fbs/2015/10/10/navy-notre-dame",
      "videoState": ""
    }},
    {"game": {
      "away": {
        "conferenceNames": {
          "conferenceDisplay": "American Athletic Conference",
          "conferenceDivision": "fbs",
          "conferenceName": "AAC",
          "conferenceSeo": "american-athletic"
        },
        "description": "(3-3)",
        "names": {
          "char6": "UCONN",
          "full": "University of Connecticut",
          "seo": "uconn",
          "short": "UConn"
        },
        "rank": "",
        "score": "40",
        "seed": "",
        "winner": true
      },
      "bracketId": "",
      "bracketRegion": "",
      "bracketRound": "",
      "contestClock": "0:00",
      "currentPeriod": "Final",
      "finalMessage": "Final",
      "gameID": "1aa53c88-819d-4b9a-9f27-9fc629bce375",
      "gameState": "final",
      "home": {
        "conferenceNames": {
          "conferenceDisplay": "American Athletic Conference",
          "conferenceDivision": "fbs",
          "conferenceName": "AAC",
          "conferenceSeo": "american-athletic"
        },
        "description": "(0-6)",
        "names": {
          "char6": "UCF",
          "full": "University of Central Florida",
          "seo": "ucf",
          "short": "UCF"
        },
        "rank": "",
        "score": "13",
        "seed": "",
        "winner": false
      },
      "liveVideoEnabled": false,
      "network": "",
      "startDate": "10-10-2015",
      "startTime": "03:45PM ET",
      "startTimeEpoch": "1444506300",
      "title": "UCF UConn",
      "url": "/game/football/fbs/2015/10/10/uconn-ucf",
      "videoState": ""
    }},
    {"game": {
      "away": {
        "conferenceNames": {
          "conferenceDisplay": "Pac-12 Conference",
          "conferenceDivision": "fbs",
          "conferenceName": "Pac-12",
          "conferenceSeo": "pac-12"
        },
        "description": "(2-3)",
        "names": {
          "char6": "ORE ST",
          "full": "Oregon State University",
          "seo": "oregon-st",
          "short": "Oregon St."
        },
        "rank": "",
        "score": "7",
        "seed": "",
        "winner": false
      },
      "bracketId": "",
      "bracketRegion": "",
      "bracketRound": "",
      "contestClock": "0:00",
      "currentPeriod": "Final",
      "finalMessage": "Final",
      "gameID": "9013b3b2-30bd-4f01-af0c-a32caeaeca3e",
      "gameState": "final",
      "home": {
        "conferenceNames": {
          "conferenceDisplay": "Pac-12 Conference",
          "conferenceDivision": "fbs",
          "conferenceName": "Pac-12",
          "conferenceSeo": "pac-12"
        },
        "description": "(4-2)",
        "names": {
          "char6": "ARIZ",
          "full": "University of Arizona",
          "seo": "arizona",
          "short": "Arizona"
        },
        "rank": "",
        "score": "44",
        "seed": "",
        "winner": true
      },
      "liveVideoEnabled": false,
      "network": "",
      "startDate": "10-10-2015",
      "startTime": "04:00PM ET",
      "startTimeEpoch": "1444507200",
      "title": "Arizona Oregon St.",
      "url": "/game/football/fbs/2015/10/10/oregon-st-arizona",
      "videoState": ""
    }},
    {"game": {
      "away": {
        "conferenceNames": {
          "conferenceDisplay": "Sun Belt Conference",
          "conferenceDivision": "fbs",
          "conferenceName": "Sun Belt",
          "conferenceSeo": "sun-belt"
        },
        "description": "(1-4)",
        "names": {
          "char6": "TROY",
          "full": "Troy University",
          "seo": "troy",
          "short": "Troy"
        },
        "rank": "",
        "score": "17",
        "seed": "",
        "winner": false
      },
      "bracketId": "",
      "bracketRegion": "",
      "bracketRound": "",
      "contestClock": "0:00",
      "currentPeriod": "Final",
      "finalMessage": "Final",
      "gameID": "50d50ffb-82f2-4f8e-97fe-19574cc0506b",
      "gameState": "final",
      "home": {
        "conferenceNames": {
          "conferenceDisplay": "Southeastern Conference",
          "conferenceDivision": "fbs",
          "conferenceName": "SEC",
          "conferenceSeo": "southeastern"
        },
        "description": "(4-2)",
        "names": {
          "char6": "MISSST",
          "full": "Mississippi State University",
          "seo": "mississippi-st",
          "short": "Mississippi St."
        },
        "rank": "",
        "score": "45",
        "seed": "",
        "winner": true
      },
      "liveVideoEnabled": false,
      "network": "",
      "startDate": "10-10-2015",
      "startTime": "04:00PM ET",
      "startTimeEpoch": "1444507200",
      "title": "Mississippi St. Troy",
      "url": "/game/football/fbs/2015/10/10/troy-mississippi-st",
      "videoState": ""
    }},
    {"game": {
      "away": {
        "conferenceNames": {
          "conferenceDisplay": "Big Sky Conference",
          "conferenceDivision": "fcs",
          "conferenceName": "Big Sky",
          "conferenceSeo": "big-sky"
        },
        "description": "(4-1)",
        "names": {
          "char6": "PORTST",
          "full": "Portland State University",
          "seo": "portland-st",
          "short": "Portland St."
        },
        "rank": "",
        "score": "66",
        "seed": "",
        "winner": true
      },
      "bracketId": "",
      "bracketRegion": "",
      "bracketRound": "",
      "contestClock": "0:00",
      "currentPeriod": "Final",
      "finalMessage": "Final",
      "gameID": "637f2f0c-5ebc-4f13-b206-c1c51c9332bd",
      "gameState": "final",
      "home": {
        "conferenceNames": {
          "conferenceDisplay": "Conference USA",
          "conferenceDivision": "fbs",
          "conferenceName": "C-USA",
          "conferenceSeo": "conference-usa"
        },
        "description": "(0-5)",
        "names": {
          "char6": "NO TEX",
          "full": "University of North Texas",
          "seo": "north-texas",
          "short": "North Texas"
        },
        "rank": "",
        "score": "7",
        "seed": "",
        "winner": false
      },
      "liveVideoEnabled": false,
      "network": "",
      "startDate": "10-10-2015",
      "startTime": "05:00PM ET",
      "startTimeEpoch": "1444510800",
      "title": "North Texas Portland St.",
      "url": "/game/football/fbs/2015/10/10/portland-st-north-texas",
      "videoState": ""
    }},
    {"game": {
      "away": {
        "conferenceNames": {
          "conferenceDisplay": "Pac-12 Conference",
          "conferenceDivision": "fbs",
          "conferenceName": "Pac-12",
          "conferenceSeo": "pac-12"
        },
        "description": "(3-2)",
        "names": {
          "char6": "WASHST",
          "full": "Washington State University",
          "seo": "washington-st",
          "short": "Washington St."
        },
        "rank": "",
        "score": "45",
        "seed": "",
        "winner": true
      },
      "bracketId": "",
      "bracketRegion": "",
      "bracketRound": "",
      "contestClock": "0:00",
      "currentPeriod": "Final (2OT)",
      "finalMessage": "Final (2OT)",
      "gameID": "ebbc1ad8-ce45-4a4b-a3e7-12e29d3f656c",
      "gameState": "final",
      "home": {
        "conferenceNames": {
          "conferenceDisplay": "Pac-12 Conference",
          "conferenceDivision": "fbs",
          "conferenceName": "Pac-12",
          "conferenceSeo": "pac-12"
        },
        "description": "(3-3)",
        "names": {
          "char6": "OREGN",
          "full": "University of Oregon",
          "seo": "oregon",
          "short": "Oregon"
        },
        "rank": "",
        "score": "38",
        "seed": "",
        "winner": false
      },
      "liveVideoEnabled": false,
      "network": "",
      "startDate": "10-10-2015",
      "startTime": "06:00PM ET",
      "startTimeEpoch": "1444514400",
      "title": "Oregon Washington St.",
      "url": "/game/football/fbs/2015/10/10/washington-st-oregon",
      "videoState": ""
    }},
    {"game": {
      "away": {
        "conferenceNames": {
          "conferenceDisplay": "Sun Belt Conference",
          "conferenceDivision": "fbs",
          "conferenceName": "Sun Belt",
          "conferenceSeo": "sun-belt"
        },
        "description": "(1-4)",
        "names": {
          "char6": "LA MON",
          "full": "University of Louisiana at Monroe",
          "seo": "la-monroe",
          "short": "La.-Monroe"
        },
        "rank": "",
        "score": "24",
        "seed": "",
        "winner": false
      },
      "bracketId": "",
      "bracketRegion": "",
      "bracketRound": "",
      "contestClock": "0:00",
      "currentPeriod": "Final",
      "finalMessage": "Final",
      "gameID": "fe458633-9693-405a-9188-ce73ec6ce8e7",
      "gameState": "final",
      "home": {
        "conferenceNames": {
          "conferenceDisplay": "American Athletic Conference",
          "conferenceDivision": "fbs",
          "conferenceName": "AAC",
          "conferenceSeo": "american-athletic"
        },
        "description": "(3-2)",
        "names": {
          "char6": "TULSA",
          "full": "University of Tulsa",
          "seo": "tulsa",
          "short": "Tulsa"
        },
        "rank": "",
        "score": "34",
        "seed": "",
        "winner": true
      },
      "liveVideoEnabled": false,
      "network": "",
      "startDate": "10-10-2015",
      "startTime": "06:00PM ET",
      "startTimeEpoch": "1444514400",
      "title": "Tulsa La.-Monroe",
      "url": "/game/football/fbs/2015/10/10/la-monroe-tulsa",
      "videoState": ""
    }},
    {"game": {
      "away": {
        "conferenceNames": {
          "conferenceDisplay": "Southeastern Conference",
          "conferenceDivision": "fbs",
          "conferenceName": "SEC",
          "conferenceSeo": "southeastern"
        },
        "description": "(2-4)",
        "names": {
          "char6": "ARK",
          "full": "University of Arkansas, Fayetteville",
          "seo": "arkansas",
          "short": "Arkansas"
        },
        "rank": "",
        "score": "14",
        "seed": "",
        "winner": false
      },
      "bracketId": "",
      "bracketRegion": "",
      "bracketRound": "",
      "contestClock": "0:00",
      "currentPeriod": "Final",
      "finalMessage": "Final",
      "gameID": "53f98461-ce8f-488f-a2a1-54345e61cfff",
      "gameState": "final",
      "home": {
        "conferenceNames": {
          "conferenceDisplay": "Southeastern Conference",
          "conferenceDivision": "fbs",
          "conferenceName": "SEC",
          "conferenceSeo": "southeastern"
        },
        "description": "(5-1)",
        "names": {
          "char6": "ALA",
          "full": "University of Alabama",
          "seo": "alabama",
          "short": "Alabama"
        },
        "rank": "8",
        "score": "27",
        "seed": "",
        "winner": true
      },
      "liveVideoEnabled": false,
      "network": "",
      "startDate": "10-10-2015",
      "startTime": "07:00PM ET",
      "startTimeEpoch": "1444518000",
      "title": "Alabama Arkansas",
      "url": "/game/football/fbs/2015/10/10/arkansas-alabama",
      "videoState": ""
    }},
    {"game": {
      "away": {
        "conferenceNames": {
          "conferenceDisplay": "Mountain West Conference",
          "conferenceDivision": "fbs",
          "conferenceName": "MWC",
          "conferenceSeo": "mountain-west"
        },
        "description": "(5-1)",
        "names": {
          "char6": "BOISE",
          "full": "Boise State University",
          "seo": "boise-st",
          "short": "Boise St."
        },
        "rank": "25",
        "score": "41",
        "seed": "",
        "winner": true
      },
      "bracketId": "",
      "bracketRegion": "",
      "bracketRound": "",
      "contestClock": "0:00",
      "currentPeriod": "Final",
      "finalMessage": "Final",
      "gameID": "19250261-12d8-4e01-a9ce-009db560204e",
      "gameState": "final",
      "home": {
        "conferenceNames": {
          "conferenceDisplay": "Mountain West Conference",
          "conferenceDivision": "fbs",
          "conferenceName": "MWC",
          "conferenceSeo": "mountain-west"
        },
        "description": "(2-4)",
        "names": {
          "char6": "CO ST",
          "full": "Colorado State University",
          "seo": "colorado-st",
          "short": "Colorado St."
        },
        "rank": "",
        "score": "10",
        "seed": "",
        "winner": false
      },
      "liveVideoEnabled": false,
      "network": "",
      "startDate": "10-10-2015",
      "startTime": "07:00PM ET",
      "startTimeEpoch": "1444518000",
      "title": "Colorado St. Boise St.",
      "url": "/game/football/fbs/2015/10/10/boise-st-colorado-st",
      "videoState": ""
    }},
    {"game": {
      "away": {
        "conferenceNames": {
          "conferenceDisplay": "Conference USA",
          "conferenceDivision": "fbs",
          "conferenceName": "C-USA",
          "conferenceSeo": "conference-usa"
        },
        "description": "(4-2)",
        "names": {
          "char6": "LATECH",
          "full": "Louisiana Tech University",
          "seo": "louisiana-tech",
          "short": "Louisiana Tech"
        },
        "rank": "",
        "score": "34",
        "seed": "",
        "winner": true
      },
      "bracketId": "",
      "bracketRegion": "",
      "bracketRound": "",
      "contestClock": "0:00",
      "currentPeriod": "Final",
      "finalMessage": "Final",
      "gameID": "95e6cdfc-f9bb-49f3-8ee0-598ed6308f97",
      "gameState": "final",
      "home": {
        "conferenceNames": {
          "conferenceDisplay": "Conference USA",
          "conferenceDivision": "fbs",
          "conferenceName": "C-USA",
          "conferenceSeo": "conference-usa"
        },
        "description": "(1-5)",
        "names": {
          "char6": "UTSA",
          "full": "University of Texas at San Antonio",
          "seo": "utsa",
          "short": "UTSA"
        },
        "rank": "",
        "score": "31",
        "seed": "",
        "winner": false
      },
      "liveVideoEnabled": false,
      "network": "",
      "startDate": "10-10-2015",
      "startTime": "07:00PM ET",
      "startTimeEpoch": "1444518000",
      "title": "UTSA Louisiana Tech",
      "url": "/game/football/fbs/2015/10/10/louisiana-tech-utsa",
      "videoState": ""
    }},
    {"game": {
      "away": {
        "conferenceNames": {
          "conferenceDisplay": "Mountain West Conference",
          "conferenceDivision": "fbs",
          "conferenceName": "MWC",
          "conferenceSeo": "mountain-west"
        },
        "description": "(3-3)",
        "names": {
          "char6": "N MEX",
          "full": "University of New Mexico",
          "seo": "new-mexico",
          "short": "New Mexico"
        },
        "rank": "",
        "score": "17",
        "seed": "",
        "winner": false
      },
      "bracketId": "",
      "bracketRegion": "",
      "bracketRound": "",
      "contestClock": "0:00",
      "currentPeriod": "Final",
      "finalMessage": "Final",
      "gameID": "ced0b572-dce3-43b1-9413-730bb3b54522",
      "gameState": "final",
      "home": {
        "conferenceNames": {
          "conferenceDisplay": "Mountain West Conference",
          "conferenceDivision": "fbs",
          "conferenceName": "MWC",
          "conferenceSeo": "mountain-west"
        },
        "description": "(3-3)",
        "names": {
          "char6": "NEVADA",
          "full": "University of Nevada",
          "seo": "nevada",
          "short": "Nevada"
        },
        "rank": "",
        "score": "35",
        "seed": "",
        "winner": true
      },
      "liveVideoEnabled": false,
      "network": "",
      "startDate": "10-10-2015",
      "startTime": "07:00PM ET",
      "startTimeEpoch": "1444518000",
      "title": "Nevada New Mexico",
      "url": "/game/football/fbs/2015/10/10/new-mexico-nevada",
      "videoState": ""
    }},
    {"game": {
      "away": {
        "conferenceNames": {
          "conferenceDisplay": "Big 12 Conference",
          "conferenceDivision": "fbs",
          "conferenceName": "Big 12",
          "conferenceSeo": "big-12"
        },
        "description": "(6-0)",
        "names": {
          "char6": "OKLAST",
          "full": "Oklahoma State University",
          "seo": "oklahoma-st",
          "short": "Oklahoma St."
        },
        "rank": "21",
        "score": "33",
        "seed": "",
        "winner": true
      },
      "bracketId": "",
      "bracketRegion": "",
      "bracketRound": "",
      "contestClock": "0:00",
      "currentPeriod": "Final (OT)",
      "finalMessage": "Final (OT)",
      "gameID": "f672363c-d9cd-429a-a8e7-b3435b22cd9e",
      "gameState": "final",
      "home": {
        "conferenceNames": {
          "conferenceDisplay": "Big 12 Conference",
          "conferenceDivision": "fbs",
          "conferenceName": "Big 12",
          "conferenceSeo": "big-12"
        },
        "description": "(3-2)",
        "names": {
          "char6": "WVU",
          "full": "West Virginia University",
          "seo": "west-virginia",
          "short": "West Virginia"
        },
        "rank": "",
        "score": "26",
        "seed": "",
        "winner": false
      },
      "liveVideoEnabled": false,
      "network": "",
      "startDate": "10-10-2015",
      "startTime": "07:00PM ET",
      "startTimeEpoch": "1444518000",
      "title": "West Virginia Oklahoma St.",
      "url": "/game/football/fbs/2015/10/10/oklahoma-st-west-virginia",
      "videoState": ""
    }},
    {"game": {
      "away": {
        "conferenceNames": {
          "conferenceDisplay": "Sun Belt Conference",
          "conferenceDivision": "fbs",
          "conferenceName": "Sun Belt",
          "conferenceSeo": "sun-belt"
        },
        "description": "(1-4)",
        "names": {
          "char6": "TX ST",
          "full": "Texas State University-San Marcos",
          "seo": "texas-st",
          "short": "Texas St."
        },
        "rank": "",
        "score": "27",
        "seed": "",
        "winner": false
      },
      "bracketId": "",
      "bracketRegion": "",
      "bracketRound": "",
      "contestClock": "0:00",
      "currentPeriod": "Final",
      "finalMessage": "Final",
      "gameID": "2eff2fad-a17b-48ee-8fd1-38a7ea336876",
      "gameState": "final",
      "home": {
        "conferenceNames": {
          "conferenceDisplay": "Sun Belt Conference",
          "conferenceDivision": "fbs",
          "conferenceName": "Sun Belt",
          "conferenceSeo": "sun-belt"
        },
        "description": "(2-3)",
        "names": {
          "char6": "ULL",
          "full": "University of Louisiana at Lafayette",
          "seo": "la-lafayette",
          "short": "Louisiana"
        },
        "rank": "",
        "score": "49",
        "seed": "",
        "winner": true
      },
      "liveVideoEnabled": false,
      "network": "",
      "startDate": "10-10-2015",
      "startTime": "07:00PM ET",
      "startTimeEpoch": "1444518000",
      "title": "Louisiana Texas St.",
      "url": "/game/football/fbs/2015/10/10/texas-st-la-lafayette",
      "videoState": ""
    }},
    {"game": {
      "away": {
        "conferenceNames": {
          "conferenceDisplay": "Big 12 Conference",
          "conferenceDivision": "fbs",
          "conferenceName": "Big 12",
          "conferenceSeo": "big-12"
        },
        "description": "(6-0)",
        "names": {
          "char6": "TCU",
          "full": "Texas Christian University",
          "seo": "tcu",
          "short": "TCU"
        },
        "rank": "2",
        "score": "52",
        "seed": "",
        "winner": true
      },
      "bracketId": "",
      "bracketRegion": "",
      "bracketRound": "",
      "contestClock": "0:00",
      "currentPeriod": "Final",
      "finalMessage": "Final",
      "gameID": "932be78f-b59c-41e6-8a79-a22cc6a20aa0",
      "gameState": "final",
      "home": {
        "conferenceNames": {
          "conferenceDisplay": "Big 12 Conference",
          "conferenceDivision": "fbs",
          "conferenceName": "Big 12",
          "conferenceSeo": "big-12"
        },
        "description": "(3-2)",
        "names": {
          "char6": "KAN ST",
          "full": "Kansas State University",
          "seo": "kansas-st",
          "short": "Kansas St."
        },
        "rank": "",
        "score": "45",
        "seed": "",
        "winner": false
      },
      "liveVideoEnabled": false,
      "network": "",
      "startDate": "10-10-2015",
      "startTime": "07:30PM ET",
      "startTimeEpoch": "1444519800",
      "title": "Kansas St. TCU",
      "url": "/game/football/fbs/2015/10/10/tcu-kansas-st",
      "videoState": ""
    }},
    {"game": {
      "away": {
        "conferenceNames": {
          "conferenceDisplay": "Southeastern Conference",
          "conferenceDivision": "fbs",
          "conferenceName": "SEC",
          "conferenceSeo": "southeastern"
        },
        "description": "(6-0)",
        "names": {
          "char6": "FLA",
          "full": "University of Florida",
          "seo": "florida",
          "short": "Florida"
        },
        "rank": "11",
        "score": "21",
        "seed": "",
        "winner": true
      },
      "bracketId": "",
      "bracketRegion": "",
      "bracketRound": "",
      "contestClock": "0:00",
      "currentPeriod": "Final",
      "finalMessage": "Final",
      "gameID": "eeec3ba2-d8bb-443c-bb05-0f0506d6830f",
      "gameState": "final",
      "home": {
        "conferenceNames": {
          "conferenceDisplay": "Southeastern Conference",
          "conferenceDivision": "fbs",
          "conferenceName": "SEC",
          "conferenceSeo": "southeastern"
        },
        "description": "(4-2)",
        "names": {
          "char6": "MIZZOU",
          "full": "University of Missouri, Columbia",
          "seo": "missouri",
          "short": "Missouri"
        },
        "rank": "",
        "score": "3",
        "seed": "",
        "winner": false
      },
      "liveVideoEnabled": false,
      "network": "",
      "startDate": "10-10-2015",
      "startTime": "07:30PM ET",
      "startTimeEpoch": "1444519800",
      "title": "Missouri Florida",
      "url": "/game/football/fbs/2015/10/10/florida-missouri",
      "videoState": ""
    }},
    {"game": {
      "away": {
        "conferenceNames": {
          "conferenceDisplay": "American Athletic Conference",
          "conferenceDivision": "fbs",
          "conferenceName": "AAC",
          "conferenceSeo": "american-athletic"
        },
        "description": "(3-3)",
        "names": {
          "char6": "E CAR",
          "full": "East Carolina University",
          "seo": "east-carolina",
          "short": "East Carolina"
        },
        "rank": "",
        "score": "38",
        "seed": "",
        "winner": false
      },
      "bracketId": "",
      "bracketRegion": "",
      "bracketRound": "",
      "contestClock": "0:00",
      "currentPeriod": "Final",
      "finalMessage": "Final",
      "gameID": "f4f081d0-8393-468b-9254-031bc15da61d",
      "gameState": "final",
      "home": {
        "conferenceNames": {
          "conferenceDisplay": "FBS Independent",
          "conferenceDivision": "fbs",
          "conferenceName": "IND",
          "conferenceSeo": "fbs-independent"
        },
        "description": "(4-2)",
        "names": {
          "char6": "BYU",
          "full": "Brigham Young University",
          "seo": "byu",
          "short": "BYU"
        },
        "rank": "",
        "score": "45",
        "seed": "",
        "winner": true
      },
      "liveVideoEnabled": false,
      "network": "",
      "startDate": "10-10-2015",
      "startTime": "07:30PM ET",
      "startTimeEpoch": "1444519800",
      "title": "BYU East Carolina",
      "url": "/game/football/fbs/2015/10/10/east-carolina-byu",
      "videoState": ""
    }},
    {"game": {
      "away": {
        "conferenceNames": {
          "conferenceDisplay": "Big Ten Conference",
          "conferenceDivision": "fbs",
          "conferenceName": "Big Ten",
          "conferenceSeo": "big-ten"
        },
        "description": "(6-0)",
        "names": {
          "char6": "MICHST",
          "full": "Michigan State University",
          "seo": "michigan-st",
          "short": "Michigan St."
        },
        "rank": "4",
        "score": "31",
        "seed": "",
        "winner": true
      },
      "bracketId": "",
      "bracketRegion": "",
      "bracketRound": "",
      "contestClock": "0:00",
      "currentPeriod": "Final",
      "finalMessage": "Final",
      "gameID": "0018c3b8-77d1-4c13-acc0-0de0cd714895",
      "gameState": "final",
      "home": {
        "conferenceNames": {
          "conferenceDisplay": "Big Ten Conference",
          "conferenceDivision": "fbs",
          "conferenceName": "Big Ten",
          "conferenceSeo": "big-ten"
        },
        "description": "(2-3)",
        "names": {
          "char6": "RUTGER",
          "full": "Rutgers, State Univ of New Jersey, New Brunswick",
          "seo": "rutgers",
          "short": "Rutgers"
        },
        "rank": "",
        "score": "24",
        "seed": "",
        "winner": false
      },
      "liveVideoEnabled": false,
      "network": "",
      "startDate": "10-10-2015",
      "startTime": "08:00PM ET",
      "startTimeEpoch": "1444521600",
      "title": "Rutgers Michigan St.",
      "url": "/game/football/fbs/2015/10/10/michigan-st-rutgers",
      "videoState": ""
    }},
    {"game": {
      "away": {
        "conferenceNames": {
          "conferenceDisplay": "Atlantic Coast Conference",
          "conferenceDivision": "fbs",
          "conferenceName": "ACC",
          "conferenceSeo": "atlantic-coast"
        },
        "description": "(3-2)",
        "names": {
          "char6": "MIAMI",
          "full": "University of Miami (Florida)",
          "seo": "miami-fl",
          "short": "Miami (FL)"
        },
        "rank": "",
        "score": "24",
        "seed": "",
        "winner": false
      },
      "bracketId": "",
      "bracketRegion": "",
      "bracketRound": "",
      "contestClock": "0:00",
      "currentPeriod": "Final",
      "finalMessage": "Final",
      "gameID": "3d6f35e1-a6e7-48f2-91aa-3587ddb9503d",
      "gameState": "final",
      "home": {
        "conferenceNames": {
          "conferenceDisplay": "Atlantic Coast Conference",
          "conferenceDivision": "fbs",
          "conferenceName": "ACC",
          "conferenceSeo": "atlantic-coast"
        },
        "description": "(5-0)",
        "names": {
          "char6": "FSU",
          "full": "Florida State University",
          "seo": "florida-st",
          "short": "Florida St."
        },
        "rank": "12",
        "score": "29",
        "seed": "",
        "winner": true
      },
      "liveVideoEnabled": false,
      "network": "",
      "startDate": "10-10-2015",
      "startTime": "08:00PM ET",
      "startTimeEpoch": "1444521600",
      "title": "Florida St. Miami (FL)",
      "url": "/game/football/fbs/2015/10/10/miami-fl-florida-st",
      "videoState": ""
    }},
    {"game": {
      "away": {
        "conferenceNames": {
          "conferenceDisplay": "Mountain West Conference",
          "conferenceDivision": "fbs",
          "conferenceName": "MWC",
          "conferenceSeo": "mountain-west"
        },
        "description": "(3-3)",
        "names": {
          "char6": "SJSU",
          "full": "San Jose State University",
          "seo": "san-jose-st",
          "short": "San Jose St."
        },
        "rank": "",
        "score": "33",
        "seed": "",
        "winner": true
      },
      "bracketId": "",
      "bracketRegion": "",
      "bracketRound": "",
      "contestClock": "0:00",
      "currentPeriod": "Final (OT)",
      "finalMessage": "Final (OT)",
      "gameID": "10890233-5645-41a3-a9eb-a20b4be8a997",
      "gameState": "final",
      "home": {
        "conferenceNames": {
          "conferenceDisplay": "Mountain West Conference",
          "conferenceDivision": "fbs",
          "conferenceName": "MWC",
          "conferenceSeo": "mountain-west"
        },
        "description": "(2-4)",
        "names": {
          "char6": "UNLV",
          "full": "University of Nevada, Las Vegas",
          "seo": "unlv",
          "short": "UNLV"
        },
        "rank": "",
        "score": "27",
        "seed": "",
        "winner": false
      },
      "liveVideoEnabled": false,
      "network": "",
      "startDate": "10-10-2015",
      "startTime": "09:00PM ET",
      "startTimeEpoch": "1444525200",
      "title": "UNLV San Jose St.",
      "url": "/game/football/fbs/2015/10/10/san-jose-st-unlv",
      "videoState": ""
    }},
    {"game": {
      "away": {
        "conferenceNames": {
          "conferenceDisplay": "Pac-12 Conference",
          "conferenceDivision": "fbs",
          "conferenceName": "Pac-12",
          "conferenceSeo": "pac-12"
        },
        "description": "(5-1)",
        "names": {
          "char6": "CAL",
          "full": "University of California, Berkeley",
          "seo": "california",
          "short": "California"
        },
        "rank": "23",
        "score": "24",
        "seed": "",
        "winner": false
      },
      "bracketId": "",
      "bracketRegion": "",
      "bracketRound": "",
      "contestClock": "0:00",
      "currentPeriod": "Final",
      "finalMessage": "Final",
      "gameID": "e222b439-371b-4f3d-9e14-4dd5fbc70aaf",
      "gameState": "final",
      "home": {
        "conferenceNames": {
          "conferenceDisplay": "Pac-12 Conference",
          "conferenceDivision": "fbs",
          "conferenceName": "Pac-12",
          "conferenceSeo": "pac-12"
        },
        "description": "(5-0)",
        "names": {
          "char6": "UTAH",
          "full": "University of Utah",
          "seo": "utah",
          "short": "Utah"
        },
        "rank": "5",
        "score": "30",
        "seed": "",
        "winner": true
      },
      "liveVideoEnabled": false,
      "network": "",
      "startDate": "10-10-2015",
      "startTime": "10:00PM ET",
      "startTimeEpoch": "1444528800",
      "title": "Utah California",
      "url": "/game/football/fbs/2015/10/10/california-utah",
      "videoState": ""
    }},
    {"game": {
      "away": {
        "conferenceNames": {
          "conferenceDisplay": "Pac-12 Conference",
          "conferenceDivision": "fbs",
          "conferenceName": "Pac-12",
          "conferenceSeo": "pac-12"
        },
        "description": "(3-3)",
        "names": {
          "char6": "COLO",
          "full": "University of Colorado, Boulder",
          "seo": "colorado",
          "short": "Colorado"
        },
        "rank": "",
        "score": "23",
        "seed": "",
        "winner": false
      },
      "bracketId": "",
      "bracketRegion": "",
      "bracketRound": "",
      "contestClock": "0:00",
      "currentPeriod": "Final",
      "finalMessage": "Final",
      "gameID": "219e6842-a006-42f0-9ade-9d11721543ea",
      "gameState": "final",
      "home": {
        "conferenceNames": {
          "conferenceDisplay": "Pac-12 Conference",
          "conferenceDivision": "fbs",
          "conferenceName": "Pac-12",
          "conferenceSeo": "pac-12"
        },
        "description": "(4-2)",
        "names": {
          "char6": "AZ ST",
          "full": "Arizona State University",
          "seo": "arizona-st",
          "short": "Arizona St."
        },
        "rank": "",
        "score": "48",
        "seed": "",
        "winner": true
      },
      "liveVideoEnabled": false,
      "network": "",
      "startDate": "10-10-2015",
      "startTime": "10:00PM ET",
      "startTimeEpoch": "1444528800",
      "title": "Arizona St. Colorado",
      "url": "/game/football/fbs/2015/10/10/colorado-arizona-st",
      "videoState": ""
    }},
    {"game": {
      "away": {
        "conferenceNames": {
          "conferenceDisplay": "Mountain West Conference",
          "conferenceDivision": "fbs",
          "conferenceName": "MWC",
          "conferenceSeo": "mountain-west"
        },
        "description": "(0-6)",
        "names": {
          "char6": "WYO",
          "full": "University of Wyoming",
          "seo": "wyoming",
          "short": "Wyoming"
        },
        "rank": "",
        "score": "17",
        "seed": "",
        "winner": false
      },
      "bracketId": "",
      "bracketRegion": "",
      "bracketRound": "",
      "contestClock": "0:00",
      "currentPeriod": "Final",
      "finalMessage": "Final",
      "gameID": "001240e8-113e-488c-82e0-a249f60e3327",
      "gameState": "final",
      "home": {
        "conferenceNames": {
          "conferenceDisplay": "Mountain West Conference",
          "conferenceDivision": "fbs",
          "conferenceName": "MWC",
          "conferenceSeo": "mountain-west"
        },
        "description": "(3-2)",
        "names": {
          "char6": "AIRFOR",
          "full": "U.S. Air Force Academy",
          "seo": "air-force",
          "short": "Air Force"
        },
        "rank": "",
        "score": "31",
        "seed": "",
        "winner": true
      },
      "liveVideoEnabled": false,
      "network": "",
      "startDate": "10-10-2015",
      "startTime": "10:15PM ET",
      "startTimeEpoch": "1444529700",
      "title": "Air Force Wyoming",
      "url": "/game/football/fbs/2015/10/10/wyoming-air-force",
      "videoState": ""
    }},
    {"game": {
      "away": {
        "conferenceNames": {
          "conferenceDisplay": "Mountain West Conference",
          "conferenceDivision": "fbs",
          "conferenceName": "MWC",
          "conferenceSeo": "mountain-west"
        },
        "description": "(3-2)",
        "names": {
          "char6": "UT ST",
          "full": "Utah State University",
          "seo": "utah-st",
          "short": "Utah St."
        },
        "rank": "",
        "score": "56",
        "seed": "",
        "winner": true
      },
      "bracketId": "",
      "bracketRegion": "",
      "bracketRound": "",
      "contestClock": "0:00",
      "currentPeriod": "Final",
      "finalMessage": "Final",
      "gameID": "2f513b87-a523-4565-90d4-db0a956abc4b",
      "gameState": "final",
      "home": {
        "conferenceNames": {
          "conferenceDisplay": "Mountain West Conference",
          "conferenceDivision": "fbs",
          "conferenceName": "MWC",
          "conferenceSeo": "mountain-west"
        },
        "description": "(1-5)",
        "names": {
          "char6": "FRESNO",
          "full": "California State University, Fresno",
          "seo": "fresno-st",
          "short": "Fresno St."
        },
        "rank": "",
        "score": "14",
        "seed": "",
        "winner": false
      },
      "liveVideoEnabled": false,
      "network": "",
      "startDate": "10-10-2015",
      "startTime": "10:30PM ET",
      "startTimeEpoch": "1444530600",
      "title": "Fresno St. Utah St.",
      "url": "/game/football/fbs/2015/10/10/utah-st-fresno-st",
      "videoState": ""
    }},
    {"game": {
      "away": {
        "conferenceNames": {
          "conferenceDisplay": "Mountain West Conference",
          "conferenceDivision": "fbs",
          "conferenceName": "MWC",
          "conferenceSeo": "mountain-west"
        },
        "description": "(3-3)",
        "names": {
          "char6": "SDSU",
          "full": "San Diego State University",
          "seo": "san-diego-st",
          "short": "San Diego St."
        },
        "rank": "",
        "score": "28",
        "seed": "",
        "winner": true
      },
      "bracketId": "",
      "bracketRegion": "",
      "bracketRound": "",
      "contestClock": "0:00",
      "currentPeriod": "Final",
      "finalMessage": "Final",
      "gameID": "1184f0a1-d525-45d8-bd3d-b575c70a58b9",
      "gameState": "final",
      "home": {
        "conferenceNames": {
          "conferenceDisplay": "Mountain West Conference",
          "conferenceDivision": "fbs",
          "conferenceName": "MWC",
          "conferenceSeo": "mountain-west"
        },
        "description": "(2-4)",
        "names": {
          "char6": "HAWAII",
          "full": "University of Hawaii, Manoa",
          "seo": "hawaii",
          "short": "Hawaii"
        },
        "rank": "",
        "score": "14",
        "seed": "",
        "winner": false
      },
      "liveVideoEnabled": false,
      "network": "",
      "startDate": "10-11-2015",
      "startTime": "12:00AM ET",
      "startTimeEpoch": "1444536000",
      "title": "Hawaii San Diego St.",
      "url": "/game/football/fbs/2015/10/11/san-diego-st-hawaii",
      "videoState": ""
    }}
  ],
  "inputMD5Sum": "c9f64f2a913a34888badeebf46c5046f"
}