{
  "LouisianaLafayette vs ArkansasState": {
    "stadium": "CentennialBankStadium-Jonesboro-AR",
    "LouisianaLafayette": {
      "points": 23,
      "1st downs": 26,
      "rushing 1st downs": 12,
      "passing 1st downs": 11,
      "penalty 1st downs": 3,
      "rushing yards": 265,
      "rushing attempts": 58,
      "passing yards": 205,
      "passing attempts": 28,
      "passing completions": 18,
      "passing interceptions": 1,
      "total yards": 470,
      "total plays": 86,
      "fumbles": 1,
      "fumbles lost": 0,
      "penalties": 4,
      "penalty yards": 30,
      "punts": 2,
      "punt yards": 59,
      "punt returns": 1,
      "punt return yards": -2,
      "kickoff returns": 1,
      "kickoff return yards": 23,
      "interception returns": 1,
      "interception return yards": 13,
      "3rd down conversions": 12,
      "3rd down attempts": 21,
      "4th down conversions": 1,
      "4th down attempts": 1
    },
    "ArkansasState": {
      "points": 7,
      "1st downs": 10,
      "rushing 1st downs": 5,
      "passing 1st downs": 5,
      "penalty 1st downs": 0,
      "rushing yards": 79,
      "rushing attempts": 25,
      "passing yards": 89,
      "passing attempts": 21,
      "passing completions": 11,
      "passing interceptions": 1,
      "total yards": 168,
      "total plays": 46,
      "fumbles": 0,
      "fumbles lost": 0,
      "penalties": 4,
      "penalty yards": 44,
      "punts": 6,
      "punt yards": 256,
      "punt returns": 0,
      "punt return yards": 0,
      "kickoff returns": 3,
      "kickoff return yards": 78,
      "interception returns": 1,
      "interception return yards": 0,
      "3rd down conversions": 5,
      "3rd down attempts": 12,
      "4th down conversions": 0,
      "4th down attempts": 1
    }
  },
  "Kentucky vs MississippiState": {
    "stadium": "DavisWadeStadium-MississippiState-MS",
    "Kentucky": {
      "points": 22,
      "1st downs": 20,
      "rushing 1st downs": 10,
      "passing 1st downs": 7,
      "penalty 1st downs": 3,
      "rushing yards": 160,
      "rushing attempts": 40,
      "passing yards": 165,
      "passing attempts": 35,
      "passing completions": 19,
      "passing interceptions": 0,
      "total yards": 325,
      "total plays": 75,
      "fumbles": 0,
      "fumbles lost": 0,
      "penalties": 4,
      "penalty yards": 40,
      "punts": 6,
      "punt yards": 267,
      "punt returns": 2,
      "punt return yards": 13,
      "kickoff returns": 3,
      "kickoff return yards": 58,
      "interception returns": 0,
      "interception return yards": 0,
      "3rd down conversions": 4,
      "3rd down attempts": 18,
      "4th down conversions": 4,
      "4th down attempts": 5
    },
    "MississippiState": {
      "points": 28,
      "1st downs": 24,
      "rushing 1st downs": 8,
      "passing 1st downs": 15,
      "penalty 1st downs": 1,
      "rushing yards": 152,
      "rushing attempts": 42,
      "passing yards": 295,
      "passing attempts": 37,
      "passing completions": 25,
      "passing interceptions": 0,
      "total yards": 447,
      "total plays": 79,
      "fumbles": 0,
      "fumbles lost": 0,
      "penalties": 8,
      "penalty yards": 82,
      "punts": 5,
      "punt yards": 197,
      "punt returns": 1,
      "punt return yards": -1,
      "kickoff returns": 3,
      "kickoff return yards": 47,
      "interception returns": 0,
      "interception return yards": 0,
      "3rd down conversions": 10,
      "3rd down attempts": 18,
      "4th down conversions": 1,
      "4th down attempts": 3
    }
  },
  "Marshall vs MiddleTennessee": {
    "stadium": "Johnny\"Red\"FloydStadium-Murfreesboro-TN",
    "Marshall": {
      "points": 49,
      "1st downs": 27,
      "rushing 1st downs": 14,
      "passing 1st downs": 10,
      "penalty 1st downs": 3,
      "rushing yards": 213,
      "rushing attempts": 52,
      "passing yards": 235,
      "passing attempts": 35,
      "passing completions": 19,
      "passing interceptions": 1,
      "total yards": 448,
      "total plays": 87,
      "fumbles": 1,
      "fumbles lost": 1,
      "penalties": 6,
      "penalty yards": 61,
      "punts": 5,
      "punt yards": 159,
      "punt returns": 2,
      "punt return yards": 40,
      "kickoff returns": 6,
      "kickoff return yards": 166,
      "interception returns": 1,
      "interception return yards": 0,
      "3rd down conversions": 9,
      "3rd down attempts": 16,
      "4th down conversions": 1,
      "4th down attempts": 2
    },
    "MiddleTennessee": {
      "points": 51,
      "1st downs": 31,
      "rushing 1st downs": 13,
      "passing 1st downs": 14,
      "penalty 1st downs": 4,
      "rushing yards": 308,
      "rushing attempts": 60,
      "passing yards": 277,
      "passing attempts": 40,
      "passing completions": 22,
      "passing interceptions": 1,
      "total yards": 585,
      "total plays": 100,
      "fumbles": 1,
      "fumbles lost": 1,
      "penalties": 6,
      "penalty yards": 75,
      "punts": 4,
      "punt yards": 186,
      "punt returns": 2,
      "punt return yards": 33,
      "kickoff returns": 3,
      "kickoff return yards": 55,
      "interception returns": 1,
      "interception return yards": 47,
      "3rd down conversions": 10,
      "3rd down attempts": 20,
      "4th down conversions": 4,
      "4th down attempts": 5
    }
  },
  "BoiseState vs BrighamYoung": {
    "stadium": "LaVellEdwardsStadium-Provo-UT",
    "BoiseState": {
      "points": 20,
      "1st downs": 23,
      "rushing 1st downs": 8,
      "passing 1st downs": 14,
      "penalty 1st downs": 1,
      "rushing yards": 214,
      "rushing attempts": 44,
      "passing yards": 285,
      "passing attempts": 46,
      "passing completions": 29,
      "passing interceptions": 1,
      "total yards": 499,
      "total plays": 90,
      "fumbles": 3,
      "fumbles lost": 3,
      "penalties": 5,
      "penalty yards": 39,
      "punts": 3,
      "punt yards": 157,
      "punt returns": 4,
      "punt return yards": 46,
      "kickoff returns": 2,
      "kickoff return yards": 53,
      "interception returns": 0,
      "interception return yards": 0,
      "3rd down conversions": 8,
      "3rd down attempts": 18,
      "4th down conversions": 2,
      "4th down attempts": 5
    },
    "BrighamYoung": {
      "points": 37,
      "1st downs": 28,
      "rushing 1st downs": 12,
      "passing 1st downs": 15,
      "penalty 1st downs": 1,
      "rushing yards": 229,
      "rushing attempts": 50,
      "passing yards": 339,
      "passing attempts": 41,
      "passing completions": 27,
      "passing interceptions": 0,
      "total yards": 568,
      "total plays": 91,
      "fumbles": 0,
      "fumbles lost": 0,
      "penalties": 7,
      "penalty yards": 55,
      "punts": 7,
      "punt yards": 280,
      "punt returns": 0,
      "punt return yards": 0,
      "kickoff returns": 2,
      "kickoff return yards": 41,
      "interception returns": 1,
      "interception return yards": 9,
      "3rd down conversions": 7,
      "3rd down attempts": 19,
      "4th down conversions": 1,
      "4th down attempts": 1
    }
  },
  "WakeForest vs MiamiFL": {
    "stadium": "SunLifeStadium-MiamiGardens-FL",
    "WakeForest": {
      "points": 21,
      "1st downs": 21,
      "rushing 1st downs": 4,
      "passing 1st downs": 16,
      "penalty 1st downs": 1,
      "rushing yards": 59,
      "rushing attempts": 25,
      "passing yards": 302,
      "passing attempts": 46,
      "passing completions": 25,
      "passing interceptions": 1,
      "total yards": 361,
      "total plays": 71,
      "fumbles": 0,
      "fumbles lost": 0,
      "penalties": 6,
      "penalty yards": 58,
      "punts": 5,
      "punt yards": 203,
      "punt returns": 1,
      "punt return yards": 1,
      "kickoff returns": 1,
      "kickoff return yards": 19,
      "interception returns": 0,
      "interception return yards": 0,
      "3rd down conversions": 8,
      "3rd down attempts": 16,
      "4th down conversions": 2,
      "4th down attempts": 2
    },
    "MiamiFL": {
      "points": 24,
      "1st downs": 20,
      "rushing 1st downs": 9,
      "passing 1st downs": 7,
      "penalty 1st downs": 4,
      "rushing yards": 200,
      "rushing attempts": 40,
      "passing yards": 191,
      "passing attempts": 28,
      "passing completions": 17,
      "passing interceptions": 0,
      "total yards": 391,
      "total plays": 68,
      "fumbles": 0,
      "fumbles lost": 0,
      "penalties": 6,
      "penalty yards": 46,
      "punts": 4,
      "punt yards": 177,
      "punt returns": 2,
      "punt return yards": 37,
      "kickoff returns": 4,
      "kickoff return yards": 89,
      "interception returns": 1,
      "interception return yards": 6,
      "3rd down conversions": 6,
      "3rd down attempts": 13,
      "4th down conversions": 0,
      "4th down attempts": 1
    }
  },
  "BallState vs Akron": {
    "stadium": "InfoCisionStadiumSummaField-Akron-OH",
    "BallState": {
      "points": 42,
      "1st downs": 27,
      "rushing 1st downs": 9,
      "passing 1st downs": 14,
      "penalty 1st downs": 4,
      "rushing yards": 157,
      "rushing attempts": 37,
      "passing yards": 277,
      "passing attempts": 36,
      "passing completions": 26,
      "passing interceptions": 0,
      "total yards": 434,
      "total plays": 73,
      "fumbles": 2,
      "fumbles lost": 1,
      "penalties": 2,
      "penalty yards": 9,
      "punts": 7,
      "punt yards": 279,
      "punt returns": 0,
      "punt return yards": 0,
      "kickoff returns": 3,
      "kickoff return yards": 57,
      "interception returns": 2,
      "interception return yards": 36,
      "3rd down conversions": 4,
      "3rd down attempts": 12,
      "4th down conversions": 0,
      "4th down attempts": 0
    },
    "Akron": {
      "points": 24,
      "1st downs": 22,
      "rushing 1st downs": 13,
      "passing 1st downs": 9,
      "penalty 1st downs": 0,
      "rushing yards": 226,
      "rushing attempts": 44,
      "passing yards": 211,
      "passing attempts": 35,
      "passing completions": 17,
      "passing interceptions": 2,
      "total yards": 437,
      "total plays": 79,
      "fumbles": 1,
      "fumbles lost": 1,
      "penalties": 8,
      "penalty yards": 57,
      "punts": 6,
      "punt yards": 248,
      "punt returns": 1,
      "punt return yards": 0,
      "kickoff returns": 5,
      "kickoff return yards": 116,
      "interception returns": 0,
      "interception return yards": 0,
      "3rd down conversions": 6,
      "3rd down attempts": 16,
      "4th down conversions": 0,
      "4th down attempts": 1
    }
  },
  "Northwestern vs Iowa": {
    "stadium": "KinnickStadium-IowaCity-IA",
    "Northwestern": {
      "points": 10,
      "1st downs": 19,
      "rushing 1st downs": 13,
      "passing 1st downs": 6,
      "penalty 1st downs": 0,
      "rushing yards": 225,
      "rushing attempts": 52,
      "passing yards": 104,
      "passing attempts": 14,
      "passing completions": 11,
      "passing interceptions": 0,
      "total yards": 329,
      "total plays": 66,
      "fumbles": 2,
      "fumbles lost": 2,
      "penalties": 5,
      "penalty yards": 55,
      "punts": 4,
      "punt yards": 138,
      "punt returns": 0,
      "punt return yards": 0,
      "kickoff returns": 2,
      "kickoff return yards": 51,
      "interception returns": 1,
      "interception return yards": 7,
      "3rd down conversions": 8,
      "3rd down attempts": 14,
      "4th down conversions": 0,
      "4th down attempts": 1
    },
    "Iowa": {
      "points": 17,
      "1st downs": 19,
      "rushing 1st downs": 8,
      "passing 1st downs": 11,
      "penalty 1st downs": 0,
      "rushing yards": 136,
      "rushing attempts": 41,
      "passing yards": 169,
      "passing attempts": 27,
      "passing completions": 19,
      "passing interceptions": 1,
      "total yards": 305,
      "total plays": 68,
      "fumbles": 0,
      "fumbles lost": 0,
      "penalties": 2,
      "penalty yards": 10,
      "punts": 4,
      "punt yards": 160,
      "punt returns": 1,
      "punt return yards": 10,
      "kickoff returns": 2,
      "kickoff return yards": 29,
      "interception returns": 0,
      "interception return yards": 0,
      "3rd down conversions": 6,
      "3rd down attempts": 14,
      "4th down conversions": 1,
      "4th down attempts": 2
    }
  },
  "OklahomaState vs IowaState": {
    "stadium": "JackTriceStadium-Ames-IA",
    "OklahomaState": {
      "points": 58,
      "1st downs": 20,
      "rushing 1st downs": 13,
      "passing 1st downs": 4,
      "penalty 1st downs": 3,
      "rushing yards": 342,
      "rushing attempts": 47,
      "passing yards": 78,
      "passing attempts": 27,
      "passing completions": 10,
      "passing interceptions": 1,
      "total yards": 420,
      "total plays": 74,
      "fumbles": 1,
      "fumbles lost": 0,
      "penalties": 7,
      "penalty yards": 41,
      "punts": 7,
      "punt yards": 293,
      "punt returns": 3,
      "punt return yards": 15,
      "kickoff returns": 2,
      "kickoff return yards": 47,
      "interception returns": 1,
      "interception return yards": 31,
      "3rd down conversions": 3,
      "3rd down attempts": 12,
      "4th down conversions": 0,
      "4th down attempts": 1
    },
    "IowaState": {
      "points": 27,
      "1st downs": 20,
      "rushing 1st downs": 11,
      "passing 1st downs": 7,
      "penalty 1st downs": 2,
      "rushing yards": 154,
      "rushing attempts": 48,
      "passing yards": 192,
      "passing attempts": 38,
      "passing completions": 18,
      "passing interceptions": 1,
      "total yards": 346,
      "total plays": 86,
      "fumbles": 2,
      "fumbles lost": 2,
      "penalties": 10,
      "penalty yards": 72,
      "punts": 11,
      "punt yards": 442,
      "punt returns": 3,
      "punt return yards": 20,
      "kickoff returns": 4,
      "kickoff return yards": 32,
      "interception returns": 1,
      "interception return yards": -6,
      "3rd down conversions": 4,
      "3rd down attempts": 20,
      "4th down conversions": 1,
      "4th down attempts": 1
    }
  },
  "Louisville vs SouthFlorida": {
    "stadium": "RaymondJamesStadium-Tampa-FL",
    "Louisville": {
      "points": 34,
      "1st downs": 26,
      "rushing 1st downs": 8,
      "passing 1st downs": 17,
      "penalty 1st downs": 1,
      "rushing yards": 132,
      "rushing attempts": 40,
      "passing yards": 353,
      "passing attempts": 30,
      "passing completions": 26,
      "passing interceptions": 0,
      "total yards": 485,
      "total plays": 70,
      "fumbles": 0,
      "fumbles lost": 0,
      "penalties": 9,
      "penalty yards": 100,
      "punts": 3,
      "punt yards": 133,
      "punt returns": 0,
      "punt return yards": 0,
      "kickoff returns": 1,
      "kickoff return yards": 20,
      "interception returns": 1,
      "interception return yards": 70,
      "3rd down conversions": 8,
      "3rd down attempts": 13,
      "4th down conversions": 0,
      "4th down attempts": 0
    },
    "SouthFlorida": {
      "points": 3,
      "1st downs": 8,
      "rushing 1st downs": 2,
      "passing 1st downs": 5,
      "penalty 1st downs": 1,
      "rushing yards": 38,
      "rushing attempts": 20,
      "passing yards": 95,
      "passing attempts": 19,
      "passing completions": 8,
      "passing interceptions": 1,
      "total yards": 133,
      "total plays": 39,
      "fumbles": 2,
      "fumbles lost": 1,
      "penalties": 2,
      "penalty yards": 25,
      "punts": 6,
      "punt yards": 283,
      "punt returns": 1,
      "punt return yards": 0,
      "kickoff returns": 6,
      "kickoff return yards": 140,
      "interception returns": 0,
      "interception return yards": 0,
      "3rd down conversions": 1,
      "3rd down attempts": 9,
      "4th down conversions": 0,
      "4th down attempts": 0
    }
  },
  "Houston vs Rutgers": {
    "stadium": "HighPointSolutionsStadium-Piscataway-NJ",
    "Houston": {
      "points": 49,
      "1st downs": 26,
      "rushing 1st downs": 11,
      "passing 1st downs": 13,
      "penalty 1st downs": 2,
      "rushing yards": 211,
      "rushing attempts": 38,
      "passing yards": 400,
      "passing attempts": 35,
      "passing completions": 28,
      "passing interceptions": 0,
      "total yards": 611,
      "total plays": 73,
      "fumbles": 1,
      "fumbles lost": 0,
      "penalties": 11,
      "penalty yards": 100,
      "punts": 3,
      "punt yards": 119,
      "punt returns": 0,
      "punt return yards": 0,
      "kickoff returns": 2,
      "kickoff return yards": 28,
      "interception returns": 5,
      "interception return yards": 36,
      "3rd down conversions": 7,
      "3rd down attempts": 12,
      "4th down conversions": 0,
      "4th down attempts": 0
    },
    "Rutgers": {
      "points": 14,
      "1st downs": 22,
      "rushing 1st downs": 12,
      "passing 1st downs": 9,
      "penalty 1st downs": 1,
      "rushing yards": 204,
      "rushing attempts": 41,
      "passing yards": 216,
      "passing attempts": 31,
      "passing completions": 18,
      "passing interceptions": 5,
      "total yards": 420,
      "total plays": 72,
      "fumbles": 1,
      "fumbles lost": 1,
      "penalties": 4,
      "penalty yards": 38,
      "punts": 3,
      "punt yards": 113,
      "punt returns": 1,
      "punt return yards": 8,
      "kickoff returns": 0,
      "kickoff return yards": 0,
      "interception returns": 0,
      "interception return yards": 0,
      "3rd down conversions": 8,
      "3rd down attempts": 15,
      "4th down conversions": 2,
      "4th down attempts": 2
    }
  },
  "Connecticut vs UCF": {
    "stadium": "BrightHouseNetworksStadium-Orlando-FL",
    "Connecticut": {
      "points": 17,
      "1st downs": 15,
      "rushing 1st downs": 3,
      "passing 1st downs": 7,
      "penalty 1st downs": 5,
      "rushing yards": 91,
      "rushing attempts": 30,
      "passing yards": 142,
      "passing attempts": 32,
      "passing completions": 14,
      "passing interceptions": 2,
      "total yards": 233,
      "total plays": 62,
      "fumbles": 5,
      "fumbles lost": 2,
      "penalties": 5,
      "penalty yards": 55,
      "punts": 5,
      "punt yards": 226,
      "punt returns": 1,
      "punt return yards": 0,
      "kickoff returns": 6,
      "kickoff return yards": 101,
      "interception returns": 1,
      "interception return yards": 7,
      "3rd down conversions": 2,
      "3rd down attempts": 12,
      "4th down conversions": 1,
      "4th down attempts": 3
    },
    "UCF": {
      "points": 62,
      "1st downs": 24,
      "rushing 1st downs": 7,
      "passing 1st downs": 14,
      "penalty 1st downs": 3,
      "rushing yards": 176,
      "rushing attempts": 38,
      "passing yards": 351,
      "passing attempts": 35,
      "passing completions": 26,
      "passing interceptions": 1,
      "total yards": 527,
      "total plays": 73,
      "fumbles": 1,
      "fumbles lost": 1,
      "penalties": 8,
      "penalty yards": 72,
      "punts": 2,
      "punt yards": 76,
      "punt returns": 5,
      "punt return yards": 57,
      "kickoff returns": 3,
      "kickoff return yards": 72,
      "interception returns": 2,
      "interception return yards": 0,
      "3rd down conversions": 8,
      "3rd down attempts": 13,
      "4th down conversions": 0,
      "4th down attempts": 1
    }
  },
  "Nebraska vs Minnesota": {
    "stadium": "TCFBankStadium-Minneapolis-MN",
    "Nebraska": {
      "points": 23,
      "1st downs": 17,
      "rushing 1st downs": 10,
      "passing 1st downs": 5,
      "penalty 1st downs": 2,
      "rushing yards": 189,
      "rushing attempts": 30,
      "passing yards": 139,
      "passing attempts": 30,
      "passing completions": 16,
      "passing interceptions": 1,
      "total yards": 328,
      "total plays": 60,
      "fumbles": 2,
      "fumbles lost": 1,
      "penalties": 3,
      "penalty yards": 21,
      "punts": 5,
      "punt yards": 213,
      "punt returns": 3,
      "punt return yards": 17,
      "kickoff returns": 6,
      "kickoff return yards": 133,
      "interception returns": 0,
      "interception return yards": 0,
      "3rd down conversions": 4,
      "3rd down attempts": 12,
      "4th down conversions": 0,
      "4th down attempts": 0
    },
    "Minnesota": {
      "points": 34,
      "1st downs": 23,
      "rushing 1st downs": 16,
      "passing 1st downs": 7,
      "penalty 1st downs": 0,
      "rushing yards": 271,
      "rushing attempts": 54,
      "passing yards": 159,
      "passing attempts": 17,
      "passing completions": 8,
      "passing interceptions": 0,
      "total yards": 430,
      "total plays": 71,
      "fumbles": 0,
      "fumbles lost": 0,
      "penalties": 3,
      "penalty yards": 35,
      "punts": 5,
      "punt yards": 175,
      "punt returns": 2,
      "punt return yards": 9,
      "kickoff returns": 1,
      "kickoff return yards": 15,
      "interception returns": 1,
      "interception return yards": 8,
      "3rd down conversions": 5,
      "3rd down attempts": 13,
      "4th down conversions": 1,
      "4th down attempts": 1
    }
  },
  "Vanderbilt vs TexasAM": {
    "stadium": "KyleField-CollegeStation-TX",
    "Vanderbilt": {
      "points": 24,
      "1st downs": 19,
      "rushing 1st downs": 7,
      "passing 1st downs": 12,
      "penalty 1st downs": 0,
      "rushing yards": 95,
      "rushing attempts": 44,
      "passing yards": 234,
      "passing attempts": 32,
      "passing completions": 17,
      "passing interceptions": 3,
      "total yards": 329,
      "total plays": 76,
      "fumbles": 0,
      "fumbles lost": 0,
      "penalties": 1,
      "penalty yards": 5,
      "punts": 6,
      "punt yards": 192,
      "punt returns": 0,
      "punt return yards": 0,
      "kickoff returns": 5,
      "kickoff return yards": 61,
      "interception returns": 1,
      "interception return yards": 32,
      "3rd down conversions": 3,
      "3rd down attempts": 14,
      "4th down conversions": 2,
      "4th down attempts": 4
    },
    "TexasAM": {
      "points": 56,
      "1st downs": 28,
      "rushing 1st downs": 11,
      "passing 1st downs": 17,
      "penalty 1st downs": 0,
      "rushing yards": 182,
      "rushing attempts": 32,
      "passing yards": 376,
      "passing attempts": 46,
      "passing completions": 33,
      "passing interceptions": 1,
      "total yards": 558,
      "total plays": 78,
      "fumbles": 4,
      "fumbles lost": 4,
      "penalties": 7,
      "penalty yards": 35,
      "punts": 1,
      "punt yards": 45,
      "punt returns": 1,
      "punt return yards": 20,
      "kickoff returns": 2,
      "kickoff return yards": 18,
      "interception returns": 3,
      "interception return yards": 48,
      "3rd down conversions": 7,
      "3rd down attempts": 11,
      "4th down conversions": 2,
      "4th down attempts": 3
    }
  },
  "GeorgiaTech vs Virginia": {
    "stadium": "ScottStadium-Charlottesville-VA",
    "GeorgiaTech": {
      "points": 35,
      "1st downs": 18,
      "rushing 1st downs": 14,
      "passing 1st downs": 4,
      "penalty 1st downs": 0,
      "rushing yards": 394,
      "rushing attempts": 52,
      "passing yards": 113,
      "passing attempts": 9,
      "passing completions": 5,
      "passing interceptions": 2,
      "total yards": 507,
      "total plays": 61,
      "fumbles": 3,
      "fumbles lost": 3,
      "penalties": 9,
      "penalty yards": 97,
      "punts": 2,
      "punt yards": 90,
      "punt returns": 0,
      "punt return yards": 0,
      "kickoff returns": 3,
      "kickoff return yards": 108,
      "interception returns": 1,
      "interception return yards": 12,
      "3rd down conversions": 7,
      "3rd down attempts": 12,
      "4th down conversions": 0,
      "4th down attempts": 1
    },
    "Virginia": {
      "points": 25,
      "1st downs": 32,
      "rushing 1st downs": 5,
      "passing 1st downs": 22,
      "penalty 1st downs": 5,
      "rushing yards": 68,
      "rushing attempts": 31,
      "passing yards": 376,
      "passing attempts": 62,
      "passing completions": 43,
      "passing interceptions": 1,
      "total yards": 444,
      "total plays": 93,
      "fumbles": 4,
      "fumbles lost": 0,
      "penalties": 5,
      "penalty yards": 45,
      "punts": 5,
      "punt yards": 177,
      "punt returns": 0,
      "punt return yards": 0,
      "kickoff returns": 4,
      "kickoff return yards": 53,
      "interception returns": 2,
      "interception return yards": 0,
      "3rd down conversions": 9,
      "3rd down attempts": 20,
      "4th down conversions": 2,
      "4th down attempts": 3
    }
  },
  "Pittsburgh vs Navy": {
    "stadium": "NavyMarineCorpsMemorialStadium-Annapolis-MD",
    "Pittsburgh": {
      "points": 21,
      "1st downs": 18,
      "rushing 1st downs": 8,
      "passing 1st downs": 9,
      "penalty 1st downs": 1,
      "rushing yards": 135,
      "rushing attempts": 38,
      "passing yards": 203,
      "passing attempts": 27,
      "passing completions": 20,
      "passing interceptions": 0,
      "total yards": 338,
      "total plays": 65,
      "fumbles": 1,
      "fumbles lost": 1,
      "penalties": 7,
      "penalty yards": 45,
      "punts": 4,
      "punt yards": 141,
      "punt returns": 0,
      "punt return yards": 0,
      "kickoff returns": 1,
      "kickoff return yards": 14,
      "interception returns": 1,
      "interception return yards": 0,
      "3rd down conversions": 7,
      "3rd down attempts": 14,
      "4th down conversions": 0,
      "4th down attempts": 0
    },
    "Navy": {
      "points": 24,
      "1st downs": 20,
      "rushing 1st downs": 16,
      "passing 1st downs": 3,
      "penalty 1st downs": 1,
      "rushing yards": 220,
      "rushing attempts": 47,
      "passing yards": 105,
      "passing attempts": 18,
      "passing completions": 8,
      "passing interceptions": 1,
      "total yards": 325,
      "total plays": 65,
      "fumbles": 1,
      "fumbles lost": 0,
      "penalties": 4,
      "penalty yards": 27,
      "punts": 5,
      "punt yards": 184,
      "punt returns": 2,
      "punt return yards": 2,
      "kickoff returns": 3,
      "kickoff return yards": 46,
      "interception returns": 0,
      "interception return yards": 0,
      "3rd down conversions": 6,
      "3rd down attempts": 12,
      "4th down conversions": 1,
      "4th down attempts": 1
    }
  },
  "MiamiOH vs Ohio": {
    "stadium": "PedenStadium-Athens-OH",
    "MiamiOH": {
      "points": 16,
      "1st downs": 16,
      "rushing 1st downs": 6,
      "passing 1st downs": 8,
      "penalty 1st downs": 2,
      "rushing yards": 85,
      "rushing attempts": 40,
      "passing yards": 155,
      "passing attempts": 34,
      "passing completions": 15,
      "passing interceptions": 1,
      "total yards": 240,
      "total plays": 74,
      "fumbles": 1,
      "fumbles lost": 0,
      "penalties": 4,
      "penalty yards": 25,
      "punts": 8,
      "punt yards": 398,
      "punt returns": 1,
      "punt return yards": 1,
      "kickoff returns": 5,
      "kickoff return yards": 62,
      "interception returns": 0,
      "interception return yards": 0,
      "3rd down conversions": 7,
      "3rd down attempts": 20,
      "4th down conversions": 2,
      "4th down attempts": 3
    },
    "Ohio": {
      "points": 41,
      "1st downs": 25,
      "rushing 1st downs": 8,
      "passing 1st downs": 17,
      "penalty 1st downs": 0,
      "rushing yards": 229,
      "rushing attempts": 42,
      "passing yards": 306,
      "passing attempts": 33,
      "passing completions": 22,
      "passing interceptions": 0,
      "total yards": 535,
      "total plays": 75,
      "fumbles": 1,
      "fumbles lost": 1,
      "penalties": 6,
      "penalty yards": 54,
      "punts": 5,
      "punt yards": 166,
      "punt returns": 4,
      "punt return yards": 13,
      "kickoff returns": 2,
      "kickoff return yards": 9,
      "interception returns": 1,
      "interception return yards": 7,
      "3rd down conversions": 7,
      "3rd down attempts": 15,
      "4th down conversions": 1,
      "4th down attempts": 1
    }
  },
  "Toledo vs BowlingGreen": {
    "stadium": "DoytPerryStadium-BowlingGreen-OH",
    "Toledo": {
      "points": 28,
      "1st downs": 21,
      "rushing 1st downs": 12,
      "passing 1st downs": 6,
      "penalty 1st downs": 3,
      "rushing yards": 242,
      "rushing attempts": 41,
      "passing yards": 130,
      "passing attempts": 23,
      "passing completions": 15,
      "passing interceptions": 0,
      "total yards": 372,
      "total plays": 64,
      "fumbles": 1,
      "fumbles lost": 1,
      "penalties": 7,
      "penalty yards": 69,
      "punts": 2,
      "punt yards": 77,
      "punt returns": 0,
      "punt return yards": 0,
      "kickoff returns": 4,
      "kickoff return yards": 67,
      "interception returns": 0,
      "interception return yards": 0,
      "3rd down conversions": 5,
      "3rd down attempts": 11,
      "4th down conversions": 1,
      "4th down attempts": 1
    },
    "BowlingGreen": {
      "points": 25,
      "1st downs": 19,
      "rushing 1st downs": 9,
      "passing 1st downs": 8,
      "penalty 1st downs": 2,
      "rushing yards": 135,
      "rushing attempts": 36,
      "passing yards": 208,
      "passing attempts": 26,
      "passing completions": 17,
      "passing interceptions": 0,
      "total yards": 343,
      "total plays": 62,
      "fumbles": 1,
      "fumbles lost": 0,
      "penalties": 5,
      "penalty yards": 34,
      "punts": 2,
      "punt yards": 58,
      "punt returns": 0,
      "punt return yards": 0,
      "kickoff returns": 2,
      "kickoff return yards": 57,
      "interception returns": 0,
      "interception return yards": 0,
      "3rd down conversions": 9,
      "3rd down attempts": 15,
      "4th down conversions": 1,
      "4th down attempts": 3
    }
  },
  "WesternMichigan vs Massachusetts": {
    "stadium": "GilletteStadium-Foxborough-MA",
    "WesternMichigan": {
      "points": 31,
      "1st downs": 21,
      "rushing 1st downs": 8,
      "passing 1st downs": 13,
      "penalty 1st downs": 0,
      "rushing yards": 118,
      "rushing attempts": 35,
      "passing yards": 275,
      "passing attempts": 37,
      "passing completions": 23,
      "passing interceptions": 0,
      "total yards": 393,
      "total plays": 72,
      "fumbles": 0,
      "fumbles lost": 0,
      "penalties": 10,
      "penalty yards": 83,
      "punts": 4,
      "punt yards": 149,
      "punt returns": 1,
      "punt return yards": 36,
      "kickoff returns": 4,
      "kickoff return yards": 101,
      "interception returns": 0,
      "interception return yards": 0,
      "3rd down conversions": 7,
      "3rd down attempts": 17,
      "4th down conversions": 3,
      "4th down attempts": 5
    },
    "Massachusetts": {
      "points": 30,
      "1st downs": 16,
      "rushing 1st downs": 5,
      "passing 1st downs": 9,
      "penalty 1st downs": 2,
      "rushing yards": 112,
      "rushing attempts": 42,
      "passing yards": 220,
      "passing attempts": 25,
      "passing completions": 16,
      "passing interceptions": 0,
      "total yards": 332,
      "total plays": 67,
      "fumbles": 2,
      "fumbles lost": 0,
      "penalties": 2,
      "penalty yards": 15,
      "punts": 2,
      "punt yards": 91,
      "punt returns": 2,
      "punt return yards": 29,
      "kickoff returns": 6,
      "kickoff return yards": 143,
      "interception returns": 0,
      "interception return yards": 0,
      "3rd down conversions": 7,
      "3rd down attempts": 16,
      "4th down conversions": 2,
      "4th down attempts": 4
    }
  },
  "Temple vs SouthernMethodist": {
    "stadium": "GeraldJFordStadium-Dallas-TX",
    "Temple": {
      "points": 49,
      "1st downs": 23,
      "rushing 1st downs": 11,
      "passing 1st downs": 11,
      "penalty 1st downs": 1,
      "rushing yards": 217,
      "rushing attempts": 36,
      "passing yards": 376,
      "passing attempts": 38,
      "passing completions": 27,
      "passing interceptions": 0,
      "total yards": 593,
      "total plays": 74,
      "fumbles": 2,
      "fumbles lost": 0,
      "penalties": 6,
      "penalty yards": 55,
      "punts": 5,
      "punt yards": 188,
      "punt returns": 1,
      "punt return yards": 9,
      "kickoff returns": 5,
      "kickoff return yards": 110,
      "interception returns": 0,
      "interception return yards": 0,
      "3rd down conversions": 4,
      "3rd down attempts": 13,
      "4th down conversions": 1,
      "4th down attempts": 4
    },
    "SouthernMethodist": {
      "points": 59,
      "1st downs": 34,
      "rushing 1st downs": 8,
      "passing 1st downs": 24,
      "penalty 1st downs": 2,
      "rushing yards": 190,
      "rushing attempts": 29,
      "passing yards": 538,
      "passing attempts": 53,
      "passing completions": 37,
      "passing interceptions": 0,
      "total yards": 728,
      "total plays": 82,
      "fumbles": 3,
      "fumbles lost": 3,
      "penalties": 9,
      "penalty yards": 75,
      "punts": 3,
      "punt yards": 107,
      "punt returns": 1,
      "punt return yards": 9,
      "kickoff returns": 7,
      "kickoff return yards": 186,
      "interception returns": 0,
      "interception return yards": 0,
      "3rd down conversions": 8,
      "3rd down attempts": 13,
      "4th down conversions": 0,
      "4th down attempts": 0
    }
  },
  "Clemson vs Maryland": {
    "stadium": "ByrdStadium-CollegePark-MD",
    "Clemson": {
      "points": 40,
      "1st downs": 30,
      "rushing 1st downs": 14,
      "passing 1st downs": 14,
      "penalty 1st downs": 2,
      "rushing yards": 236,
      "rushing attempts": 57,
      "passing yards": 304,
      "passing attempts": 41,
      "passing completions": 28,
      "passing interceptions": 1,
      "total yards": 540,
      "total plays": 98,
      "fumbles": 3,
      "fumbles lost": 2,
      "penalties": 4,
      "penalty yards": 30,
      "punts": 4,
      "punt yards": 149,
      "punt returns": 1,
      "punt return yards": -2,
      "kickoff returns": 3,
      "kickoff return yards": 46,
      "interception returns": 2,
      "interception return yards": 53,
      "3rd down conversions": 8,
      "3rd down attempts": 17,
      "4th down conversions": 0,
      "4th down attempts": 1
    },
    "Maryland": {
      "points": 27,
      "1st downs": 19,
      "rushing 1st downs": 4,
      "passing 1st downs": 13,
      "penalty 1st downs": 2,
      "rushing yards": 82,
      "rushing attempts": 25,
      "passing yards": 287,
      "passing attempts": 46,
      "passing completions": 20,
      "passing interceptions": 2,
      "total yards": 369,
      "total plays": 71,
      "fumbles": 2,
      "fumbles lost": 2,
      "penalties": 10,
      "penalty yards": 59,
      "punts": 7,
      "punt yards": 304,
      "punt returns": 0,
      "punt return yards": 0,
      "kickoff returns": 4,
      "kickoff return yards": 55,
      "interception returns": 1,
      "interception return yards": 15,
      "3rd down conversions": 5,
      "3rd down attempts": 16,
      "4th down conversions": 0,
      "4th down attempts": 1
    }
  },
  "Buffalo vs KentState": {
    "stadium": "DiStadium-Kent-OH",
    "Buffalo": {
      "points": 41,
      "1st downs": 23,
      "rushing 1st downs": 10,
      "passing 1st downs": 11,
      "penalty 1st downs": 2,
      "rushing yards": 206,
      "rushing attempts": 39,
      "passing yards": 285,
      "passing attempts": 31,
      "passing completions": 20,
      "passing interceptions": 0,
      "total yards": 491,
      "total plays": 70,
      "fumbles": 1,
      "fumbles lost": 0,
      "penalties": 6,
      "penalty yards": 65,
      "punts": 4,
      "punt yards": 155,
      "punt returns": 0,
      "punt return yards": 0,
      "kickoff returns": 4,
      "kickoff return yards": 94,
      "interception returns": 2,
      "interception return yards": 67,
      "3rd down conversions": 7,
      "3rd down attempts": 13,
      "4th down conversions": 0,
      "4th down attempts": 1
    },
    "KentState": {
      "points": 21,
      "1st downs": 19,
      "rushing 1st downs": 7,
      "passing 1st downs": 10,
      "penalty 1st downs": 2,
      "rushing yards": 103,
      "rushing attempts": 30,
      "passing yards": 260,
      "passing attempts": 32,
      "passing completions": 20,
      "passing interceptions": 2,
      "total yards": 363,
      "total plays": 62,
      "fumbles": 0,
      "fumbles lost": 0,
      "penalties": 8,
      "penalty yards": 50,
      "punts": 6,
      "punt yards": 218,
      "punt returns": 2,
      "punt return yards": 10,
      "kickoff returns": 6,
      "kickoff return yards": 66,
      "interception returns": 0,
      "interception return yards": 0,
      "3rd down conversions": 3,
      "3rd down attempts": 11,
      "4th down conversions": 0,
      "4th down attempts": 1
    }
  },
  "NorthCarolinaState vs FloridaState": {
    "stadium": "DoakCampbellStadium-Tallahassee-FL",
    "NorthCarolinaState": {
      "points": 17,
      "1st downs": 16,
      "rushing 1st downs": 5,
      "passing 1st downs": 10,
      "penalty 1st downs": 1,
      "rushing yards": 188,
      "rushing attempts": 42,
      "passing yards": 128,
      "passing attempts": 33,
      "passing completions": 17,
      "passing interceptions": 2,
      "total yards": 316,
      "total plays": 75,
      "fumbles": 1,
      "fumbles lost": 1,
      "penalties": 2,
      "penalty yards": 13,
      "punts": 8,
      "punt yards": 374,
      "punt returns": 0,
      "punt return yards": 0,
      "kickoff returns": 3,
      "kickoff return yards": 44,
      "interception returns": 2,
      "interception return yards": 0,
      "3rd down conversions": 6,
      "3rd down attempts": 17,
      "4th down conversions": 1,
      "4th down attempts": 2
    },
    "FloridaState": {
      "points": 49,
      "1st downs": 30,
      "rushing 1st downs": 11,
      "passing 1st downs": 19,
      "penalty 1st downs": 0,
      "rushing yards": 224,
      "rushing attempts": 34,
      "passing yards": 342,
      "passing attempts": 34,
      "passing completions": 20,
      "passing interceptions": 2,
      "total yards": 566,
      "total plays": 68,
      "fumbles": 0,
      "fumbles lost": 0,
      "penalties": 3,
      "penalty yards": 30,
      "punts": 4,
      "punt yards": 147,
      "punt returns": 5,
      "punt return yards": 42,
      "kickoff returns": 3,
      "kickoff return yards": 79,
      "interception returns": 2,
      "interception return yards": 4,
      "3rd down conversions": 3,
      "3rd down attempts": 8,
      "4th down conversions": 1,
      "4th down attempts": 1
    }
  },
  "MichiganState vs Illinois": {
    "stadium": "MemorialStadium-Champaign-IL",
    "MichiganState": {
      "points": 42,
      "1st downs": 29,
      "rushing 1st downs": 17,
      "passing 1st downs": 9,
      "penalty 1st downs": 3,
      "rushing yards": 269,
      "rushing attempts": 55,
      "passing yards": 208,
      "passing attempts": 16,
      "passing completions": 15,
      "passing interceptions": 0,
      "total yards": 477,
      "total plays": 71,
      "fumbles": 1,
      "fumbles lost": 1,
      "penalties": 5,
      "penalty yards": 34,
      "punts": 1,
      "punt yards": 54,
      "punt returns": 1,
      "punt return yards": 8,
      "kickoff returns": 1,
      "kickoff return yards": 3,
      "interception returns": 1,
      "interception return yards": 0,
      "3rd down conversions": 14,
      "3rd down attempts": 16,
      "4th down conversions": 0,
      "4th down attempts": 0
    },
    "Illinois": {
      "points": 3,
      "1st downs": 8,
      "rushing 1st downs": 3,
      "passing 1st downs": 4,
      "penalty 1st downs": 1,
      "rushing yards": 25,
      "rushing attempts": 21,
      "passing yards": 103,
      "passing attempts": 21,
      "passing completions": 13,
      "passing interceptions": 1,
      "total yards": 128,
      "total plays": 42,
      "fumbles": 1,
      "fumbles lost": 1,
      "penalties": 7,
      "penalty yards": 66,
      "punts": 5,
      "punt yards": 203,
      "punt returns": 0,
      "punt return yards": 0,
      "kickoff returns": 6,
      "kickoff return yards": 118,
      "interception returns": 0,
      "interception return yards": 0,
      "3rd down conversions": 3,
      "3rd down attempts": 10,
      "4th down conversions": 0,
      "4th down attempts": 1
    }
  },
  "Tennessee vs Alabama": {
    "stadium": "BryantDennyStadium-Tuscaloosa-AL",
    "Tennessee": {
      "points": 10,
      "1st downs": 14,
      "rushing 1st downs": 4,
      "passing 1st downs": 9,
      "penalty 1st downs": 1,
      "rushing yards": 127,
      "rushing attempts": 28,
      "passing yards": 195,
      "passing attempts": 28,
      "passing completions": 13,
      "passing interceptions": 2,
      "total yards": 322,
      "total plays": 56,
      "fumbles": 1,
      "fumbles lost": 0,
      "penalties": 3,
      "penalty yards": 32,
      "punts": 5,
      "punt yards": 231,
      "punt returns": 0,
      "punt return yards": 0,
      "kickoff returns": 5,
      "kickoff return yards": 146,
      "interception returns": 0,
      "interception return yards": 0,
      "3rd down conversions": 3,
      "3rd down attempts": 12,
      "4th down conversions": 1,
      "4th down attempts": 2
    },
    "Alabama": {
      "points": 45,
      "1st downs": 26,
      "rushing 1st downs": 11,
      "passing 1st downs": 13,
      "penalty 1st downs": 2,
      "rushing yards": 204,
      "rushing attempts": 37,
      "passing yards": 275,
      "passing attempts": 28,
      "passing completions": 19,
      "passing interceptions": 0,
      "total yards": 479,
      "total plays": 65,
      "fumbles": 1,
      "fumbles lost": 1,
      "penalties": 4,
      "penalty yards": 45,
      "punts": 2,
      "punt yards": 80,
      "punt returns": 2,
      "punt return yards": 19,
      "kickoff returns": 3,
      "kickoff return yards": 113,
      "interception returns": 2,
      "interception return yards": 117,
      "3rd down conversions": 7,
      "3rd down attempts": 11,
      "4th down conversions": 1,
      "4th down attempts": 1
    }
  },
  "TexasTech vs Oklahoma": {
    "stadium": "GaylordFamilyOklahomaMemorialStadium-Norman-OK",
    "TexasTech": {
      "points": 30,
      "1st downs": 24,
      "rushing 1st downs": 7,
      "passing 1st downs": 16,
      "penalty 1st downs": 1,
      "rushing yards": 72,
      "rushing attempts": 25,
      "passing yards": 388,
      "passing attempts": 54,
      "passing completions": 34,
      "passing interceptions": 2,
      "total yards": 460,
      "total plays": 79,
      "fumbles": 2,
      "fumbles lost": 1,
      "penalties": 3,
      "penalty yards": 42,
      "punts": 3,
      "punt yards": 102,
      "punt returns": 3,
      "punt return yards": 57,
      "kickoff returns": 3,
      "kickoff return yards": 72,
      "interception returns": 0,
      "interception return yards": 0,
      "3rd down conversions": 5,
      "3rd down attempts": 14,
      "4th down conversions": 1,
      "4th down attempts": 3
    },
    "Oklahoma": {
      "points": 38,
      "1st downs": 25,
      "rushing 1st downs": 15,
      "passing 1st downs": 10,
      "penalty 1st downs": 0,
      "rushing yards": 277,
      "rushing attempts": 50,
      "passing yards": 249,
      "passing attempts": 22,
      "passing completions": 14,
      "passing interceptions": 0,
      "total yards": 526,
      "total plays": 72,
      "fumbles": 2,
      "fumbles lost": 1,
      "penalties": 6,
      "penalty yards": 40,
      "punts": 4,
      "punt yards": 198,
      "punt returns": 0,
      "punt return yards": 0,
      "kickoff returns": 3,
      "kickoff return yards": 68,
      "interception returns": 2,
      "interception return yards": 3,
      "3rd down conversions": 7,
      "3rd down attempts": 14,
      "4th down conversions": 1,
      "4th down attempts": 1
    }
  },
  "BostonCollege vs NorthCarolina": {
    "stadium": "KenanMemorialStadium-ChapelHill-NC",
    "BostonCollege": {
      "points": 10,
      "1st downs": 12,
      "rushing 1st downs": 6,
      "passing 1st downs": 4,
      "penalty 1st downs": 2,
      "rushing yards": 202,
      "rushing attempts": 38,
      "passing yards": 59,
      "passing attempts": 22,
      "passing completions": 11,
      "passing interceptions": 0,
      "total yards": 261,
      "total plays": 60,
      "fumbles": 1,
      "fumbles lost": 1,
      "penalties": 5,
      "penalty yards": 42,
      "punts": 8,
      "punt yards": 313,
      "punt returns": 3,
      "punt return yards": 28,
      "kickoff returns": 5,
      "kickoff return yards": 79,
      "interception returns": 0,
      "interception return yards": 0,
      "3rd down conversions": 5,
      "3rd down attempts": 16,
      "4th down conversions": 0,
      "4th down attempts": 1
    },
    "NorthCarolina": {
      "points": 34,
      "1st downs": 21,
      "rushing 1st downs": 8,
      "passing 1st downs": 13,
      "penalty 1st downs": 0,
      "rushing yards": 110,
      "rushing attempts": 44,
      "passing yards": 282,
      "passing attempts": 29,
      "passing completions": 22,
      "passing interceptions": 0,
      "total yards": 392,
      "total plays": 73,
      "fumbles": 0,
      "fumbles lost": 0,
      "penalties": 4,
      "penalty yards": 50,
      "punts": 7,
      "punt yards": 317,
      "punt returns": 2,
      "punt return yards": -2,
      "kickoff returns": 2,
      "kickoff return yards": 20,
      "interception returns": 0,
      "interception return yards": 0,
      "3rd down conversions": 8,
      "3rd down attempts": 16,
      "4th down conversions": 0,
      "4th down attempts": 0
    }
  },
  "UTEP vs Rice": {
    "stadium": "RiceStadium-Houston-TX",
    "UTEP": {
      "points": 7,
      "1st downs": 17,
      "rushing 1st downs": 12,
      "passing 1st downs": 3,
      "penalty 1st downs": 2,
      "rushing yards": 248,
      "rushing attempts": 55,
      "passing yards": 116,
      "passing attempts": 12,
      "passing completions": 7,
      "passing interceptions": 1,
      "total yards": 364,
      "total plays": 67,
      "fumbles": 3,
      "fumbles lost": 2,
      "penalties": 3,
      "penalty yards": 19,
      "punts": 5,
      "punt yards": 215,
      "punt returns": 1,
      "punt return yards": 8,
      "kickoff returns": 2,
      "kickoff return yards": 33,
      "interception returns": 0,
      "interception return yards": 0,
      "3rd down conversions": 5,
      "3rd down attempts": 14,
      "4th down conversions": 0,
      "4th down attempts": 1
    },
    "Rice": {
      "points": 45,
      "1st downs": 21,
      "rushing 1st downs": 13,
      "passing 1st downs": 8,
      "penalty 1st downs": 0,
      "rushing yards": 265,
      "rushing attempts": 47,
      "passing yards": 259,
      "passing attempts": 20,
      "passing completions": 8,
      "passing interceptions": 0,
      "total yards": 524,
      "total plays": 67,
      "fumbles": 1,
      "fumbles lost": 0,
      "penalties": 6,
      "penalty yards": 43,
      "punts": 6,
      "punt yards": 223,
      "punt returns": 2,
      "punt return yards": 26,
      "kickoff returns": 1,
      "kickoff return yards": 45,
      "interception returns": 1,
      "interception return yards": 0,
      "3rd down conversions": 7,
      "3rd down attempts": 14,
      "4th down conversions": 0,
      "4th down attempts": 0
    }
  },
  "EasternMichigan vs NorthernIllinois": {
    "stadium": "BrighamFieldatHuskieStadium-DeKalb-IL",
    "EasternMichigan": {
      "points": 20,
      "1st downs": 21,
      "rushing 1st downs": 12,
      "passing 1st downs": 7,
      "penalty 1st downs": 2,
      "rushing yards": 164,
      "rushing attempts": 46,
      "passing yards": 173,
      "passing attempts": 32,
      "passing completions": 13,
      "passing interceptions": 0,
      "total yards": 337,
      "total plays": 78,
      "fumbles": 0,
      "fumbles lost": 0,
      "penalties": 7,
      "penalty yards": 47,
      "punts": 7,
      "punt yards": 268,
      "punt returns": 0,
      "punt return yards": 0,
      "kickoff returns": 6,
      "kickoff return yards": 114,
      "interception returns": 0,
      "interception return yards": 0,
      "3rd down conversions": 6,
      "3rd down attempts": 18,
      "4th down conversions": 2,
      "4th down attempts": 2
    },
    "NorthernIllinois": {
      "points": 59,
      "1st downs": 30,
      "rushing 1st downs": 14,
      "passing 1st downs": 15,
      "penalty 1st downs": 1,
      "rushing yards": 327,
      "rushing attempts": 44,
      "passing yards": 331,
      "passing attempts": 28,
      "passing completions": 21,
      "passing interceptions": 0,
      "total yards": 658,
      "total plays": 72,
      "fumbles": 0,
      "fumbles lost": 0,
      "penalties": 4,
      "penalty yards": 50,
      "punts": 2,
      "punt yards": 87,
      "punt returns": 1,
      "punt return yards": 41,
      "kickoff returns": 2,
      "kickoff return yards": 39,
      "interception returns": 0,
      "interception return yards": 0,
      "3rd down conversions": 6,
      "3rd down attempts": 10,
      "4th down conversions": 1,
      "4th down attempts": 2
    }
  },
  "Tulsa vs Tulane": {
    "stadium": "MercedesBenzSuperdome-NewOrleans-LA",
    "Tulsa": {
      "points": 7,
      "1st downs": 19,
      "rushing 1st downs": 12,
      "passing 1st downs": 6,
      "penalty 1st downs": 1,
      "rushing yards": 205,
      "rushing attempts": 46,
      "passing yards": 139,
      "passing attempts": 30,
      "passing completions": 13,
      "passing interceptions": 3,
      "total yards": 344,
      "total plays": 76,
      "fumbles": 1,
      "fumbles lost": 1,
      "penalties": 8,
      "penalty yards": 94,
      "punts": 5,
      "punt yards": 181,
      "punt returns": 4,
      "punt return yards": 16,
      "kickoff returns": 1,
      "kickoff return yards": 11,
      "interception returns": 2,
      "interception return yards": 64,
      "3rd down conversions": 4,
      "3rd down attempts": 15,
      "4th down conversions": 2,
      "4th down attempts": 3
    },
    "Tulane": {
      "points": 14,
      "1st downs": 17,
      "rushing 1st downs": 5,
      "passing 1st downs": 10,
      "penalty 1st downs": 2,
      "rushing yards": 137,
      "rushing attempts": 41,
      "passing yards": 164,
      "passing attempts": 29,
      "passing completions": 17,
      "passing interceptions": 2,
      "total yards": 301,
      "total plays": 70,
      "fumbles": 0,
      "fumbles lost": 0,
      "penalties": 6,
      "penalty yards": 45,
      "punts": 8,
      "punt yards": 337,
      "punt returns": 1,
      "punt return yards": 5,
      "kickoff returns": 2,
      "kickoff return yards": 43,
      "interception returns": 3,
      "interception return yards": 0,
      "3rd down conversions": 6,
      "3rd down attempts": 16,
      "4th down conversions": 1,
      "4th down attempts": 1
    }
  },
  "Duke vs VirginiaTech": {
    "stadium": "LaneStadium-Blacksburg-VA",
    "Duke": {
      "points": 13,
      "1st downs": 13,
      "rushing 1st downs": 6,
      "passing 1st downs": 4,
      "penalty 1st downs": 3,
      "rushing yards": 91,
      "rushing attempts": 28,
      "passing yards": 107,
      "passing attempts": 26,
      "passing completions": 7,
      "passing interceptions": 4,
      "total yards": 198,
      "total plays": 54,
      "fumbles": 1,
      "fumbles lost": 0,
      "penalties": 6,
      "penalty yards": 26,
      "punts": 6,
      "punt yards": 226,
      "punt returns": 0,
      "punt return yards": 0,
      "kickoff returns": 3,
      "kickoff return yards": 49,
      "interception returns": 4,
      "interception return yards": 28,
      "3rd down conversions": 0,
      "3rd down attempts": 11,
      "4th down conversions": 1,
      "4th down attempts": 1
    },
    "VirginiaTech": {
      "points": 10,
      "1st downs": 19,
      "rushing 1st downs": 12,
      "passing 1st downs": 6,
      "penalty 1st downs": 1,
      "rushing yards": 173,
      "rushing attempts": 46,
      "passing yards": 214,
      "passing attempts": 38,
      "passing completions": 21,
      "passing interceptions": 4,
      "total yards": 387,
      "total plays": 84,
      "fumbles": 0,
      "fumbles lost": 0,
      "penalties": 6,
      "penalty yards": 67,
      "punts": 3,
      "punt yards": 110,
      "punt returns": 2,
      "punt return yards": 3,
      "kickoff returns": 2,
      "kickoff return yards": 41,
      "interception returns": 4,
      "interception return yards": 3,
      "3rd down conversions": 4,
      "3rd down attempts": 18,
      "4th down conversions": 4,
      "4th down attempts": 6
    }
  },
  "WestVirginia vs KansasState": {
    "stadium": "BillSnyderFamilyFootballStadium-Manhattan-KS",
    "WestVirginia": {
      "points": 12,
      "1st downs": 18,
      "rushing 1st downs": 4,
      "passing 1st downs": 13,
      "penalty 1st downs": 1,
      "rushing yards": 103,
      "rushing attempts": 29,
      "passing yards": 264,
      "passing attempts": 41,
      "passing completions": 19,
      "passing interceptions": 1,
      "total yards": 367,
      "total plays": 70,
      "fumbles": 2,
      "fumbles lost": 2,
      "penalties": 3,
      "penalty yards": 25,
      "punts": 5,
      "punt yards": 160,
      "punt returns": 1,
      "punt return yards": 3,
      "kickoff returns": 4,
      "kickoff return yards": 68,
      "interception returns": 0,
      "interception return yards": 0,
      "3rd down conversions": 4,
      "3rd down attempts": 15,
      "4th down conversions": 0,
      "4th down attempts": 2
    },
    "KansasState": {
      "points": 35,
      "1st downs": 19,
      "rushing 1st downs": 6,
      "passing 1st downs": 13,
      "penalty 1st downs": 0,
      "rushing yards": 157,
      "rushing attempts": 43,
      "passing yards": 291,
      "passing attempts": 21,
      "passing completions": 18,
      "passing interceptions": 0,
      "total yards": 448,
      "total plays": 64,
      "fumbles": 3,
      "fumbles lost": 2,
      "penalties": 4,
      "penalty yards": 33,
      "punts": 5,
      "punt yards": 185,
      "punt returns": 1,
      "punt return yards": 4,
      "kickoff returns": 2,
      "kickoff return yards": 42,
      "interception returns": 1,
      "interception return yards": 15,
      "3rd down conversions": 8,
      "3rd down attempts": 13,
      "4th down conversions": 0,
      "4th down attempts": 0
    }
  },
  "Troy vs WesternKentucky": {
    "stadium": "HouchensIndustriesLTSmithStadium-BowlingGreen-KY",
    "Troy": {
      "points": 32,
      "1st downs": 18,
      "rushing 1st downs": 7,
      "passing 1st downs": 10,
      "penalty 1st downs": 1,
      "rushing yards": 91,
      "rushing attempts": 30,
      "passing yards": 306,
      "passing attempts": 33,
      "passing completions": 20,
      "passing interceptions": 1,
      "total yards": 397,
      "total plays": 63,
      "fumbles": 3,
      "fumbles lost": 0,
      "penalties": 10,
      "penalty yards": 104,
      "punts": 3,
      "punt yards": 120,
      "punt returns": 0,
      "punt return yards": 0,
      "kickoff returns": 5,
      "kickoff return yards": 73,
      "interception returns": 0,
      "interception return yards": 0,
      "3rd down conversions": 6,
      "3rd down attempts": 13,
      "4th down conversions": 1,
      "4th down attempts": 1
    },
    "WesternKentucky": {
      "points": 26,
      "1st downs": 29,
      "rushing 1st downs": 8,
      "passing 1st downs": 19,
      "penalty 1st downs": 2,
      "rushing yards": 133,
      "rushing attempts": 41,
      "passing yards": 399,
      "passing attempts": 48,
      "passing completions": 31,
      "passing interceptions": 0,
      "total yards": 532,
      "total plays": 89,
      "fumbles": 2,
      "fumbles lost": 2,
      "penalties": 5,
      "penalty yards": 37,
      "punts": 1,
      "punt yards": 24,
      "punt returns": 1,
      "punt return yards": 0,
      "kickoff returns": 2,
      "kickoff return yards": 40,
      "interception returns": 1,
      "interception return yards": 0,
      "3rd down conversions": 7,
      "3rd down attempts": 16,
      "4th down conversions": 2,
      "4th down attempts": 3
    }
  },
  "Utah vs USC": {
    "stadium": "LosAngelesMemorialColiseum-LosAngeles-CA",
    "Utah": {
      "points": 3,
      "1st downs": 13,
      "rushing 1st downs": 8,
      "passing 1st downs": 5,
      "penalty 1st downs": 0,
      "rushing yards": 71,
      "rushing attempts": 38,
      "passing yards": 130,
      "passing attempts": 31,
      "passing completions": 12,
      "passing interceptions": 3,
      "total yards": 201,
      "total plays": 69,
      "fumbles": 2,
      "fumbles lost": 1,
      "penalties": 2,
      "penalty yards": 15,
      "punts": 5,
      "punt yards": 187,
      "punt returns": 3,
      "punt return yards": 67,
      "kickoff returns": 4,
      "kickoff return yards": 52,
      "interception returns": 0,
      "interception return yards": 0,
      "3rd down conversions": 6,
      "3rd down attempts": 17,
      "4th down conversions": 2,
      "4th down attempts": 4
    },
    "USC": {
      "points": 19,
      "1st downs": 14,
      "rushing 1st downs": 3,
      "passing 1st downs": 11,
      "penalty 1st downs": 0,
      "rushing yards": 30,
      "rushing attempts": 30,
      "passing yards": 230,
      "passing attempts": 32,
      "passing completions": 21,
      "passing interceptions": 0,
      "total yards": 260,
      "total plays": 62,
      "fumbles": 1,
      "fumbles lost": 0,
      "penalties": 4,
      "penalty yards": 20,
      "punts": 7,
      "punt yards": 269,
      "punt returns": 0,
      "punt return yards": 0,
      "kickoff returns": 2,
      "kickoff return yards": 22,
      "interception returns": 3,
      "interception return yards": 72,
      "3rd down conversions": 3,
      "3rd down attempts": 15,
      "4th down conversions": 1,
      "4th down attempts": 1
    }
  },
  "UAB vs UTSA": {
    "stadium": "Alamodome-SanAntonio-TX",
    "UAB": {
      "points": 31,
      "1st downs": 29,
      "rushing 1st downs": 13,
      "passing 1st downs": 16,
      "penalty 1st downs": 0,
      "rushing yards": 189,
      "rushing attempts": 34,
      "passing yards": 317,
      "passing attempts": 43,
      "passing completions": 23,
      "passing interceptions": 2,
      "total yards": 506,
      "total plays": 77,
      "fumbles": 2,
      "fumbles lost": 1,
      "penalties": 5,
      "penalty yards": 36,
      "punts": 2,
      "punt yards": 67,
      "punt returns": 0,
      "punt return yards": 0,
      "kickoff returns": 4,
      "kickoff return yards": 76,
      "interception returns": 0,
      "interception return yards": 0,
      "3rd down conversions": 11,
      "3rd down attempts": 15,
      "4th down conversions": 0,
      "4th down attempts": 1
    },
    "UTSA": {
      "points": 52,
      "1st downs": 26,
      "rushing 1st downs": 12,
      "passing 1st downs": 12,
      "penalty 1st downs": 2,
      "rushing yards": 248,
      "rushing attempts": 42,
      "passing yards": 275,
      "passing attempts": 25,
      "passing completions": 18,
      "passing interceptions": 0,
      "total yards": 523,
      "total plays": 67,
      "fumbles": 1,
      "fumbles lost": 0,
      "penalties": 3,
      "penalty yards": 30,
      "punts": 2,
      "punt yards": 84,
      "punt returns": 0,
      "punt return yards": 0,
      "kickoff returns": 4,
      "kickoff return yards": 96,
      "interception returns": 2,
      "interception return yards": 13,
      "3rd down conversions": 8,
      "3rd down attempts": 11,
      "4th down conversions": 0,
      "4th down attempts": 0
    }
  },
  "NotreDame vs AirForce": {
    "stadium": "FalconStadium-USAirForceAcademy-CO",
    "NotreDame": {
      "points": 45,
      "1st downs": 22,
      "rushing 1st downs": 7,
      "passing 1st downs": 13,
      "penalty 1st downs": 2,
      "rushing yards": 135,
      "rushing attempts": 37,
      "passing yards": 331,
      "passing attempts": 26,
      "passing completions": 18,
      "passing interceptions": 0,
      "total yards": 466,
      "total plays": 63,
      "fumbles": 1,
      "fumbles lost": 0,
      "penalties": 1,
      "penalty yards": 5,
      "punts": 3,
      "punt yards": 133,
      "punt returns": 1,
      "punt return yards": 0,
      "kickoff returns": 1,
      "kickoff return yards": 37,
      "interception returns": 0,
      "interception return yards": 0,
      "3rd down conversions": 5,
      "3rd down attempts": 11,
      "4th down conversions": 1,
      "4th down attempts": 1
    },
    "AirForce": {
      "points": 10,
      "1st downs": 19,
      "rushing 1st downs": 18,
      "passing 1st downs": 1,
      "penalty 1st downs": 0,
      "rushing yards": 290,
      "rushing attempts": 65,
      "passing yards": 49,
      "passing attempts": 12,
      "passing completions": 8,
      "passing interceptions": 0,
      "total yards": 339,
      "total plays": 77,
      "fumbles": 2,
      "fumbles lost": 2,
      "penalties": 5,
      "penalty yards": 40,
      "punts": 5,
      "punt yards": 180,
      "punt returns": 2,
      "punt return yards": 16,
      "kickoff returns": 1,
      "kickoff return yards": 29,
      "interception returns": 0,
      "interception return yards": 0,
      "3rd down conversions": 7,
      "3rd down attempts": 17,
      "4th down conversions": 1,
      "4th down attempts": 3
    }
  },
  "LouisianaTech vs FloridaInternational": {
    "stadium": "FIUStadium-Miami-FL",
    "LouisianaTech": {
      "points": 23,
      "1st downs": 23,
      "rushing 1st downs": 12,
      "passing 1st downs": 8,
      "penalty 1st downs": 3,
      "rushing yards": 141,
      "rushing attempts": 47,
      "passing yards": 192,
      "passing attempts": 32,
      "passing completions": 20,
      "passing interceptions": 3,
      "total yards": 333,
      "total plays": 79,
      "fumbles": 3,
      "fumbles lost": 0,
      "penalties": 4,
      "penalty yards": 40,
      "punts": 4,
      "punt yards": 140,
      "punt returns": 1,
      "punt return yards": 1,
      "kickoff returns": 1,
      "kickoff return yards": 16,
      "interception returns": 2,
      "interception return yards": 0,
      "3rd down conversions": 3,
      "3rd down attempts": 15,
      "4th down conversions": 1,
      "4th down attempts": 2
    },
    "FloridaInternational": {
      "points": 7,
      "1st downs": 12,
      "rushing 1st downs": 7,
      "passing 1st downs": 5,
      "penalty 1st downs": 0,
      "rushing yards": 69,
      "rushing attempts": 38,
      "passing yards": 128,
      "passing attempts": 26,
      "passing completions": 11,
      "passing interceptions": 2,
      "total yards": 197,
      "total plays": 64,
      "fumbles": 4,
      "fumbles lost": 1,
      "penalties": 7,
      "penalty yards": 75,
      "punts": 7,
      "punt yards": 249,
      "punt returns": 0,
      "punt return yards": 0,
      "kickoff returns": 5,
      "kickoff return yards": 73,
      "interception returns": 3,
      "interception return yards": 5,
      "3rd down conversions": 5,
      "3rd down attempts": 16,
      "4th down conversions": 0,
      "4th down attempts": 2
    }
  },
  "UNLV vs Nevada": {
    "stadium": "MackayStadium-Reno-NV",
    "UNLV": {
      "points": 27,
      "1st downs": 29,
      "rushing 1st downs": 10,
      "passing 1st downs": 17,
      "penalty 1st downs": 2,
      "rushing yards": 149,
      "rushing attempts": 42,
      "passing yards": 335,
      "passing attempts": 42,
      "passing completions": 29,
      "passing interceptions": 0,
      "total yards": 484,
      "total plays": 84,
      "fumbles": 2,
      "fumbles lost": 1,
      "penalties": 3,
      "penalty yards": 35,
      "punts": 8,
      "punt yards": 309,
      "punt returns": 3,
      "punt return yards": 5,
      "kickoff returns": 2,
      "kickoff return yards": 56,
      "interception returns": 1,
      "interception return yards": 5,
      "3rd down conversions": 5,
      "3rd down attempts": 15,
      "4th down conversions": 1,
      "4th down attempts": 1
    },
    "Nevada": {
      "points": 22,
      "1st downs": 18,
      "rushing 1st downs": 6,
      "passing 1st downs": 11,
      "penalty 1st downs": 1,
      "rushing yards": 130,
      "rushing attempts": 36,
      "passing yards": 357,
      "passing attempts": 40,
      "passing completions": 24,
      "passing interceptions": 1,
      "total yards": 487,
      "total plays": 76,
      "fumbles": 1,
      "fumbles lost": 1,
      "penalties": 13,
      "penalty yards": 105,
      "punts": 6,
      "punt yards": 329,
      "punt returns": 0,
      "punt return yards": 0,
      "kickoff returns": 2,
      "kickoff return yards": 48,
      "interception returns": 0,
      "interception return yards": 0,
      "3rd down conversions": 2,
      "3rd down attempts": 15,
      "4th down conversions": 1,
      "4th down attempts": 3
    }
  },
  "NorthTexas vs SouthernMiss": {
    "stadium": "MMRobertsStadium-Hattiesburg-MS",
    "NorthTexas": {
      "points": 55,
      "1st downs": 30,
      "rushing 1st downs": 15,
      "passing 1st downs": 14,
      "penalty 1st downs": 1,
      "rushing yards": 229,
      "rushing attempts": 62,
      "passing yards": 300,
      "passing attempts": 27,
      "passing completions": 18,
      "passing interceptions": 2,
      "total yards": 529,
      "total plays": 89,
      "fumbles": 2,
      "fumbles lost": 2,
      "penalties": 2,
      "penalty yards": 10,
      "punts": 3,
      "punt yards": 104,
      "punt returns": 1,
      "punt return yards": 0,
      "kickoff returns": 3,
      "kickoff return yards": 78,
      "interception returns": 3,
      "interception return yards": 49,
      "3rd down conversions": 11,
      "3rd down attempts": 17,
      "4th down conversions": 2,
      "4th down attempts": 2
    },
    "SouthernMiss": {
      "points": 14,
      "1st downs": 10,
      "rushing 1st downs": 2,
      "passing 1st downs": 8,
      "penalty 1st downs": 0,
      "rushing yards": 39,
      "rushing attempts": 21,
      "passing yards": 210,
      "passing attempts": 31,
      "passing completions": 12,
      "passing interceptions": 3,
      "total yards": 249,
      "total plays": 52,
      "fumbles": 4,
      "fumbles lost": 2,
      "penalties": 4,
      "penalty yards": 40,
      "punts": 7,
      "punt yards": 281,
      "punt returns": 0,
      "punt return yards": 0,
      "kickoff returns": 6,
      "kickoff return yards": 139,
      "interception returns": 2,
      "interception return yards": 4,
      "3rd down conversions": 2,
      "3rd down attempts": 11,
      "4th down conversions": 0,
      "4th down attempts": 0
    }
  },
  "SouthAlabama vs TexasState": {
    "stadium": "JimWackerFieldatBobcatStadium-SanMarcos-TX",
    "SouthAlabama": {
      "points": 31,
      "1st downs": 18,
      "rushing 1st downs": 6,
      "passing 1st downs": 10,
      "penalty 1st downs": 2,
      "rushing yards": 109,
      "rushing attempts": 22,
      "passing yards": 300,
      "passing attempts": 43,
      "passing completions": 27,
      "passing interceptions": 1,
      "total yards": 409,
      "total plays": 65,
      "fumbles": 2,
      "fumbles lost": 1,
      "penalties": 2,
      "penalty yards": 15,
      "punts": 5,
      "punt yards": 220,
      "punt returns": 2,
      "punt return yards": 18,
      "kickoff returns": 2,
      "kickoff return yards": 15,
      "interception returns": 1,
      "interception return yards": 35,
      "3rd down conversions": 4,
      "3rd down attempts": 13,
      "4th down conversions": 1,
      "4th down attempts": 2
    },
    "TexasState": {
      "points": 33,
      "1st downs": 22,
      "rushing 1st downs": 14,
      "passing 1st downs": 8,
      "penalty 1st downs": 0,
      "rushing yards": 234,
      "rushing attempts": 53,
      "passing yards": 218,
      "passing attempts": 26,
      "passing completions": 15,
      "passing interceptions": 1,
      "total yards": 452,
      "total plays": 79,
      "fumbles": 0,
      "fumbles lost": 0,
      "penalties": 11,
      "penalty yards": 98,
      "punts": 4,
      "punt yards": 172,
      "punt returns": 3,
      "punt return yards": 30,
      "kickoff returns": 5,
      "kickoff return yards": 63,
      "interception returns": 1,
      "interception return yards": 29,
      "3rd down conversions": 8,
      "3rd down attempts": 17,
      "4th down conversions": 2,
      "4th down attempts": 2
    }
  },
  "FCS vs LSU": {
    "stadium": "TigerStadium-BatonRouge-LA",
    "FCS": {
      "points": 16,
      "1st downs": 13,
      "rushing 1st downs": 7,
      "passing 1st downs": 5,
      "penalty 1st downs": 1,
      "rushing yards": 92,
      "rushing attempts": 35,
      "passing yards": 106,
      "passing attempts": 29,
      "passing completions": 17,
      "passing interceptions": 1,
      "total yards": 198,
      "total plays": 64,
      "fumbles": 2,
      "fumbles lost": 0,
      "penalties": 3,
      "penalty yards": 18,
      "punts": 8,
      "punt yards": 282,
      "punt returns": 1,
      "punt return yards": 0,
      "kickoff returns": 2,
      "kickoff return yards": 41,
      "interception returns": 2,
      "interception return yards": 78,
      "3rd down conversions": 4,
      "3rd down attempts": 16,
      "4th down conversions": 1,
      "4th down attempts": 1
    },
    "LSU": {
      "points": 48,
      "1st downs": 26,
      "rushing 1st downs": 16,
      "passing 1st downs": 10,
      "penalty 1st downs": 0,
      "rushing yards": 332,
      "rushing attempts": 36,
      "passing yards": 340,
      "passing attempts": 26,
      "passing completions": 17,
      "passing interceptions": 2,
      "total yards": 672,
      "total plays": 62,
      "fumbles": 1,
      "fumbles lost": 1,
      "penalties": 7,
      "penalty yards": 75,
      "punts": 1,
      "punt yards": 37,
      "punt returns": 5,
      "punt return yards": 22,
      "kickoff returns": 3,
      "kickoff return yards": 40,
      "interception returns": 1,
      "interception return yards": 0,
      "3rd down conversions": 5,
      "3rd down attempts": 7,
      "4th down conversions": 0,
      "4th down attempts": 0
    }
  },
  "Baylor vs Kansas": {
    "stadium": "MemorialStadium-Lawrence-KS",
    "Baylor": {
      "points": 59,
      "1st downs": 31,
      "rushing 1st downs": 13,
      "passing 1st downs": 17,
      "penalty 1st downs": 1,
      "rushing yards": 306,
      "rushing attempts": 44,
      "passing yards": 437,
      "passing attempts": 38,
      "passing completions": 21,
      "passing interceptions": 0,
      "total yards": 743,
      "total plays": 82,
      "fumbles": 5,
      "fumbles lost": 2,
      "penalties": 4,
      "penalty yards": 30,
      "punts": 4,
      "punt yards": 165,
      "punt returns": 6,
      "punt return yards": 38,
      "kickoff returns": 2,
      "kickoff return yards": 36,
      "interception returns": 0,
      "interception return yards": 0,
      "3rd down conversions": 8,
      "3rd down attempts": 14,
      "4th down conversions": 0,
      "4th down attempts": 1
    },
    "Kansas": {
      "points": 14,
      "1st downs": 16,
      "rushing 1st downs": 7,
      "passing 1st downs": 8,
      "penalty 1st downs": 1,
      "rushing yards": 154,
      "rushing attempts": 50,
      "passing yards": 154,
      "passing attempts": 33,
      "passing completions": 11,
      "passing interceptions": 0,
      "total yards": 308,
      "total plays": 83,
      "fumbles": 3,
      "fumbles lost": 1,
      "penalties": 9,
      "penalty yards": 80,
      "punts": 11,
      "punt yards": 515,
      "punt returns": 1,
      "punt return yards": 24,
      "kickoff returns": 6,
      "kickoff return yards": 137,
      "interception returns": 0,
      "interception return yards": 0,
      "3rd down conversions": 8,
      "3rd down attempts": 22,
      "4th down conversions": 0,
      "4th down attempts": 2
    }
  },
  "Wyoming vs SanJoseState": {
    "stadium": "SpartanStadium-SanJose-CA",
    "Wyoming": {
      "points": 44,
      "1st downs": 24,
      "rushing 1st downs": 15,
      "passing 1st downs": 8,
      "penalty 1st downs": 1,
      "rushing yards": 332,
      "rushing attempts": 43,
      "passing yards": 267,
      "passing attempts": 34,
      "passing completions": 22,
      "passing interceptions": 1,
      "total yards": 599,
      "total plays": 77,
      "fumbles": 2,
      "fumbles lost": 1,
      "penalties": 3,
      "penalty yards": 22,
      "punts": 5,
      "punt yards": 221,
      "punt returns": 1,
      "punt return yards": 1,
      "kickoff returns": 3,
      "kickoff return yards": 41,
      "interception returns": 0,
      "interception return yards": 0,
      "3rd down conversions": 9,
      "3rd down attempts": 16,
      "4th down conversions": 1,
      "4th down attempts": 1
    },
    "SanJoseState": {
      "points": 51,
      "1st downs": 28,
      "rushing 1st downs": 10,
      "passing 1st downs": 18,
      "penalty 1st downs": 0,
      "rushing yards": 160,
      "rushing attempts": 44,
      "passing yards": 482,
      "passing attempts": 37,
      "passing completions": 27,
      "passing interceptions": 0,
      "total yards": 642,
      "total plays": 81,
      "fumbles": 2,
      "fumbles lost": 1,
      "penalties": 2,
      "penalty yards": 25,
      "punts": 6,
      "punt yards": 250,
      "punt returns": 2,
      "punt return yards": 8,
      "kickoff returns": 4,
      "kickoff return yards": 91,
      "interception returns": 1,
      "interception return yards": 0,
      "3rd down conversions": 5,
      "3rd down attempts": 14,
      "4th down conversions": 2,
      "4th down attempts": 2
    }
  },
  "UCLA vs Oregon": {
    "stadium": "AutzenStadium-Eugene-OR",
    "UCLA": {
      "points": 14,
      "1st downs": 15,
      "rushing 1st downs": 11,
      "passing 1st downs": 3,
      "penalty 1st downs": 1,
      "rushing yards": 219,
      "rushing attempts": 52,
      "passing yards": 64,
      "passing attempts": 19,
      "passing completions": 13,
      "passing interceptions": 2,
      "total yards": 283,
      "total plays": 71,
      "fumbles": 3,
      "fumbles lost": 0,
      "penalties": 5,
      "penalty yards": 59,
      "punts": 7,
      "punt yards": 259,
      "punt returns": 0,
      "punt return yards": 0,
      "kickoff returns": 6,
      "kickoff return yards": 134,
      "interception returns": 0,
      "interception return yards": 0,
      "3rd down conversions": 9,
      "3rd down attempts": 18,
      "4th down conversions": 0,
      "4th down attempts": 1
    },
    "Oregon": {
      "points": 42,
      "1st downs": 30,
      "rushing 1st downs": 16,
      "passing 1st downs": 12,
      "penalty 1st downs": 2,
      "rushing yards": 325,
      "rushing attempts": 53,
      "passing yards": 230,
      "passing attempts": 28,
      "passing completions": 21,
      "passing interceptions": 0,
      "total yards": 555,
      "total plays": 81,
      "fumbles": 3,
      "fumbles lost": 2,
      "penalties": 5,
      "penalty yards": 50,
      "punts": 3,
      "punt yards": 84,
      "punt returns": 2,
      "punt return yards": 8,
      "kickoff returns": 1,
      "kickoff return yards": 18,
      "interception returns": 2,
      "interception return yards": 43,
      "3rd down conversions": 7,
      "3rd down attempts": 12,
      "4th down conversions": 1,
      "4th down attempts": 2
    }
  },
  "SouthCarolina vs Missouri": {
    "stadium": "FaurotField-Columbia-MO",
    "SouthCarolina": {
      "points": 27,
      "1st downs": 28,
      "rushing 1st downs": 7,
      "passing 1st downs": 18,
      "penalty 1st downs": 3,
      "rushing yards": 75,
      "rushing attempts": 35,
      "passing yards": 423,
      "passing attempts": 56,
      "passing completions": 35,
      "passing interceptions": 1,
      "total yards": 498,
      "total plays": 91,
      "fumbles": 2,
      "fumbles lost": 2,
      "penalties": 9,
      "penalty yards": 65,
      "punts": 3,
      "punt yards": 134,
      "punt returns": 2,
      "punt return yards": -8,
      "kickoff returns": 3,
      "kickoff return yards": 61,
      "interception returns": 1,
      "interception return yards": -3,
      "3rd down conversions": 5,
      "3rd down attempts": 17,
      "4th down conversions": 3,
      "4th down attempts": 5
    },
    "Missouri": {
      "points": 24,
      "1st downs": 17,
      "rushing 1st downs": 7,
      "passing 1st downs": 7,
      "penalty 1st downs": 3,
      "rushing yards": 155,
      "rushing attempts": 41,
      "passing yards": 249,
      "passing attempts": 25,
      "passing completions": 10,
      "passing interceptions": 1,
      "total yards": 404,
      "total plays": 66,
      "fumbles": 0,
      "fumbles lost": 0,
      "penalties": 6,
      "penalty yards": 50,
      "punts": 7,
      "punt yards": 236,
      "punt returns": 0,
      "punt return yards": 0,
      "kickoff returns": 3,
      "kickoff return yards": 75,
      "interception returns": 1,
      "interception return yards": 0,
      "3rd down conversions": 4,
      "3rd down attempts": 14,
      "4th down conversions": 0,
      "4th down attempts": 0
    }
  },
  "GeorgiaState vs LouisianaMonroe": {
    "stadium": "MaloneStadium-Monroe-LA",
    "GeorgiaState": {
      "points": 10,
      "1st downs": 14,
      "rushing 1st downs": 6,
      "passing 1st downs": 5,
      "penalty 1st downs": 3,
      "rushing yards": 136,
      "rushing attempts": 33,
      "passing yards": 108,
      "passing attempts": 31,
      "passing completions": 12,
      "passing interceptions": 3,
      "total yards": 244,
      "total plays": 64,
      "fumbles": 2,
      "fumbles lost": 1,
      "penalties": 3,
      "penalty yards": 20,
      "punts": 8,
      "punt yards": 345,
      "punt returns": 2,
      "punt return yards": 12,
      "kickoff returns": 4,
      "kickoff return yards": 88,
      "interception returns": 0,
      "interception return yards": 0,
      "3rd down conversions": 3,
      "3rd down attempts": 15,
      "4th down conversions": 0,
      "4th down attempts": 1
    },
    "LouisianaMonroe": {
      "points": 38,
      "1st downs": 24,
      "rushing 1st downs": 9,
      "passing 1st downs": 15,
      "penalty 1st downs": 0,
      "rushing yards": 225,
      "rushing attempts": 38,
      "passing yards": 309,
      "passing attempts": 44,
      "passing completions": 30,
      "passing interceptions": 0,
      "total yards": 534,
      "total plays": 82,
      "fumbles": 2,
      "fumbles lost": 2,
      "penalties": 3,
      "penalty yards": 33,
      "punts": 5,
      "punt yards": 225,
      "punt returns": 0,
      "punt return yards": 0,
      "kickoff returns": 3,
      "kickoff return yards": 45,
      "interception returns": 3,
      "interception return yards": 25,
      "3rd down conversions": 8,
      "3rd down attempts": 16,
      "4th down conversions": 0,
      "4th down attempts": 2
    }
  },
  "Texas vs TCU": {
    "stadium": "AmonGCarterStadium-FortWorth-TX",
    "Texas": {
      "points": 30,
      "1st downs": 18,
      "rushing 1st downs": 7,
      "passing 1st downs": 7,
      "penalty 1st downs": 4,
      "rushing yards": 187,
      "rushing attempts": 52,
      "passing yards": 228,
      "passing attempts": 19,
      "passing completions": 9,
      "passing interceptions": 2,
      "total yards": 415,
      "total plays": 71,
      "fumbles": 1,
      "fumbles lost": 0,
      "penalties": 6,
      "penalty yards": 50,
      "punts": 7,
      "punt yards": 280,
      "punt returns": 3,
      "punt return yards": -7,
      "kickoff returns": 1,
      "kickoff return yards": 19,
      "interception returns": 1,
      "interception return yards": 6,
      "3rd down conversions": 4,
      "3rd down attempts": 15,
      "4th down conversions": 0,
      "4th down attempts": 1
    },
    "TCU": {
      "points": 7,
      "1st downs": 12,
      "rushing 1st downs": 4,
      "passing 1st downs": 8,
      "penalty 1st downs": 0,
      "rushing yards": 45,
      "rushing attempts": 24,
      "passing yards": 201,
      "passing attempts": 39,
      "passing completions": 17,
      "passing interceptions": 1,
      "total yards": 246,
      "total plays": 63,
      "fumbles": 2,
      "fumbles lost": 2,
      "penalties": 8,
      "penalty yards": 86,
      "punts": 10,
      "punt yards": 366,
      "punt returns": 1,
      "punt return yards": -3,
      "kickoff returns": 6,
      "kickoff return yards": 156,
      "interception returns": 2,
      "interception return yards": 20,
      "3rd down conversions": 4,
      "3rd down attempts": 16,
      "4th down conversions": 0,
      "4th down attempts": 0
    }
  },
  "FloridaAtlantic vs Auburn": {
    "stadium": "JordanHareStadium-Auburn-AL",
    "FloridaAtlantic": {
      "points": 10,
      "1st downs": 10,
      "rushing 1st downs": 3,
      "passing 1st downs": 5,
      "penalty 1st downs": 2,
      "rushing yards": 97,
      "rushing attempts": 25,
      "passing yards": 150,
      "passing attempts": 26,
      "passing completions": 11,
      "passing interceptions": 0,
      "total yards": 247,
      "total plays": 51,
      "fumbles": 1,
      "fumbles lost": 1,
      "penalties": 5,
      "penalty yards": 34,
      "punts": 10,
      "punt yards": 462,
      "punt returns": 0,
      "punt return yards": 0,
      "kickoff returns": 3,
      "kickoff return yards": 65,
      "interception returns": 1,
      "interception return yards": 0,
      "3rd down conversions": 2,
      "3rd down attempts": 13,
      "4th down conversions": 0,
      "4th down attempts": 0
    },
    "Auburn": {
      "points": 45,
      "1st downs": 27,
      "rushing 1st downs": 18,
      "passing 1st downs": 8,
      "penalty 1st downs": 1,
      "rushing yards": 422,
      "rushing attempts": 59,
      "passing yards": 206,
      "passing attempts": 18,
      "passing completions": 12,
      "passing interceptions": 1,
      "total yards": 628,
      "total plays": 77,
      "fumbles": 2,
      "fumbles lost": 0,
      "penalties": 6,
      "penalty yards": 55,
      "punts": 3,
      "punt yards": 119,
      "punt returns": 7,
      "punt return yards": 70,
      "kickoff returns": 3,
      "kickoff return yards": 72,
      "interception returns": 0,
      "interception return yards": 0,
      "3rd down conversions": 5,
      "3rd down attempts": 11,
      "4th down conversions": 1,
      "4th down attempts": 2
    }
  },
  "Idaho vs OleMiss": {
    "stadium": "VaughtHemingwayStadium-University-MS",
    "Idaho": {
      "points": 14,
      "1st downs": 12,
      "rushing 1st downs": 6,
      "passing 1st downs": 4,
      "penalty 1st downs": 2,
      "rushing yards": 87,
      "rushing attempts": 36,
      "passing yards": 166,
      "passing attempts": 30,
      "passing completions": 12,
      "passing interceptions": 0,
      "total yards": 253,
      "total plays": 66,
      "fumbles": 1,
      "fumbles lost": 1,
      "penalties": 7,
      "penalty yards": 75,
      "punts": 7,
      "punt yards": 351,
      "punt returns": 1,
      "punt return yards": 18,
      "kickoff returns": 2,
      "kickoff return yards": 32,
      "interception returns": 0,
      "interception return yards": 0,
      "3rd down conversions": 4,
      "3rd down attempts": 16,
      "4th down conversions": 1,
      "4th down attempts": 3
    },
    "OleMiss": {
      "points": 59,
      "1st downs": 28,
      "rushing 1st downs": 15,
      "passing 1st downs": 8,
      "penalty 1st downs": 5,
      "rushing yards": 292,
      "rushing attempts": 45,
      "passing yards": 280,
      "passing attempts": 29,
      "passing completions": 22,
      "passing interceptions": 0,
      "total yards": 572,
      "total plays": 74,
      "fumbles": 3,
      "fumbles lost": 0,
      "penalties": 8,
      "penalty yards": 60,
      "punts": 3,
      "punt yards": 128,
      "punt returns": 1,
      "punt return yards": 4,
      "kickoff returns": 3,
      "kickoff return yards": 56,
      "interception returns": 0,
      "interception return yards": 0,
      "3rd down conversions": 3,
      "3rd down attempts": 10,
      "4th down conversions": 2,
      "4th down attempts": 2
    }
  },
  "Arizona vs Colorado": {
    "stadium": "FolsomField-Boulder-CO",
    "Arizona": {
      "points": 44,
      "1st downs": 26,
      "rushing 1st downs": 17,
      "passing 1st downs": 9,
      "penalty 1st downs": 0,
      "rushing yards": 405,
      "rushing attempts": 50,
      "passing yards": 265,
      "passing attempts": 32,
      "passing completions": 21,
      "passing interceptions": 1,
      "total yards": 670,
      "total plays": 82,
      "fumbles": 2,
      "fumbles lost": 1,
      "penalties": 5,
      "penalty yards": 69,
      "punts": 4,
      "punt yards": 148,
      "punt returns": 0,
      "punt return yards": 0,
      "kickoff returns": 1,
      "kickoff return yards": 23,
      "interception returns": 1,
      "interception return yards": 19,
      "3rd down conversions": 7,
      "3rd down attempts": 16,
      "4th down conversions": 1,
      "4th down attempts": 1
    },
    "Colorado": {
      "points": 20,
      "1st downs": 19,
      "rushing 1st downs": 7,
      "passing 1st downs": 9,
      "penalty 1st downs": 3,
      "rushing yards": 137,
      "rushing attempts": 42,
      "passing yards": 212,
      "passing attempts": 33,
      "passing completions": 17,
      "passing interceptions": 1,
      "total yards": 349,
      "total plays": 75,
      "fumbles": 0,
      "fumbles lost": 0,
      "penalties": 2,
      "penalty yards": 20,
      "punts": 5,
      "punt yards": 193,
      "punt returns": 0,
      "punt return yards": 0,
      "kickoff returns": 2,
      "kickoff return yards": 79,
      "interception returns": 1,
      "interception return yards": 26,
      "3rd down conversions": 7,
      "3rd down attempts": 17,
      "4th down conversions": 0,
      "4th down attempts": 2
    }
  },
  "FCS vs NewMexicoState": {
    "stadium": "AggieMemorialStadium-LasCruces-NM",
    "FCS": {
      "points": 29,
      "1st downs": 21,
      "rushing 1st downs": 5,
      "passing 1st downs": 16,
      "penalty 1st downs": 0,
      "rushing yards": 146,
      "rushing attempts": 24,
      "passing yards": 428,
      "passing attempts": 49,
      "passing completions": 33,
      "passing interceptions": 1,
      "total yards": 574,
      "total plays": 73,
      "fumbles": 1,
      "fumbles lost": 1,
      "penalties": 10,
      "penalty yards": 76,
      "punts": 5,
      "punt yards": 208,
      "punt returns": 2,
      "punt return yards": 9,
      "kickoff returns": 5,
      "kickoff return yards": 105,
      "interception returns": 2,
      "interception return yards": 2,
      "3rd down conversions": 4,
      "3rd down attempts": 14,
      "4th down conversions": 2,
      "4th down attempts": 3
    },
    "NewMexicoState": {
      "points": 34,
      "1st downs": 26,
      "rushing 1st downs": 12,
      "passing 1st downs": 12,
      "penalty 1st downs": 2,
      "rushing yards": 224,
      "rushing attempts": 45,
      "passing yards": 245,
      "passing attempts": 31,
      "passing completions": 24,
      "passing interceptions": 2,
      "total yards": 469,
      "total plays": 76,
      "fumbles": 2,
      "fumbles lost": 1,
      "penalties": 7,
      "penalty yards": 79,
      "punts": 4,
      "punt yards": 175,
      "punt returns": 0,
      "punt return yards": 0,
      "kickoff returns": 5,
      "kickoff return yards": 85,
      "interception returns": 1,
      "interception return yards": 5,
      "3rd down conversions": 7,
      "3rd down attempts": 13,
      "4th down conversions": 0,
      "4th down attempts": 0
    }
  },
  "PennState vs OhioState": {
    "stadium": "OhioStadium-Columbus-OH",
    "PennState": {
      "points": 14,
      "1st downs": 20,
      "rushing 1st downs": 9,
      "passing 1st downs": 9,
      "penalty 1st downs": 2,
      "rushing yards": 120,
      "rushing attempts": 40,
      "passing yards": 237,
      "passing attempts": 34,
      "passing completions": 19,
      "passing interceptions": 2,
      "total yards": 357,
      "total plays": 74,
      "fumbles": 2,
      "fumbles lost": 1,
      "penalties": 2,
      "penalty yards": 10,
      "punts": 6,
      "punt yards": 222,
      "punt returns": 1,
      "punt return yards": 0,
      "kickoff returns": 5,
      "kickoff return yards": 71,
      "interception returns": 0,
      "interception return yards": 0,
      "3rd down conversions": 8,
      "3rd down attempts": 16,
      "4th down conversions": 0,
      "4th down attempts": 1
    },
    "OhioState": {
      "points": 63,
      "1st downs": 32,
      "rushing 1st downs": 18,
      "passing 1st downs": 14,
      "penalty 1st downs": 0,
      "rushing yards": 408,
      "rushing attempts": 51,
      "passing yards": 278,
      "passing attempts": 26,
      "passing completions": 20,
      "passing interceptions": 0,
      "total yards": 686,
      "total plays": 77,
      "fumbles": 0,
      "fumbles lost": 0,
      "penalties": 6,
      "penalty yards": 49,
      "punts": 3,
      "punt yards": 140,
      "punt returns": 0,
      "punt return yards": 0,
      "kickoff returns": 1,
      "kickoff return yards": 49,
      "interception returns": 2,
      "interception return yards": 0,
      "3rd down conversions": 7,
      "3rd down attempts": 10,
      "4th down conversions": 0,
      "4th down attempts": 0
    }
  },
  "Stanford vs OregonState": {
    "stadium": "ReserStadium-Corvallis-OR",
    "Stanford": {
      "points": 20,
      "1st downs": 13,
      "rushing 1st downs": 8,
      "passing 1st downs": 4,
      "penalty 1st downs": 1,
      "rushing yards": 185,
      "rushing attempts": 33,
      "passing yards": 88,
      "passing attempts": 18,
      "passing completions": 8,
      "passing interceptions": 0,
      "total yards": 273,
      "total plays": 51,
      "fumbles": 2,
      "fumbles lost": 2,
      "penalties": 5,
      "penalty yards": 43,
      "punts": 7,
      "punt yards": 280,
      "punt returns": 1,
      "punt return yards": 21,
      "kickoff returns": 3,
      "kickoff return yards": 50,
      "interception returns": 0,
      "interception return yards": 0,
      "3rd down conversions": 2,
      "3rd down attempts": 9,
      "4th down conversions": 0,
      "4th down attempts": 0
    },
    "OregonState": {
      "points": 12,
      "1st downs": 23,
      "rushing 1st downs": 5,
      "passing 1st downs": 16,
      "penalty 1st downs": 2,
      "rushing yards": 17,
      "rushing attempts": 24,
      "passing yards": 271,
      "passing attempts": 57,
      "passing completions": 41,
      "passing interceptions": 0,
      "total yards": 288,
      "total plays": 81,
      "fumbles": 2,
      "fumbles lost": 1,
      "penalties": 6,
      "penalty yards": 50,
      "punts": 4,
      "punt yards": 157,
      "punt returns": 3,
      "punt return yards": 74,
      "kickoff returns": 4,
      "kickoff return yards": 57,
      "interception returns": 0,
      "interception return yards": 0,
      "3rd down conversions": 6,
      "3rd down attempts": 17,
      "4th down conversions": 1,
      "4th down attempts": 5
    }
  },
  "FresnoState vs SanDiegoState": {
    "stadium": "QualcommStadium-SanDiego-CA",
    "FresnoState": {
      "points": 35,
      "1st downs": 20,
      "rushing 1st downs": 3,
      "passing 1st downs": 13,
      "penalty 1st downs": 4,
      "rushing yards": 43,
      "rushing attempts": 19,
      "passing yards": 298,
      "passing attempts": 57,
      "passing completions": 35,
      "passing interceptions": 0,
      "total yards": 341,
      "total plays": 76,
      "fumbles": 0,
      "fumbles lost": 0,
      "penalties": 5,
      "penalty yards": 50,
      "punts": 7,
      "punt yards": 330,
      "punt returns": 0,
      "punt return yards": 0,
      "kickoff returns": 3,
      "kickoff return yards": 57,
      "interception returns": 1,
      "interception return yards": 0,
      "3rd down conversions": 7,
      "3rd down attempts": 17,
      "4th down conversions": 1,
      "4th down attempts": 2
    },
    "SanDiegoState": {
      "points": 28,
      "1st downs": 22,
      "rushing 1st downs": 9,
      "passing 1st downs": 13,
      "penalty 1st downs": 0,
      "rushing yards": 170,
      "rushing attempts": 48,
      "passing yards": 337,
      "passing attempts": 39,
      "passing completions": 21,
      "passing interceptions": 1,
      "total yards": 507,
      "total plays": 87,
      "fumbles": 2,
      "fumbles lost": 1,
      "penalties": 8,
      "penalty yards": 80,
      "punts": 5,
      "punt yards": 204,
      "punt returns": 1,
      "punt return yards": 23,
      "kickoff returns": 4,
      "kickoff return yards": 101,
      "interception returns": 0,
      "interception return yards": 0,
      "3rd down conversions": 10,
      "3rd down attempts": 21,
      "4th down conversions": 1,
      "4th down attempts": 4
    }
  },
  "California vs Washington": {
    "stadium": "HuskyStadium-Seattle-WA",
    "California": {
      "points": 17,
      "1st downs": 21,
      "rushing 1st downs": 3,
      "passing 1st downs": 16,
      "penalty 1st downs": 2,
      "rushing yards": 131,
      "rushing attempts": 29,
      "passing yards": 352,
      "passing attempts": 59,
      "passing completions": 34,
      "passing interceptions": 0,
      "total yards": 483,
      "total plays": 88,
      "fumbles": 2,
      "fumbles lost": 1,
      "penalties": 3,
      "penalty yards": 35,
      "punts": 10,
      "punt yards": 428,
      "punt returns": 0,
      "punt return yards": 0,
      "kickoff returns": 5,
      "kickoff return yards": 102,
      "interception returns": 0,
      "interception return yards": 0,
      "3rd down conversions": 7,
      "3rd down attempts": 22,
      "4th down conversions": 1,
      "4th down attempts": 4
    },
    "Washington": {
      "points": 41,
      "1st downs": 24,
      "rushing 1st downs": 8,
      "passing 1st downs": 15,
      "penalty 1st downs": 1,
      "rushing yards": 262,
      "rushing attempts": 44,
      "passing yards": 380,
      "passing attempts": 34,
      "passing completions": 21,
      "passing interceptions": 0,
      "total yards": 642,
      "total plays": 78,
      "fumbles": 0,
      "fumbles lost": 0,
      "penalties": 6,
      "penalty yards": 63,
      "punts": 8,
      "punt yards": 302,
      "punt returns": 2,
      "punt return yards": 33,
      "kickoff returns": 3,
      "kickoff return yards": 60,
      "interception returns": 0,
      "interception return yards": 0,
      "3rd down conversions": 6,
      "3rd down attempts": 16,
      "4th down conversions": 0,
      "4th down attempts": 0
    }
  },
  "ColoradoState vs Hawaii": {
    "stadium": "AlohaStadium-Honolulu-Hawaii",
    "ColoradoState": {
      "points": 35,
      "1st downs": 20,
      "rushing 1st downs": 10,
      "passing 1st downs": 7,
      "penalty 1st downs": 3,
      "rushing yards": 231,
      "rushing attempts": 49,
      "passing yards": 177,
      "passing attempts": 26,
      "passing completions": 15,
      "passing interceptions": 1,
      "total yards": 408,
      "total plays": 75,
      "fumbles": 2,
      "fumbles lost": 1,
      "penalties": 12,
      "penalty yards": 115,
      "punts": 10,
      "punt yards": 423,
      "punt returns": 0,
      "punt return yards": 0,
      "kickoff returns": 5,
      "kickoff return yards": 114,
      "interception returns": 2,
      "interception return yards": 0,
      "3rd down conversions": 7,
      "3rd down attempts": 18,
      "4th down conversions": 0,
      "4th down attempts": 0
    },
    "Hawaii": {
      "points": 28,
      "1st downs": 24,
      "rushing 1st downs": 3,
      "passing 1st downs": 16,
      "penalty 1st downs": 5,
      "rushing yards": 32,
      "rushing attempts": 29,
      "passing yards": 386,
      "passing attempts": 57,
      "passing completions": 31,
      "passing interceptions": 2,
      "total yards": 418,
      "total plays": 86,
      "fumbles": 4,
      "fumbles lost": 2,
      "penalties": 7,
      "penalty yards": 50,
      "punts": 6,
      "punt yards": 276,
      "punt returns": 5,
      "punt return yards": 29,
      "kickoff returns": 5,
      "kickoff return yards": 161,
      "interception returns": 1,
      "interception return yards": 11,
      "3rd down conversions": 2,
      "3rd down attempts": 17,
      "4th down conversions": 2,
      "4th down attempts": 4
    }
  }
}