{
  "inputMD5Sum": "3b04365053fb28b5824be0153a11a90c",
  "updated_at": "11-18-2021 12:24:38",
  "games": [
    {"game": {
      "gameID": "353810",
      "away": {
        "score": "40",
        "names": {
          "char6": "AKRON",
          "short": "Akron",
          "seo": "akron",
          "full": "University of Akron"
        },
        "winner": false,
        "seed": "",
        "description": "(2-7)",
        "rank": "",
        "conferences": [{
          "conferenceName": "MAC",
          "conferenceSeo": "mac"
        }]
      },
      "finalMessage": "FINAL",
      "bracketRound": "",
      "title": "Western Mich. Akron",
      "url": "/game/5851338",
      "network": "",
      "home": {
        "score": "45",
        "names": {
          "char6": "W MICH",
          "short": "Western Mich.",
          "seo": "western-mich",
          "full": "Western Michigan University"
        },
        "winner": true,
        "seed": "",
        "description": "(5-4)",
        "rank": "",
        "conferences": [{
          "conferenceName": "MAC",
          "conferenceSeo": "mac"
        }]
      },
      "liveVideoEnabled": false,
      "startTime": "07:00PM ET",
      "startTimeEpoch": "1636502400",
      "bracketId": "",
      "gameState": "final",
      "startDate": "11-09-2021",
      "currentPeriod": "FINAL",
      "videoState": "",
      "bracketRegion": "",
      "contestClock": "0:00"
    }},
    {"game": {
      "gameID": "353877",
      "away": {
        "score": "18",
        "names": {
          "char6": "BUFF",
          "short": "Buffalo",
          "seo": "buffalo",
          "full": "University at Buffalo, the State University of New York"
        },
        "winner": false,
        "seed": "",
        "description": "(4-6)",
        "rank": "",
        "conferences": [{
          "conferenceName": "MAC",
          "conferenceSeo": "mac"
        }]
      },
      "finalMessage": "FINAL",
      "bracketRound": "",
      "title": "Miami (OH) Buffalo",
      "url": "/game/5851339",
      "network": "",
      "home": {
        "score": "45",
        "names": {
          "char6": "MIA OH",
          "short": "Miami (OH)",
          "seo": "miami-oh",
          "full": "Miami University (Ohio)"
        },
        "winner": true,
        "seed": "",
        "description": "(5-5)",
        "rank": "",
        "conferences": [{
          "conferenceName": "MAC",
          "conferenceSeo": "mac"
        }]
      },
      "liveVideoEnabled": false,
      "startTime": "07:00PM ET",
      "startTimeEpoch": "1636502400",
      "bracketId": "",
      "gameState": "final",
      "startDate": "11-09-2021",
      "currentPeriod": "FINAL",
      "videoState": "",
      "bracketRegion": "",
      "contestClock": "0:00"
    }},
    {"game": {
      "gameID": "353867",
      "away": {
        "score": "34",
        "names": {
          "char6": "OHIO",
          "short": "Ohio",
          "seo": "ohio",
          "full": "Ohio University"
        },
        "winner": true,
        "seed": "",
        "description": "(3-7)",
        "rank": "",
        "conferences": [{
          "conferenceName": "MAC",
          "conferenceSeo": "mac"
        }]
      },
      "finalMessage": "FINAL",
      "bracketRound": "",
      "title": "Eastern Mich. Ohio",
      "url": "/game/5851340",
      "network": "",
      "home": {
        "score": "26",
        "names": {
          "char6": "E MICH",
          "short": "Eastern Mich.",
          "seo": "eastern-mich",
          "full": "Eastern Michigan University"
        },
        "winner": false,
        "seed": "",
        "description": "(6-4)",
        "rank": "",
        "conferences": [{
          "conferenceName": "MAC",
          "conferenceSeo": "mac"
        }]
      },
      "liveVideoEnabled": false,
      "startTime": "08:00PM ET",
      "startTimeEpoch": "1636506000",
      "bracketId": "",
      "gameState": "final",
      "startDate": "11-09-2021",
      "currentPeriod": "FINAL",
      "videoState": "",
      "bracketRegion": "",
      "contestClock": "0:15"
    }},
    {"game": {
      "gameID": "353889",
      "away": {
        "score": "29",
        "names": {
          "char6": "BALLST",
          "short": "Ball St.",
          "seo": "ball-st",
          "full": "Ball State University"
        },
        "winner": false,
        "seed": "",
        "description": "(5-5)",
        "rank": "",
        "conferences": [{
          "conferenceName": "MAC",
          "conferenceSeo": "mac"
        }]
      },
      "finalMessage": "FINAL",
      "bracketRound": "",
      "title": "Northern Ill. Ball St.",
      "url": "/game/5851342",
      "network": "",
      "home": {
        "score": "30",
        "names": {
          "char6": "NIU",
          "short": "Northern Ill.",
          "seo": "northern-ill",
          "full": "Northern Illinois University"
        },
        "winner": true,
        "seed": "",
        "description": "(7-3)",
        "rank": "",
        "conferences": [{
          "conferenceName": "MAC",
          "conferenceSeo": "mac"
        }]
      },
      "liveVideoEnabled": false,
      "startTime": "07:00PM ET",
      "startTimeEpoch": "1636588800",
      "bracketId": "",
      "gameState": "final",
      "startDate": "11-10-2021",
      "currentPeriod": "FINAL",
      "videoState": "",
      "bracketRegion": "",
      "contestClock": "0:00"
    }},
    {"game": {
      "gameID": "353855",
      "away": {
        "score": "49",
        "names": {
          "char6": "TOLEDO",
          "short": "Toledo",
          "seo": "toledo",
          "full": "University of Toledo"
        },
        "winner": true,
        "seed": "",
        "description": "(5-5)",
        "rank": "",
        "conferences": [{
          "conferenceName": "MAC",
          "conferenceSeo": "mac"
        }]
      },
      "finalMessage": "FINAL",
      "bracketRound": "",
      "title": "Bowling Green Toledo",
      "url": "/game/5851343",
      "network": "",
      "home": {
        "score": "17",
        "names": {
          "char6": "BGSU",
          "short": "Bowling Green",
          "seo": "bowling-green",
          "full": "Bowling Green State University"
        },
        "winner": false,
        "seed": "",
        "description": "(3-7)",
        "rank": "",
        "conferences": [{
          "conferenceName": "MAC",
          "conferenceSeo": "mac"
        }]
      },
      "liveVideoEnabled": false,
      "startTime": "07:00PM ET",
      "startTimeEpoch": "1636588800",
      "bracketId": "",
      "gameState": "final",
      "startDate": "11-10-2021",
      "currentPeriod": "FINAL",
      "videoState": "",
      "bracketRegion": "",
      "contestClock": "0:00"
    }},
    {"game": {
      "gameID": "353861",
      "away": {
        "score": "30",
        "names": {
          "char6": "KENT",
          "short": "Kent St.",
          "seo": "kent-st",
          "full": "Kent State University"
        },
        "winner": false,
        "seed": "",
        "description": "(5-5)",
        "rank": "",
        "conferences": [{
          "conferenceName": "MAC",
          "conferenceSeo": "mac"
        }]
      },
      "finalMessage": "FINAL",
      "bracketRound": "",
      "title": "Central Mich. Kent St.",
      "url": "/game/5851341",
      "network": "",
      "home": {
        "score": "54",
        "names": {
          "char6": "C MICH",
          "short": "Central Mich.",
          "seo": "central-mich",
          "full": "Central Michigan University"
        },
        "winner": true,
        "seed": "",
        "description": "(6-4)",
        "rank": "",
        "conferences": [{
          "conferenceName": "MAC",
          "conferenceSeo": "mac"
        }]
      },
      "liveVideoEnabled": false,
      "startTime": "08:00PM ET",
      "startTimeEpoch": "1636592400",
      "bracketId": "",
      "gameState": "final",
      "startDate": "11-10-2021",
      "currentPeriod": "FINAL",
      "videoState": "",
      "bracketRegion": "",
      "contestClock": "0:00"
    }},
    {"game": {
      "gameID": "353281",
      "away": {
        "score": "23",
        "names": {
          "char6": "UNC",
          "short": "North Carolina",
          "seo": "north-carolina",
          "full": "University of North Carolina, Chapel Hill"
        },
        "winner": false,
        "seed": "",
        "description": "(5-5)",
        "rank": "",
        "conferences": [{
          "conferenceName": "ACC",
          "conferenceSeo": "acc"
        }]
      },
      "finalMessage": "FINAL (OT)",
      "bracketRound": "",
      "title": "Pittsburgh North Carolina",
      "url": "/game/5851344",
      "network": "",
      "home": {
        "score": "30",
        "names": {
          "char6": "PITT",
          "short": "Pittsburgh",
          "seo": "pittsburgh",
          "full": "University of Pittsburgh"
        },
        "winner": true,
        "seed": "",
        "description": "(8-2)",
        "rank": "21",
        "conferences": [
          {
            "conferenceName": "ACC",
            "conferenceSeo": "acc"
          },
          {
            "conferenceName": "Top 25",
            "conferenceSeo": "top-25"
          }
        ]
      },
      "liveVideoEnabled": false,
      "startTime": "07:30PM ET",
      "startTimeEpoch": "1636677000",
      "bracketId": "",
      "gameState": "final",
      "startDate": "11-11-2021",
      "currentPeriod": "FINAL (OT)",
      "videoState": "",
      "bracketRegion": "",
      "contestClock": ""
    }},
    {"game": {
      "gameID": "353430",
      "away": {
        "score": "45",
        "names": {
          "char6": "CINCY",
          "short": "Cincinnati",
          "seo": "cincinnati",
          "full": "University of Cincinnati"
        },
        "winner": true,
        "seed": "",
        "description": "(10-0)",
        "rank": "5",
        "conferences": [
          {
            "conferenceName": "AAC",
            "conferenceSeo": "aac"
          },
          {
            "conferenceName": "Top 25",
            "conferenceSeo": "top-25"
          }
        ]
      },
      "finalMessage": "FINAL",
      "bracketRound": "",
      "title": "South Fla. Cincinnati",
      "url": "/game/5851345",
      "network": "",
      "home": {
        "score": "28",
        "names": {
          "char6": "USF",
          "short": "South Fla.",
          "seo": "south-fla",
          "full": "University of South Florida"
        },
        "winner": false,
        "seed": "",
        "description": "(2-8)",
        "rank": "",
        "conferences": [{
          "conferenceName": "AAC",
          "conferenceSeo": "aac"
        }]
      },
      "liveVideoEnabled": false,
      "startTime": "06:00PM ET",
      "startTimeEpoch": "1636758000",
      "bracketId": "",
      "gameState": "final",
      "startDate": "11-12-2021",
      "currentPeriod": "FINAL",
      "videoState": "",
      "bracketRegion": "",
      "contestClock": "0:00"
    }},
    {"game": {
      "gameID": "352538",
      "away": {
        "score": "13",
        "names": {
          "char6": "WYO",
          "short": "Wyoming",
          "seo": "wyoming",
          "full": "University of Wyoming"
        },
        "winner": false,
        "seed": "",
        "description": "(5-5)",
        "rank": "",
        "conferences": [{
          "conferenceName": "Mountain West",
          "conferenceSeo": "mountain-west"
        }]
      },
      "finalMessage": "FINAL",
      "bracketRound": "",
      "title": "Boise St. Wyoming",
      "url": "/game/5851346",
      "network": "",
      "home": {
        "score": "23",
        "names": {
          "char6": "BOISE",
          "short": "Boise St.",
          "seo": "boise-st",
          "full": "Boise State University"
        },
        "winner": true,
        "seed": "",
        "description": "(6-4)",
        "rank": "",
        "conferences": [{
          "conferenceName": "Mountain West",
          "conferenceSeo": "mountain-west"
        }]
      },
      "liveVideoEnabled": false,
      "startTime": "09:00PM ET",
      "startTimeEpoch": "1636768800",
      "bracketId": "",
      "gameState": "final",
      "startDate": "11-12-2021",
      "currentPeriod": "FINAL",
      "videoState": "",
      "bracketRegion": "",
      "contestClock": "0:00"
    }},
    {"game": {
      "gameID": "353457",
      "away": {
        "score": "28",
        "names": {
          "char6": "UCF",
          "short": "UCF",
          "seo": "ucf",
          "full": "University of Central Florida"
        },
        "winner": false,
        "seed": "",
        "description": "(6-4)",
        "rank": "",
        "conferences": [{
          "conferenceName": "AAC",
          "conferenceSeo": "aac"
        }]
      },
      "finalMessage": "FINAL",
      "bracketRound": "",
      "title": "SMU UCF",
      "url": "/game/5851347",
      "network": "",
      "home": {
        "score": "55",
        "names": {
          "char6": "SMU",
          "short": "SMU",
          "seo": "smu",
          "full": "Southern Methodist University"
        },
        "winner": true,
        "seed": "",
        "description": "(8-2)",
        "rank": "",
        "conferences": [{
          "conferenceName": "AAC",
          "conferenceSeo": "aac"
        }]
      },
      "liveVideoEnabled": false,
      "startTime": "12:00PM ET",
      "startTimeEpoch": "1636822800",
      "bracketId": "",
      "gameState": "final",
      "startDate": "11-13-2021",
      "currentPeriod": "FINAL",
      "videoState": "",
      "bracketRegion": "",
      "contestClock": "0:00"
    }},
    {"game": {
      "gameID": "353896",
      "away": {
        "score": "35",
        "names": {
          "char6": "MAINE",
          "short": "Maine",
          "seo": "maine",
          "full": "University of Maine"
        },
        "winner": true,
        "seed": "",
        "description": "(5-5)",
        "rank": "",
        "conferences": [{
          "conferenceName": "CAA",
          "conferenceSeo": "caa"
        }]
      },
      "finalMessage": "FINAL",
      "bracketRound": "",
      "title": "Massachusetts Maine",
      "url": "/game/5851348",
      "network": "",
      "home": {
        "score": "10",
        "names": {
          "char6": "UMASS",
          "short": "Massachusetts",
          "seo": "massachusetts",
          "full": "University of Massachusetts, Amherst"
        },
        "winner": false,
        "seed": "",
        "description": "(1-9)",
        "rank": "",
        "conferences": [{
          "conferenceName": "FBS Independent",
          "conferenceSeo": "fbs-independent"
        }]
      },
      "liveVideoEnabled": false,
      "startTime": "12:00PM ET",
      "startTimeEpoch": "1636822800",
      "bracketId": "",
      "gameState": "final",
      "startDate": "11-13-2021",
      "currentPeriod": "FINAL",
      "videoState": "",
      "bracketRegion": "",
      "contestClock": "0:00"
    }},
    {"game": {
      "gameID": "352643",
      "away": {
        "score": "7",
        "names": {
          "char6": "UCONN",
          "short": "UConn",
          "seo": "uconn",
          "full": "University of Connecticut"
        },
        "winner": false,
        "seed": "",
        "description": "(1-9)",
        "rank": "",
        "conferences": [{
          "conferenceName": "FBS Independent",
          "conferenceSeo": "fbs-independent"
        }]
      },
      "finalMessage": "FINAL",
      "bracketRound": "",
      "title": "Clemson UConn",
      "url": "/game/5851349",
      "network": "",
      "home": {
        "score": "44",
        "names": {
          "char6": "CLEM",
          "short": "Clemson",
          "seo": "clemson",
          "full": "Clemson University"
        },
        "winner": true,
        "seed": "",
        "description": "(7-3)",
        "rank": "",
        "conferences": [{
          "conferenceName": "ACC",
          "conferenceSeo": "acc"
        }]
      },
      "liveVideoEnabled": false,
      "startTime": "12:00PM ET",
      "startTimeEpoch": "1636822800",
      "bracketId": "",
      "gameState": "final",
      "startDate": "11-13-2021",
      "currentPeriod": "FINAL",
      "videoState": "",
      "bracketRegion": "",
      "contestClock": "0:00"
    }},
    {"game": {
      "gameID": "353513",
      "away": {
        "score": "37",
        "names": {
          "char6": "HOU",
          "short": "Houston",
          "seo": "houston",
          "full": "University of Houston"
        },
        "winner": true,
        "seed": "",
        "description": "(9-1)",
        "rank": "",
        "conferences": [{
          "conferenceName": "AAC",
          "conferenceSeo": "aac"
        }]
      },
      "finalMessage": "FINAL",
      "bracketRound": "",
      "title": "Temple Houston",
      "url": "/game/5851352",
      "network": "",
      "home": {
        "score": "8",
        "names": {
          "char6": "TEMPLE",
          "short": "Temple",
          "seo": "temple",
          "full": "Temple University"
        },
        "winner": false,
        "seed": "",
        "description": "(3-7)",
        "rank": "",
        "conferences": [{
          "conferenceName": "AAC",
          "conferenceSeo": "aac"
        }]
      },
      "liveVideoEnabled": false,
      "startTime": "12:00PM ET",
      "startTimeEpoch": "1636822800",
      "bracketId": "",
      "gameState": "final",
      "startDate": "11-13-2021",
      "currentPeriod": "FINAL",
      "videoState": "",
      "bracketRegion": "",
      "contestClock": "0:00"
    }},
    {"game": {
      "gameID": "352588",
      "away": {
        "score": "43",
        "names": {
          "char6": "MISSST",
          "short": "Mississippi St.",
          "seo": "mississippi-st",
          "full": "Mississippi State University"
        },
        "winner": true,
        "seed": "",
        "description": "(6-4)",
        "rank": "",
        "conferences": [{
          "conferenceName": "SEC",
          "conferenceSeo": "sec"
        }]
      },
      "finalMessage": "FINAL",
      "bracketRound": "",
      "title": "Auburn Mississippi St.",
      "url": "/game/5851356",
      "network": "",
      "home": {
        "score": "34",
        "names": {
          "char6": "AUBURN",
          "short": "Auburn",
          "seo": "auburn",
          "full": "Auburn University"
        },
        "winner": false,
        "seed": "",
        "description": "(6-4)",
        "rank": "17",
        "conferences": [
          {
            "conferenceName": "SEC",
            "conferenceSeo": "sec"
          },
          {
            "conferenceName": "Top 25",
            "conferenceSeo": "top-25"
          }
        ]
      },
      "liveVideoEnabled": false,
      "startTime": "12:00PM ET",
      "startTimeEpoch": "1636822800",
      "bracketId": "",
      "gameState": "final",
      "startDate": "11-13-2021",
      "currentPeriod": "FINAL",
      "videoState": "",
      "bracketRegion": "",
      "contestClock": "0:00"
    }},
    {"game": {
      "gameID": "352567",
      "away": {
        "score": "14",
        "names": {
          "char6": "OKLA",
          "short": "Oklahoma",
          "seo": "oklahoma",
          "full": "University of Oklahoma"
        },
        "winner": false,
        "seed": "",
        "description": "(9-1)",
        "rank": "8",
        "conferences": [
          {
            "conferenceName": "Big 12",
            "conferenceSeo": "big-12"
          },
          {
            "conferenceName": "Top 25",
            "conferenceSeo": "top-25"
          }
        ]
      },
      "finalMessage": "FINAL",
      "bracketRound": "",
      "title": "Baylor Oklahoma",
      "url": "/game/5851358",
      "network": "",
      "home": {
        "score": "27",
        "names": {
          "char6": "BAYLOR",
          "short": "Baylor",
          "seo": "baylor",
          "full": "Baylor University"
        },
        "winner": true,
        "seed": "",
        "description": "(8-2)",
        "rank": "13",
        "conferences": [
          {
            "conferenceName": "Big 12",
            "conferenceSeo": "big-12"
          },
          {
            "conferenceName": "Top 25",
            "conferenceSeo": "top-25"
          }
        ]
      },
      "liveVideoEnabled": false,
      "startTime": "12:00PM ET",
      "startTimeEpoch": "1636822800",
      "bracketId": "",
      "gameState": "final",
      "startDate": "11-13-2021",
      "currentPeriod": "FINAL",
      "videoState": "",
      "bracketRegion": "",
      "contestClock": "0:00"
    }},
    {"game": {
      "gameID": "352783",
      "away": {
        "score": "52",
        "names": {
          "char6": "SAMFRD",
          "short": "Samford",
          "seo": "samford",
          "full": "Samford University"
        },
        "winner": false,
        "seed": "",
        "description": "(4-6)",
        "rank": "",
        "conferences": [{
          "conferenceName": "SoCon",
          "conferenceSeo": "socon"
        }]
      },
      "finalMessage": "FINAL",
      "bracketRound": "",
      "title": "Florida Samford",
      "url": "/game/5851359",
      "network": "",
      "home": {
        "score": "70",
        "names": {
          "char6": "FLA",
          "short": "Florida",
          "seo": "florida",
          "full": "University of Florida"
        },
        "winner": true,
        "seed": "",
        "description": "(5-5)",
        "rank": "",
        "conferences": [{
          "conferenceName": "SEC",
          "conferenceSeo": "sec"
        }]
      },
      "liveVideoEnabled": false,
      "startTime": "12:00PM ET",
      "startTimeEpoch": "1636822800",
      "bracketId": "",
      "gameState": "final",
      "startDate": "11-13-2021",
      "currentPeriod": "FINAL",
      "videoState": "",
      "bracketRegion": "",
      "contestClock": "0:00"
    }},
    {"game": {
      "gameID": "352553",
      "away": {
        "score": "3",
        "names": {
          "char6": "NM ST",
          "short": "New Mexico St.",
          "seo": "new-mexico-st",
          "full": "New Mexico State University"
        },
        "winner": false,
        "seed": "",
        "description": "(1-9)",
        "rank": "",
        "conferences": [{
          "conferenceName": "FBS Independent",
          "conferenceSeo": "fbs-independent"
        }]
      },
      "finalMessage": "FINAL",
      "bracketRound": "",
      "title": "Alabama New Mexico St.",
      "url": "/game/5851365",
      "network": "",
      "home": {
        "score": "59",
        "names": {
          "char6": "ALA",
          "short": "Alabama",
          "seo": "alabama",
          "full": "University of Alabama"
        },
        "winner": true,
        "seed": "",
        "description": "(9-1)",
        "rank": "2",
        "conferences": [
          {
            "conferenceName": "SEC",
            "conferenceSeo": "sec"
          },
          {
            "conferenceName": "Top 25",
            "conferenceSeo": "top-25"
          }
        ]
      },
      "liveVideoEnabled": false,
      "startTime": "12:00PM ET",
      "startTimeEpoch": "1636822800",
      "bracketId": "",
      "gameState": "final",
      "startDate": "11-13-2021",
      "currentPeriod": "FINAL",
      "videoState": "",
      "bracketRegion": "",
      "contestClock": "0:00"
    }},
    {"game": {
      "gameID": "352987",
      "away": {
        "score": "3",
        "names": {
          "char6": "SYR",
          "short": "Syracuse",
          "seo": "syracuse",
          "full": "Syracuse University"
        },
        "winner": false,
        "seed": "",
        "description": "(5-5)",
        "rank": "",
        "conferences": [{
          "conferenceName": "ACC",
          "conferenceSeo": "acc"
        }]
      },
      "finalMessage": "FINAL",
      "bracketRound": "",
      "title": "Louisville Syracuse",
      "url": "/game/5851368",
      "network": "",
      "home": {
        "score": "41",
        "names": {
          "char6": "LOUIS",
          "short": "Louisville",
          "seo": "louisville",
          "full": "University of Louisville"
        },
        "winner": true,
        "seed": "",
        "description": "(5-5)",
        "rank": "",
        "conferences": [{
          "conferenceName": "ACC",
          "conferenceSeo": "acc"
        }]
      },
      "liveVideoEnabled": false,
      "startTime": "12:00PM ET",
      "startTimeEpoch": "1636822800",
      "bracketId": "",
      "gameState": "final",
      "startDate": "11-13-2021",
      "currentPeriod": "FINAL",
      "videoState": "",
      "bracketRegion": "",
      "contestClock": "0:00"
    }},
    {"game": {
      "gameID": "353022",
      "away": {
        "score": "30",
        "names": {
          "char6": "E CAR",
          "short": "East Carolina",
          "seo": "east-carolina",
          "full": "East Carolina University"
        },
        "winner": true,
        "seed": "",
        "description": "(6-4)",
        "rank": "",
        "conferences": [{
          "conferenceName": "AAC",
          "conferenceSeo": "aac"
        }]
      },
      "finalMessage": "FINAL (OT)",
      "bracketRound": "",
      "title": "Memphis East Carolina",
      "url": "/game/5851370",
      "network": "",
      "home": {
        "score": "29",
        "names": {
          "char6": "MEM",
          "short": "Memphis",
          "seo": "memphis",
          "full": "University of Memphis"
        },
        "winner": false,
        "seed": "",
        "description": "(5-5)",
        "rank": "",
        "conferences": [{
          "conferenceName": "AAC",
          "conferenceSeo": "aac"
        }]
      },
      "liveVideoEnabled": false,
      "startTime": "12:00PM ET",
      "startTimeEpoch": "1636822800",
      "bracketId": "",
      "gameState": "final",
      "startDate": "11-13-2021",
      "currentPeriod": "FINAL (OT)",
      "videoState": "",
      "bracketRegion": "",
      "contestClock": ""
    }},
    {"game": {
      "gameID": "352916",
      "away": {
        "score": "38",
        "names": {
          "char6": "RUTGER",
          "short": "Rutgers",
          "seo": "rutgers",
          "full": "Rutgers, The State University of New Jersey, New Brunswick"
        },
        "winner": true,
        "seed": "",
        "description": "(5-5)",
        "rank": "",
        "conferences": [{
          "conferenceName": "Big Ten",
          "conferenceSeo": "big-ten"
        }]
      },
      "finalMessage": "FINAL",
      "bracketRound": "",
      "title": "Indiana Rutgers",
      "url": "/game/5851371",
      "network": "",
      "home": {
        "score": "3",
        "names": {
          "char6": "IND",
          "short": "Indiana",
          "seo": "indiana",
          "full": "Indiana University, Bloomington"
        },
        "winner": false,
        "seed": "",
        "description": "(2-8)",
        "rank": "",
        "conferences": [{
          "conferenceName": "Big Ten",
          "conferenceSeo": "big-ten"
        }]
      },
      "liveVideoEnabled": false,
      "startTime": "12:00PM ET",
      "startTimeEpoch": "1636822800",
      "bracketId": "",
      "gameState": "final",
      "startDate": "11-13-2021",
      "currentPeriod": "FINAL",
      "videoState": "",
      "bracketRegion": "",
      "contestClock": "0:00"
    }},
    {"game": {
      "gameID": "352959",
      "away": {
        "score": "17",
        "names": {
          "char6": "WVU",
          "short": "West Virginia",
          "seo": "west-virginia",
          "full": "West Virginia University"
        },
        "winner": false,
        "seed": "",
        "description": "(4-6)",
        "rank": "",
        "conferences": [{
          "conferenceName": "Big 12",
          "conferenceSeo": "big-12"
        }]
      },
      "finalMessage": "FINAL",
      "bracketRound": "",
      "title": "Kansas St. West Virginia",
      "url": "/game/5851372",
      "network": "",
      "home": {
        "score": "34",
        "names": {
          "char6": "KAN ST",
          "short": "Kansas St.",
          "seo": "kansas-st",
          "full": "Kansas State University"
        },
        "winner": true,
        "seed": "",
        "description": "(7-3)",
        "rank": "",
        "conferences": [{
          "conferenceName": "Big 12",
          "conferenceSeo": "big-12"
        }]
      },
      "liveVideoEnabled": false,
      "startTime": "12:00PM ET",
      "startTimeEpoch": "1636822800",
      "bracketId": "",
      "gameState": "final",
      "startDate": "11-13-2021",
      "currentPeriod": "FINAL",
      "videoState": "",
      "bracketRegion": "",
      "contestClock": "0:00"
    }},
    {"game": {
      "gameID": "353295",
      "away": {
        "score": "21",
        "names": {
          "char6": "MICH",
          "short": "Michigan",
          "seo": "michigan",
          "full": "University of Michigan"
        },
        "winner": true,
        "seed": "",
        "description": "(9-1)",
        "rank": "6",
        "conferences": [
          {
            "conferenceName": "Big Ten",
            "conferenceSeo": "big-ten"
          },
          {
            "conferenceName": "Top 25",
            "conferenceSeo": "top-25"
          }
        ]
      },
      "finalMessage": "FINAL",
      "bracketRound": "",
      "title": "Penn St. Michigan",
      "url": "/game/5851376",
      "network": "",
      "home": {
        "score": "17",
        "names": {
          "char6": "PENNST",
          "short": "Penn St.",
          "seo": "penn-st",
          "full": "Pennsylvania State University"
        },
        "winner": false,
        "seed": "",
        "description": "(6-4)",
        "rank": "",
        "conferences": [{
          "conferenceName": "Big Ten",
          "conferenceSeo": "big-ten"
        }]
      },
      "liveVideoEnabled": false,
      "startTime": "12:00PM ET",
      "startTimeEpoch": "1636822800",
      "bracketId": "",
      "gameState": "final",
      "startDate": "11-13-2021",
      "currentPeriod": "FINAL",
      "videoState": "",
      "bracketRegion": "",
      "contestClock": "0:00"
    }},
    {"game": {
      "gameID": "353796",
      "away": {
        "score": "7",
        "names": {
          "char6": "NWSTRN",
          "short": "Northwestern",
          "seo": "northwestern",
          "full": "Northwestern University"
        },
        "winner": false,
        "seed": "",
        "description": "(3-7)",
        "rank": "",
        "conferences": [{
          "conferenceName": "Big Ten",
          "conferenceSeo": "big-ten"
        }]
      },
      "finalMessage": "FINAL",
      "bracketRound": "",
      "title": "Wisconsin Northwestern",
      "url": "/game/5851384",
      "network": "",
      "home": {
        "score": "35",
        "names": {
          "char6": "WISC",
          "short": "Wisconsin",
          "seo": "wisconsin",
          "full": "University of Wisconsin-Madison"
        },
        "winner": true,
        "seed": "",
        "description": "(7-3)",
        "rank": "18",
        "conferences": [
          {
            "conferenceName": "Big Ten",
            "conferenceSeo": "big-ten"
          },
          {
            "conferenceName": "Top 25",
            "conferenceSeo": "top-25"
          }
        ]
      },
      "liveVideoEnabled": false,
      "startTime": "12:00PM ET",
      "startTimeEpoch": "1636822800",
      "bracketId": "",
      "gameState": "final",
      "startDate": "11-13-2021",
      "currentPeriod": "FINAL",
      "videoState": "",
      "bracketRegion": "",
      "contestClock": "0:00"
    }},
    {"game": {
      "gameID": "353843",
      "away": {
        "score": "10",
        "names": {
          "char6": "BUCKNL",
          "short": "Bucknell",
          "seo": "bucknell",
          "full": "Bucknell University"
        },
        "winner": false,
        "seed": "",
        "description": "(1-9)",
        "rank": "",
        "conferences": [{
          "conferenceName": "Patriot",
          "conferenceSeo": "patriot"
        }]
      },
      "finalMessage": "FINAL",
      "bracketRound": "",
      "title": "Army West Point Bucknell",
      "url": "/game/5851388",
      "network": "",
      "home": {
        "score": "63",
        "names": {
          "char6": "ARMY",
          "short": "Army West Point",
          "seo": "army",
          "full": "U.S. Military Academy"
        },
        "winner": true,
        "seed": "",
        "description": "(6-3)",
        "rank": "",
        "conferences": [{
          "conferenceName": "FBS Independent",
          "conferenceSeo": "fbs-independent"
        }]
      },
      "liveVideoEnabled": false,
      "startTime": "12:00PM ET",
      "startTimeEpoch": "1636822800",
      "bracketId": "",
      "gameState": "final",
      "startDate": "11-13-2021",
      "currentPeriod": "FINAL",
      "videoState": "",
      "bracketRegion": "",
      "contestClock": "0:00"
    }},
    {"game": {
      "gameID": "353584",
      "away": {
        "score": "35",
        "names": {
          "char6": "ULL",
          "short": "Louisiana",
          "seo": "la-lafayette",
          "full": "University of Louisiana at Lafayette"
        },
        "winner": true,
        "seed": "",
        "description": "(9-1)",
        "rank": "",
        "conferences": [{
          "conferenceName": "Sun Belt",
          "conferenceSeo": "sun-belt"
        }]
      },
      "finalMessage": "FINAL",
      "bracketRound": "",
      "title": "Troy Louisiana",
      "url": "/game/5851389",
      "network": "",
      "home": {
        "score": "21",
        "names": {
          "char6": "TROY",
          "short": "Troy",
          "seo": "troy",
          "full": "Troy University"
        },
        "winner": false,
        "seed": "",
        "description": "(5-5)",
        "rank": "",
        "conferences": [{
          "conferenceName": "Sun Belt",
          "conferenceSeo": "sun-belt"
        }]
      },
      "liveVideoEnabled": false,
      "startTime": "01:06PM ET",
      "startTimeEpoch": "1636826760",
      "bracketId": "",
      "gameState": "final",
      "startDate": "11-13-2021",
      "currentPeriod": "FINAL",
      "videoState": "",
      "bracketRegion": "",
      "contestClock": "0:00"
    }},
    {"game": {
      "gameID": "352651",
      "away": {
        "score": "42",
        "names": {
          "char6": "GA ST",
          "short": "Georgia St.",
          "seo": "georgia-st",
          "full": "Georgia State University"
        },
        "winner": true,
        "seed": "",
        "description": "(5-5)",
        "rank": "",
        "conferences": [{
          "conferenceName": "Sun Belt",
          "conferenceSeo": "sun-belt"
        }]
      },
      "finalMessage": "FINAL",
      "bracketRound": "",
      "title": "Coastal Carolina Georgia St.",
      "url": "/game/5851377",
      "network": "",
      "home": {
        "score": "40",
        "names": {
          "char6": "CO CAR",
          "short": "Coastal Carolina",
          "seo": "coastal-caro",
          "full": "Coastal Carolina University"
        },
        "winner": false,
        "seed": "",
        "description": "(8-2)",
        "rank": "",
        "conferences": [{
          "conferenceName": "Sun Belt",
          "conferenceSeo": "sun-belt"
        }]
      },
      "liveVideoEnabled": false,
      "startTime": "02:00PM ET",
      "startTimeEpoch": "1636830000",
      "bracketId": "",
      "gameState": "final",
      "startDate": "11-13-2021",
      "currentPeriod": "FINAL",
      "videoState": "",
      "bracketRegion": "",
      "contestClock": "0:00"
    }},
    {"game": {
      "gameID": "352430",
      "away": {
        "score": "38",
        "names": {
          "char6": "UTAH",
          "short": "Utah",
          "seo": "utah",
          "full": "University of Utah"
        },
        "winner": true,
        "seed": "",
        "description": "(7-3)",
        "rank": "24",
        "conferences": [
          {
            "conferenceName": "Pac-12",
            "conferenceSeo": "pac-12"
          },
          {
            "conferenceName": "Top 25",
            "conferenceSeo": "top-25"
          }
        ]
      },
      "finalMessage": "FINAL",
      "bracketRound": "",
      "title": "Arizona Utah",
      "url": "/game/5851380",
      "network": "",
      "home": {
        "score": "36",
        "names": {
          "char6": "ARIZ",
          "short": "Arizona",
          "seo": "arizona",
          "full": "University of Arizona"
        },
        "winner": false,
        "seed": "",
        "description": "(1-9)",
        "rank": "",
        "conferences": [{
          "conferenceName": "Pac-12",
          "conferenceSeo": "pac-12"
        }]
      },
      "liveVideoEnabled": false,
      "startTime": "02:00PM ET",
      "startTimeEpoch": "1636830000",
      "bracketId": "",
      "gameState": "final",
      "startDate": "11-13-2021",
      "currentPeriod": "FINAL",
      "videoState": "",
      "bracketRegion": "",
      "contestClock": "0:00"
    }},
    {"game": {
      "gameID": "353322",
      "away": {
        "score": "42",
        "names": {
          "char6": "W KY",
          "short": "Western Ky.",
          "seo": "western-ky",
          "full": "Western Kentucky University"
        },
        "winner": true,
        "seed": "",
        "description": "(6-4)",
        "rank": "",
        "conferences": [{
          "conferenceName": "C-USA",
          "conferenceSeo": "c-usa"
        }]
      },
      "finalMessage": "FINAL",
      "bracketRound": "",
      "title": "Rice Western Ky.",
      "url": "/game/5851390",
      "network": "",
      "home": {
        "score": "21",
        "names": {
          "char6": "RICE",
          "short": "Rice",
          "seo": "rice",
          "full": "Rice University"
        },
        "winner": false,
        "seed": "",
        "description": "(3-7)",
        "rank": "",
        "conferences": [{
          "conferenceName": "C-USA",
          "conferenceSeo": "c-usa"
        }]
      },
      "liveVideoEnabled": false,
      "startTime": "02:00PM ET",
      "startTimeEpoch": "1636830000",
      "bracketId": "",
      "gameState": "final",
      "startDate": "11-13-2021",
      "currentPeriod": "FINAL",
      "videoState": "",
      "bracketRegion": "",
      "contestClock": "0:00"
    }},
    {"game": {
      "gameID": "352436",
      "away": {
        "score": "7",
        "names": {
          "char6": "S ALA",
          "short": "South Alabama",
          "seo": "south-ala",
          "full": "University of South Alabama"
        },
        "winner": false,
        "seed": "",
        "description": "(5-5)",
        "rank": "",
        "conferences": [{
          "conferenceName": "Sun Belt",
          "conferenceSeo": "sun-belt"
        }]
      },
      "finalMessage": "FINAL",
      "bracketRound": "",
      "title": "App State South Alabama",
      "url": "/game/5851395",
      "network": "",
      "home": {
        "score": "31",
        "names": {
          "char6": "APP ST",
          "short": "App State",
          "seo": "appalachian-st",
          "full": "Appalachian State University"
        },
        "winner": true,
        "seed": "",
        "description": "(8-2)",
        "rank": "",
        "conferences": [{
          "conferenceName": "Sun Belt",
          "conferenceSeo": "sun-belt"
        }]
      },
      "liveVideoEnabled": false,
      "startTime": "02:30PM ET",
      "startTimeEpoch": "1636831800",
      "bracketId": "",
      "gameState": "final",
      "startDate": "11-13-2021",
      "currentPeriod": "FINAL",
      "videoState": "",
      "bracketRegion": "",
      "contestClock": "0:00"
    }},
    {"game": {
      "gameID": "353627",
      "away": {
        "score": "38",
        "names": {
          "char6": "GA SOU",
          "short": "Ga. Southern",
          "seo": "ga-southern",
          "full": "Georgia Southern University"
        },
        "winner": true,
        "seed": "",
        "description": "(3-7)",
        "rank": "",
        "conferences": [{
          "conferenceName": "Sun Belt",
          "conferenceSeo": "sun-belt"
        }]
      },
      "finalMessage": "FINAL",
      "bracketRound": "",
      "title": "Texas St. Ga. Southern",
      "url": "/game/5851387",
      "network": "",
      "home": {
        "score": "30",
        "names": {
          "char6": "TX ST",
          "short": "Texas St.",
          "seo": "texas-st",
          "full": "Texas State University"
        },
        "winner": false,
        "seed": "",
        "description": "(3-7)",
        "rank": "",
        "conferences": [{
          "conferenceName": "Sun Belt",
          "conferenceSeo": "sun-belt"
        }]
      },
      "liveVideoEnabled": false,
      "startTime": "03:00PM ET",
      "startTimeEpoch": "1636833600",
      "bracketId": "",
      "gameState": "final",
      "startDate": "11-13-2021",
      "currentPeriod": "FINAL",
      "videoState": "",
      "bracketRegion": "",
      "contestClock": "0:00"
    }},
    {"game": {
      "gameID": "353267",
      "away": {
        "score": "31",
        "names": {
          "char6": "PURDUE",
          "short": "Purdue",
          "seo": "purdue",
          "full": "Purdue University"
        },
        "winner": false,
        "seed": "",
        "description": "(6-4)",
        "rank": "19",
        "conferences": [
          {
            "conferenceName": "Big Ten",
            "conferenceSeo": "big-ten"
          },
          {
            "conferenceName": "Top 25",
            "conferenceSeo": "top-25"
          }
        ]
      },
      "finalMessage": "FINAL",
      "bracketRound": "",
      "title": "Ohio St. Purdue",
      "url": "/game/5851350",
      "network": "",
      "home": {
        "score": "59",
        "names": {
          "char6": "OHIOST",
          "short": "Ohio St.",
          "seo": "ohio-st",
          "full": "The Ohio State University"
        },
        "winner": true,
        "seed": "",
        "description": "(9-1)",
        "rank": "4",
        "conferences": [
          {
            "conferenceName": "Big Ten",
            "conferenceSeo": "big-ten"
          },
          {
            "conferenceName": "Top 25",
            "conferenceSeo": "top-25"
          }
        ]
      },
      "liveVideoEnabled": false,
      "startTime": "03:30PM ET",
      "startTimeEpoch": "1636835400",
      "bracketId": "",
      "gameState": "final",
      "startDate": "11-13-2021",
      "currentPeriod": "FINAL",
      "videoState": "",
      "bracketRegion": "",
      "contestClock": "0:00"
    }},
    {"game": {
      "gameID": "353528",
      "away": {
        "score": "41",
        "names": {
          "char6": "UGA",
          "short": "Georgia",
          "seo": "georgia",
          "full": "University of Georgia"
        },
        "winner": true,
        "seed": "",
        "description": "(10-0)",
        "rank": "1",
        "conferences": [
          {
            "conferenceName": "SEC",
            "conferenceSeo": "sec"
          },
          {
            "conferenceName": "Top 25",
            "conferenceSeo": "top-25"
          }
        ]
      },
      "finalMessage": "FINAL",
      "bracketRound": "",
      "title": "Tennessee Georgia",
      "url": "/game/5851353",
      "network": "",
      "home": {
        "score": "17",
        "names": {
          "char6": "TENN",
          "short": "Tennessee",
          "seo": "tennessee",
          "full": "University of Tennessee, Knoxville"
        },
        "winner": false,
        "seed": "",
        "description": "(5-5)",
        "rank": "",
        "conferences": [{
          "conferenceName": "SEC",
          "conferenceSeo": "sec"
        }]
      },
      "liveVideoEnabled": false,
      "startTime": "03:30PM ET",
      "startTimeEpoch": "1636835400",
      "bracketId": "",
      "gameState": "final",
      "startDate": "11-13-2021",
      "currentPeriod": "FINAL",
      "videoState": "",
      "bracketRegion": "",
      "contestClock": "0:00"
    }},
    {"game": {
      "gameID": "352924",
      "away": {
        "score": "22",
        "names": {
          "char6": "MINN",
          "short": "Minnesota",
          "seo": "minnesota",
          "full": "University of Minnesota, Twin Cities"
        },
        "winner": false,
        "seed": "",
        "description": "(6-4)",
        "rank": "",
        "conferences": [{
          "conferenceName": "Big Ten",
          "conferenceSeo": "big-ten"
        }]
      },
      "finalMessage": "FINAL",
      "bracketRound": "",
      "title": "Iowa Minnesota",
      "url": "/game/5851354",
      "network": "",
      "home": {
        "score": "27",
        "names": {
          "char6": "IOWA",
          "short": "Iowa",
          "seo": "iowa",
          "full": "University of Iowa"
        },
        "winner": true,
        "seed": "",
        "description": "(8-2)",
        "rank": "20",
        "conferences": [
          {
            "conferenceName": "Big Ten",
            "conferenceSeo": "big-ten"
          },
          {
            "conferenceName": "Top 25",
            "conferenceSeo": "top-25"
          }
        ]
      },
      "liveVideoEnabled": false,
      "startTime": "03:30PM ET",
      "startTimeEpoch": "1636835400",
      "bracketId": "",
      "gameState": "final",
      "startDate": "11-13-2021",
      "currentPeriod": "FINAL",
      "videoState": "",
      "bracketRegion": "",
      "contestClock": "0:00"
    }},
    {"game": {
      "gameID": "352840",
      "away": {
        "score": "41",
        "names": {
          "char6": "BC",
          "short": "Boston College",
          "seo": "boston-college",
          "full": "Boston College"
        },
        "winner": true,
        "seed": "",
        "description": "(6-4)",
        "rank": "",
        "conferences": [{
          "conferenceName": "ACC",
          "conferenceSeo": "acc"
        }]
      },
      "finalMessage": "FINAL",
      "bracketRound": "",
      "title": "Georgia Tech Boston College",
      "url": "/game/5851355",
      "network": "",
      "home": {
        "score": "30",
        "names": {
          "char6": "GATECH",
          "short": "Georgia Tech",
          "seo": "georgia-tech",
          "full": "Georgia Institute of Technology"
        },
        "winner": false,
        "seed": "",
        "description": "(3-7)",
        "rank": "",
        "conferences": [{
          "conferenceName": "ACC",
          "conferenceSeo": "acc"
        }]
      },
      "liveVideoEnabled": false,
      "startTime": "03:30PM ET",
      "startTimeEpoch": "1636835400",
      "bracketId": "",
      "gameState": "final",
      "startDate": "11-13-2021",
      "currentPeriod": "FINAL",
      "videoState": "",
      "bracketRegion": "",
      "contestClock": "0:00"
    }},
    {"game": {
      "gameID": "352806",
      "away": {
        "score": "28",
        "names": {
          "char6": "MIAMI",
          "short": "Miami (FL)",
          "seo": "miami-fl",
          "full": "University of Miami (Florida)"
        },
        "winner": false,
        "seed": "",
        "description": "(5-5)",
        "rank": "",
        "conferences": [{
          "conferenceName": "ACC",
          "conferenceSeo": "acc"
        }]
      },
      "finalMessage": "FINAL",
      "bracketRound": "",
      "title": "Florida St. Miami (FL)",
      "url": "/game/5851360",
      "network": "",
      "home": {
        "score": "31",
        "names": {
          "char6": "FSU",
          "short": "Florida St.",
          "seo": "florida-st",
          "full": "Florida State University"
        },
        "winner": true,
        "seed": "",
        "description": "(4-6)",
        "rank": "",
        "conferences": [{
          "conferenceName": "ACC",
          "conferenceSeo": "acc"
        }]
      },
      "liveVideoEnabled": false,
      "startTime": "03:30PM ET",
      "startTimeEpoch": "1636835400",
      "bracketId": "",
      "gameState": "final",
      "startDate": "11-13-2021",
      "currentPeriod": "FINAL",
      "videoState": "",
      "bracketRegion": "",
      "contestClock": "0:00"
    }},
    {"game": {
      "gameID": "353747",
      "away": {
        "score": "17",
        "names": {
          "char6": "DUKE",
          "short": "Duke",
          "seo": "duke",
          "full": "Duke University"
        },
        "winner": false,
        "seed": "",
        "description": "(3-7)",
        "rank": "",
        "conferences": [{
          "conferenceName": "ACC",
          "conferenceSeo": "acc"
        }]
      },
      "finalMessage": "FINAL",
      "bracketRound": "",
      "title": "Virginia Tech Duke",
      "url": "/game/5851374",
      "network": "",
      "home": {
        "score": "48",
        "names": {
          "char6": "VT",
          "short": "Virginia Tech",
          "seo": "virginia-tech",
          "full": "Virginia Polytechnic Institute and State University"
        },
        "winner": true,
        "seed": "",
        "description": "(5-5)",
        "rank": "",
        "conferences": [{
          "conferenceName": "ACC",
          "conferenceSeo": "acc"
        }]
      },
      "liveVideoEnabled": false,
      "startTime": "03:30PM ET",
      "startTimeEpoch": "1636835400",
      "bracketId": "",
      "gameState": "final",
      "startDate": "11-13-2021",
      "currentPeriod": "FINAL",
      "videoState": "",
      "bracketRegion": "",
      "contestClock": "0:00"
    }},
    {"game": {
      "gameID": "353549",
      "away": {
        "score": "38",
        "names": {
          "char6": "IOWAST",
          "short": "Iowa St.",
          "seo": "iowa-st",
          "full": "Iowa State University"
        },
        "winner": false,
        "seed": "",
        "description": "(6-4)",
        "rank": "",
        "conferences": [{
          "conferenceName": "Big 12",
          "conferenceSeo": "big-12"
        }]
      },
      "finalMessage": "FINAL",
      "bracketRound": "",
      "title": "Texas Tech Iowa St.",
      "url": "/game/5851381",
      "network": "",
      "home": {
        "score": "41",
        "names": {
          "char6": "TXTECH",
          "short": "Texas Tech",
          "seo": "texas-tech",
          "full": "Texas Tech University"
        },
        "winner": true,
        "seed": "",
        "description": "(6-4)",
        "rank": "",
        "conferences": [{
          "conferenceName": "Big 12",
          "conferenceSeo": "big-12"
        }]
      },
      "liveVideoEnabled": false,
      "startTime": "03:30PM ET",
      "startTimeEpoch": "1636835400",
      "bracketId": "",
      "gameState": "final",
      "startDate": "11-13-2021",
      "currentPeriod": "FINAL",
      "videoState": "",
      "bracketRegion": "",
      "contestClock": "0:00"
    }},
    {"game": {
      "gameID": "352972",
      "away": {
        "score": "32",
        "names": {
          "char6": "CHAR",
          "short": "Charlotte",
          "seo": "charlotte",
          "full": "The University of North Carolina at Charlotte"
        },
        "winner": false,
        "seed": "",
        "description": "(5-5)",
        "rank": "",
        "conferences": [{
          "conferenceName": "C-USA",
          "conferenceSeo": "c-usa"
        }]
      },
      "finalMessage": "FINAL",
      "bracketRound": "",
      "title": "Louisiana Tech Charlotte",
      "url": "/game/5851392",
      "network": "",
      "home": {
        "score": "42",
        "names": {
          "char6": "LATECH",
          "short": "Louisiana Tech",
          "seo": "louisiana-tech",
          "full": "Louisiana Tech University"
        },
        "winner": true,
        "seed": "",
        "description": "(3-7)",
        "rank": "",
        "conferences": [{
          "conferenceName": "C-USA",
          "conferenceSeo": "c-usa"
        }]
      },
      "liveVideoEnabled": false,
      "startTime": "03:30PM ET",
      "startTimeEpoch": "1636835400",
      "bracketId": "",
      "gameState": "final",
      "startDate": "11-13-2021",
      "currentPeriod": "FINAL",
      "videoState": "",
      "bracketRegion": "",
      "contestClock": "0:00"
    }},
    {"game": {
      "gameID": "353104",
      "away": {
        "score": "10",
        "names": {
          "char6": "FIU",
          "short": "FIU",
          "seo": "fiu",
          "full": "Florida International University"
        },
        "winner": false,
        "seed": "",
        "description": "(1-9)",
        "rank": "",
        "conferences": [{
          "conferenceName": "C-USA",
          "conferenceSeo": "c-usa"
        }]
      },
      "finalMessage": "FINAL",
      "bracketRound": "",
      "title": "Middle Tenn. FIU",
      "url": "/game/5851393",
      "network": "",
      "home": {
        "score": "50",
        "names": {
          "char6": "MIDTEN",
          "short": "Middle Tenn.",
          "seo": "middle-tenn",
          "full": "Middle Tennessee State University"
        },
        "winner": true,
        "seed": "",
        "description": "(5-5)",
        "rank": "",
        "conferences": [{
          "conferenceName": "C-USA",
          "conferenceSeo": "c-usa"
        }]
      },
      "liveVideoEnabled": false,
      "startTime": "03:30PM ET",
      "startTimeEpoch": "1636835400",
      "bracketId": "",
      "gameState": "final",
      "startDate": "11-13-2021",
      "currentPeriod": "FINAL",
      "videoState": "",
      "bracketRegion": "",
      "contestClock": "0:20"
    }},
    {"game": {
      "gameID": "353619",
      "away": {
        "score": "17",
        "names": {
          "char6": "S MISS",
          "short": "Southern Miss.",
          "seo": "southern-miss",
          "full": "The University of Southern Mississippi"
        },
        "winner": false,
        "seed": "",
        "description": "(1-9)",
        "rank": "",
        "conferences": [{
          "conferenceName": "C-USA",
          "conferenceSeo": "c-usa"
        }]
      },
      "finalMessage": "FINAL",
      "bracketRound": "",
      "title": "UTSA Southern Miss.",
      "url": "/game/5851394",
      "network": "",
      "home": {
        "score": "27",
        "names": {
          "char6": "UTSA",
          "short": "UTSA",
          "seo": "utsa",
          "full": "University of Texas at San Antonio"
        },
        "winner": true,
        "seed": "",
        "description": "(10-0)",
        "rank": "23",
        "conferences": [
          {
            "conferenceName": "C-USA",
            "conferenceSeo": "c-usa"
          },
          {
            "conferenceName": "Top 25",
            "conferenceSeo": "top-25"
          }
        ]
      },
      "liveVideoEnabled": false,
      "startTime": "03:30PM ET",
      "startTimeEpoch": "1636835400",
      "bracketId": "",
      "gameState": "final",
      "startDate": "11-13-2021",
      "currentPeriod": "FINAL",
      "videoState": "",
      "bracketRegion": "",
      "contestClock": "0:00"
    }},
    {"game": {
      "gameID": "353238",
      "away": {
        "score": "16",
        "names": {
          "char6": "FAU",
          "short": "Fla. Atlantic",
          "seo": "fla-atlantic",
          "full": "Florida Atlantic University"
        },
        "winner": false,
        "seed": "",
        "description": "(5-5)",
        "rank": "",
        "conferences": [{
          "conferenceName": "C-USA",
          "conferenceSeo": "c-usa"
        }]
      },
      "finalMessage": "FINAL",
      "bracketRound": "",
      "title": "Old Dominion Fla. Atlantic",
      "url": "/game/5851397",
      "network": "",
      "home": {
        "score": "30",
        "names": {
          "char6": "ODU",
          "short": "Old Dominion",
          "seo": "old-dominion",
          "full": "Old Dominion University"
        },
        "winner": true,
        "seed": "",
        "description": "(4-6)",
        "rank": "",
        "conferences": [{
          "conferenceName": "C-USA",
          "conferenceSeo": "c-usa"
        }]
      },
      "liveVideoEnabled": false,
      "startTime": "03:30PM ET",
      "startTimeEpoch": "1636835400",
      "bracketId": "",
      "gameState": "final",
      "startDate": "11-13-2021",
      "currentPeriod": "FINAL",
      "videoState": "",
      "bracketRegion": "",
      "contestClock": "0:00"
    }},
    {"game": {
      "gameID": "353007",
      "away": {
        "score": "21",
        "names": {
          "char6": "UAB",
          "short": "UAB",
          "seo": "uab",
          "full": "University of Alabama at Birmingham"
        },
        "winner": true,
        "seed": "",
        "description": "(7-3)",
        "rank": "",
        "conferences": [{
          "conferenceName": "C-USA",
          "conferenceSeo": "c-usa"
        }]
      },
      "finalMessage": "FINAL",
      "bracketRound": "",
      "title": "Marshall UAB",
      "url": "/game/5851398",
      "network": "",
      "home": {
        "score": "14",
        "names": {
          "char6": "MARSH",
          "short": "Marshall",
          "seo": "marshall",
          "full": "Marshall University"
        },
        "winner": false,
        "seed": "",
        "description": "(6-4)",
        "rank": "",
        "conferences": [{
          "conferenceName": "C-USA",
          "conferenceSeo": "c-usa"
        }]
      },
      "liveVideoEnabled": false,
      "startTime": "03:30PM ET",
      "startTimeEpoch": "1636835400",
      "bracketId": "",
      "gameState": "final",
      "startDate": "11-13-2021",
      "currentPeriod": "FINAL",
      "videoState": "",
      "bracketRegion": "",
      "contestClock": "0:00"
    }},
    {"game": {
      "gameID": "353057",
      "away": {
        "score": "28",
        "names": {
          "char6": "S CAR",
          "short": "South Carolina",
          "seo": "south-carolina",
          "full": "University of South Carolina, Columbia"
        },
        "winner": false,
        "seed": "",
        "description": "(5-5)",
        "rank": "",
        "conferences": [{
          "conferenceName": "SEC",
          "conferenceSeo": "sec"
        }]
      },
      "finalMessage": "FINAL",
      "bracketRound": "",
      "title": "Missouri South Carolina",
      "url": "/game/5851361",
      "network": "",
      "home": {
        "score": "31",
        "names": {
          "char6": "MIZZOU",
          "short": "Missouri",
          "seo": "missouri",
          "full": "University of Missouri, Columbia"
        },
        "winner": true,
        "seed": "",
        "description": "(5-5)",
        "rank": "",
        "conferences": [{
          "conferenceName": "SEC",
          "conferenceSeo": "sec"
        }]
      },
      "liveVideoEnabled": false,
      "startTime": "04:00PM ET",
      "startTimeEpoch": "1636837200",
      "bracketId": "",
      "gameState": "final",
      "startDate": "11-13-2021",
      "currentPeriod": "FINAL",
      "videoState": "",
      "bracketRegion": "",
      "contestClock": "0:00"
    }},
    {"game": {
      "gameID": "353599",
      "away": {
        "score": "20",
        "names": {
          "char6": "TULSA",
          "short": "Tulsa",
          "seo": "tulsa",
          "full": "The University of Tulsa"
        },
        "winner": true,
        "seed": "",
        "description": "(4-6)",
        "rank": "",
        "conferences": [{
          "conferenceName": "AAC",
          "conferenceSeo": "aac"
        }]
      },
      "finalMessage": "FINAL (OT)",
      "bracketRound": "",
      "title": "Tulane Tulsa",
      "url": "/game/5851369",
      "network": "",
      "home": {
        "score": "13",
        "names": {
          "char6": "TULANE",
          "short": "Tulane",
          "seo": "tulane",
          "full": "Tulane University"
        },
        "winner": false,
        "seed": "",
        "description": "(1-9)",
        "rank": "",
        "conferences": [{
          "conferenceName": "AAC",
          "conferenceSeo": "aac"
        }]
      },
      "liveVideoEnabled": false,
      "startTime": "04:00PM ET",
      "startTimeEpoch": "1636837200",
      "bracketId": "",
      "gameState": "final",
      "startDate": "11-13-2021",
      "currentPeriod": "FINAL (OT)",
      "videoState": "",
      "bracketRegion": "",
      "contestClock": ""
    }},
    {"game": {
      "gameID": "353099",
      "away": {
        "score": "21",
        "names": {
          "char6": "MD",
          "short": "Maryland",
          "seo": "maryland",
          "full": "University of Maryland, College Park"
        },
        "winner": false,
        "seed": "",
        "description": "(5-5)",
        "rank": "",
        "conferences": [{
          "conferenceName": "Big Ten",
          "conferenceSeo": "big-ten"
        }]
      },
      "finalMessage": "FINAL",
      "bracketRound": "",
      "title": "Michigan St. Maryland",
      "url": "/game/5851385",
      "network": "",
      "home": {
        "score": "40",
        "names": {
          "char6": "MICHST",
          "short": "Michigan St.",
          "seo": "michigan-st",
          "full": "Michigan State University"
        },
        "winner": true,
        "seed": "",
        "description": "(9-1)",
        "rank": "7",
        "conferences": [
          {
            "conferenceName": "Big Ten",
            "conferenceSeo": "big-ten"
          },
          {
            "conferenceName": "Top 25",
            "conferenceSeo": "top-25"
          }
        ]
      },
      "liveVideoEnabled": false,
      "startTime": "04:00PM ET",
      "startTimeEpoch": "1636837200",
      "bracketId": "",
      "gameState": "final",
      "startDate": "11-13-2021",
      "currentPeriod": "FINAL",
      "videoState": "",
      "bracketRegion": "",
      "contestClock": "0:00"
    }},
    {"game": {
      "gameID": "353901",
      "away": {
        "score": "13",
        "names": {
          "char6": "HAWAII",
          "short": "Hawaii",
          "seo": "hawaii",
          "full": "University of Hawaii, Manoa"
        },
        "winner": false,
        "seed": "",
        "description": "(4-7)",
        "rank": "",
        "conferences": [{
          "conferenceName": "Mountain West",
          "conferenceSeo": "mountain-west"
        }]
      },
      "finalMessage": "FINAL",
      "bracketRound": "",
      "title": "UNLV Hawaii",
      "url": "/game/5851391",
      "network": "",
      "home": {
        "score": "27",
        "names": {
          "char6": "UNLV",
          "short": "UNLV",
          "seo": "unlv",
          "full": "University of Nevada, Las Vegas"
        },
        "winner": true,
        "seed": "",
        "description": "(2-8)",
        "rank": "",
        "conferences": [{
          "conferenceName": "Mountain West",
          "conferenceSeo": "mountain-west"
        }]
      },
      "liveVideoEnabled": false,
      "startTime": "04:00PM ET",
      "startTimeEpoch": "1636837200",
      "bracketId": "",
      "gameState": "final",
      "startDate": "11-13-2021",
      "currentPeriod": "FINAL",
      "videoState": "",
      "bracketRegion": "",
      "contestClock": "0:00"
    }},
    {"game": {
      "gameID": "353196",
      "away": {
        "score": "17",
        "names": {
          "char6": "UTEP",
          "short": "UTEP",
          "seo": "utep",
          "full": "University of Texas at El Paso"
        },
        "winner": false,
        "seed": "",
        "description": "(6-4)",
        "rank": "",
        "conferences": [{
          "conferenceName": "C-USA",
          "conferenceSeo": "c-usa"
        }]
      },
      "finalMessage": "FINAL",
      "bracketRound": "",
      "title": "North Texas UTEP",
      "url": "/game/5851396",
      "network": "",
      "home": {
        "score": "20",
        "names": {
          "char6": "NO TEX",
          "short": "North Texas",
          "seo": "north-texas",
          "full": "University of North Texas"
        },
        "winner": true,
        "seed": "",
        "description": "(4-6)",
        "rank": "",
        "conferences": [{
          "conferenceName": "C-USA",
          "conferenceSeo": "c-usa"
        }]
      },
      "liveVideoEnabled": false,
      "startTime": "04:00PM ET",
      "startTimeEpoch": "1636837200",
      "bracketId": "",
      "gameState": "final",
      "startDate": "11-13-2021",
      "currentPeriod": "FINAL",
      "videoState": "",
      "bracketRegion": "",
      "contestClock": "0:00"
    }},
    {"game": {
      "gameID": "353662",
      "away": {
        "score": "27",
        "names": {
          "char6": "ARK ST",
          "short": "Arkansas St.",
          "seo": "arkansas-st",
          "full": "Arkansas State University"
        },
        "winner": true,
        "seed": "",
        "description": "(2-8)",
        "rank": "",
        "conferences": [{
          "conferenceName": "Sun Belt",
          "conferenceSeo": "sun-belt"
        }]
      },
      "finalMessage": "FINAL",
      "bracketRound": "",
      "title": "ULM Arkansas St.",
      "url": "/game/5851386",
      "network": "",
      "home": {
        "score": "24",
        "names": {
          "char6": "LA MON",
          "short": "ULM",
          "seo": "la-monroe",
          "full": "University of Louisiana Monroe"
        },
        "winner": false,
        "seed": "",
        "description": "(4-6)",
        "rank": "",
        "conferences": [{
          "conferenceName": "Sun Belt",
          "conferenceSeo": "sun-belt"
        }]
      },
      "liveVideoEnabled": false,
      "startTime": "05:00PM ET",
      "startTimeEpoch": "1636840800",
      "bracketId": "",
      "gameState": "final",
      "startDate": "11-13-2021",
      "currentPeriod": "FINAL",
      "videoState": "",
      "bracketRegion": "",
      "contestClock": "0:00"
    }},
    {"game": {
      "gameID": "353259",
      "away": {
        "score": "14",
        "names": {
          "char6": "STAN",
          "short": "Stanford",
          "seo": "stanford",
          "full": "Stanford University"
        },
        "winner": false,
        "seed": "",
        "description": "(3-7)",
        "rank": "",
        "conferences": [{
          "conferenceName": "Pac-12",
          "conferenceSeo": "pac-12"
        }]
      },
      "finalMessage": "FINAL",
      "bracketRound": "",
      "title": "Oregon St. Stanford",
      "url": "/game/5851363",
      "network": "",
      "home": {
        "score": "35",
        "names": {
          "char6": "ORE ST",
          "short": "Oregon St.",
          "seo": "oregon-st",
          "full": "Oregon State University"
        },
        "winner": true,
        "seed": "",
        "description": "(6-4)",
        "rank": "",
        "conferences": [{
          "conferenceName": "Pac-12",
          "conferenceSeo": "pac-12"
        }]
      },
      "liveVideoEnabled": false,
      "startTime": "05:30PM ET",
      "startTimeEpoch": "1636842600",
      "bracketId": "",
      "gameState": "final",
      "startDate": "11-13-2021",
      "currentPeriod": "FINAL",
      "videoState": "",
      "bracketRegion": "",
      "contestClock": "0:00"
    }},
    {"game": {
      "gameID": "353733",
      "away": {
        "score": "34",
        "names": {
          "char6": "UK",
          "short": "Kentucky",
          "seo": "kentucky",
          "full": "University of Kentucky"
        },
        "winner": true,
        "seed": "",
        "description": "(7-3)",
        "rank": "",
        "conferences": [{
          "conferenceName": "SEC",
          "conferenceSeo": "sec"
        }]
      },
      "finalMessage": "FINAL",
      "bracketRound": "",
      "title": "Vanderbilt Kentucky",
      "url": "/game/5851351",
      "network": "",
      "home": {
        "score": "17",
        "names": {
          "char6": "VANDY",
          "short": "Vanderbilt",
          "seo": "vanderbilt",
          "full": "Vanderbilt University"
        },
        "winner": false,
        "seed": "",
        "description": "(2-8)",
        "rank": "",
        "conferences": [{
          "conferenceName": "SEC",
          "conferenceSeo": "sec"
        }]
      },
      "liveVideoEnabled": false,
      "startTime": "07:00PM ET",
      "startTimeEpoch": "1636848000",
      "bracketId": "",
      "gameState": "final",
      "startDate": "11-13-2021",
      "currentPeriod": "FINAL",
      "videoState": "",
      "bracketRegion": "",
      "contestClock": "0:00"
    }},
    {"game": {
      "gameID": "353246",
      "away": {
        "score": "19",
        "names": {
          "char6": "TX A&M",
          "short": "Texas A&M",
          "seo": "texas-am",
          "full": "Texas A&M University, College Station"
        },
        "winner": false,
        "seed": "",
        "description": "(7-3)",
        "rank": "11",
        "conferences": [
          {
            "conferenceName": "SEC",
            "conferenceSeo": "sec"
          },
          {
            "conferenceName": "Top 25",
            "conferenceSeo": "top-25"
          }
        ]
      },
      "finalMessage": "FINAL",
      "bracketRound": "",
      "title": "Ole Miss Texas A&M",
      "url": "/game/5851367",
      "network": "",
      "home": {
        "score": "29",
        "names": {
          "char6": "MISS",
          "short": "Ole Miss",
          "seo": "ole-miss",
          "full": "University of Mississippi"
        },
        "winner": true,
        "seed": "",
        "description": "(8-2)",
        "rank": "15",
        "conferences": [
          {
            "conferenceName": "SEC",
            "conferenceSeo": "sec"
          },
          {
            "conferenceName": "Top 25",
            "conferenceSeo": "top-25"
          }
        ]
      },
      "liveVideoEnabled": false,
      "startTime": "07:00PM ET",
      "startTimeEpoch": "1636848000",
      "bracketId": "",
      "gameState": "final",
      "startDate": "11-13-2021",
      "currentPeriod": "FINAL",
      "videoState": "",
      "bracketRegion": "",
      "contestClock": "0:00"
    }},
    {"game": {
      "gameID": "353768",
      "away": {
        "score": "35",
        "names": {
          "char6": "AZ ST",
          "short": "Arizona St.",
          "seo": "arizona-st",
          "full": "Arizona State University"
        },
        "winner": true,
        "seed": "",
        "description": "(7-3)",
        "rank": "",
        "conferences": [{
          "conferenceName": "Pac-12",
          "conferenceSeo": "pac-12"
        }]
      },
      "finalMessage": "FINAL",
      "bracketRound": "",
      "title": "Washington Arizona St.",
      "url": "/game/5851375",
      "network": "",
      "home": {
        "score": "30",
        "names": {
          "char6": "WASH",
          "short": "Washington",
          "seo": "washington",
          "full": "University of Washington"
        },
        "winner": false,
        "seed": "",
        "description": "(4-6)",
        "rank": "",
        "conferences": [{
          "conferenceName": "Pac-12",
          "conferenceSeo": "pac-12"
        }]
      },
      "liveVideoEnabled": false,
      "startTime": "07:00PM ET",
      "startTimeEpoch": "1636848000",
      "bracketId": "",
      "gameState": "final",
      "startDate": "11-13-2021",
      "currentPeriod": "FINAL",
      "videoState": "",
      "bracketRegion": "",
      "contestClock": "0:00"
    }},
    {"game": {
      "gameID": "352798",
      "away": {
        "score": "7",
        "names": {
          "char6": "N MEX",
          "short": "New Mexico",
          "seo": "new-mexico",
          "full": "University of New Mexico"
        },
        "winner": false,
        "seed": "",
        "description": "(3-7)",
        "rank": "",
        "conferences": [{
          "conferenceName": "Mountain West",
          "conferenceSeo": "mountain-west"
        }]
      },
      "finalMessage": "FINAL",
      "bracketRound": "",
      "title": "Fresno St. New Mexico",
      "url": "/game/5851399",
      "network": "",
      "home": {
        "score": "34",
        "names": {
          "char6": "FRESNO",
          "short": "Fresno St.",
          "seo": "fresno-st",
          "full": "California State University, Fresno"
        },
        "winner": true,
        "seed": "",
        "description": "(8-3)",
        "rank": "",
        "conferences": [{
          "conferenceName": "Mountain West",
          "conferenceSeo": "mountain-west"
        }]
      },
      "liveVideoEnabled": false,
      "startTime": "07:00PM ET",
      "startTimeEpoch": "1636848000",
      "bracketId": "",
      "gameState": "final",
      "startDate": "11-13-2021",
      "currentPeriod": "FINAL",
      "videoState": "",
      "bracketRegion": "",
      "contestClock": "0:00"
    }},
    {"game": {
      "gameID": "352699",
      "away": {
        "score": "35",
        "names": {
          "char6": "AIRFOR",
          "short": "Air Force",
          "seo": "air-force",
          "full": "U.S. Air Force Academy"
        },
        "winner": true,
        "seed": "",
        "description": "(7-3)",
        "rank": "",
        "conferences": [{
          "conferenceName": "Mountain West",
          "conferenceSeo": "mountain-west"
        }]
      },
      "finalMessage": "FINAL",
      "bracketRound": "",
      "title": "Colorado St. Air Force",
      "url": "/game/5851400",
      "network": "",
      "home": {
        "score": "21",
        "names": {
          "char6": "CO ST",
          "short": "Colorado St.",
          "seo": "colorado-st",
          "full": "Colorado State University"
        },
        "winner": false,
        "seed": "",
        "description": "(3-7)",
        "rank": "",
        "conferences": [{
          "conferenceName": "Mountain West",
          "conferenceSeo": "mountain-west"
        }]
      },
      "liveVideoEnabled": false,
      "startTime": "07:00PM ET",
      "startTimeEpoch": "1636848000",
      "bracketId": "",
      "gameState": "final",
      "startDate": "11-13-2021",
      "currentPeriod": "FINAL",
      "videoState": "",
      "bracketRegion": "",
      "contestClock": "0:00"
    }},
    {"game": {
      "gameID": "353761",
      "away": {
        "score": "42",
        "names": {
          "char6": "NC ST",
          "short": "NC State",
          "seo": "north-carolina-st",
          "full": "North Carolina State University"
        },
        "winner": false,
        "seed": "",
        "description": "(7-3)",
        "rank": "16",
        "conferences": [
          {
            "conferenceName": "ACC",
            "conferenceSeo": "acc"
          },
          {
            "conferenceName": "Top 25",
            "conferenceSeo": "top-25"
          }
        ]
      },
      "finalMessage": "FINAL",
      "bracketRound": "",
      "title": "Wake Forest NC State",
      "url": "/game/5851357",
      "network": "",
      "home": {
        "score": "45",
        "names": {
          "char6": "WAKE",
          "short": "Wake Forest",
          "seo": "wake-forest",
          "full": "Wake Forest University"
        },
        "winner": true,
        "seed": "",
        "description": "(9-1)",
        "rank": "12",
        "conferences": [
          {
            "conferenceName": "ACC",
            "conferenceSeo": "acc"
          },
          {
            "conferenceName": "Top 25",
            "conferenceSeo": "top-25"
          }
        ]
      },
      "liveVideoEnabled": false,
      "startTime": "07:30PM ET",
      "startTimeEpoch": "1636849800",
      "bracketId": "",
      "gameState": "final",
      "startDate": "11-13-2021",
      "currentPeriod": "FINAL",
      "videoState": "",
      "bracketRegion": "",
      "contestClock": "0:00"
    }},
    {"game": {
      "gameID": "352993",
      "away": {
        "score": "16",
        "names": {
          "char6": "ARK",
          "short": "Arkansas",
          "seo": "arkansas",
          "full": "University of Arkansas, Fayetteville"
        },
        "winner": true,
        "seed": "",
        "description": "(7-3)",
        "rank": "25",
        "conferences": [
          {
            "conferenceName": "SEC",
            "conferenceSeo": "sec"
          },
          {
            "conferenceName": "Top 25",
            "conferenceSeo": "top-25"
          }
        ]
      },
      "finalMessage": "FINAL (OT)",
      "bracketRound": "",
      "title": "LSU Arkansas",
      "url": "/game/5851366",
      "network": "",
      "home": {
        "score": "13",
        "names": {
          "char6": "LSU",
          "short": "LSU",
          "seo": "lsu",
          "full": "Louisiana State University"
        },
        "winner": false,
        "seed": "",
        "description": "(4-6)",
        "rank": "",
        "conferences": [{
          "conferenceName": "SEC",
          "conferenceSeo": "sec"
        }]
      },
      "liveVideoEnabled": false,
      "startTime": "07:30PM ET",
      "startTimeEpoch": "1636849800",
      "bracketId": "",
      "gameState": "final",
      "startDate": "11-13-2021",
      "currentPeriod": "FINAL (OT)",
      "videoState": "",
      "bracketRegion": "",
      "contestClock": ""
    }},
    {"game": {
      "gameID": "353718",
      "away": {
        "score": "28",
        "names": {
          "char6": "N DAME",
          "short": "Notre Dame",
          "seo": "notre-dame",
          "full": "University of Notre Dame"
        },
        "winner": true,
        "seed": "",
        "description": "(9-1)",
        "rank": "9",
        "conferences": [
          {
            "conferenceName": "FBS Independent",
            "conferenceSeo": "fbs-independent"
          },
          {
            "conferenceName": "Top 25",
            "conferenceSeo": "top-25"
          }
        ]
      },
      "finalMessage": "FINAL",
      "bracketRound": "",
      "title": "Virginia Notre Dame",
      "url": "/game/5851379",
      "network": "",
      "home": {
        "score": "3",
        "names": {
          "char6": "UVA",
          "short": "Virginia",
          "seo": "virginia",
          "full": "University of Virginia"
        },
        "winner": false,
        "seed": "",
        "description": "(6-4)",
        "rank": "",
        "conferences": [{
          "conferenceName": "ACC",
          "conferenceSeo": "acc"
        }]
      },
      "liveVideoEnabled": false,
      "startTime": "07:30PM ET",
      "startTimeEpoch": "1636849800",
      "bracketId": "",
      "gameState": "final",
      "startDate": "11-13-2021",
      "currentPeriod": "FINAL",
      "videoState": "",
      "bracketRegion": "",
      "contestClock": "0:00"
    }},
    {"game": {
      "gameID": "353542",
      "away": {
        "score": "57",
        "names": {
          "char6": "KANSAS",
          "short": "Kansas",
          "seo": "kansas",
          "full": "University of Kansas"
        },
        "winner": true,
        "seed": "",
        "description": "(2-8)",
        "rank": "",
        "conferences": [{
          "conferenceName": "Big 12",
          "conferenceSeo": "big-12"
        }]
      },
      "finalMessage": "FINAL (OT)",
      "bracketRound": "",
      "title": "Texas Kansas",
      "url": "/game/5851383",
      "network": "",
      "home": {
        "score": "56",
        "names": {
          "char6": "TEXAS",
          "short": "Texas",
          "seo": "texas",
          "full": "University of Texas at Austin"
        },
        "winner": false,
        "seed": "",
        "description": "(4-6)",
        "rank": "",
        "conferences": [{
          "conferenceName": "Big 12",
          "conferenceSeo": "big-12"
        }]
      },
      "liveVideoEnabled": false,
      "startTime": "07:30PM ET",
      "startTimeEpoch": "1636849800",
      "bracketId": "",
      "gameState": "final",
      "startDate": "11-13-2021",
      "currentPeriod": "FINAL (OT)",
      "videoState": "",
      "bracketRegion": "",
      "contestClock": ""
    }},
    {"game": {
      "gameID": "353232",
      "away": {
        "score": "16",
        "names": {
          "char6": "TCU",
          "short": "TCU",
          "seo": "tcu",
          "full": "Texas Christian University"
        },
        "winner": false,
        "seed": "",
        "description": "(4-6)",
        "rank": "",
        "conferences": [{
          "conferenceName": "Big 12",
          "conferenceSeo": "big-12"
        }]
      },
      "finalMessage": "FINAL",
      "bracketRound": "",
      "title": "Oklahoma St. TCU",
      "url": "/game/5851382",
      "network": "",
      "home": {
        "score": "63",
        "names": {
          "char6": "OKLAST",
          "short": "Oklahoma St.",
          "seo": "oklahoma-st",
          "full": "Oklahoma State University"
        },
        "winner": true,
        "seed": "",
        "description": "(9-1)",
        "rank": "10",
        "conferences": [
          {
            "conferenceName": "Big 12",
            "conferenceSeo": "big-12"
          },
          {
            "conferenceName": "Top 25",
            "conferenceSeo": "top-25"
          }
        ]
      },
      "liveVideoEnabled": false,
      "startTime": "08:00PM ET",
      "startTimeEpoch": "1636851600",
      "bracketId": "",
      "gameState": "final",
      "startDate": "11-13-2021",
      "currentPeriod": "FINAL",
      "videoState": "",
      "bracketRegion": "",
      "contestClock": "2:16"
    }},
    {"game": {
      "gameID": "2159747",
      "away": {
        "score": "17",
        "names": {
          "char6": "TCU",
          "short": "TCU",
          "seo": "tcu",
          "full": "Texas Christian University"
        },
        "winner": false,
        "seed": "",
        "description": "(4-6)",
        "rank": "",
        "conferences": [{
          "conferenceName": "Big 12",
          "conferenceSeo": "big-12"
        }]
      },
      "finalMessage": "FINAL",
      "bracketRound": "",
      "title": "Oklahoma St. TCU",
      "url": "/game/5930132",
      "network": "",
      "home": {
        "score": "63",
        "names": {
          "char6": "OKLAST",
          "short": "Oklahoma St.",
          "seo": "oklahoma-st",
          "full": "Oklahoma State University"
        },
        "winner": true,
        "seed": "",
        "description": "(9-1)",
        "rank": "",
        "conferences": [{
          "conferenceName": "Big 12",
          "conferenceSeo": "big-12"
        }]
      },
      "liveVideoEnabled": false,
      "startTime": "08:00PM ET",
      "startTimeEpoch": "1636851600",
      "bracketId": "",
      "gameState": "final",
      "startDate": "11-13-2021",
      "currentPeriod": "FINAL",
      "videoState": "",
      "bracketRegion": "",
      "contestClock": "0:00"
    }},
    {"game": {
      "gameID": "353648",
      "away": {
        "score": "20",
        "names": {
          "char6": "COLO",
          "short": "Colorado",
          "seo": "colorado",
          "full": "University of Colorado, Boulder"
        },
        "winner": false,
        "seed": "",
        "description": "(3-7)",
        "rank": "",
        "conferences": [{
          "conferenceName": "Pac-12",
          "conferenceSeo": "pac-12"
        }]
      },
      "finalMessage": "FINAL",
      "bracketRound": "",
      "title": "UCLA Colorado",
      "url": "/game/5851364",
      "network": "",
      "home": {
        "score": "44",
        "names": {
          "char6": "UCLA",
          "short": "UCLA",
          "seo": "ucla",
          "full": "University of California, Los Angeles"
        },
        "winner": true,
        "seed": "",
        "description": "(6-4)",
        "rank": "",
        "conferences": [{
          "conferenceName": "Pac-12",
          "conferenceSeo": "pac-12"
        }]
      },
      "liveVideoEnabled": false,
      "startTime": "09:00PM ET",
      "startTimeEpoch": "1636855200",
      "bracketId": "",
      "gameState": "final",
      "startDate": "11-13-2021",
      "currentPeriod": "FINAL",
      "videoState": "",
      "bracketRegion": "",
      "contestClock": "0:00"
    }},
    {"game": {
      "gameID": "353253",
      "away": {
        "score": "24",
        "names": {
          "char6": "WASHST",
          "short": "Washington St.",
          "seo": "washington-st",
          "full": "Washington State University"
        },
        "winner": false,
        "seed": "",
        "description": "(5-5)",
        "rank": "",
        "conferences": [{
          "conferenceName": "Pac-12",
          "conferenceSeo": "pac-12"
        }]
      },
      "finalMessage": "FINAL",
      "bracketRound": "",
      "title": "Oregon Washington St.",
      "url": "/game/5851362",
      "network": "",
      "home": {
        "score": "38",
        "names": {
          "char6": "OREGN",
          "short": "Oregon",
          "seo": "oregon",
          "full": "University of Oregon"
        },
        "winner": true,
        "seed": "",
        "description": "(9-1)",
        "rank": "3",
        "conferences": [
          {
            "conferenceName": "Pac-12",
            "conferenceSeo": "pac-12"
          },
          {
            "conferenceName": "Top 25",
            "conferenceSeo": "top-25"
          }
        ]
      },
      "liveVideoEnabled": false,
      "startTime": "10:30PM ET",
      "startTimeEpoch": "1636860600",
      "bracketId": "",
      "gameState": "final",
      "startDate": "11-13-2021",
      "currentPeriod": "FINAL",
      "videoState": "",
      "bracketRegion": "",
      "contestClock": "0:00"
    }},
    {"game": {
      "gameID": "353443",
      "away": {
        "score": "48",
        "names": {
          "char6": "UT ST",
          "short": "Utah St.",
          "seo": "utah-st",
          "full": "Utah State University"
        },
        "winner": true,
        "seed": "",
        "description": "(8-2)",
        "rank": "",
        "conferences": [{
          "conferenceName": "Mountain West",
          "conferenceSeo": "mountain-west"
        }]
      },
      "finalMessage": "FINAL",
      "bracketRound": "",
      "title": "San Jose St. Utah St.",
      "url": "/game/5851378",
      "network": "",
      "home": {
        "score": "17",
        "names": {
          "char6": "SJSU",
          "short": "San Jose St.",
          "seo": "san-jose-st",
          "full": "San Jose State University"
        },
        "winner": false,
        "seed": "",
        "description": "(5-6)",
        "rank": "",
        "conferences": [{
          "conferenceName": "Mountain West",
          "conferenceSeo": "mountain-west"
        }]
      },
      "liveVideoEnabled": false,
      "startTime": "10:30PM ET",
      "startTimeEpoch": "1636860600",
      "bracketId": "",
      "gameState": "final",
      "startDate": "11-13-2021",
      "currentPeriod": "FINAL",
      "videoState": "",
      "bracketRegion": "",
      "contestClock": "0:00"
    }},
    {"game": {
      "gameID": "353416",
      "away": {
        "score": "21",
        "names": {
          "char6": "NEVADA",
          "short": "Nevada",
          "seo": "nevada",
          "full": "University of Nevada, Reno"
        },
        "winner": false,
        "seed": "",
        "description": "(7-3)",
        "rank": "",
        "conferences": [{
          "conferenceName": "Mountain West",
          "conferenceSeo": "mountain-west"
        }]
      },
      "finalMessage": "FINAL",
      "bracketRound": "",
      "title": "San Diego St. Nevada",
      "url": "/game/5851401",
      "network": "",
      "home": {
        "score": "23",
        "names": {
          "char6": "SDSU",
          "short": "San Diego St.",
          "seo": "san-diego-st",
          "full": "San Diego State University"
        },
        "winner": true,
        "seed": "",
        "description": "(9-1)",
        "rank": "22",
        "conferences": [
          {
            "conferenceName": "Mountain West",
            "conferenceSeo": "mountain-west"
          },
          {
            "conferenceName": "Top 25",
            "conferenceSeo": "top-25"
          }
        ]
      },
      "liveVideoEnabled": false,
      "startTime": "10:30PM ET",
      "startTimeEpoch": "1636860600",
      "bracketId": "",
      "gameState": "final",
      "startDate": "11-13-2021",
      "currentPeriod": "FINAL",
      "videoState": "",
      "bracketRegion": "",
      "contestClock": "0:00"
    }}
  ]
}