{
  "inputMD5Sum": "ff810a4d7630f33c2a9db0c17a71cc73",
  "updated_at": "11-04-2022 20:14:38",
  "games": [
    {"game": {
      "gameID": "410377",
      "away": {
        "score": "24",
        "names": {
          "char6": "LA",
          "short": "Louisiana",
          "seo": "la-lafayette",
          "full": "University of Louisiana at Lafayette"
        },
        "winner": false,
        "seed": "",
        "description": "(4-4)",
        "rank": "",
        "conferences": [{
          "conferenceName": "Sun Belt",
          "conferenceSeo": "sun-belt"
        }]
      },
      "finalMessage": "FINAL",
      "bracketRound": "",
      "title": "Southern Miss. Louisiana",
      "contestName": "",
      "url": "/game/6006118",
      "network": "",
      "home": {
        "score": "39",
        "names": {
          "char6": "S MISS",
          "short": "Southern Miss.",
          "seo": "southern-miss",
          "full": "The University of Southern Mississippi"
        },
        "winner": true,
        "seed": "",
        "description": "(5-3)",
        "rank": "",
        "conferences": [{
          "conferenceName": "Sun Belt",
          "conferenceSeo": "sun-belt"
        }]
      },
      "liveVideoEnabled": false,
      "startTime": "07:30PM ET",
      "startTimeEpoch": "1666913400",
      "bracketId": "",
      "gameState": "final",
      "startDate": "10-27-2022",
      "currentPeriod": "FINAL",
      "videoState": "",
      "bracketRegion": "",
      "contestClock": "0:00"
    }},
    {"game": {
      "gameID": "410090",
      "away": {
        "score": "21",
        "names": {
          "char6": "VT",
          "short": "Virginia Tech",
          "seo": "virginia-tech",
          "full": "Virginia Polytechnic Institute and State University"
        },
        "winner": false,
        "seed": "",
        "description": "(2-6)",
        "rank": "",
        "conferences": [{
          "conferenceName": "ACC",
          "conferenceSeo": "acc"
        }]
      },
      "finalMessage": "FINAL",
      "bracketRound": "",
      "title": "NC State Virginia Tech",
      "contestName": "",
      "url": "/game/6006120",
      "network": "",
      "home": {
        "score": "22",
        "names": {
          "char6": "NC ST",
          "short": "NC State",
          "seo": "north-carolina-st",
          "full": "North Carolina State University"
        },
        "winner": true,
        "seed": "",
        "description": "(6-2)",
        "rank": "24",
        "conferences": [
          {
            "conferenceName": "ACC",
            "conferenceSeo": "acc"
          },
          {
            "conferenceName": "Top 25",
            "conferenceSeo": "top-25"
          }
        ]
      },
      "liveVideoEnabled": false,
      "startTime": "07:30PM ET",
      "startTimeEpoch": "1666913400",
      "bracketId": "",
      "gameState": "final",
      "startDate": "10-27-2022",
      "currentPeriod": "FINAL",
      "videoState": "",
      "bracketRegion": "",
      "contestClock": "0:00"
    }},
    {"game": {
      "gameID": "410652",
      "away": {
        "score": "21",
        "names": {
          "char6": "UTAH",
          "short": "Utah",
          "seo": "utah",
          "full": "University of Utah"
        },
        "winner": true,
        "seed": "",
        "description": "(6-2)",
        "rank": "14",
        "conferences": [
          {
            "conferenceName": "Pac-12",
            "conferenceSeo": "pac-12"
          },
          {
            "conferenceName": "Top 25",
            "conferenceSeo": "top-25"
          }
        ]
      },
      "finalMessage": "FINAL",
      "bracketRound": "",
      "title": "Washington St. Utah",
      "contestName": "",
      "url": "/game/6006119",
      "network": "",
      "home": {
        "score": "17",
        "names": {
          "char6": "WASHST",
          "short": "Washington St.",
          "seo": "washington-st",
          "full": "Washington State University"
        },
        "winner": false,
        "seed": "",
        "description": "(4-4)",
        "rank": "",
        "conferences": [{
          "conferenceName": "Pac-12",
          "conferenceSeo": "pac-12"
        }]
      },
      "liveVideoEnabled": false,
      "startTime": "10:00PM ET",
      "startTimeEpoch": "1666922400",
      "bracketId": "",
      "gameState": "final",
      "startDate": "10-27-2022",
      "currentPeriod": "FINAL",
      "videoState": "",
      "bracketRegion": "",
      "contestClock": "0:00"
    }},
    {"game": {
      "gameID": "409519",
      "away": {
        "score": "27",
        "names": {
          "char6": "E CAR",
          "short": "East Carolina",
          "seo": "east-carolina",
          "full": "East Carolina University"
        },
        "winner": true,
        "seed": "",
        "description": "(6-3)",
        "rank": "",
        "conferences": [{
          "conferenceName": "AAC",
          "conferenceSeo": "aac"
        }]
      },
      "finalMessage": "FINAL",
      "bracketRound": "",
      "title": "BYU East Carolina",
      "contestName": "",
      "url": "/game/6006121",
      "network": "",
      "home": {
        "score": "24",
        "names": {
          "char6": "BYU",
          "short": "BYU",
          "seo": "byu",
          "full": "Brigham Young University"
        },
        "winner": false,
        "seed": "",
        "description": "(4-5)",
        "rank": "",
        "conferences": [{
          "conferenceName": "FBS Independent",
          "conferenceSeo": "fbs-independent"
        }]
      },
      "liveVideoEnabled": false,
      "startTime": "08:00PM ET",
      "startTimeEpoch": "1667001600",
      "bracketId": "",
      "gameState": "final",
      "startDate": "10-28-2022",
      "currentPeriod": "FINAL",
      "videoState": "",
      "bracketRegion": "",
      "contestClock": "0:00"
    }},
    {"game": {
      "gameID": "409709",
      "away": {
        "score": "34",
        "names": {
          "char6": "LATECH",
          "short": "Louisiana Tech",
          "seo": "louisiana-tech",
          "full": "Louisiana Tech University"
        },
        "winner": false,
        "seed": "",
        "description": "(2-6)",
        "rank": "",
        "conferences": [{
          "conferenceName": "C-USA",
          "conferenceSeo": "c-usa"
        }]
      },
      "finalMessage": "FINAL (2OT)",
      "bracketRound": "",
      "title": "FIU Louisiana Tech",
      "contestName": "",
      "url": "/game/6006122",
      "network": "",
      "home": {
        "score": "42",
        "names": {
          "char6": "FIU",
          "short": "FIU",
          "seo": "fiu",
          "full": "Florida International University"
        },
        "winner": true,
        "seed": "",
        "description": "(4-4)",
        "rank": "",
        "conferences": [{
          "conferenceName": "C-USA",
          "conferenceSeo": "c-usa"
        }]
      },
      "liveVideoEnabled": false,
      "startTime": "08:00PM ET",
      "startTimeEpoch": "1667001600",
      "bracketId": "",
      "gameState": "final",
      "startDate": "10-28-2022",
      "currentPeriod": "FINAL (2OT)",
      "videoState": "",
      "bracketRegion": "",
      "contestClock": ""
    }},
    {"game": {
      "gameID": "409808",
      "away": {
        "score": "27",
        "names": {
          "char6": "OKLA",
          "short": "Oklahoma",
          "seo": "oklahoma",
          "full": "University of Oklahoma"
        },
        "winner": true,
        "seed": "",
        "description": "(5-3)",
        "rank": "",
        "conferences": [{
          "conferenceName": "Big 12",
          "conferenceSeo": "big-12"
        }]
      },
      "finalMessage": "FINAL",
      "bracketRound": "",
      "title": "Iowa St. Oklahoma",
      "contestName": "",
      "url": "/game/6006123",
      "network": "",
      "home": {
        "score": "13",
        "names": {
          "char6": "IOWAST",
          "short": "Iowa St.",
          "seo": "iowa-st",
          "full": "Iowa State University"
        },
        "winner": false,
        "seed": "",
        "description": "(3-5)",
        "rank": "",
        "conferences": [{
          "conferenceName": "Big 12",
          "conferenceSeo": "big-12"
        }]
      },
      "liveVideoEnabled": false,
      "startTime": "12:00PM ET",
      "startTimeEpoch": "1667059200",
      "bracketId": "",
      "gameState": "final",
      "startDate": "10-29-2022",
      "currentPeriod": "FINAL",
      "videoState": "",
      "bracketRegion": "",
      "contestClock": "0:00"
    }},
    {"game": {
      "gameID": "409724",
      "away": {
        "score": "16",
        "names": {
          "char6": "GATECH",
          "short": "Georgia Tech",
          "seo": "georgia-tech",
          "full": "Georgia Institute of Technology"
        },
        "winner": false,
        "seed": "",
        "description": "(3-5)",
        "rank": "",
        "conferences": [{
          "conferenceName": "ACC",
          "conferenceSeo": "acc"
        }]
      },
      "finalMessage": "FINAL",
      "bracketRound": "",
      "title": "Florida St. Georgia Tech",
      "contestName": "",
      "url": "/game/6006130",
      "network": "",
      "home": {
        "score": "41",
        "names": {
          "char6": "FSU",
          "short": "Florida St.",
          "seo": "florida-st",
          "full": "Florida State University"
        },
        "winner": true,
        "seed": "",
        "description": "(5-3)",
        "rank": "",
        "conferences": [{
          "conferenceName": "ACC",
          "conferenceSeo": "acc"
        }]
      },
      "liveVideoEnabled": false,
      "startTime": "12:00PM ET",
      "startTimeEpoch": "1667059200",
      "bracketId": "",
      "gameState": "final",
      "startDate": "10-29-2022",
      "currentPeriod": "FINAL",
      "videoState": "",
      "bracketRegion": "",
      "contestClock": "0:00"
    }},
    {"game": {
      "gameID": "2278950",
      "away": {
        "score": "27",
        "names": {
          "char6": "TOLEDO",
          "short": "Toledo",
          "seo": "toledo",
          "full": "University of Toledo"
        },
        "winner": true,
        "seed": "",
        "description": "(6-3)",
        "rank": "",
        "conferences": [{
          "conferenceName": "MAC",
          "conferenceSeo": "mac"
        }]
      },
      "finalMessage": "FINAL",
      "bracketRound": "",
      "title": "Eastern Mich. Toledo",
      "contestName": "",
      "url": "/game/6006131",
      "network": "",
      "home": {
        "score": "24",
        "names": {
          "char6": "E MICH",
          "short": "Eastern Mich.",
          "seo": "eastern-mich",
          "full": "Eastern Michigan University"
        },
        "winner": false,
        "seed": "",
        "description": "(5-4)",
        "rank": "",
        "conferences": [{
          "conferenceName": "MAC",
          "conferenceSeo": "mac"
        }]
      },
      "liveVideoEnabled": false,
      "startTime": "12:00PM ET",
      "startTimeEpoch": "1667059200",
      "bracketId": "",
      "gameState": "final",
      "startDate": "10-29-2022",
      "currentPeriod": "FINAL",
      "videoState": "",
      "bracketRegion": "",
      "contestClock": "0:00"
    }},
    {"game": {
      "gameID": "410259",
      "away": {
        "score": "44",
        "names": {
          "char6": "OHIOST",
          "short": "Ohio St.",
          "seo": "ohio-st",
          "full": "The Ohio State University"
        },
        "winner": true,
        "seed": "",
        "description": "(8-0)",
        "rank": "2",
        "conferences": [
          {
            "conferenceName": "Big Ten",
            "conferenceSeo": "big-ten"
          },
          {
            "conferenceName": "Top 25",
            "conferenceSeo": "top-25"
          }
        ]
      },
      "finalMessage": "FINAL",
      "bracketRound": "",
      "title": "Penn St. Ohio St.",
      "contestName": "",
      "url": "/game/6006135",
      "network": "",
      "home": {
        "score": "31",
        "names": {
          "char6": "PENNST",
          "short": "Penn St.",
          "seo": "penn-st",
          "full": "Pennsylvania State University"
        },
        "winner": false,
        "seed": "",
        "description": "(6-2)",
        "rank": "13",
        "conferences": [
          {
            "conferenceName": "Big Ten",
            "conferenceSeo": "big-ten"
          },
          {
            "conferenceName": "Top 25",
            "conferenceSeo": "top-25"
          }
        ]
      },
      "liveVideoEnabled": false,
      "startTime": "12:00PM ET",
      "startTimeEpoch": "1667059200",
      "bracketId": "",
      "gameState": "final",
      "startDate": "10-29-2022",
      "currentPeriod": "FINAL",
      "videoState": "",
      "bracketRegion": "",
      "contestClock": "0:00"
    }},
    {"game": {
      "gameID": "2278955",
      "away": {
        "score": "27",
        "names": {
          "char6": "MIA OH",
          "short": "Miami (OH)",
          "seo": "miami-oh",
          "full": "Miami University (Ohio)"
        },
        "winner": true,
        "seed": "",
        "description": "(4-5)",
        "rank": "",
        "conferences": [{
          "conferenceName": "MAC",
          "conferenceSeo": "mac"
        }]
      },
      "finalMessage": "FINAL",
      "bracketRound": "",
      "title": "Akron Miami (OH)",
      "contestName": "",
      "url": "/game/6006136",
      "network": "",
      "home": {
        "score": "9",
        "names": {
          "char6": "AKRON",
          "short": "Akron",
          "seo": "akron",
          "full": "University of Akron"
        },
        "winner": false,
        "seed": "",
        "description": "(1-8)",
        "rank": "",
        "conferences": [{
          "conferenceName": "MAC",
          "conferenceSeo": "mac"
        }]
      },
      "liveVideoEnabled": false,
      "startTime": "12:00PM ET",
      "startTimeEpoch": "1667059200",
      "bracketId": "",
      "gameState": "final",
      "startDate": "10-29-2022",
      "currentPeriod": "FINAL",
      "videoState": "",
      "bracketRegion": "",
      "contestClock": "0:00"
    }},
    {"game": {
      "gameID": "409469",
      "away": {
        "score": "41",
        "names": {
          "char6": "ARK",
          "short": "Arkansas",
          "seo": "arkansas",
          "full": "University of Arkansas, Fayetteville"
        },
        "winner": true,
        "seed": "",
        "description": "(5-3)",
        "rank": "",
        "conferences": [{
          "conferenceName": "SEC",
          "conferenceSeo": "sec"
        }]
      },
      "finalMessage": "FINAL",
      "bracketRound": "",
      "title": "Auburn Arkansas",
      "contestName": "",
      "url": "/game/6006144",
      "network": "",
      "home": {
        "score": "27",
        "names": {
          "char6": "AUBURN",
          "short": "Auburn",
          "seo": "auburn",
          "full": "Auburn University"
        },
        "winner": false,
        "seed": "",
        "description": "(3-5)",
        "rank": "",
        "conferences": [{
          "conferenceName": "SEC",
          "conferenceSeo": "sec"
        }]
      },
      "liveVideoEnabled": false,
      "startTime": "12:00PM ET",
      "startTimeEpoch": "1667059200",
      "bracketId": "",
      "gameState": "final",
      "startDate": "10-29-2022",
      "currentPeriod": "FINAL",
      "videoState": "",
      "bracketRegion": "",
      "contestClock": "0:00"
    }},
    {"game": {
      "gameID": "409800",
      "away": {
        "score": "27",
        "names": {
          "char6": "USF",
          "short": "South Fla.",
          "seo": "south-fla",
          "full": "University of South Florida"
        },
        "winner": false,
        "seed": "",
        "description": "(1-7)",
        "rank": "",
        "conferences": [{
          "conferenceName": "AAC",
          "conferenceSeo": "aac"
        }]
      },
      "finalMessage": "FINAL",
      "bracketRound": "",
      "title": "Houston South Fla.",
      "contestName": "",
      "url": "/game/6006146",
      "network": "",
      "home": {
        "score": "42",
        "names": {
          "char6": "HOU",
          "short": "Houston",
          "seo": "houston",
          "full": "University of Houston"
        },
        "winner": true,
        "seed": "",
        "description": "(5-3)",
        "rank": "",
        "conferences": [{
          "conferenceName": "AAC",
          "conferenceSeo": "aac"
        }]
      },
      "liveVideoEnabled": false,
      "startTime": "12:00PM ET",
      "startTimeEpoch": "1667059200",
      "bracketId": "",
      "gameState": "final",
      "startDate": "10-29-2022",
      "currentPeriod": "FINAL",
      "videoState": "",
      "bracketRegion": "",
      "contestClock": "0:00"
    }},
    {"game": {
      "gameID": "410400",
      "away": {
        "score": "41",
        "names": {
          "char6": "N DAME",
          "short": "Notre Dame",
          "seo": "notre-dame",
          "full": "University of Notre Dame"
        },
        "winner": true,
        "seed": "",
        "description": "(5-3)",
        "rank": "",
        "conferences": [{
          "conferenceName": "FBS Independent",
          "conferenceSeo": "fbs-independent"
        }]
      },
      "finalMessage": "FINAL",
      "bracketRound": "",
      "title": "Syracuse Notre Dame",
      "contestName": "",
      "url": "/game/6006152",
      "network": "",
      "home": {
        "score": "24",
        "names": {
          "char6": "SYR",
          "short": "Syracuse",
          "seo": "syracuse",
          "full": "Syracuse University"
        },
        "winner": false,
        "seed": "",
        "description": "(6-2)",
        "rank": "16",
        "conferences": [
          {
            "conferenceName": "ACC",
            "conferenceSeo": "acc"
          },
          {
            "conferenceName": "Top 25",
            "conferenceSeo": "top-25"
          }
        ]
      },
      "liveVideoEnabled": false,
      "startTime": "12:00PM ET",
      "startTimeEpoch": "1667059200",
      "bracketId": "",
      "gameState": "final",
      "startDate": "10-29-2022",
      "currentPeriod": "FINAL",
      "videoState": "",
      "bracketRegion": "",
      "contestClock": "0:00"
    }},
    {"game": {
      "gameID": "410700",
      "away": {
        "score": "41",
        "names": {
          "char6": "TCU",
          "short": "TCU",
          "seo": "tcu",
          "full": "Texas Christian University"
        },
        "winner": true,
        "seed": "",
        "description": "(8-0)",
        "rank": "7",
        "conferences": [
          {
            "conferenceName": "Big 12",
            "conferenceSeo": "big-12"
          },
          {
            "conferenceName": "Top 25",
            "conferenceSeo": "top-25"
          }
        ]
      },
      "finalMessage": "FINAL",
      "bracketRound": "",
      "title": "West Virginia TCU",
      "contestName": "",
      "url": "/game/6006153",
      "network": "",
      "home": {
        "score": "31",
        "names": {
          "char6": "WVU",
          "short": "West Virginia",
          "seo": "west-virginia",
          "full": "West Virginia University"
        },
        "winner": false,
        "seed": "",
        "description": "(3-5)",
        "rank": "",
        "conferences": [{
          "conferenceName": "Big 12",
          "conferenceSeo": "big-12"
        }]
      },
      "liveVideoEnabled": false,
      "startTime": "12:00PM ET",
      "startTimeEpoch": "1667059200",
      "bracketId": "",
      "gameState": "final",
      "startDate": "10-29-2022",
      "currentPeriod": "FINAL",
      "videoState": "",
      "bracketRegion": "",
      "contestClock": "0:00"
    }},
    {"game": {
      "gameID": "409595",
      "away": {
        "score": "3",
        "names": {
          "char6": "BC",
          "short": "Boston College",
          "seo": "boston-college",
          "full": "Boston College"
        },
        "winner": false,
        "seed": "",
        "description": "(2-6)",
        "rank": "",
        "conferences": [{
          "conferenceName": "ACC",
          "conferenceSeo": "acc"
        }]
      },
      "finalMessage": "FINAL",
      "bracketRound": "",
      "title": "UConn Boston College",
      "contestName": "",
      "url": "/game/6006157",
      "network": "",
      "home": {
        "score": "13",
        "names": {
          "char6": "UCONN",
          "short": "UConn",
          "seo": "uconn",
          "full": "University of Connecticut"
        },
        "winner": true,
        "seed": "",
        "description": "(4-5)",
        "rank": "",
        "conferences": [{
          "conferenceName": "FBS Independent",
          "conferenceSeo": "fbs-independent"
        }]
      },
      "liveVideoEnabled": false,
      "startTime": "12:00PM ET",
      "startTimeEpoch": "1667059200",
      "bracketId": "",
      "gameState": "final",
      "startDate": "10-29-2022",
      "currentPeriod": "FINAL",
      "videoState": "",
      "bracketRegion": "",
      "contestClock": "0:00"
    }},
    {"game": {
      "gameID": "410602",
      "away": {
        "score": "14",
        "names": {
          "char6": "MIAMI",
          "short": "Miami (FL)",
          "seo": "miami-fl",
          "full": "University of Miami (Florida)"
        },
        "winner": true,
        "seed": "",
        "description": "(4-4)",
        "rank": "",
        "conferences": [{
          "conferenceName": "ACC",
          "conferenceSeo": "acc"
        }]
      },
      "finalMessage": "FINAL (4OT)",
      "bracketRound": "",
      "title": "Virginia Miami (FL)",
      "contestName": "",
      "url": "/game/6006127",
      "network": "",
      "home": {
        "score": "12",
        "names": {
          "char6": "UVA",
          "short": "Virginia",
          "seo": "virginia",
          "full": "University of Virginia"
        },
        "winner": false,
        "seed": "",
        "description": "(3-5)",
        "rank": "",
        "conferences": [{
          "conferenceName": "ACC",
          "conferenceSeo": "acc"
        }]
      },
      "liveVideoEnabled": false,
      "startTime": "12:30PM ET",
      "startTimeEpoch": "1667061000",
      "bracketId": "",
      "gameState": "final",
      "startDate": "10-29-2022",
      "currentPeriod": "FINAL (4OT)",
      "videoState": "",
      "bracketRegion": "",
      "contestClock": ""
    }},
    {"game": {
      "gameID": "410286",
      "away": {
        "score": "56",
        "names": {
          "char6": "CHAR",
          "short": "Charlotte",
          "seo": "charlotte",
          "full": "The University of North Carolina at Charlotte"
        },
        "winner": true,
        "seed": "",
        "description": "(2-7)",
        "rank": "",
        "conferences": [{
          "conferenceName": "C-USA",
          "conferenceSeo": "c-usa"
        }]
      },
      "finalMessage": "FINAL",
      "bracketRound": "",
      "title": "Rice Charlotte",
      "contestName": "",
      "url": "/game/6006158",
      "network": "",
      "home": {
        "score": "23",
        "names": {
          "char6": "RICE",
          "short": "Rice",
          "seo": "rice",
          "full": "Rice University"
        },
        "winner": false,
        "seed": "",
        "description": "(4-4)",
        "rank": "",
        "conferences": [{
          "conferenceName": "C-USA",
          "conferenceSeo": "c-usa"
        }]
      },
      "liveVideoEnabled": false,
      "startTime": "02:00PM ET",
      "startTimeEpoch": "1667066400",
      "bracketId": "",
      "gameState": "final",
      "startDate": "10-29-2022",
      "currentPeriod": "FINAL",
      "videoState": "",
      "bracketRegion": "",
      "contestClock": "0:00"
    }},
    {"game": {
      "gameID": "409992",
      "away": {
        "score": "0",
        "names": {
          "char6": "RUTGER",
          "short": "Rutgers",
          "seo": "rutgers",
          "full": "Rutgers, The State University of New Jersey, New Brunswick"
        },
        "winner": false,
        "seed": "",
        "description": "(4-4)",
        "rank": "",
        "conferences": [{
          "conferenceName": "Big Ten",
          "conferenceSeo": "big-ten"
        }]
      },
      "finalMessage": "FINAL",
      "bracketRound": "",
      "title": "Minnesota Rutgers",
      "contestName": "",
      "url": "/game/6006138",
      "network": "",
      "home": {
        "score": "31",
        "names": {
          "char6": "MINN",
          "short": "Minnesota",
          "seo": "minnesota",
          "full": "University of Minnesota, Twin Cities"
        },
        "winner": true,
        "seed": "",
        "description": "(5-3)",
        "rank": "",
        "conferences": [{
          "conferenceName": "Big Ten",
          "conferenceSeo": "big-ten"
        }]
      },
      "liveVideoEnabled": false,
      "startTime": "02:30PM ET",
      "startTimeEpoch": "1667068200",
      "bracketId": "",
      "gameState": "final",
      "startDate": "10-29-2022",
      "currentPeriod": "FINAL",
      "videoState": "",
      "bracketRegion": "",
      "contestClock": "0:00"
    }},
    {"game": {
      "gameID": "409766",
      "away": {
        "score": "17",
        "names": {
          "char6": "ODU",
          "short": "Old Dominion",
          "seo": "old-dominion",
          "full": "Old Dominion University"
        },
        "winner": false,
        "seed": "",
        "description": "(3-5)",
        "rank": "",
        "conferences": [{
          "conferenceName": "Sun Belt",
          "conferenceSeo": "sun-belt"
        }]
      },
      "finalMessage": "FINAL",
      "bracketRound": "",
      "title": "Georgia St. Old Dominion",
      "contestName": "",
      "url": "/game/6006124",
      "network": "",
      "home": {
        "score": "31",
        "names": {
          "char6": "GA ST",
          "short": "Georgia St.",
          "seo": "georgia-st",
          "full": "Georgia State University"
        },
        "winner": true,
        "seed": "",
        "description": "(3-5)",
        "rank": "",
        "conferences": [{
          "conferenceName": "Sun Belt",
          "conferenceSeo": "sun-belt"
        }]
      },
      "liveVideoEnabled": false,
      "startTime": "03:00PM ET",
      "startTimeEpoch": "1667070000",
      "bracketId": "",
      "gameState": "final",
      "startDate": "10-29-2022",
      "currentPeriod": "FINAL",
      "videoState": "",
      "bracketRegion": "",
      "contestClock": "0:00"
    }},
    {"game": {
      "gameID": "423118",
      "away": {
        "score": "23",
        "names": {
          "char6": "NM ST",
          "short": "New Mexico St.",
          "seo": "new-mexico-st",
          "full": "New Mexico State University"
        },
        "winner": true,
        "seed": "",
        "description": "(3-5)",
        "rank": "",
        "conferences": [{
          "conferenceName": "FBS Independent",
          "conferenceSeo": "fbs-independent"
        }]
      },
      "finalMessage": "FINAL",
      "bracketRound": "",
      "title": "Massachusetts New Mexico St.",
      "contestName": "",
      "url": "/game/6006125",
      "network": "",
      "home": {
        "score": "13",
        "names": {
          "char6": "UMASS",
          "short": "Massachusetts",
          "seo": "massachusetts",
          "full": "University of Massachusetts, Amherst"
        },
        "winner": false,
        "seed": "",
        "description": "(1-7)",
        "rank": "",
        "conferences": [{
          "conferenceName": "FBS Independent",
          "conferenceSeo": "fbs-independent"
        }]
      },
      "liveVideoEnabled": false,
      "startTime": "03:30PM ET",
      "startTimeEpoch": "1667071800",
      "bracketId": "",
      "gameState": "final",
      "startDate": "10-29-2022",
      "currentPeriod": "FINAL",
      "videoState": "",
      "bracketRegion": "",
      "contestClock": "0:00"
    }},
    {"game": {
      "gameID": "410496",
      "away": {
        "score": "45",
        "names": {
          "char6": "SMU",
          "short": "SMU",
          "seo": "smu",
          "full": "Southern Methodist University"
        },
        "winner": true,
        "seed": "",
        "description": "(4-4)",
        "rank": "",
        "conferences": [{
          "conferenceName": "AAC",
          "conferenceSeo": "aac"
        }]
      },
      "finalMessage": "FINAL",
      "bracketRound": "",
      "title": "Tulsa SMU",
      "contestName": "",
      "url": "/game/6006129",
      "network": "",
      "home": {
        "score": "34",
        "names": {
          "char6": "TULSA",
          "short": "Tulsa",
          "seo": "tulsa",
          "full": "The University of Tulsa"
        },
        "winner": false,
        "seed": "",
        "description": "(3-5)",
        "rank": "",
        "conferences": [{
          "conferenceName": "AAC",
          "conferenceSeo": "aac"
        }]
      },
      "liveVideoEnabled": false,
      "startTime": "03:30PM ET",
      "startTimeEpoch": "1667071800",
      "bracketId": "",
      "gameState": "final",
      "startDate": "10-29-2022",
      "currentPeriod": "FINAL",
      "videoState": "",
      "bracketRegion": "",
      "contestClock": "0:00"
    }},
    {"game": {
      "gameID": "409427",
      "away": {
        "score": "3",
        "names": {
          "char6": "ROBMOR",
          "short": "Robert Morris",
          "seo": "robert-morris",
          "full": "Robert Morris University"
        },
        "winner": false,
        "seed": "",
        "description": "(0-8)",
        "rank": "",
        "conferences": [{
          "conferenceName": "Big South",
          "conferenceSeo": "big-south"
        }]
      },
      "finalMessage": "FINAL",
      "bracketRound": "",
      "title": "App State Robert Morris",
      "contestName": "",
      "url": "/game/6006137",
      "network": "",
      "home": {
        "score": "42",
        "names": {
          "char6": "APP ST",
          "short": "App State",
          "seo": "appalachian-st",
          "full": "Appalachian State University"
        },
        "winner": true,
        "seed": "",
        "description": "(5-3)",
        "rank": "",
        "conferences": [{
          "conferenceName": "Sun Belt",
          "conferenceSeo": "sun-belt"
        }]
      },
      "liveVideoEnabled": false,
      "startTime": "03:30PM ET",
      "startTimeEpoch": "1667071800",
      "bracketId": "",
      "gameState": "final",
      "startDate": "10-29-2022",
      "currentPeriod": "FINAL",
      "videoState": "",
      "bracketRegion": "",
      "contestClock": "0:00"
    }},
    {"game": {
      "gameID": "409885",
      "away": {
        "score": "0",
        "names": {
          "char6": "OKLAST",
          "short": "Oklahoma St.",
          "seo": "oklahoma-st",
          "full": "Oklahoma State University"
        },
        "winner": false,
        "seed": "",
        "description": "(6-2)",
        "rank": "9",
        "conferences": [
          {
            "conferenceName": "Big 12",
            "conferenceSeo": "big-12"
          },
          {
            "conferenceName": "Top 25",
            "conferenceSeo": "top-25"
          }
        ]
      },
      "finalMessage": "FINAL",
      "bracketRound": "",
      "title": "Kansas St. Oklahoma St.",
      "contestName": "",
      "url": "/game/6006141",
      "network": "",
      "home": {
        "score": "48",
        "names": {
          "char6": "KAN ST",
          "short": "Kansas St.",
          "seo": "kansas-st",
          "full": "Kansas State University"
        },
        "winner": true,
        "seed": "",
        "description": "(6-2)",
        "rank": "22",
        "conferences": [
          {
            "conferenceName": "Big 12",
            "conferenceSeo": "big-12"
          },
          {
            "conferenceName": "Top 25",
            "conferenceSeo": "top-25"
          }
        ]
      },
      "liveVideoEnabled": false,
      "startTime": "03:30PM ET",
      "startTimeEpoch": "1667071800",
      "bracketId": "",
      "gameState": "final",
      "startDate": "10-29-2022",
      "currentPeriod": "FINAL",
      "videoState": "",
      "bracketRegion": "",
      "contestClock": "0:00"
    }},
    {"game": {
      "gameID": "410533",
      "away": {
        "score": "21",
        "names": {
          "char6": "CINCY",
          "short": "Cincinnati",
          "seo": "cincinnati",
          "full": "University of Cincinnati"
        },
        "winner": false,
        "seed": "",
        "description": "(6-2)",
        "rank": "20",
        "conferences": [
          {
            "conferenceName": "AAC",
            "conferenceSeo": "aac"
          },
          {
            "conferenceName": "Top 25",
            "conferenceSeo": "top-25"
          }
        ]
      },
      "finalMessage": "FINAL",
      "bracketRound": "",
      "title": "UCF Cincinnati",
      "contestName": "",
      "url": "/game/6006142",
      "network": "",
      "home": {
        "score": "25",
        "names": {
          "char6": "UCF",
          "short": "UCF",
          "seo": "ucf",
          "full": "University of Central Florida"
        },
        "winner": true,
        "seed": "",
        "description": "(6-2)",
        "rank": "",
        "conferences": [{
          "conferenceName": "AAC",
          "conferenceSeo": "aac"
        }]
      },
      "liveVideoEnabled": false,
      "startTime": "03:30PM ET",
      "startTimeEpoch": "1667071800",
      "bracketId": "",
      "gameState": "final",
      "startDate": "10-29-2022",
      "currentPeriod": "FINAL",
      "videoState": "",
      "bracketRegion": "",
      "contestClock": "0:00"
    }},
    {"game": {
      "gameID": "410111",
      "away": {
        "score": "26",
        "names": {
          "char6": "ILL",
          "short": "Illinois",
          "seo": "illinois",
          "full": "University of Illinois Urbana-Champaign"
        },
        "winner": true,
        "seed": "",
        "description": "(7-1)",
        "rank": "17",
        "conferences": [
          {
            "conferenceName": "Big Ten",
            "conferenceSeo": "big-ten"
          },
          {
            "conferenceName": "Top 25",
            "conferenceSeo": "top-25"
          }
        ]
      },
      "finalMessage": "FINAL",
      "bracketRound": "",
      "title": "Nebraska Illinois",
      "contestName": "",
      "url": "/game/6006143",
      "network": "",
      "home": {
        "score": "9",
        "names": {
          "char6": "NEB",
          "short": "Nebraska",
          "seo": "nebraska",
          "full": "University of Nebraska, Lincoln"
        },
        "winner": false,
        "seed": "",
        "description": "(3-5)",
        "rank": "",
        "conferences": [{
          "conferenceName": "Big Ten",
          "conferenceSeo": "big-ten"
        }]
      },
      "liveVideoEnabled": false,
      "startTime": "03:30PM ET",
      "startTimeEpoch": "1667071800",
      "bracketId": "",
      "gameState": "final",
      "startDate": "10-29-2022",
      "currentPeriod": "FINAL",
      "videoState": "",
      "bracketRegion": "",
      "contestClock": "0:00"
    }},
    {"game": {
      "gameID": "409526",
      "away": {
        "score": "42",
        "names": {
          "char6": "OREGN",
          "short": "Oregon",
          "seo": "oregon",
          "full": "University of Oregon"
        },
        "winner": true,
        "seed": "",
        "description": "(7-1)",
        "rank": "8",
        "conferences": [
          {
            "conferenceName": "Pac-12",
            "conferenceSeo": "pac-12"
          },
          {
            "conferenceName": "Top 25",
            "conferenceSeo": "top-25"
          }
        ]
      },
      "finalMessage": "FINAL",
      "bracketRound": "",
      "title": "California Oregon",
      "contestName": "",
      "url": "/game/6006150",
      "network": "",
      "home": {
        "score": "24",
        "names": {
          "char6": "CAL",
          "short": "California",
          "seo": "california",
          "full": "University of California, Berkeley"
        },
        "winner": false,
        "seed": "",
        "description": "(3-5)",
        "rank": "",
        "conferences": [{
          "conferenceName": "Pac-12",
          "conferenceSeo": "pac-12"
        }]
      },
      "liveVideoEnabled": false,
      "startTime": "03:30PM ET",
      "startTimeEpoch": "1667071800",
      "bracketId": "",
      "gameState": "final",
      "startDate": "10-29-2022",
      "currentPeriod": "FINAL",
      "videoState": "",
      "bracketRegion": "",
      "contestClock": "0:00"
    }},
    {"game": {
      "gameID": "409920",
      "away": {
        "score": "21",
        "names": {
          "char6": "WAKE",
          "short": "Wake Forest",
          "seo": "wake-forest",
          "full": "Wake Forest University"
        },
        "winner": false,
        "seed": "",
        "description": "(6-2)",
        "rank": "10",
        "conferences": [
          {
            "conferenceName": "ACC",
            "conferenceSeo": "acc"
          },
          {
            "conferenceName": "Top 25",
            "conferenceSeo": "top-25"
          }
        ]
      },
      "finalMessage": "FINAL",
      "bracketRound": "",
      "title": "Louisville Wake Forest",
      "contestName": "",
      "url": "/game/6006155",
      "network": "",
      "home": {
        "score": "48",
        "names": {
          "char6": "LOUIS",
          "short": "Louisville",
          "seo": "louisville",
          "full": "University of Louisville"
        },
        "winner": true,
        "seed": "",
        "description": "(5-3)",
        "rank": "",
        "conferences": [{
          "conferenceName": "ACC",
          "conferenceSeo": "acc"
        }]
      },
      "liveVideoEnabled": false,
      "startTime": "03:30PM ET",
      "startTimeEpoch": "1667071800",
      "bracketId": "",
      "gameState": "final",
      "startDate": "10-29-2022",
      "currentPeriod": "FINAL",
      "videoState": "",
      "bracketRegion": "",
      "contestClock": "0:00"
    }},
    {"game": {
      "gameID": "409850",
      "away": {
        "score": "13",
        "names": {
          "char6": "NWSTRN",
          "short": "Northwestern",
          "seo": "northwestern",
          "full": "Northwestern University"
        },
        "winner": false,
        "seed": "",
        "description": "(1-7)",
        "rank": "",
        "conferences": [{
          "conferenceName": "Big Ten",
          "conferenceSeo": "big-ten"
        }]
      },
      "finalMessage": "FINAL",
      "bracketRound": "",
      "title": "Iowa Northwestern",
      "contestName": "",
      "url": "/game/6006159",
      "network": "",
      "home": {
        "score": "33",
        "names": {
          "char6": "IOWA",
          "short": "Iowa",
          "seo": "iowa",
          "full": "University of Iowa"
        },
        "winner": true,
        "seed": "",
        "description": "(4-4)",
        "rank": "",
        "conferences": [{
          "conferenceName": "Big Ten",
          "conferenceSeo": "big-ten"
        }]
      },
      "liveVideoEnabled": false,
      "startTime": "03:30PM ET",
      "startTimeEpoch": "1667071800",
      "bracketId": "",
      "gameState": "final",
      "startDate": "10-29-2022",
      "currentPeriod": "FINAL",
      "videoState": "",
      "bracketRegion": "",
      "contestClock": "0:00"
    }},
    {"game": {
      "gameID": "410680",
      "away": {
        "score": "40",
        "names": {
          "char6": "NO TEX",
          "short": "North Texas",
          "seo": "north-texas",
          "full": "University of North Texas"
        },
        "winner": true,
        "seed": "",
        "description": "(5-4)",
        "rank": "",
        "conferences": [{
          "conferenceName": "C-USA",
          "conferenceSeo": "c-usa"
        }]
      },
      "finalMessage": "FINAL",
      "bracketRound": "",
      "title": "Western Ky. North Texas",
      "contestName": "",
      "url": "/game/6006160",
      "network": "",
      "home": {
        "score": "13",
        "names": {
          "char6": "W KY",
          "short": "Western Ky.",
          "seo": "western-ky",
          "full": "Western Kentucky University"
        },
        "winner": false,
        "seed": "",
        "description": "(5-4)",
        "rank": "",
        "conferences": [{
          "conferenceName": "C-USA",
          "conferenceSeo": "c-usa"
        }]
      },
      "liveVideoEnabled": false,
      "startTime": "03:30PM ET",
      "startTimeEpoch": "1667071800",
      "bracketId": "",
      "gameState": "final",
      "startDate": "10-29-2022",
      "currentPeriod": "FINAL",
      "videoState": "",
      "bracketRegion": "",
      "contestClock": "0:00"
    }},
    {"game": {
      "gameID": "410069",
      "away": {
        "score": "20",
        "names": {
          "char6": "TEMPLE",
          "short": "Temple",
          "seo": "temple",
          "full": "Temple University"
        },
        "winner": false,
        "seed": "",
        "description": "(2-6)",
        "rank": "",
        "conferences": [{
          "conferenceName": "AAC",
          "conferenceSeo": "aac"
        }]
      },
      "finalMessage": "FINAL (OT)",
      "bracketRound": "",
      "title": "Navy Temple",
      "contestName": "",
      "url": "/game/6006162",
      "network": "",
      "home": {
        "score": "27",
        "names": {
          "char6": "NAVY",
          "short": "Navy",
          "seo": "navy",
          "full": "U.S. Naval Academy"
        },
        "winner": true,
        "seed": "",
        "description": "(3-5)",
        "rank": "",
        "conferences": [{
          "conferenceName": "AAC",
          "conferenceSeo": "aac"
        }]
      },
      "liveVideoEnabled": false,
      "startTime": "03:30PM ET",
      "startTimeEpoch": "1667071800",
      "bracketId": "",
      "gameState": "final",
      "startDate": "10-29-2022",
      "currentPeriod": "FINAL (OT)",
      "videoState": "",
      "bracketRegion": "",
      "contestClock": ""
    }},
    {"game": {
      "gameID": "2279207",
      "away": {
        "score": "20",
        "names": {
          "char6": "FLA",
          "short": "Florida",
          "seo": "florida",
          "full": "University of Florida"
        },
        "winner": false,
        "seed": "",
        "description": "(4-4)",
        "rank": "",
        "conferences": [{
          "conferenceName": "SEC",
          "conferenceSeo": "sec"
        }]
      },
      "finalMessage": "FINAL",
      "bracketRound": "",
      "title": "Georgia Florida",
      "contestName": "",
      "url": "/game/6006163",
      "network": "",
      "home": {
        "score": "42",
        "names": {
          "char6": "UGA",
          "short": "Georgia",
          "seo": "georgia",
          "full": "University of Georgia"
        },
        "winner": true,
        "seed": "",
        "description": "(8-0)",
        "rank": "1",
        "conferences": [
          {
            "conferenceName": "SEC",
            "conferenceSeo": "sec"
          },
          {
            "conferenceName": "Top 25",
            "conferenceSeo": "top-25"
          }
        ]
      },
      "liveVideoEnabled": false,
      "startTime": "03:30PM ET",
      "startTimeEpoch": "1667071800",
      "bracketId": "",
      "gameState": "final",
      "startDate": "10-29-2022",
      "currentPeriod": "FINAL",
      "videoState": "",
      "bracketRegion": "",
      "contestClock": "0:00"
    }},
    {"game": {
      "gameID": "410330",
      "away": {
        "score": "23",
        "names": {
          "char6": "MIZZOU",
          "short": "Missouri",
          "seo": "missouri",
          "full": "University of Missouri, Columbia"
        },
        "winner": true,
        "seed": "",
        "description": "(4-4)",
        "rank": "",
        "conferences": [{
          "conferenceName": "SEC",
          "conferenceSeo": "sec"
        }]
      },
      "finalMessage": "FINAL",
      "bracketRound": "",
      "title": "South Carolina Missouri",
      "contestName": "",
      "url": "/game/6006128",
      "network": "",
      "home": {
        "score": "10",
        "names": {
          "char6": "S CAR",
          "short": "South Carolina",
          "seo": "south-carolina",
          "full": "University of South Carolina, Columbia"
        },
        "winner": false,
        "seed": "",
        "description": "(5-3)",
        "rank": "25",
        "conferences": [
          {
            "conferenceName": "SEC",
            "conferenceSeo": "sec"
          },
          {
            "conferenceName": "Top 25",
            "conferenceSeo": "top-25"
          }
        ]
      },
      "liveVideoEnabled": false,
      "startTime": "04:00PM ET",
      "startTimeEpoch": "1667073600",
      "bracketId": "",
      "gameState": "final",
      "startDate": "10-29-2022",
      "currentPeriod": "FINAL",
      "videoState": "",
      "bracketRegion": "",
      "contestClock": "0:00"
    }},
    {"game": {
      "gameID": "409453",
      "away": {
        "score": "31",
        "names": {
          "char6": "S ALA",
          "short": "South Alabama",
          "seo": "south-ala",
          "full": "University of South Alabama"
        },
        "winner": true,
        "seed": "",
        "description": "(6-2)",
        "rank": "",
        "conferences": [{
          "conferenceName": "Sun Belt",
          "conferenceSeo": "sun-belt"
        }]
      },
      "finalMessage": "FINAL",
      "bracketRound": "",
      "title": "Arkansas St. South Alabama",
      "contestName": "",
      "url": "/game/6006151",
      "network": "",
      "home": {
        "score": "3",
        "names": {
          "char6": "ARK ST",
          "short": "Arkansas St.",
          "seo": "arkansas-st",
          "full": "Arkansas State University"
        },
        "winner": false,
        "seed": "",
        "description": "(2-7)",
        "rank": "",
        "conferences": [{
          "conferenceName": "Sun Belt",
          "conferenceSeo": "sun-belt"
        }]
      },
      "liveVideoEnabled": false,
      "startTime": "04:00PM ET",
      "startTimeEpoch": "1667073600",
      "bracketId": "",
      "gameState": "final",
      "startDate": "10-29-2022",
      "currentPeriod": "FINAL",
      "videoState": "",
      "bracketRegion": "",
      "contestClock": "0:00"
    }},
    {"game": {
      "gameID": "409433",
      "away": {
        "score": "45",
        "names": {
          "char6": "USC",
          "short": "Southern California",
          "seo": "southern-california",
          "full": "University of Southern California"
        },
        "winner": true,
        "seed": "",
        "description": "(7-1)",
        "rank": "10",
        "conferences": [
          {
            "conferenceName": "Pac-12",
            "conferenceSeo": "pac-12"
          },
          {
            "conferenceName": "Top 25",
            "conferenceSeo": "top-25"
          }
        ]
      },
      "finalMessage": "FINAL",
      "bracketRound": "",
      "title": "Arizona Southern California",
      "contestName": "",
      "url": "/game/6006148",
      "network": "",
      "home": {
        "score": "37",
        "names": {
          "char6": "ARIZ",
          "short": "Arizona",
          "seo": "arizona",
          "full": "University of Arizona"
        },
        "winner": false,
        "seed": "",
        "description": "(3-5)",
        "rank": "",
        "conferences": [{
          "conferenceName": "Pac-12",
          "conferenceSeo": "pac-12"
        }]
      },
      "liveVideoEnabled": false,
      "startTime": "06:00PM ET",
      "startTimeEpoch": "1667080800",
      "bracketId": "",
      "gameState": "final",
      "startDate": "10-29-2022",
      "currentPeriod": "FINAL",
      "videoState": "",
      "bracketRegion": "",
      "contestClock": "0:00"
    }},
    {"game": {
      "gameID": "410435",
      "away": {
        "score": "6",
        "names": {
          "char6": "UK",
          "short": "Kentucky",
          "seo": "kentucky",
          "full": "University of Kentucky"
        },
        "winner": false,
        "seed": "",
        "description": "(5-3)",
        "rank": "19",
        "conferences": [
          {
            "conferenceName": "SEC",
            "conferenceSeo": "sec"
          },
          {
            "conferenceName": "Top 25",
            "conferenceSeo": "top-25"
          }
        ]
      },
      "finalMessage": "FINAL",
      "bracketRound": "",
      "title": "Tennessee Kentucky",
      "contestName": "",
      "url": "/game/6006140",
      "network": "",
      "home": {
        "score": "44",
        "names": {
          "char6": "TENN",
          "short": "Tennessee",
          "seo": "tennessee",
          "full": "University of Tennessee, Knoxville"
        },
        "winner": true,
        "seed": "",
        "description": "(8-0)",
        "rank": "3",
        "conferences": [
          {
            "conferenceName": "SEC",
            "conferenceSeo": "sec"
          },
          {
            "conferenceName": "Top 25",
            "conferenceSeo": "top-25"
          }
        ]
      },
      "liveVideoEnabled": false,
      "startTime": "07:00PM ET",
      "startTimeEpoch": "1667084400",
      "bracketId": "",
      "gameState": "final",
      "startDate": "10-29-2022",
      "currentPeriod": "FINAL",
      "videoState": "",
      "bracketRegion": "",
      "contestClock": "0:00"
    }},
    {"game": {
      "gameID": "409941",
      "away": {
        "score": "24",
        "names": {
          "char6": "CO CAR",
          "short": "Coastal Carolina",
          "seo": "coastal-caro",
          "full": "Coastal Carolina University"
        },
        "winner": true,
        "seed": "",
        "description": "(7-1)",
        "rank": "",
        "conferences": [{
          "conferenceName": "Sun Belt",
          "conferenceSeo": "sun-belt"
        }]
      },
      "finalMessage": "FINAL",
      "bracketRound": "",
      "title": "Marshall Coastal Carolina",
      "contestName": "",
      "url": "/game/6006154",
      "network": "",
      "home": {
        "score": "13",
        "names": {
          "char6": "MARSH",
          "short": "Marshall",
          "seo": "marshall",
          "full": "Marshall University"
        },
        "winner": false,
        "seed": "",
        "description": "(4-4)",
        "rank": "",
        "conferences": [{
          "conferenceName": "Sun Belt",
          "conferenceSeo": "sun-belt"
        }]
      },
      "liveVideoEnabled": false,
      "startTime": "07:00PM ET",
      "startTimeEpoch": "1667084400",
      "bracketId": "",
      "gameState": "final",
      "startDate": "10-29-2022",
      "currentPeriod": "FINAL",
      "videoState": "",
      "bracketRegion": "",
      "contestClock": "0:00"
    }},
    {"game": {
      "gameID": "409504",
      "away": {
        "score": "10",
        "names": {
          "char6": "CO ST",
          "short": "Colorado St.",
          "seo": "colorado-st",
          "full": "Colorado State University"
        },
        "winner": false,
        "seed": "",
        "description": "(2-6)",
        "rank": "",
        "conferences": [{
          "conferenceName": "Mountain West",
          "conferenceSeo": "mountain-west"
        }]
      },
      "finalMessage": "FINAL",
      "bracketRound": "",
      "title": "Boise St. Colorado St.",
      "contestName": "",
      "url": "/game/6006156",
      "network": "",
      "home": {
        "score": "49",
        "names": {
          "char6": "BOISE",
          "short": "Boise St.",
          "seo": "boise-st",
          "full": "Boise State University"
        },
        "winner": true,
        "seed": "",
        "description": "(6-2)",
        "rank": "",
        "conferences": [{
          "conferenceName": "Mountain West",
          "conferenceSeo": "mountain-west"
        }]
      },
      "liveVideoEnabled": false,
      "startTime": "07:00PM ET",
      "startTimeEpoch": "1667084400",
      "bracketId": "",
      "gameState": "final",
      "startDate": "10-29-2022",
      "currentPeriod": "FINAL",
      "videoState": "",
      "bracketRegion": "",
      "contestClock": "0:00"
    }},
    {"game": {
      "gameID": "409696",
      "away": {
        "score": "17",
        "names": {
          "char6": "UAB",
          "short": "UAB",
          "seo": "uab",
          "full": "University of Alabama at Birmingham"
        },
        "winner": false,
        "seed": "",
        "description": "(4-4)",
        "rank": "",
        "conferences": [{
          "conferenceName": "C-USA",
          "conferenceSeo": "c-usa"
        }]
      },
      "finalMessage": "FINAL",
      "bracketRound": "",
      "title": "Fla. Atlantic UAB",
      "contestName": "",
      "url": "/game/6006166",
      "network": "",
      "home": {
        "score": "24",
        "names": {
          "char6": "FAU",
          "short": "Fla. Atlantic",
          "seo": "fla-atlantic",
          "full": "Florida Atlantic University"
        },
        "winner": true,
        "seed": "",
        "description": "(4-5)",
        "rank": "",
        "conferences": [{
          "conferenceName": "C-USA",
          "conferenceSeo": "c-usa"
        }]
      },
      "liveVideoEnabled": false,
      "startTime": "07:00PM ET",
      "startTimeEpoch": "1667084400",
      "bracketId": "",
      "gameState": "final",
      "startDate": "10-29-2022",
      "currentPeriod": "FINAL",
      "videoState": "",
      "bracketRegion": "",
      "contestClock": "0:00"
    }},
    {"game": {
      "gameID": "410448",
      "away": {
        "score": "45",
        "names": {
          "char6": "BAYLOR",
          "short": "Baylor",
          "seo": "baylor",
          "full": "Baylor University"
        },
        "winner": true,
        "seed": "",
        "description": "(5-3)",
        "rank": "",
        "conferences": [{
          "conferenceName": "Big 12",
          "conferenceSeo": "big-12"
        }]
      },
      "finalMessage": "FINAL",
      "bracketRound": "",
      "title": "Texas Tech Baylor",
      "contestName": "",
      "url": "/game/6006126",
      "network": "",
      "home": {
        "score": "17",
        "names": {
          "char6": "TXTECH",
          "short": "Texas Tech",
          "seo": "texas-tech",
          "full": "Texas Tech University"
        },
        "winner": false,
        "seed": "",
        "description": "(4-4)",
        "rank": "",
        "conferences": [{
          "conferenceName": "Big 12",
          "conferenceSeo": "big-12"
        }]
      },
      "liveVideoEnabled": false,
      "startTime": "07:30PM ET",
      "startTimeEpoch": "1667086200",
      "bracketId": "",
      "gameState": "final",
      "startDate": "10-29-2022",
      "currentPeriod": "FINAL",
      "videoState": "",
      "bracketRegion": "",
      "contestClock": "0:00"
    }},
    {"game": {
      "gameID": "409030",
      "away": {
        "score": "31",
        "names": {
          "char6": "MISS",
          "short": "Ole Miss",
          "seo": "ole-miss",
          "full": "University of Mississippi"
        },
        "winner": true,
        "seed": "",
        "description": "(8-1)",
        "rank": "15",
        "conferences": [
          {
            "conferenceName": "SEC",
            "conferenceSeo": "sec"
          },
          {
            "conferenceName": "Top 25",
            "conferenceSeo": "top-25"
          }
        ]
      },
      "finalMessage": "FINAL",
      "bracketRound": "",
      "title": "Texas A&M Ole Miss",
      "contestName": "",
      "url": "/game/6006139",
      "network": "",
      "home": {
        "score": "28",
        "names": {
          "char6": "TX A&M",
          "short": "Texas A&M",
          "seo": "texas-am",
          "full": "Texas A&M University, College Station"
        },
        "winner": false,
        "seed": "",
        "description": "(3-5)",
        "rank": "",
        "conferences": [{
          "conferenceName": "SEC",
          "conferenceSeo": "sec"
        }]
      },
      "liveVideoEnabled": false,
      "startTime": "07:30PM ET",
      "startTimeEpoch": "1667086200",
      "bracketId": "",
      "gameState": "final",
      "startDate": "10-29-2022",
      "currentPeriod": "FINAL",
      "videoState": "",
      "bracketRegion": "",
      "contestClock": "0:00"
    }},
    {"game": {
      "gameID": "409588",
      "away": {
        "score": "42",
        "names": {
          "char6": "AZ ST",
          "short": "Arizona St.",
          "seo": "arizona-st",
          "full": "Arizona State University"
        },
        "winner": true,
        "seed": "",
        "description": "(3-5)",
        "rank": "",
        "conferences": [{
          "conferenceName": "Pac-12",
          "conferenceSeo": "pac-12"
        }]
      },
      "finalMessage": "FINAL",
      "bracketRound": "",
      "title": "Colorado Arizona St.",
      "contestName": "",
      "url": "/game/6006145",
      "network": "",
      "home": {
        "score": "34",
        "names": {
          "char6": "COLO",
          "short": "Colorado",
          "seo": "colorado",
          "full": "University of Colorado, Boulder"
        },
        "winner": false,
        "seed": "",
        "description": "(1-7)",
        "rank": "",
        "conferences": [{
          "conferenceName": "Pac-12",
          "conferenceSeo": "pac-12"
        }]
      },
      "liveVideoEnabled": false,
      "startTime": "07:30PM ET",
      "startTimeEpoch": "1667086200",
      "bracketId": "",
      "gameState": "final",
      "startDate": "10-29-2022",
      "currentPeriod": "FINAL",
      "videoState": "",
      "bracketRegion": "",
      "contestClock": "0:00"
    }},
    {"game": {
      "gameID": "409971",
      "away": {
        "score": "7",
        "names": {
          "char6": "MICHST",
          "short": "Michigan St.",
          "seo": "michigan-st",
          "full": "Michigan State University"
        },
        "winner": false,
        "seed": "",
        "description": "(3-5)",
        "rank": "",
        "conferences": [{
          "conferenceName": "Big Ten",
          "conferenceSeo": "big-ten"
        }]
      },
      "finalMessage": "FINAL",
      "bracketRound": "",
      "title": "Michigan Michigan St.",
      "contestName": "",
      "url": "/game/6006147",
      "network": "",
      "home": {
        "score": "29",
        "names": {
          "char6": "MICH",
          "short": "Michigan",
          "seo": "michigan",
          "full": "University of Michigan"
        },
        "winner": true,
        "seed": "",
        "description": "(8-0)",
        "rank": "4",
        "conferences": [
          {
            "conferenceName": "Big Ten",
            "conferenceSeo": "big-ten"
          },
          {
            "conferenceName": "Top 25",
            "conferenceSeo": "top-25"
          }
        ]
      },
      "liveVideoEnabled": false,
      "startTime": "07:30PM ET",
      "startTimeEpoch": "1667086200",
      "bracketId": "",
      "gameState": "final",
      "startDate": "10-29-2022",
      "currentPeriod": "FINAL",
      "videoState": "",
      "bracketRegion": "",
      "contestClock": "0:00"
    }},
    {"game": {
      "gameID": "410560",
      "away": {
        "score": "24",
        "names": {
          "char6": "PITT",
          "short": "Pittsburgh",
          "seo": "pittsburgh",
          "full": "University of Pittsburgh"
        },
        "winner": false,
        "seed": "",
        "description": "(4-4)",
        "rank": "",
        "conferences": [{
          "conferenceName": "ACC",
          "conferenceSeo": "acc"
        }]
      },
      "finalMessage": "FINAL",
      "bracketRound": "",
      "title": "North Carolina Pittsburgh",
      "contestName": "",
      "url": "/game/6006133",
      "network": "",
      "home": {
        "score": "42",
        "names": {
          "char6": "UNC",
          "short": "North Carolina",
          "seo": "north-carolina",
          "full": "University of North Carolina, Chapel Hill"
        },
        "winner": true,
        "seed": "",
        "description": "(7-1)",
        "rank": "21",
        "conferences": [
          {
            "conferenceName": "ACC",
            "conferenceSeo": "acc"
          },
          {
            "conferenceName": "Top 25",
            "conferenceSeo": "top-25"
          }
        ]
      },
      "liveVideoEnabled": false,
      "startTime": "08:00PM ET",
      "startTimeEpoch": "1667088000",
      "bracketId": "",
      "gameState": "final",
      "startDate": "10-29-2022",
      "currentPeriod": "FINAL",
      "videoState": "",
      "bracketRegion": "",
      "contestClock": "0:00"
    }},
    {"game": {
      "gameID": "410596",
      "away": {
        "score": "24",
        "names": {
          "char6": "MIDTEN",
          "short": "Middle Tenn.",
          "seo": "middle-tenn",
          "full": "Middle Tennessee State University"
        },
        "winner": true,
        "seed": "",
        "description": "(4-4)",
        "rank": "",
        "conferences": [{
          "conferenceName": "C-USA",
          "conferenceSeo": "c-usa"
        }]
      },
      "finalMessage": "FINAL",
      "bracketRound": "",
      "title": "UTEP Middle Tenn.",
      "contestName": "",
      "url": "/game/6006165",
      "network": "",
      "home": {
        "score": "13",
        "names": {
          "char6": "UTEP",
          "short": "UTEP",
          "seo": "utep",
          "full": "University of Texas at El Paso"
        },
        "winner": false,
        "seed": "",
        "description": "(4-5)",
        "rank": "",
        "conferences": [{
          "conferenceName": "C-USA",
          "conferenceSeo": "c-usa"
        }]
      },
      "liveVideoEnabled": false,
      "startTime": "09:00PM ET",
      "startTimeEpoch": "1667091600",
      "bracketId": "",
      "gameState": "final",
      "startDate": "10-29-2022",
      "currentPeriod": "FINAL",
      "videoState": "",
      "bracketRegion": "",
      "contestClock": "0:00"
    }},
    {"game": {
      "gameID": "410540",
      "away": {
        "score": "13",
        "names": {
          "char6": "STAN",
          "short": "Stanford",
          "seo": "stanford",
          "full": "Stanford University"
        },
        "winner": false,
        "seed": "",
        "description": "(3-5)",
        "rank": "",
        "conferences": [{
          "conferenceName": "Pac-12",
          "conferenceSeo": "pac-12"
        }]
      },
      "finalMessage": "FINAL",
      "bracketRound": "",
      "title": "UCLA Stanford",
      "contestName": "",
      "url": "/game/6006132",
      "network": "",
      "home": {
        "score": "38",
        "names": {
          "char6": "UCLA",
          "short": "UCLA",
          "seo": "ucla",
          "full": "University of California, Los Angeles"
        },
        "winner": true,
        "seed": "",
        "description": "(7-1)",
        "rank": "12",
        "conferences": [
          {
            "conferenceName": "Pac-12",
            "conferenceSeo": "pac-12"
          },
          {
            "conferenceName": "Top 25",
            "conferenceSeo": "top-25"
          }
        ]
      },
      "liveVideoEnabled": false,
      "startTime": "10:30PM ET",
      "startTimeEpoch": "1667097000",
      "bracketId": "",
      "gameState": "final",
      "startDate": "10-29-2022",
      "currentPeriod": "FINAL",
      "videoState": "",
      "bracketRegion": "",
      "contestClock": "0:00"
    }},
    {"game": {
      "gameID": "409716",
      "away": {
        "score": "28",
        "names": {
          "char6": "SDSU",
          "short": "San Diego St.",
          "seo": "san-diego-st",
          "full": "San Diego State University"
        },
        "winner": false,
        "seed": "",
        "description": "(4-4)",
        "rank": "",
        "conferences": [{
          "conferenceName": "Mountain West",
          "conferenceSeo": "mountain-west"
        }]
      },
      "finalMessage": "FINAL",
      "bracketRound": "",
      "title": "Fresno St. San Diego St.",
      "contestName": "",
      "url": "/game/6006149",
      "network": "",
      "home": {
        "score": "32",
        "names": {
          "char6": "FRESNO",
          "short": "Fresno St.",
          "seo": "fresno-st",
          "full": "California State University, Fresno"
        },
        "winner": true,
        "seed": "",
        "description": "(4-4)",
        "rank": "",
        "conferences": [{
          "conferenceName": "Mountain West",
          "conferenceSeo": "mountain-west"
        }]
      },
      "liveVideoEnabled": false,
      "startTime": "10:30PM ET",
      "startTimeEpoch": "1667097000",
      "bracketId": "",
      "gameState": "final",
      "startDate": "10-29-2022",
      "currentPeriod": "FINAL",
      "videoState": "",
      "bracketRegion": "",
      "contestClock": "0:00"
    }},
    {"game": {
      "gameID": "410370",
      "away": {
        "score": "28",
        "names": {
          "char6": "NEVADA",
          "short": "Nevada",
          "seo": "nevada",
          "full": "University of Nevada, Reno"
        },
        "winner": false,
        "seed": "",
        "description": "(2-7)",
        "rank": "",
        "conferences": [{
          "conferenceName": "Mountain West",
          "conferenceSeo": "mountain-west"
        }]
      },
      "finalMessage": "FINAL",
      "bracketRound": "",
      "title": "San Jose St. Nevada",
      "contestName": "",
      "url": "/game/6006167",
      "network": "",
      "home": {
        "score": "35",
        "names": {
          "char6": "SJSU",
          "short": "San Jose St.",
          "seo": "san-jose-st",
          "full": "San Jose State University"
        },
        "winner": true,
        "seed": "",
        "description": "(5-2)",
        "rank": "",
        "conferences": [{
          "conferenceName": "Mountain West",
          "conferenceSeo": "mountain-west"
        }]
      },
      "liveVideoEnabled": false,
      "startTime": "10:30PM ET",
      "startTimeEpoch": "1667097000",
      "bracketId": "",
      "gameState": "final",
      "startDate": "10-29-2022",
      "currentPeriod": "FINAL",
      "videoState": "",
      "bracketRegion": "",
      "contestClock": "0:00"
    }},
    {"game": {
      "gameID": "409787",
      "away": {
        "score": "27",
        "names": {
          "char6": "WYO",
          "short": "Wyoming",
          "seo": "wyoming",
          "full": "University of Wyoming"
        },
        "winner": true,
        "seed": "",
        "description": "(6-3)",
        "rank": "",
        "conferences": [{
          "conferenceName": "Mountain West",
          "conferenceSeo": "mountain-west"
        }]
      },
      "finalMessage": "FINAL",
      "bracketRound": "",
      "title": "Hawaii Wyoming",
      "contestName": "",
      "url": "/game/6006134",
      "network": "",
      "home": {
        "score": "20",
        "names": {
          "char6": "HAWAII",
          "short": "Hawaii",
          "seo": "hawaii",
          "full": "University of Hawaii, Manoa"
        },
        "winner": false,
        "seed": "",
        "description": "(2-7)",
        "rank": "",
        "conferences": [{
          "conferenceName": "Mountain West",
          "conferenceSeo": "mountain-west"
        }]
      },
      "liveVideoEnabled": false,
      "startTime": "TBA",
      "startTimeEpoch": "1667102400",
      "bracketId": "",
      "gameState": "final",
      "startDate": "10-30-2022",
      "currentPeriod": "FINAL",
      "videoState": "",
      "bracketRegion": "",
      "contestClock": "0:00"
    }}
  ]
}