{
  "LouisianaLafayette vs ArkansasState": {
    "stadium": "CentennialBankStadium-Jonesboro-AR",
    "LouisianaLafayette": {
      "points": 27,
      "1st downs": 22,
      "rushing 1st downs": 10,
      "passing 1st downs": 11,
      "penalty 1st downs": 1,
      "rushing yards": 232,
      "rushing attempts": 34,
      "passing yards": 253,
      "passing attempts": 44,
      "passing completions": 17,
      "passing interceptions": 2,
      "total yards": 485,
      "total plays": 78,
      "fumbles": 0,
      "fumbles lost": 0,
      "penalties": 3,
      "penalty yards": 32,
      "punts": 6,
      "punt yards": 307,
      "punt returns": 0,
      "punt return yards": 0,
      "kickoff returns": 3,
      "kickoff return yards": 34,
      "interception returns": 1,
      "interception return yards": 16,
      "3rd down conversions": 6,
      "3rd down attempts": 17,
      "4th down conversions": 2,
      "4th down attempts": 4
    },
    "ArkansasState": {
      "points": 37,
      "1st downs": 23,
      "rushing 1st downs": 14,
      "passing 1st downs": 6,
      "penalty 1st downs": 3,
      "rushing yards": 306,
      "rushing attempts": 52,
      "passing yards": 129,
      "passing attempts": 20,
      "passing completions": 9,
      "passing interceptions": 1,
      "total yards": 435,
      "total plays": 72,
      "fumbles": 0,
      "fumbles lost": 0,
      "penalties": 3,
      "penalty yards": 20,
      "punts": 6,
      "punt yards": 290,
      "punt returns": 1,
      "punt return yards": 12,
      "kickoff returns": 4,
      "kickoff return yards": 111,
      "interception returns": 2,
      "interception return yards": 30,
      "3rd down conversions": 5,
      "3rd down attempts": 13,
      "4th down conversions": 0,
      "4th down attempts": 0
    }
  },
  "Temple vs EastCarolina": {
    "stadium": "BagwellFieldatDowdy\u2013FicklenStadium-Greenville-NC",
    "Temple": {
      "points": 24,
      "1st downs": 17,
      "rushing 1st downs": 5,
      "passing 1st downs": 9,
      "penalty 1st downs": 3,
      "rushing yards": 72,
      "rushing attempts": 25,
      "passing yards": 250,
      "passing attempts": 36,
      "passing completions": 19,
      "passing interceptions": 0,
      "total yards": 322,
      "total plays": 61,
      "fumbles": 0,
      "fumbles lost": 0,
      "penalties": 12,
      "penalty yards": 114,
      "punts": 5,
      "punt yards": 248,
      "punt returns": 1,
      "punt return yards": 14,
      "kickoff returns": 2,
      "kickoff return yards": 42,
      "interception returns": 1,
      "interception return yards": 26,
      "3rd down conversions": 4,
      "3rd down attempts": 13,
      "4th down conversions": 1,
      "4th down attempts": 1
    },
    "EastCarolina": {
      "points": 14,
      "1st downs": 25,
      "rushing 1st downs": 6,
      "passing 1st downs": 16,
      "penalty 1st downs": 3,
      "rushing yards": 95,
      "rushing attempts": 35,
      "passing yards": 283,
      "passing attempts": 53,
      "passing completions": 33,
      "passing interceptions": 1,
      "total yards": 378,
      "total plays": 88,
      "fumbles": 1,
      "fumbles lost": 1,
      "penalties": 9,
      "penalty yards": 99,
      "punts": 4,
      "punt yards": 155,
      "punt returns": 1,
      "punt return yards": 24,
      "kickoff returns": 1,
      "kickoff return yards": 23,
      "interception returns": 0,
      "interception return yards": 0,
      "3rd down conversions": 10,
      "3rd down attempts": 20,
      "4th down conversions": 2,
      "4th down attempts": 2
    }
  },
  "GeorgiaSouthern vs AppalachianState": {
    "stadium": "KiddBrewerStadium-Boone-NC",
    "GeorgiaSouthern": {
      "points": 13,
      "1st downs": 13,
      "rushing 1st downs": 11,
      "passing 1st downs": 2,
      "penalty 1st downs": 0,
      "rushing yards": 188,
      "rushing attempts": 38,
      "passing yards": 64,
      "passing attempts": 13,
      "passing completions": 5,
      "passing interceptions": 2,
      "total yards": 252,
      "total plays": 51,
      "fumbles": 0,
      "fumbles lost": 0,
      "penalties": 4,
      "penalty yards": 26,
      "punts": 5,
      "punt yards": 218,
      "punt returns": 2,
      "punt return yards": 8,
      "kickoff returns": 2,
      "kickoff return yards": 35,
      "interception returns": 0,
      "interception return yards": 0,
      "3rd down conversions": 4,
      "3rd down attempts": 12,
      "4th down conversions": 1,
      "4th down attempts": 1
    },
    "AppalachianState": {
      "points": 31,
      "1st downs": 22,
      "rushing 1st downs": 11,
      "passing 1st downs": 11,
      "penalty 1st downs": 0,
      "rushing yards": 231,
      "rushing attempts": 48,
      "passing yards": 202,
      "passing attempts": 20,
      "passing completions": 14,
      "passing interceptions": 0,
      "total yards": 433,
      "total plays": 68,
      "fumbles": 0,
      "fumbles lost": 0,
      "penalties": 5,
      "penalty yards": 40,
      "punts": 4,
      "punt yards": 192,
      "punt returns": 4,
      "punt return yards": 0,
      "kickoff returns": 1,
      "kickoff return yards": 0,
      "interception returns": 2,
      "interception return yards": 19,
      "3rd down conversions": 6,
      "3rd down attempts": 12,
      "4th down conversions": 1,
      "4th down attempts": 1
    }
  },
  "California vs UCLA": {
    "stadium": "RoseBowl-Pasadena-CA",
    "California": {
      "points": 24,
      "1st downs": 25,
      "rushing 1st downs": 8,
      "passing 1st downs": 16,
      "penalty 1st downs": 1,
      "rushing yards": 131,
      "rushing attempts": 35,
      "passing yards": 295,
      "passing attempts": 53,
      "passing completions": 32,
      "passing interceptions": 0,
      "total yards": 426,
      "total plays": 88,
      "fumbles": 0,
      "fumbles lost": 0,
      "penalties": 5,
      "penalty yards": 37,
      "punts": 5,
      "punt yards": 208,
      "punt returns": 0,
      "punt return yards": 0,
      "kickoff returns": 1,
      "kickoff return yards": 14,
      "interception returns": 0,
      "interception return yards": 0,
      "3rd down conversions": 8,
      "3rd down attempts": 19,
      "4th down conversions": 3,
      "4th down attempts": 5
    },
    "UCLA": {
      "points": 40,
      "1st downs": 31,
      "rushing 1st downs": 13,
      "passing 1st downs": 17,
      "penalty 1st downs": 1,
      "rushing yards": 174,
      "rushing attempts": 42,
      "passing yards": 399,
      "passing attempts": 48,
      "passing completions": 34,
      "passing interceptions": 0,
      "total yards": 573,
      "total plays": 90,
      "fumbles": 1,
      "fumbles lost": 1,
      "penalties": 9,
      "penalty yards": 74,
      "punts": 3,
      "punt yards": 98,
      "punt returns": 1,
      "punt return yards": 12,
      "kickoff returns": 1,
      "kickoff return yards": 20,
      "interception returns": 0,
      "interception return yards": 0,
      "3rd down conversions": 9,
      "3rd down attempts": 16,
      "4th down conversions": 1,
      "4th down attempts": 1
    }
  },
  "Memphis vs Tulsa": {
    "stadium": "SkellyFieldatHAChapmanStadium-Tulsa-OK",
    "Memphis": {
      "points": 66,
      "1st downs": 36,
      "rushing 1st downs": 11,
      "passing 1st downs": 18,
      "penalty 1st downs": 7,
      "rushing yards": 257,
      "rushing attempts": 52,
      "passing yards": 447,
      "passing attempts": 44,
      "passing completions": 32,
      "passing interceptions": 0,
      "total yards": 704,
      "total plays": 96,
      "fumbles": 1,
      "fumbles lost": 1,
      "penalties": 12,
      "penalty yards": 120,
      "punts": 6,
      "punt yards": 264,
      "punt returns": 1,
      "punt return yards": 1,
      "kickoff returns": 3,
      "kickoff return yards": 65,
      "interception returns": 1,
      "interception return yards": 0,
      "3rd down conversions": 9,
      "3rd down attempts": 18,
      "4th down conversions": 1,
      "4th down attempts": 1
    },
    "Tulsa": {
      "points": 42,
      "1st downs": 28,
      "rushing 1st downs": 8,
      "passing 1st downs": 13,
      "penalty 1st downs": 7,
      "rushing yards": 113,
      "rushing attempts": 45,
      "passing yards": 421,
      "passing attempts": 36,
      "passing completions": 24,
      "passing interceptions": 1,
      "total yards": 534,
      "total plays": 81,
      "fumbles": 2,
      "fumbles lost": 2,
      "penalties": 11,
      "penalty yards": 76,
      "punts": 7,
      "punt yards": 256,
      "punt returns": 1,
      "punt return yards": 27,
      "kickoff returns": 0,
      "kickoff return yards": 0,
      "interception returns": 0,
      "interception return yards": 0,
      "3rd down conversions": 5,
      "3rd down attempts": 15,
      "4th down conversions": 0,
      "4th down attempts": 1
    }
  },
  "UtahState vs SanDiegoState": {
    "stadium": "QualcommStadium-SanDiego-CA",
    "UtahState": {
      "points": 14,
      "1st downs": 16,
      "rushing 1st downs": 8,
      "passing 1st downs": 4,
      "penalty 1st downs": 4,
      "rushing yards": 144,
      "rushing attempts": 36,
      "passing yards": 95,
      "passing attempts": 20,
      "passing completions": 9,
      "passing interceptions": 1,
      "total yards": 239,
      "total plays": 56,
      "fumbles": 4,
      "fumbles lost": 3,
      "penalties": 5,
      "penalty yards": 55,
      "punts": 6,
      "punt yards": 260,
      "punt returns": 2,
      "punt return yards": 7,
      "kickoff returns": 4,
      "kickoff return yards": 88,
      "interception returns": 0,
      "interception return yards": 0,
      "3rd down conversions": 3,
      "3rd down attempts": 11,
      "4th down conversions": 1,
      "4th down attempts": 2
    },
    "SanDiegoState": {
      "points": 48,
      "1st downs": 19,
      "rushing 1st downs": 12,
      "passing 1st downs": 4,
      "penalty 1st downs": 3,
      "rushing yards": 336,
      "rushing attempts": 61,
      "passing yards": 93,
      "passing attempts": 10,
      "passing completions": 6,
      "passing interceptions": 0,
      "total yards": 429,
      "total plays": 71,
      "fumbles": 0,
      "fumbles lost": 0,
      "penalties": 6,
      "penalty yards": 60,
      "punts": 5,
      "punt yards": 179,
      "punt returns": 0,
      "punt return yards": 0,
      "kickoff returns": 2,
      "kickoff return yards": 43,
      "interception returns": 1,
      "interception return yards": 8,
      "3rd down conversions": 8,
      "3rd down attempts": 16,
      "4th down conversions": 0,
      "4th down attempts": 0
    }
  },
  "Auburn vs Arkansas": {
    "stadium": "DonaldWReynoldsRazorbackStadium-Fayetteville-AR",
    "Auburn": {
      "points": 46,
      "1st downs": 22,
      "rushing 1st downs": 8,
      "passing 1st downs": 13,
      "penalty 1st downs": 1,
      "rushing yards": 162,
      "rushing attempts": 52,
      "passing yards": 254,
      "passing attempts": 34,
      "passing completions": 19,
      "passing interceptions": 0,
      "total yards": 416,
      "total plays": 86,
      "fumbles": 1,
      "fumbles lost": 0,
      "penalties": 2,
      "penalty yards": 25,
      "punts": 6,
      "punt yards": 217,
      "punt returns": 0,
      "punt return yards": 0,
      "kickoff returns": 3,
      "kickoff return yards": 81,
      "interception returns": 1,
      "interception return yards": 0,
      "3rd down conversions": 8,
      "3rd down attempts": 17,
      "4th down conversions": 2,
      "4th down attempts": 3
    },
    "Arkansas": {
      "points": 54,
      "1st downs": 29,
      "rushing 1st downs": 14,
      "passing 1st downs": 14,
      "penalty 1st downs": 1,
      "rushing yards": 213,
      "rushing attempts": 49,
      "passing yards": 244,
      "passing attempts": 32,
      "passing completions": 20,
      "passing interceptions": 1,
      "total yards": 457,
      "total plays": 81,
      "fumbles": 2,
      "fumbles lost": 0,
      "penalties": 3,
      "penalty yards": 25,
      "punts": 4,
      "punt yards": 170,
      "punt returns": 1,
      "punt return yards": 4,
      "kickoff returns": 1,
      "kickoff return yards": 7,
      "interception returns": 0,
      "interception return yards": 0,
      "3rd down conversions": 9,
      "3rd down attempts": 16,
      "4th down conversions": 2,
      "4th down attempts": 2
    }
  },
  "Northwestern vs Nebraska": {
    "stadium": "MemorialStadiumLincoln-NE-Lincoln",
    "Northwestern": {
      "points": 30,
      "1st downs": 16,
      "rushing 1st downs": 5,
      "passing 1st downs": 8,
      "penalty 1st downs": 3,
      "rushing yards": 156,
      "rushing attempts": 28,
      "passing yards": 177,
      "passing attempts": 28,
      "passing completions": 13,
      "passing interceptions": 0,
      "total yards": 333,
      "total plays": 56,
      "fumbles": 0,
      "fumbles lost": 0,
      "penalties": 5,
      "penalty yards": 58,
      "punts": 4,
      "punt yards": 151,
      "punt returns": 2,
      "punt return yards": 27,
      "kickoff returns": 5,
      "kickoff return yards": 120,
      "interception returns": 1,
      "interception return yards": 72,
      "3rd down conversions": 5,
      "3rd down attempts": 13,
      "4th down conversions": 0,
      "4th down attempts": 0
    },
    "Nebraska": {
      "points": 28,
      "1st downs": 22,
      "rushing 1st downs": 6,
      "passing 1st downs": 13,
      "penalty 1st downs": 3,
      "rushing yards": 82,
      "rushing attempts": 38,
      "passing yards": 291,
      "passing attempts": 48,
      "passing completions": 24,
      "passing interceptions": 1,
      "total yards": 373,
      "total plays": 86,
      "fumbles": 0,
      "fumbles lost": 0,
      "penalties": 6,
      "penalty yards": 64,
      "punts": 6,
      "punt yards": 304,
      "punt returns": 1,
      "punt return yards": -1,
      "kickoff returns": 3,
      "kickoff return yards": 38,
      "interception returns": 0,
      "interception return yards": 0,
      "3rd down conversions": 9,
      "3rd down attempts": 20,
      "4th down conversions": 1,
      "4th down attempts": 1
    }
  },
  "NorthCarolinaState vs WakeForest": {
    "stadium": "BBTField-WinstonSalem-NC",
    "NorthCarolinaState": {
      "points": 35,
      "1st downs": 19,
      "rushing 1st downs": 9,
      "passing 1st downs": 8,
      "penalty 1st downs": 2,
      "rushing yards": 248,
      "rushing attempts": 30,
      "passing yards": 227,
      "passing attempts": 34,
      "passing completions": 20,
      "passing interceptions": 0,
      "total yards": 475,
      "total plays": 64,
      "fumbles": 0,
      "fumbles lost": 0,
      "penalties": 6,
      "penalty yards": 46,
      "punts": 6,
      "punt yards": 267,
      "punt returns": 3,
      "punt return yards": 51,
      "kickoff returns": 2,
      "kickoff return yards": 26,
      "interception returns": 1,
      "interception return yards": 0,
      "3rd down conversions": 4,
      "3rd down attempts": 13,
      "4th down conversions": 0,
      "4th down attempts": 1
    },
    "WakeForest": {
      "points": 17,
      "1st downs": 17,
      "rushing 1st downs": 6,
      "passing 1st downs": 7,
      "penalty 1st downs": 4,
      "rushing yards": 149,
      "rushing attempts": 38,
      "passing yards": 122,
      "passing attempts": 30,
      "passing completions": 14,
      "passing interceptions": 1,
      "total yards": 271,
      "total plays": 68,
      "fumbles": 1,
      "fumbles lost": 0,
      "penalties": 3,
      "penalty yards": 35,
      "punts": 9,
      "punt yards": 389,
      "punt returns": 3,
      "punt return yards": 9,
      "kickoff returns": 2,
      "kickoff return yards": 51,
      "interception returns": 0,
      "interception return yards": 0,
      "3rd down conversions": 4,
      "3rd down attempts": 16,
      "4th down conversions": 0,
      "4th down attempts": 1
    }
  },
  "IowaState vs Baylor": {
    "stadium": "McLaneStadium-Waco-TX",
    "IowaState": {
      "points": 27,
      "1st downs": 23,
      "rushing 1st downs": 15,
      "passing 1st downs": 7,
      "penalty 1st downs": 1,
      "rushing yards": 232,
      "rushing attempts": 55,
      "passing yards": 156,
      "passing attempts": 29,
      "passing completions": 15,
      "passing interceptions": 2,
      "total yards": 388,
      "total plays": 84,
      "fumbles": 5,
      "fumbles lost": 2,
      "penalties": 4,
      "penalty yards": 30,
      "punts": 5,
      "punt yards": 218,
      "punt returns": 2,
      "punt return yards": 22,
      "kickoff returns": 5,
      "kickoff return yards": 91,
      "interception returns": 1,
      "interception return yards": -1,
      "3rd down conversions": 5,
      "3rd down attempts": 16,
      "4th down conversions": 2,
      "4th down attempts": 3
    },
    "Baylor": {
      "points": 45,
      "1st downs": 27,
      "rushing 1st downs": 16,
      "passing 1st downs": 10,
      "penalty 1st downs": 1,
      "rushing yards": 276,
      "rushing attempts": 49,
      "passing yards": 209,
      "passing attempts": 38,
      "passing completions": 17,
      "passing interceptions": 1,
      "total yards": 485,
      "total plays": 87,
      "fumbles": 1,
      "fumbles lost": 1,
      "penalties": 9,
      "penalty yards": 48,
      "punts": 5,
      "punt yards": 197,
      "punt returns": 1,
      "punt return yards": 6,
      "kickoff returns": 3,
      "kickoff return yards": 48,
      "interception returns": 2,
      "interception return yards": 15,
      "3rd down conversions": 7,
      "3rd down attempts": 15,
      "4th down conversions": 2,
      "4th down attempts": 2
    }
  },
  "Clemson vs MiamiFL": {
    "stadium": "NewMiamiStadium-MiamiGardens-FL",
    "Clemson": {
      "points": 58,
      "1st downs": 34,
      "rushing 1st downs": 19,
      "passing 1st downs": 10,
      "penalty 1st downs": 5,
      "rushing yards": 416,
      "rushing attempts": 63,
      "passing yards": 151,
      "passing attempts": 25,
      "passing completions": 17,
      "passing interceptions": 0,
      "total yards": 567,
      "total plays": 88,
      "fumbles": 2,
      "fumbles lost": 1,
      "penalties": 4,
      "penalty yards": 29,
      "punts": 4,
      "punt yards": 169,
      "punt returns": 1,
      "punt return yards": 1,
      "kickoff returns": 1,
      "kickoff return yards": 11,
      "interception returns": 3,
      "interception return yards": 78,
      "3rd down conversions": 8,
      "3rd down attempts": 14,
      "4th down conversions": 1,
      "4th down attempts": 1
    },
    "MiamiFL": {
      "points": 0,
      "1st downs": 6,
      "rushing 1st downs": 4,
      "passing 1st downs": 2,
      "penalty 1st downs": 0,
      "rushing yards": 53,
      "rushing attempts": 29,
      "passing yards": 93,
      "passing attempts": 32,
      "passing completions": 13,
      "passing interceptions": 3,
      "total yards": 146,
      "total plays": 61,
      "fumbles": 0,
      "fumbles lost": 0,
      "penalties": 7,
      "penalty yards": 88,
      "punts": 10,
      "punt yards": 425,
      "punt returns": 1,
      "punt return yards": 10,
      "kickoff returns": 4,
      "kickoff return yards": 86,
      "interception returns": 0,
      "interception return yards": 0,
      "3rd down conversions": 4,
      "3rd down attempts": 18,
      "4th down conversions": 0,
      "4th down attempts": 1
    }
  },
  "KansasState vs Texas": {
    "stadium": "DarrellKRoyalTexasMemorialStadium-Austin-TX",
    "KansasState": {
      "points": 9,
      "1st downs": 15,
      "rushing 1st downs": 9,
      "passing 1st downs": 5,
      "penalty 1st downs": 1,
      "rushing yards": 135,
      "rushing attempts": 37,
      "passing yards": 107,
      "passing attempts": 24,
      "passing completions": 11,
      "passing interceptions": 1,
      "total yards": 242,
      "total plays": 61,
      "fumbles": 2,
      "fumbles lost": 0,
      "penalties": 5,
      "penalty yards": 27,
      "punts": 7,
      "punt yards": 283,
      "punt returns": 1,
      "punt return yards": 11,
      "kickoff returns": 3,
      "kickoff return yards": 72,
      "interception returns": 0,
      "interception return yards": 0,
      "3rd down conversions": 4,
      "3rd down attempts": 14,
      "4th down conversions": 1,
      "4th down attempts": 2
    },
    "Texas": {
      "points": 23,
      "1st downs": 21,
      "rushing 1st downs": 15,
      "passing 1st downs": 5,
      "penalty 1st downs": 1,
      "rushing yards": 274,
      "rushing attempts": 53,
      "passing yards": 99,
      "passing attempts": 16,
      "passing completions": 10,
      "passing interceptions": 0,
      "total yards": 373,
      "total plays": 69,
      "fumbles": 0,
      "fumbles lost": 0,
      "penalties": 3,
      "penalty yards": 35,
      "punts": 6,
      "punt yards": 222,
      "punt returns": 2,
      "punt return yards": -1,
      "kickoff returns": 3,
      "kickoff return yards": 44,
      "interception returns": 1,
      "interception return yards": 0,
      "3rd down conversions": 7,
      "3rd down attempts": 15,
      "4th down conversions": 0,
      "4th down attempts": 1
    }
  },
  "Houston vs UCF": {
    "stadium": "BrightHouseNetworksStadium-Orlando-FL",
    "Houston": {
      "points": 59,
      "1st downs": 29,
      "rushing 1st downs": 17,
      "passing 1st downs": 10,
      "penalty 1st downs": 2,
      "rushing yards": 366,
      "rushing attempts": 48,
      "passing yards": 234,
      "passing attempts": 28,
      "passing completions": 20,
      "passing interceptions": 0,
      "total yards": 600,
      "total plays": 76,
      "fumbles": 1,
      "fumbles lost": 0,
      "penalties": 7,
      "penalty yards": 87,
      "punts": 5,
      "punt yards": 199,
      "punt returns": 3,
      "punt return yards": -2,
      "kickoff returns": 3,
      "kickoff return yards": 46,
      "interception returns": 3,
      "interception return yards": 49,
      "3rd down conversions": 7,
      "3rd down attempts": 13,
      "4th down conversions": 0,
      "4th down attempts": 0
    },
    "UCF": {
      "points": 10,
      "1st downs": 14,
      "rushing 1st downs": 5,
      "passing 1st downs": 7,
      "penalty 1st downs": 2,
      "rushing yards": 97,
      "rushing attempts": 30,
      "passing yards": 183,
      "passing attempts": 29,
      "passing completions": 14,
      "passing interceptions": 3,
      "total yards": 280,
      "total plays": 59,
      "fumbles": 1,
      "fumbles lost": 1,
      "penalties": 6,
      "penalty yards": 52,
      "punts": 7,
      "punt yards": 350,
      "punt returns": 1,
      "punt return yards": 0,
      "kickoff returns": 7,
      "kickoff return yards": 145,
      "interception returns": 0,
      "interception return yards": 0,
      "3rd down conversions": 4,
      "3rd down attempts": 14,
      "4th down conversions": 0,
      "4th down attempts": 0
    }
  },
  "SouthernMiss vs Charlotte": {
    "stadium": "JerryRichardsonStadium-Charlotte-NC",
    "SouthernMiss": {
      "points": 44,
      "1st downs": 22,
      "rushing 1st downs": 10,
      "passing 1st downs": 10,
      "penalty 1st downs": 2,
      "rushing yards": 212,
      "rushing attempts": 38,
      "passing yards": 268,
      "passing attempts": 40,
      "passing completions": 25,
      "passing interceptions": 0,
      "total yards": 480,
      "total plays": 78,
      "fumbles": 2,
      "fumbles lost": 2,
      "penalties": 7,
      "penalty yards": 63,
      "punts": 5,
      "punt yards": 175,
      "punt returns": 3,
      "punt return yards": 4,
      "kickoff returns": 3,
      "kickoff return yards": 140,
      "interception returns": 3,
      "interception return yards": 35,
      "3rd down conversions": 10,
      "3rd down attempts": 18,
      "4th down conversions": 0,
      "4th down attempts": 2
    },
    "Charlotte": {
      "points": 10,
      "1st downs": 13,
      "rushing 1st downs": 7,
      "passing 1st downs": 6,
      "penalty 1st downs": 0,
      "rushing yards": 137,
      "rushing attempts": 36,
      "passing yards": 120,
      "passing attempts": 30,
      "passing completions": 12,
      "passing interceptions": 3,
      "total yards": 257,
      "total plays": 66,
      "fumbles": 0,
      "fumbles lost": 0,
      "penalties": 5,
      "penalty yards": 60,
      "punts": 9,
      "punt yards": 345,
      "punt returns": 3,
      "punt return yards": 28,
      "kickoff returns": 6,
      "kickoff return yards": 93,
      "interception returns": 0,
      "interception return yards": 0,
      "3rd down conversions": 4,
      "3rd down attempts": 16,
      "4th down conversions": 0,
      "4th down attempts": 0
    }
  },
  "Army vs Rice": {
    "stadium": "RiceStadium-Houston-TX",
    "Army": {
      "points": 31,
      "1st downs": 18,
      "rushing 1st downs": 14,
      "passing 1st downs": 1,
      "penalty 1st downs": 3,
      "rushing yards": 378,
      "rushing attempts": 56,
      "passing yards": 18,
      "passing attempts": 10,
      "passing completions": 2,
      "passing interceptions": 0,
      "total yards": 396,
      "total plays": 66,
      "fumbles": 2,
      "fumbles lost": 1,
      "penalties": 2,
      "penalty yards": 24,
      "punts": 5,
      "punt yards": 182,
      "punt returns": 1,
      "punt return yards": 8,
      "kickoff returns": 2,
      "kickoff return yards": 39,
      "interception returns": 0,
      "interception return yards": 0,
      "3rd down conversions": 4,
      "3rd down attempts": 14,
      "4th down conversions": 0,
      "4th down attempts": 2
    },
    "Rice": {
      "points": 38,
      "1st downs": 21,
      "rushing 1st downs": 6,
      "passing 1st downs": 14,
      "penalty 1st downs": 1,
      "rushing yards": 165,
      "rushing attempts": 35,
      "passing yards": 267,
      "passing attempts": 30,
      "passing completions": 20,
      "passing interceptions": 0,
      "total yards": 432,
      "total plays": 65,
      "fumbles": 2,
      "fumbles lost": 2,
      "penalties": 8,
      "penalty yards": 64,
      "punts": 5,
      "punt yards": 216,
      "punt returns": 1,
      "punt return yards": 1,
      "kickoff returns": 3,
      "kickoff return yards": 64,
      "interception returns": 0,
      "interception return yards": 0,
      "3rd down conversions": 7,
      "3rd down attempts": 14,
      "4th down conversions": 0,
      "4th down attempts": 0
    }
  },
  "Pittsburgh vs Syracuse": {
    "stadium": "CarrierDome-Syracuse-NY",
    "Pittsburgh": {
      "points": 23,
      "1st downs": 24,
      "rushing 1st downs": 13,
      "passing 1st downs": 11,
      "penalty 1st downs": 0,
      "rushing yards": 188,
      "rushing attempts": 46,
      "passing yards": 239,
      "passing attempts": 28,
      "passing completions": 21,
      "passing interceptions": 0,
      "total yards": 427,
      "total plays": 74,
      "fumbles": 3,
      "fumbles lost": 0,
      "penalties": 6,
      "penalty yards": 60,
      "punts": 4,
      "punt yards": 165,
      "punt returns": 1,
      "punt return yards": 4,
      "kickoff returns": 5,
      "kickoff return yards": 104,
      "interception returns": 2,
      "interception return yards": 19,
      "3rd down conversions": 9,
      "3rd down attempts": 17,
      "4th down conversions": 2,
      "4th down attempts": 2
    },
    "Syracuse": {
      "points": 20,
      "1st downs": 16,
      "rushing 1st downs": 5,
      "passing 1st downs": 10,
      "penalty 1st downs": 1,
      "rushing yards": 136,
      "rushing attempts": 23,
      "passing yards": 217,
      "passing attempts": 31,
      "passing completions": 22,
      "passing interceptions": 2,
      "total yards": 353,
      "total plays": 54,
      "fumbles": 0,
      "fumbles lost": 0,
      "penalties": 4,
      "penalty yards": 39,
      "punts": 3,
      "punt yards": 115,
      "punt returns": 1,
      "punt return yards": 12,
      "kickoff returns": 0,
      "kickoff return yards": 0,
      "interception returns": 0,
      "interception return yards": 0,
      "3rd down conversions": 5,
      "3rd down attempts": 11,
      "4th down conversions": 1,
      "4th down attempts": 1
    }
  },
  "BostonCollege vs Louisville": {
    "stadium": "PapaJohnsCardinalStadium-Louisville-KY",
    "BostonCollege": {
      "points": 14,
      "1st downs": 4,
      "rushing 1st downs": 1,
      "passing 1st downs": 3,
      "penalty 1st downs": 0,
      "rushing yards": 0,
      "rushing attempts": 30,
      "passing yards": 93,
      "passing attempts": 22,
      "passing completions": 9,
      "passing interceptions": 0,
      "total yards": 79,
      "total plays": 52,
      "fumbles": 4,
      "fumbles lost": 1,
      "penalties": 4,
      "penalty yards": 25,
      "punts": 12,
      "punt yards": 507,
      "punt returns": 2,
      "punt return yards": 45,
      "kickoff returns": 2,
      "kickoff return yards": 37,
      "interception returns": 2,
      "interception return yards": 0,
      "3rd down conversions": 1,
      "3rd down attempts": 14,
      "4th down conversions": 0,
      "4th down attempts": 1
    },
    "Louisville": {
      "points": 17,
      "1st downs": 18,
      "rushing 1st downs": 8,
      "passing 1st downs": 10,
      "penalty 1st downs": 0,
      "rushing yards": 135,
      "rushing attempts": 48,
      "passing yards": 230,
      "passing attempts": 26,
      "passing completions": 15,
      "passing interceptions": 2,
      "total yards": 365,
      "total plays": 74,
      "fumbles": 2,
      "fumbles lost": 2,
      "penalties": 8,
      "penalty yards": 49,
      "punts": 8,
      "punt yards": 278,
      "punt returns": 6,
      "punt return yards": 3,
      "kickoff returns": 1,
      "kickoff return yards": 19,
      "interception returns": 0,
      "interception return yards": 0,
      "3rd down conversions": 6,
      "3rd down attempts": 17,
      "4th down conversions": 0,
      "4th down attempts": 0
    }
  },
  "Tulane vs Navy": {
    "stadium": "NavyMarineCorpsMemorialStadium-Annapolis-MD",
    "Tulane": {
      "points": 14,
      "1st downs": 21,
      "rushing 1st downs": 2,
      "passing 1st downs": 18,
      "penalty 1st downs": 1,
      "rushing yards": 123,
      "rushing attempts": 27,
      "passing yards": 263,
      "passing attempts": 38,
      "passing completions": 27,
      "passing interceptions": 1,
      "total yards": 386,
      "total plays": 65,
      "fumbles": 2,
      "fumbles lost": 2,
      "penalties": 9,
      "penalty yards": 80,
      "punts": 3,
      "punt yards": 95,
      "punt returns": 1,
      "punt return yards": 0,
      "kickoff returns": 6,
      "kickoff return yards": 114,
      "interception returns": 0,
      "interception return yards": 0,
      "3rd down conversions": 7,
      "3rd down attempts": 13,
      "4th down conversions": 0,
      "4th down attempts": 1
    },
    "Navy": {
      "points": 31,
      "1st downs": 18,
      "rushing 1st downs": 11,
      "passing 1st downs": 5,
      "penalty 1st downs": 2,
      "rushing yards": 133,
      "rushing attempts": 54,
      "passing yards": 158,
      "passing attempts": 12,
      "passing completions": 8,
      "passing interceptions": 0,
      "total yards": 291,
      "total plays": 66,
      "fumbles": 0,
      "fumbles lost": 0,
      "penalties": 3,
      "penalty yards": 30,
      "punts": 4,
      "punt yards": 146,
      "punt returns": 2,
      "punt return yards": 9,
      "kickoff returns": 0,
      "kickoff return yards": 0,
      "interception returns": 1,
      "interception return yards": 0,
      "3rd down conversions": 8,
      "3rd down attempts": 16,
      "4th down conversions": 3,
      "4th down attempts": 3
    }
  },
  "BowlingGreen vs KentState": {
    "stadium": "DixStadium-Kent-OH",
    "BowlingGreen": {
      "points": 48,
      "1st downs": 31,
      "rushing 1st downs": 10,
      "passing 1st downs": 18,
      "penalty 1st downs": 3,
      "rushing yards": 153,
      "rushing attempts": 46,
      "passing yards": 449,
      "passing attempts": 45,
      "passing completions": 29,
      "passing interceptions": 0,
      "total yards": 602,
      "total plays": 91,
      "fumbles": 0,
      "fumbles lost": 0,
      "penalties": 8,
      "penalty yards": 85,
      "punts": 4,
      "punt yards": 210,
      "punt returns": 3,
      "punt return yards": 6,
      "kickoff returns": 1,
      "kickoff return yards": 23,
      "interception returns": 2,
      "interception return yards": 36,
      "3rd down conversions": 13,
      "3rd down attempts": 23,
      "4th down conversions": 2,
      "4th down attempts": 2
    },
    "KentState": {
      "points": 0,
      "1st downs": 10,
      "rushing 1st downs": 4,
      "passing 1st downs": 4,
      "penalty 1st downs": 2,
      "rushing yards": 55,
      "rushing attempts": 26,
      "passing yards": 111,
      "passing attempts": 25,
      "passing completions": 12,
      "passing interceptions": 2,
      "total yards": 166,
      "total plays": 51,
      "fumbles": 0,
      "fumbles lost": 0,
      "penalties": 8,
      "penalty yards": 69,
      "punts": 9,
      "punt yards": 382,
      "punt returns": 0,
      "punt return yards": 0,
      "kickoff returns": 4,
      "kickoff return yards": 78,
      "interception returns": 0,
      "interception return yards": 0,
      "3rd down conversions": 1,
      "3rd down attempts": 11,
      "4th down conversions": 0,
      "4th down attempts": 0
    }
  },
  "MiamiOH vs WesternMichigan": {
    "stadium": "WaldoStadium-Kalamazoo-MI",
    "MiamiOH": {
      "points": 13,
      "1st downs": 12,
      "rushing 1st downs": 3,
      "passing 1st downs": 9,
      "penalty 1st downs": 0,
      "rushing yards": 58,
      "rushing attempts": 27,
      "passing yards": 218,
      "passing attempts": 27,
      "passing completions": 14,
      "passing interceptions": 0,
      "total yards": 276,
      "total plays": 54,
      "fumbles": 3,
      "fumbles lost": 2,
      "penalties": 8,
      "penalty yards": 64,
      "punts": 5,
      "punt yards": 200,
      "punt returns": 0,
      "punt return yards": 0,
      "kickoff returns": 3,
      "kickoff return yards": 76,
      "interception returns": 0,
      "interception return yards": 0,
      "3rd down conversions": 4,
      "3rd down attempts": 14,
      "4th down conversions": 0,
      "4th down attempts": 2
    },
    "WesternMichigan": {
      "points": 35,
      "1st downs": 26,
      "rushing 1st downs": 9,
      "passing 1st downs": 14,
      "penalty 1st downs": 3,
      "rushing yards": 143,
      "rushing attempts": 47,
      "passing yards": 278,
      "passing attempts": 32,
      "passing completions": 25,
      "passing interceptions": 0,
      "total yards": 421,
      "total plays": 79,
      "fumbles": 0,
      "fumbles lost": 0,
      "penalties": 5,
      "penalty yards": 38,
      "punts": 4,
      "punt yards": 174,
      "punt returns": 1,
      "punt return yards": 0,
      "kickoff returns": 3,
      "kickoff return yards": 63,
      "interception returns": 0,
      "interception return yards": 0,
      "3rd down conversions": 7,
      "3rd down attempts": 13,
      "4th down conversions": 1,
      "4th down attempts": 2
    }
  },
  "FresnoState vs AirForce": {
    "stadium": "FalconStadium-USAirForceAcademy-CO",
    "FresnoState": {
      "points": 14,
      "1st downs": 12,
      "rushing 1st downs": 3,
      "passing 1st downs": 9,
      "penalty 1st downs": 0,
      "rushing yards": 134,
      "rushing attempts": 17,
      "passing yards": 177,
      "passing attempts": 39,
      "passing completions": 14,
      "passing interceptions": 1,
      "total yards": 311,
      "total plays": 56,
      "fumbles": 0,
      "fumbles lost": 0,
      "penalties": 5,
      "penalty yards": 39,
      "punts": 7,
      "punt yards": 279,
      "punt returns": 1,
      "punt return yards": -1,
      "kickoff returns": 1,
      "kickoff return yards": 21,
      "interception returns": 0,
      "interception return yards": 0,
      "3rd down conversions": 2,
      "3rd down attempts": 12,
      "4th down conversions": 0,
      "4th down attempts": 2
    },
    "AirForce": {
      "points": 42,
      "1st downs": 26,
      "rushing 1st downs": 21,
      "passing 1st downs": 5,
      "penalty 1st downs": 0,
      "rushing yards": 458,
      "rushing attempts": 79,
      "passing yards": 128,
      "passing attempts": 11,
      "passing completions": 6,
      "passing interceptions": 0,
      "total yards": 586,
      "total plays": 90,
      "fumbles": 2,
      "fumbles lost": 1,
      "penalties": 5,
      "penalty yards": 38,
      "punts": 3,
      "punt yards": 116,
      "punt returns": 2,
      "punt return yards": -3,
      "kickoff returns": 0,
      "kickoff return yards": 0,
      "interception returns": 1,
      "interception return yards": 17,
      "3rd down conversions": 8,
      "3rd down attempts": 18,
      "4th down conversions": 3,
      "4th down attempts": 5
    }
  },
  "CentralMichigan vs BallState": {
    "stadium": "ScheumannStadium-Muncie-IN",
    "CentralMichigan": {
      "points": 23,
      "1st downs": 20,
      "rushing 1st downs": 5,
      "passing 1st downs": 13,
      "penalty 1st downs": 2,
      "rushing yards": 118,
      "rushing attempts": 31,
      "passing yards": 316,
      "passing attempts": 39,
      "passing completions": 30,
      "passing interceptions": 1,
      "total yards": 434,
      "total plays": 70,
      "fumbles": 3,
      "fumbles lost": 1,
      "penalties": 10,
      "penalty yards": 55,
      "punts": 5,
      "punt yards": 178,
      "punt returns": 1,
      "punt return yards": 0,
      "kickoff returns": 2,
      "kickoff return yards": 39,
      "interception returns": 0,
      "interception return yards": 0,
      "3rd down conversions": 6,
      "3rd down attempts": 14,
      "4th down conversions": 0,
      "4th down attempts": 0
    },
    "BallState": {
      "points": 21,
      "1st downs": 17,
      "rushing 1st downs": 7,
      "passing 1st downs": 9,
      "penalty 1st downs": 1,
      "rushing yards": 112,
      "rushing attempts": 29,
      "passing yards": 187,
      "passing attempts": 40,
      "passing completions": 25,
      "passing interceptions": 0,
      "total yards": 299,
      "total plays": 69,
      "fumbles": 1,
      "fumbles lost": 1,
      "penalties": 5,
      "penalty yards": 50,
      "punts": 7,
      "punt yards": 279,
      "punt returns": 1,
      "punt return yards": 2,
      "kickoff returns": 4,
      "kickoff return yards": 137,
      "interception returns": 1,
      "interception return yards": 0,
      "3rd down conversions": 2,
      "3rd down attempts": 12,
      "4th down conversions": 1,
      "4th down attempts": 3
    }
  },
  "Toledo vs Massachusetts": {
    "stadium": "GilletteStadium-Foxborough-MA",
    "Toledo": {
      "points": 51,
      "1st downs": 34,
      "rushing 1st downs": 14,
      "passing 1st downs": 16,
      "penalty 1st downs": 4,
      "rushing yards": 265,
      "rushing attempts": 58,
      "passing yards": 355,
      "passing attempts": 47,
      "passing completions": 26,
      "passing interceptions": 3,
      "total yards": 620,
      "total plays": 105,
      "fumbles": 1,
      "fumbles lost": 0,
      "penalties": 10,
      "penalty yards": 81,
      "punts": 1,
      "punt yards": 41,
      "punt returns": 5,
      "punt return yards": 60,
      "kickoff returns": 5,
      "kickoff return yards": 117,
      "interception returns": 1,
      "interception return yards": 83,
      "3rd down conversions": 12,
      "3rd down attempts": 21,
      "4th down conversions": 2,
      "4th down attempts": 4
    },
    "Massachusetts": {
      "points": 35,
      "1st downs": 19,
      "rushing 1st downs": 6,
      "passing 1st downs": 12,
      "penalty 1st downs": 1,
      "rushing yards": 148,
      "rushing attempts": 24,
      "passing yards": 240,
      "passing attempts": 49,
      "passing completions": 27,
      "passing interceptions": 1,
      "total yards": 388,
      "total plays": 73,
      "fumbles": 1,
      "fumbles lost": 0,
      "penalties": 15,
      "penalty yards": 134,
      "punts": 8,
      "punt yards": 330,
      "punt returns": 1,
      "punt return yards": 16,
      "kickoff returns": 9,
      "kickoff return yards": 179,
      "interception returns": 3,
      "interception return yards": 67,
      "3rd down conversions": 4,
      "3rd down attempts": 15,
      "4th down conversions": 0,
      "4th down attempts": 2
    }
  },
  "FCS vs BrighamYoung": {
    "stadium": "LaVellEdwardsStadium-Provo-UT",
    "FCS": {
      "points": 6,
      "1st downs": 6,
      "rushing 1st downs": 3,
      "passing 1st downs": 3,
      "penalty 1st downs": 0,
      "rushing yards": 83,
      "rushing attempts": 36,
      "passing yards": 46,
      "passing attempts": 16,
      "passing completions": 8,
      "passing interceptions": 1,
      "total yards": 129,
      "total plays": 52,
      "fumbles": 0,
      "fumbles lost": 0,
      "penalties": 2,
      "penalty yards": 15,
      "punts": 9,
      "punt yards": 425,
      "punt returns": 0,
      "punt return yards": 0,
      "kickoff returns": 2,
      "kickoff return yards": 46,
      "interception returns": 0,
      "interception return yards": 0,
      "3rd down conversions": 6,
      "3rd down attempts": 17,
      "4th down conversions": 0,
      "4th down attempts": 0
    },
    "BrighamYoung": {
      "points": 70,
      "1st downs": 31,
      "rushing 1st downs": 15,
      "passing 1st downs": 16,
      "penalty 1st downs": 0,
      "rushing yards": 330,
      "rushing attempts": 42,
      "passing yards": 411,
      "passing attempts": 27,
      "passing completions": 23,
      "passing interceptions": 0,
      "total yards": 741,
      "total plays": 69,
      "fumbles": 0,
      "fumbles lost": 0,
      "penalties": 7,
      "penalty yards": 55,
      "punts": 0,
      "punt yards": 0,
      "punt returns": 5,
      "punt return yards": 94,
      "kickoff returns": 1,
      "kickoff return yards": 30,
      "interception returns": 1,
      "interception return yards": 3,
      "3rd down conversions": 8,
      "3rd down attempts": 9,
      "4th down conversions": 0,
      "4th down attempts": 1
    }
  },
  "Virginia vs NorthCarolina": {
    "stadium": "KenanMemorialStadium-ChapelHill-NC",
    "Virginia": {
      "points": 13,
      "1st downs": 23,
      "rushing 1st downs": 7,
      "passing 1st downs": 10,
      "penalty 1st downs": 6,
      "rushing yards": 205,
      "rushing attempts": 39,
      "passing yards": 148,
      "passing attempts": 30,
      "passing completions": 17,
      "passing interceptions": 4,
      "total yards": 353,
      "total plays": 69,
      "fumbles": 1,
      "fumbles lost": 1,
      "penalties": 10,
      "penalty yards": 62,
      "punts": 3,
      "punt yards": 127,
      "punt returns": 0,
      "punt return yards": 0,
      "kickoff returns": 1,
      "kickoff return yards": 14,
      "interception returns": 1,
      "interception return yards": 0,
      "3rd down conversions": 5,
      "3rd down attempts": 14,
      "4th down conversions": 0,
      "4th down attempts": 1
    },
    "NorthCarolina": {
      "points": 26,
      "1st downs": 24,
      "rushing 1st downs": 11,
      "passing 1st downs": 12,
      "penalty 1st downs": 1,
      "rushing yards": 196,
      "rushing attempts": 38,
      "passing yards": 226,
      "passing attempts": 26,
      "passing completions": 21,
      "passing interceptions": 1,
      "total yards": 422,
      "total plays": 64,
      "fumbles": 3,
      "fumbles lost": 1,
      "penalties": 13,
      "penalty yards": 135,
      "punts": 3,
      "punt yards": 108,
      "punt returns": 2,
      "punt return yards": 1,
      "kickoff returns": 2,
      "kickoff return yards": 58,
      "interception returns": 4,
      "interception return yards": 46,
      "3rd down conversions": 2,
      "3rd down attempts": 8,
      "4th down conversions": 0,
      "4th down attempts": 0
    }
  },
  "EasternMichigan vs NorthernIllinois": {
    "stadium": "BrighamFieldatHuskieStadium-DeKalb-IL",
    "EasternMichigan": {
      "points": 21,
      "1st downs": 26,
      "rushing 1st downs": 14,
      "passing 1st downs": 11,
      "penalty 1st downs": 1,
      "rushing yards": 157,
      "rushing attempts": 44,
      "passing yards": 219,
      "passing attempts": 43,
      "passing completions": 26,
      "passing interceptions": 1,
      "total yards": 376,
      "total plays": 87,
      "fumbles": 0,
      "fumbles lost": 0,
      "penalties": 7,
      "penalty yards": 77,
      "punts": 8,
      "punt yards": 312,
      "punt returns": 3,
      "punt return yards": 42,
      "kickoff returns": 6,
      "kickoff return yards": 101,
      "interception returns": 0,
      "interception return yards": 0,
      "3rd down conversions": 8,
      "3rd down attempts": 18,
      "4th down conversions": 0,
      "4th down attempts": 1
    },
    "NorthernIllinois": {
      "points": 49,
      "1st downs": 34,
      "rushing 1st downs": 20,
      "passing 1st downs": 11,
      "penalty 1st downs": 3,
      "rushing yards": 322,
      "rushing attempts": 59,
      "passing yards": 269,
      "passing attempts": 38,
      "passing completions": 24,
      "passing interceptions": 0,
      "total yards": 591,
      "total plays": 97,
      "fumbles": 0,
      "fumbles lost": 0,
      "penalties": 8,
      "penalty yards": 82,
      "punts": 7,
      "punt yards": 215,
      "punt returns": 3,
      "punt return yards": 8,
      "kickoff returns": 1,
      "kickoff return yards": 29,
      "interception returns": 1,
      "interception return yards": 0,
      "3rd down conversions": 15,
      "3rd down attempts": 23,
      "4th down conversions": 1,
      "4th down attempts": 1
    }
  },
  "MiddleTennessee vs LouisianaTech": {
    "stadium": "JoeAilletStadium-Ruston-LA",
    "MiddleTennessee": {
      "points": 16,
      "1st downs": 22,
      "rushing 1st downs": 5,
      "passing 1st downs": 15,
      "penalty 1st downs": 2,
      "rushing yards": 33,
      "rushing attempts": 24,
      "passing yards": 381,
      "passing attempts": 56,
      "passing completions": 36,
      "passing interceptions": 2,
      "total yards": 414,
      "total plays": 80,
      "fumbles": 2,
      "fumbles lost": 1,
      "penalties": 7,
      "penalty yards": 59,
      "punts": 6,
      "punt yards": 268,
      "punt returns": 1,
      "punt return yards": 14,
      "kickoff returns": 5,
      "kickoff return yards": 85,
      "interception returns": 0,
      "interception return yards": 0,
      "3rd down conversions": 7,
      "3rd down attempts": 18,
      "4th down conversions": 1,
      "4th down attempts": 3
    },
    "LouisianaTech": {
      "points": 45,
      "1st downs": 22,
      "rushing 1st downs": 10,
      "passing 1st downs": 10,
      "penalty 1st downs": 2,
      "rushing yards": 169,
      "rushing attempts": 35,
      "passing yards": 301,
      "passing attempts": 33,
      "passing completions": 19,
      "passing interceptions": 0,
      "total yards": 470,
      "total plays": 68,
      "fumbles": 0,
      "fumbles lost": 0,
      "penalties": 5,
      "penalty yards": 46,
      "punts": 5,
      "punt yards": 168,
      "punt returns": 2,
      "punt return yards": 16,
      "kickoff returns": 2,
      "kickoff return yards": 34,
      "interception returns": 2,
      "interception return yards": 59,
      "3rd down conversions": 6,
      "3rd down attempts": 14,
      "4th down conversions": 1,
      "4th down attempts": 1
    }
  },
  "Duke vs VirginiaTech": {
    "stadium": "LaneStadium-Blacksburg-VA",
    "Duke": {
      "points": 45,
      "1st downs": 19,
      "rushing 1st downs": 7,
      "passing 1st downs": 11,
      "penalty 1st downs": 1,
      "rushing yards": 179,
      "rushing attempts": 32,
      "passing yards": 270,
      "passing attempts": 40,
      "passing completions": 19,
      "passing interceptions": 0,
      "total yards": 449,
      "total plays": 72,
      "fumbles": 0,
      "fumbles lost": 0,
      "penalties": 7,
      "penalty yards": 22,
      "punts": 5,
      "punt yards": 211,
      "punt returns": 2,
      "punt return yards": 6,
      "kickoff returns": 1,
      "kickoff return yards": 21,
      "interception returns": 0,
      "interception return yards": 0,
      "3rd down conversions": 8,
      "3rd down attempts": 18,
      "4th down conversions": 0,
      "4th down attempts": 0
    },
    "VirginiaTech": {
      "points": 43,
      "1st downs": 29,
      "rushing 1st downs": 13,
      "passing 1st downs": 15,
      "penalty 1st downs": 1,
      "rushing yards": 182,
      "rushing attempts": 53,
      "passing yards": 270,
      "passing attempts": 47,
      "passing completions": 24,
      "passing interceptions": 0,
      "total yards": 452,
      "total plays": 100,
      "fumbles": 0,
      "fumbles lost": 0,
      "penalties": 5,
      "penalty yards": 35,
      "punts": 7,
      "punt yards": 318,
      "punt returns": 2,
      "punt return yards": 2,
      "kickoff returns": 4,
      "kickoff return yards": 69,
      "interception returns": 0,
      "interception return yards": 0,
      "3rd down conversions": 11,
      "3rd down attempts": 22,
      "4th down conversions": 1,
      "4th down attempts": 1
    }
  },
  "PennState vs Maryland": {
    "stadium": "MTBankStadium-Baltimore-MD",
    "PennState": {
      "points": 31,
      "1st downs": 16,
      "rushing 1st downs": 4,
      "passing 1st downs": 11,
      "penalty 1st downs": 1,
      "rushing yards": 48,
      "rushing attempts": 31,
      "passing yards": 315,
      "passing attempts": 30,
      "passing completions": 13,
      "passing interceptions": 0,
      "total yards": 363,
      "total plays": 61,
      "fumbles": 4,
      "fumbles lost": 3,
      "penalties": 5,
      "penalty yards": 24,
      "punts": 6,
      "punt yards": 234,
      "punt returns": 0,
      "punt return yards": 0,
      "kickoff returns": 6,
      "kickoff return yards": 125,
      "interception returns": 3,
      "interception return yards": 0,
      "3rd down conversions": 3,
      "3rd down attempts": 13,
      "4th down conversions": 0,
      "4th down attempts": 0
    },
    "Maryland": {
      "points": 30,
      "1st downs": 21,
      "rushing 1st downs": 11,
      "passing 1st downs": 9,
      "penalty 1st downs": 1,
      "rushing yards": 241,
      "rushing attempts": 48,
      "passing yards": 225,
      "passing attempts": 28,
      "passing completions": 19,
      "passing interceptions": 3,
      "total yards": 466,
      "total plays": 76,
      "fumbles": 3,
      "fumbles lost": 2,
      "penalties": 7,
      "penalty yards": 70,
      "punts": 2,
      "punt yards": 69,
      "punt returns": 3,
      "punt return yards": 24,
      "kickoff returns": 4,
      "kickoff return yards": 100,
      "interception returns": 0,
      "interception return yards": 0,
      "3rd down conversions": 4,
      "3rd down attempts": 13,
      "4th down conversions": 0,
      "4th down attempts": 2
    }
  },
  "Wisconsin vs Illinois": {
    "stadium": "MemorialStadiumChampaign-IL-Champaign",
    "Wisconsin": {
      "points": 24,
      "1st downs": 23,
      "rushing 1st downs": 5,
      "passing 1st downs": 16,
      "penalty 1st downs": 2,
      "rushing yards": 138,
      "rushing attempts": 40,
      "passing yards": 281,
      "passing attempts": 40,
      "passing completions": 25,
      "passing interceptions": 2,
      "total yards": 419,
      "total plays": 80,
      "fumbles": 1,
      "fumbles lost": 0,
      "penalties": 4,
      "penalty yards": 45,
      "punts": 5,
      "punt yards": 234,
      "punt returns": 1,
      "punt return yards": 1,
      "kickoff returns": 4,
      "kickoff return yards": 64,
      "interception returns": 1,
      "interception return yards": 0,
      "3rd down conversions": 9,
      "3rd down attempts": 16,
      "4th down conversions": 0,
      "4th down attempts": 0
    },
    "Illinois": {
      "points": 13,
      "1st downs": 15,
      "rushing 1st downs": 1,
      "passing 1st downs": 13,
      "penalty 1st downs": 1,
      "rushing yards": 55,
      "rushing attempts": 13,
      "passing yards": 278,
      "passing attempts": 43,
      "passing completions": 22,
      "passing interceptions": 1,
      "total yards": 333,
      "total plays": 56,
      "fumbles": 1,
      "fumbles lost": 1,
      "penalties": 7,
      "penalty yards": 50,
      "punts": 5,
      "punt yards": 193,
      "punt returns": 4,
      "punt return yards": 38,
      "kickoff returns": 4,
      "kickoff return yards": 61,
      "interception returns": 2,
      "interception return yards": 0,
      "3rd down conversions": 3,
      "3rd down attempts": 12,
      "4th down conversions": 0,
      "4th down attempts": 2
    }
  },
  "Ohio vs Buffalo": {
    "stadium": "UBStadium-Amherst-NY",
    "Ohio": {
      "points": 17,
      "1st downs": 22,
      "rushing 1st downs": 3,
      "passing 1st downs": 16,
      "penalty 1st downs": 3,
      "rushing yards": 54,
      "rushing attempts": 34,
      "passing yards": 368,
      "passing attempts": 54,
      "passing completions": 33,
      "passing interceptions": 4,
      "total yards": 422,
      "total plays": 88,
      "fumbles": 0,
      "fumbles lost": 0,
      "penalties": 7,
      "penalty yards": 58,
      "punts": 3,
      "punt yards": 109,
      "punt returns": 1,
      "punt return yards": 11,
      "kickoff returns": 1,
      "kickoff return yards": 19,
      "interception returns": 0,
      "interception return yards": 0,
      "3rd down conversions": 10,
      "3rd down attempts": 18,
      "4th down conversions": 1,
      "4th down attempts": 4
    },
    "Buffalo": {
      "points": 41,
      "1st downs": 19,
      "rushing 1st downs": 8,
      "passing 1st downs": 10,
      "penalty 1st downs": 1,
      "rushing yards": 161,
      "rushing attempts": 34,
      "passing yards": 212,
      "passing attempts": 32,
      "passing completions": 21,
      "passing interceptions": 0,
      "total yards": 373,
      "total plays": 66,
      "fumbles": 0,
      "fumbles lost": 0,
      "penalties": 8,
      "penalty yards": 65,
      "punts": 5,
      "punt yards": 223,
      "punt returns": 1,
      "punt return yards": 8,
      "kickoff returns": 2,
      "kickoff return yards": 27,
      "interception returns": 4,
      "interception return yards": 82,
      "3rd down conversions": 5,
      "3rd down attempts": 14,
      "4th down conversions": 0,
      "4th down attempts": 0
    }
  },
  "Kansas vs OklahomaState": {
    "stadium": "BoonePickensStadium-Stillwater-OK",
    "Kansas": {
      "points": 10,
      "1st downs": 9,
      "rushing 1st downs": 2,
      "passing 1st downs": 7,
      "penalty 1st downs": 0,
      "rushing yards": 30,
      "rushing attempts": 27,
      "passing yards": 191,
      "passing attempts": 31,
      "passing completions": 12,
      "passing interceptions": 2,
      "total yards": 221,
      "total plays": 58,
      "fumbles": 0,
      "fumbles lost": 0,
      "penalties": 10,
      "penalty yards": 102,
      "punts": 8,
      "punt yards": 345,
      "punt returns": 0,
      "punt return yards": 0,
      "kickoff returns": 5,
      "kickoff return yards": 131,
      "interception returns": 0,
      "interception return yards": 0,
      "3rd down conversions": 5,
      "3rd down attempts": 16,
      "4th down conversions": 0,
      "4th down attempts": 0
    },
    "OklahomaState": {
      "points": 58,
      "1st downs": 35,
      "rushing 1st downs": 15,
      "passing 1st downs": 15,
      "penalty 1st downs": 5,
      "rushing yards": 202,
      "rushing attempts": 47,
      "passing yards": 381,
      "passing attempts": 36,
      "passing completions": 27,
      "passing interceptions": 0,
      "total yards": 583,
      "total plays": 83,
      "fumbles": 0,
      "fumbles lost": 0,
      "penalties": 2,
      "penalty yards": 25,
      "punts": 4,
      "punt yards": 142,
      "punt returns": 5,
      "punt return yards": 63,
      "kickoff returns": 2,
      "kickoff return yards": 47,
      "interception returns": 2,
      "interception return yards": 18,
      "3rd down conversions": 6,
      "3rd down attempts": 13,
      "4th down conversions": 1,
      "4th down attempts": 1
    }
  },
  "Tennessee vs Alabama": {
    "stadium": "BryantDennyStadium-Tuscaloosa-AL",
    "Tennessee": {
      "points": 14,
      "1st downs": 21,
      "rushing 1st downs": 11,
      "passing 1st downs": 9,
      "penalty 1st downs": 1,
      "rushing yards": 132,
      "rushing attempts": 39,
      "passing yards": 171,
      "passing attempts": 22,
      "passing completions": 13,
      "passing interceptions": 0,
      "total yards": 303,
      "total plays": 61,
      "fumbles": 1,
      "fumbles lost": 1,
      "penalties": 6,
      "penalty yards": 30,
      "punts": 4,
      "punt yards": 173,
      "punt returns": 1,
      "punt return yards": 3,
      "kickoff returns": 1,
      "kickoff return yards": 31,
      "interception returns": 1,
      "interception return yards": 1,
      "3rd down conversions": 7,
      "3rd down attempts": 13,
      "4th down conversions": 0,
      "4th down attempts": 0
    },
    "Alabama": {
      "points": 19,
      "1st downs": 23,
      "rushing 1st downs": 10,
      "passing 1st downs": 12,
      "penalty 1st downs": 1,
      "rushing yards": 117,
      "rushing attempts": 42,
      "passing yards": 247,
      "passing attempts": 27,
      "passing completions": 21,
      "passing interceptions": 1,
      "total yards": 364,
      "total plays": 69,
      "fumbles": 0,
      "fumbles lost": 0,
      "penalties": 7,
      "penalty yards": 64,
      "punts": 4,
      "punt yards": 199,
      "punt returns": 0,
      "punt return yards": 0,
      "kickoff returns": 2,
      "kickoff return yards": 62,
      "interception returns": 0,
      "interception return yards": 0,
      "3rd down conversions": 5,
      "3rd down attempts": 13,
      "4th down conversions": 0,
      "4th down attempts": 0
    }
  },
  "NorthTexas vs Marshall": {
    "stadium": "JoanCEdwardsStadium-Huntington-WV",
    "NorthTexas": {
      "points": 13,
      "1st downs": 22,
      "rushing 1st downs": 14,
      "passing 1st downs": 5,
      "penalty 1st downs": 3,
      "rushing yards": 209,
      "rushing attempts": 40,
      "passing yards": 128,
      "passing attempts": 37,
      "passing completions": 15,
      "passing interceptions": 1,
      "total yards": 337,
      "total plays": 77,
      "fumbles": 0,
      "fumbles lost": 0,
      "penalties": 5,
      "penalty yards": 28,
      "punts": 7,
      "punt yards": 298,
      "punt returns": 2,
      "punt return yards": 12,
      "kickoff returns": 3,
      "kickoff return yards": 45,
      "interception returns": 0,
      "interception return yards": 0,
      "3rd down conversions": 5,
      "3rd down attempts": 16,
      "4th down conversions": 1,
      "4th down attempts": 2
    },
    "Marshall": {
      "points": 30,
      "1st downs": 21,
      "rushing 1st downs": 11,
      "passing 1st downs": 7,
      "penalty 1st downs": 3,
      "rushing yards": 213,
      "rushing attempts": 43,
      "passing yards": 189,
      "passing attempts": 34,
      "passing completions": 19,
      "passing interceptions": 0,
      "total yards": 402,
      "total plays": 77,
      "fumbles": 0,
      "fumbles lost": 0,
      "penalties": 4,
      "penalty yards": 50,
      "punts": 4,
      "punt yards": 164,
      "punt returns": 1,
      "punt return yards": 5,
      "kickoff returns": 1,
      "kickoff return yards": 11,
      "interception returns": 1,
      "interception return yards": 18,
      "3rd down conversions": 6,
      "3rd down attempts": 17,
      "4th down conversions": 2,
      "4th down attempts": 3
    }
  },
  "TexasTech vs Oklahoma": {
    "stadium": "GaylordFamilyOklahomaMemorialStadium-Norman-OK",
    "TexasTech": {
      "points": 27,
      "1st downs": 28,
      "rushing 1st downs": 14,
      "passing 1st downs": 11,
      "penalty 1st downs": 3,
      "rushing yards": 183,
      "rushing attempts": 40,
      "passing yards": 253,
      "passing attempts": 45,
      "passing completions": 29,
      "passing interceptions": 4,
      "total yards": 436,
      "total plays": 85,
      "fumbles": 0,
      "fumbles lost": 0,
      "penalties": 7,
      "penalty yards": 68,
      "punts": 3,
      "punt yards": 148,
      "punt returns": 0,
      "punt return yards": 0,
      "kickoff returns": 7,
      "kickoff return yards": 163,
      "interception returns": 1,
      "interception return yards": 45,
      "3rd down conversions": 12,
      "3rd down attempts": 18,
      "4th down conversions": 0,
      "4th down attempts": 1
    },
    "Oklahoma": {
      "points": 63,
      "1st downs": 35,
      "rushing 1st downs": 24,
      "passing 1st downs": 9,
      "penalty 1st downs": 2,
      "rushing yards": 405,
      "rushing attempts": 57,
      "passing yards": 212,
      "passing attempts": 22,
      "passing completions": 15,
      "passing interceptions": 1,
      "total yards": 617,
      "total plays": 79,
      "fumbles": 2,
      "fumbles lost": 1,
      "penalties": 3,
      "penalty yards": 34,
      "punts": 1,
      "punt yards": 57,
      "punt returns": 0,
      "punt return yards": 0,
      "kickoff returns": 1,
      "kickoff return yards": 22,
      "interception returns": 4,
      "interception return yards": 33,
      "3rd down conversions": 11,
      "3rd down attempts": 14,
      "4th down conversions": 1,
      "4th down attempts": 1
    }
  },
  "Indiana vs MichiganState": {
    "stadium": "SpartanStadium-EastLansing-MI",
    "Indiana": {
      "points": 26,
      "1st downs": 21,
      "rushing 1st downs": 3,
      "passing 1st downs": 15,
      "penalty 1st downs": 3,
      "rushing yards": 81,
      "rushing attempts": 23,
      "passing yards": 308,
      "passing attempts": 37,
      "passing completions": 23,
      "passing interceptions": 1,
      "total yards": 389,
      "total plays": 60,
      "fumbles": 2,
      "fumbles lost": 1,
      "penalties": 6,
      "penalty yards": 45,
      "punts": 4,
      "punt yards": 191,
      "punt returns": 2,
      "punt return yards": 3,
      "kickoff returns": 4,
      "kickoff return yards": 76,
      "interception returns": 0,
      "interception return yards": 0,
      "3rd down conversions": 5,
      "3rd down attempts": 11,
      "4th down conversions": 0,
      "4th down attempts": 1
    },
    "MichiganState": {
      "points": 52,
      "1st downs": 34,
      "rushing 1st downs": 10,
      "passing 1st downs": 22,
      "penalty 1st downs": 2,
      "rushing yards": 142,
      "rushing attempts": 44,
      "passing yards": 398,
      "passing attempts": 52,
      "passing completions": 30,
      "passing interceptions": 0,
      "total yards": 540,
      "total plays": 96,
      "fumbles": 2,
      "fumbles lost": 1,
      "penalties": 5,
      "penalty yards": 56,
      "punts": 4,
      "punt yards": 170,
      "punt returns": 1,
      "punt return yards": 17,
      "kickoff returns": 2,
      "kickoff return yards": 67,
      "interception returns": 1,
      "interception return yards": 0,
      "3rd down conversions": 13,
      "3rd down attempts": 20,
      "4th down conversions": 0,
      "4th down attempts": 1
    }
  },
  "Hawaii vs Nevada": {
    "stadium": "MackayStadium-Reno-NV",
    "Hawaii": {
      "points": 20,
      "1st downs": 19,
      "rushing 1st downs": 2,
      "passing 1st downs": 16,
      "penalty 1st downs": 1,
      "rushing yards": 34,
      "rushing attempts": 24,
      "passing yards": 291,
      "passing attempts": 40,
      "passing completions": 27,
      "passing interceptions": 3,
      "total yards": 325,
      "total plays": 64,
      "fumbles": 2,
      "fumbles lost": 1,
      "penalties": 10,
      "penalty yards": 79,
      "punts": 5,
      "punt yards": 185,
      "punt returns": 3,
      "punt return yards": 60,
      "kickoff returns": 3,
      "kickoff return yards": 77,
      "interception returns": 1,
      "interception return yards": 36,
      "3rd down conversions": 2,
      "3rd down attempts": 10,
      "4th down conversions": 0,
      "4th down attempts": 0
    },
    "Nevada": {
      "points": 30,
      "1st downs": 22,
      "rushing 1st downs": 13,
      "passing 1st downs": 6,
      "penalty 1st downs": 3,
      "rushing yards": 244,
      "rushing attempts": 56,
      "passing yards": 128,
      "passing attempts": 23,
      "passing completions": 12,
      "passing interceptions": 1,
      "total yards": 372,
      "total plays": 79,
      "fumbles": 1,
      "fumbles lost": 0,
      "penalties": 4,
      "penalty yards": 35,
      "punts": 5,
      "punt yards": 218,
      "punt returns": 0,
      "punt return yards": 0,
      "kickoff returns": 2,
      "kickoff return yards": 65,
      "interception returns": 3,
      "interception return yards": 53,
      "3rd down conversions": 6,
      "3rd down attempts": 15,
      "4th down conversions": 0,
      "4th down attempts": 1
    }
  },
  "Missouri vs Vanderbilt": {
    "stadium": "VanderbiltStadium-Nashville-TN",
    "Missouri": {
      "points": 3,
      "1st downs": 10,
      "rushing 1st downs": 3,
      "passing 1st downs": 5,
      "penalty 1st downs": 2,
      "rushing yards": 80,
      "rushing attempts": 19,
      "passing yards": 108,
      "passing attempts": 34,
      "passing completions": 14,
      "passing interceptions": 0,
      "total yards": 188,
      "total plays": 53,
      "fumbles": 2,
      "fumbles lost": 1,
      "penalties": 6,
      "penalty yards": 37,
      "punts": 9,
      "punt yards": 429,
      "punt returns": 2,
      "punt return yards": 9,
      "kickoff returns": 3,
      "kickoff return yards": 50,
      "interception returns": 0,
      "interception return yards": 0,
      "3rd down conversions": 0,
      "3rd down attempts": 14,
      "4th down conversions": 1,
      "4th down attempts": 2
    },
    "Vanderbilt": {
      "points": 10,
      "1st downs": 19,
      "rushing 1st downs": 10,
      "passing 1st downs": 8,
      "penalty 1st downs": 1,
      "rushing yards": 168,
      "rushing attempts": 49,
      "passing yards": 136,
      "passing attempts": 28,
      "passing completions": 17,
      "passing interceptions": 0,
      "total yards": 304,
      "total plays": 77,
      "fumbles": 1,
      "fumbles lost": 1,
      "penalties": 5,
      "penalty yards": 59,
      "punts": 7,
      "punt yards": 319,
      "punt returns": 7,
      "punt return yards": 71,
      "kickoff returns": 0,
      "kickoff return yards": 0,
      "interception returns": 0,
      "interception return yards": 0,
      "3rd down conversions": 8,
      "3rd down attempts": 19,
      "4th down conversions": 0,
      "4th down attempts": 1
    }
  },
  "SouthernMethodist vs SouthFlorida": {
    "stadium": "RaymondJamesStadium-Tampa-FL",
    "SouthernMethodist": {
      "points": 14,
      "1st downs": 19,
      "rushing 1st downs": 8,
      "passing 1st downs": 10,
      "penalty 1st downs": 1,
      "rushing yards": 132,
      "rushing attempts": 43,
      "passing yards": 233,
      "passing attempts": 37,
      "passing completions": 20,
      "passing interceptions": 1,
      "total yards": 365,
      "total plays": 80,
      "fumbles": 3,
      "fumbles lost": 3,
      "penalties": 5,
      "penalty yards": 55,
      "punts": 8,
      "punt yards": 332,
      "punt returns": 2,
      "punt return yards": 0,
      "kickoff returns": 7,
      "kickoff return yards": 144,
      "interception returns": 0,
      "interception return yards": 0,
      "3rd down conversions": 9,
      "3rd down attempts": 20,
      "4th down conversions": 0,
      "4th down attempts": 0
    },
    "SouthFlorida": {
      "points": 38,
      "1st downs": 15,
      "rushing 1st downs": 10,
      "passing 1st downs": 3,
      "penalty 1st downs": 2,
      "rushing yards": 255,
      "rushing attempts": 44,
      "passing yards": 97,
      "passing attempts": 21,
      "passing completions": 9,
      "passing interceptions": 0,
      "total yards": 352,
      "total plays": 65,
      "fumbles": 3,
      "fumbles lost": 1,
      "penalties": 4,
      "penalty yards": 40,
      "punts": 6,
      "punt yards": 251,
      "punt returns": 3,
      "punt return yards": 82,
      "kickoff returns": 1,
      "kickoff return yards": 17,
      "interception returns": 1,
      "interception return yards": 0,
      "3rd down conversions": 5,
      "3rd down attempts": 15,
      "4th down conversions": 1,
      "4th down attempts": 2
    }
  },
  "WashingtonState vs Arizona": {
    "stadium": "ArizonaStadium-Tucson-AZ",
    "WashingtonState": {
      "points": 45,
      "1st downs": 34,
      "rushing 1st downs": 9,
      "passing 1st downs": 23,
      "penalty 1st downs": 2,
      "rushing yards": 117,
      "rushing attempts": 31,
      "passing yards": 514,
      "passing attempts": 62,
      "passing completions": 47,
      "passing interceptions": 0,
      "total yards": 631,
      "total plays": 93,
      "fumbles": 3,
      "fumbles lost": 0,
      "penalties": 9,
      "penalty yards": 51,
      "punts": 3,
      "punt yards": 114,
      "punt returns": 3,
      "punt return yards": 7,
      "kickoff returns": 3,
      "kickoff return yards": 68,
      "interception returns": 0,
      "interception return yards": 0,
      "3rd down conversions": 10,
      "3rd down attempts": 16,
      "4th down conversions": 1,
      "4th down attempts": 2
    },
    "Arizona": {
      "points": 42,
      "1st downs": 24,
      "rushing 1st downs": 8,
      "passing 1st downs": 13,
      "penalty 1st downs": 3,
      "rushing yards": 176,
      "rushing attempts": 32,
      "passing yards": 307,
      "passing attempts": 37,
      "passing completions": 24,
      "passing interceptions": 0,
      "total yards": 483,
      "total plays": 69,
      "fumbles": 1,
      "fumbles lost": 1,
      "penalties": 5,
      "penalty yards": 40,
      "punts": 3,
      "punt yards": 148,
      "punt returns": 1,
      "punt return yards": 69,
      "kickoff returns": 2,
      "kickoff return yards": 39,
      "interception returns": 0,
      "interception return yards": 0,
      "3rd down conversions": 9,
      "3rd down attempts": 14,
      "4th down conversions": 1,
      "4th down attempts": 2
    }
  },
  "Connecticut vs Cincinnati": {
    "stadium": "NippertStadium-Cincinnati-OH",
    "Connecticut": {
      "points": 13,
      "1st downs": 19,
      "rushing 1st downs": 8,
      "passing 1st downs": 6,
      "penalty 1st downs": 5,
      "rushing yards": 136,
      "rushing attempts": 30,
      "passing yards": 130,
      "passing attempts": 41,
      "passing completions": 17,
      "passing interceptions": 1,
      "total yards": 266,
      "total plays": 71,
      "fumbles": 3,
      "fumbles lost": 1,
      "penalties": 3,
      "penalty yards": 25,
      "punts": 5,
      "punt yards": 181,
      "punt returns": 0,
      "punt return yards": 0,
      "kickoff returns": 3,
      "kickoff return yards": 62,
      "interception returns": 0,
      "interception return yards": 0,
      "3rd down conversions": 2,
      "3rd down attempts": 12,
      "4th down conversions": 0,
      "4th down attempts": 2
    },
    "Cincinnati": {
      "points": 37,
      "1st downs": 28,
      "rushing 1st downs": 14,
      "passing 1st downs": 14,
      "penalty 1st downs": 0,
      "rushing yards": 285,
      "rushing attempts": 49,
      "passing yards": 327,
      "passing attempts": 35,
      "passing completions": 26,
      "passing interceptions": 0,
      "total yards": 612,
      "total plays": 84,
      "fumbles": 1,
      "fumbles lost": 1,
      "penalties": 10,
      "penalty yards": 105,
      "punts": 2,
      "punt yards": 63,
      "punt returns": 0,
      "punt return yards": 0,
      "kickoff returns": 2,
      "kickoff return yards": 27,
      "interception returns": 1,
      "interception return yards": 0,
      "3rd down conversions": 4,
      "3rd down attempts": 14,
      "4th down conversions": 3,
      "4th down attempts": 4
    }
  },
  "LouisianaMonroe vs Idaho": {
    "stadium": "KibbieDome-Moscow-ID",
    "LouisianaMonroe": {
      "points": 13,
      "1st downs": 15,
      "rushing 1st downs": 3,
      "passing 1st downs": 9,
      "penalty 1st downs": 3,
      "rushing yards": 57,
      "rushing attempts": 23,
      "passing yards": 186,
      "passing attempts": 37,
      "passing completions": 19,
      "passing interceptions": 0,
      "total yards": 243,
      "total plays": 60,
      "fumbles": 1,
      "fumbles lost": 0,
      "penalties": 6,
      "penalty yards": 42,
      "punts": 7,
      "punt yards": 269,
      "punt returns": 1,
      "punt return yards": -4,
      "kickoff returns": 2,
      "kickoff return yards": 51,
      "interception returns": 1,
      "interception return yards": 26,
      "3rd down conversions": 2,
      "3rd down attempts": 13,
      "4th down conversions": 0,
      "4th down attempts": 2
    },
    "Idaho": {
      "points": 27,
      "1st downs": 28,
      "rushing 1st downs": 12,
      "passing 1st downs": 15,
      "penalty 1st downs": 1,
      "rushing yards": 174,
      "rushing attempts": 52,
      "passing yards": 315,
      "passing attempts": 39,
      "passing completions": 23,
      "passing interceptions": 1,
      "total yards": 489,
      "total plays": 91,
      "fumbles": 2,
      "fumbles lost": 2,
      "penalties": 5,
      "penalty yards": 65,
      "punts": 3,
      "punt yards": 136,
      "punt returns": 1,
      "punt return yards": -1,
      "kickoff returns": 3,
      "kickoff return yards": 53,
      "interception returns": 0,
      "interception return yards": 0,
      "3rd down conversions": 11,
      "3rd down attempts": 18,
      "4th down conversions": 0,
      "4th down attempts": 1
    }
  },
  "OldDominion vs FloridaInternational": {
    "stadium": "FIUStadium-Miami-FL",
    "OldDominion": {
      "points": 12,
      "1st downs": 0,
      "rushing 1st downs": 0,
      "passing 1st downs": 0,
      "penalty 1st downs": 0,
      "rushing yards": 297,
      "rushing attempts": 33,
      "passing yards": 201,
      "passing attempts": 34,
      "passing completions": 18,
      "passing interceptions": 1,
      "total yards": 498,
      "total plays": 67,
      "fumbles": 0,
      "fumbles lost": 0,
      "penalties": 6,
      "penalty yards": 41,
      "punts": 3,
      "punt yards": 159,
      "punt returns": 2,
      "punt return yards": 5,
      "kickoff returns": 3,
      "kickoff return yards": 55,
      "interception returns": 0,
      "interception return yards": 0,
      "3rd down conversions": 0,
      "3rd down attempts": 0,
      "4th down conversions": 0,
      "4th down attempts": 0
    },
    "FloridaInternational": {
      "points": 41,
      "1st downs": 0,
      "rushing 1st downs": 0,
      "passing 1st downs": 0,
      "penalty 1st downs": 0,
      "rushing yards": 58,
      "rushing attempts": 33,
      "passing yards": 390,
      "passing attempts": 39,
      "passing completions": 31,
      "passing interceptions": 0,
      "total yards": 448,
      "total plays": 72,
      "fumbles": 0,
      "fumbles lost": 0,
      "penalties": 3,
      "penalty yards": 30,
      "punts": 3,
      "punt yards": 110,
      "punt returns": 1,
      "punt return yards": 44,
      "kickoff returns": 2,
      "kickoff return yards": 54,
      "interception returns": 1,
      "interception return yards": 0,
      "3rd down conversions": 0,
      "3rd down attempts": 0,
      "4th down conversions": 0,
      "4th down attempts": 0
    }
  },
  "FloridaAtlantic vs UTEP": {
    "stadium": "SunBowlStadium-ElPaso-TX",
    "FloridaAtlantic": {
      "points": 17,
      "1st downs": 16,
      "rushing 1st downs": 2,
      "passing 1st downs": 11,
      "penalty 1st downs": 3,
      "rushing yards": 146,
      "rushing attempts": 30,
      "passing yards": 263,
      "passing attempts": 23,
      "passing completions": 14,
      "passing interceptions": 1,
      "total yards": 409,
      "total plays": 53,
      "fumbles": 2,
      "fumbles lost": 2,
      "penalties": 5,
      "penalty yards": 104,
      "punts": 4,
      "punt yards": 214,
      "punt returns": 1,
      "punt return yards": -1,
      "kickoff returns": 2,
      "kickoff return yards": 71,
      "interception returns": 0,
      "interception return yards": 0,
      "3rd down conversions": 4,
      "3rd down attempts": 10,
      "4th down conversions": 0,
      "4th down attempts": 1
    },
    "UTEP": {
      "points": 27,
      "1st downs": 20,
      "rushing 1st downs": 9,
      "passing 1st downs": 8,
      "penalty 1st downs": 3,
      "rushing yards": 139,
      "rushing attempts": 38,
      "passing yards": 271,
      "passing attempts": 39,
      "passing completions": 20,
      "passing interceptions": 0,
      "total yards": 410,
      "total plays": 77,
      "fumbles": 1,
      "fumbles lost": 1,
      "penalties": 6,
      "penalty yards": 57,
      "punts": 4,
      "punt yards": 168,
      "punt returns": 3,
      "punt return yards": -5,
      "kickoff returns": 1,
      "kickoff return yards": 30,
      "interception returns": 1,
      "interception return yards": 27,
      "3rd down conversions": 11,
      "3rd down attempts": 20,
      "4th down conversions": 1,
      "4th down attempts": 2
    }
  },
  "NewMexico vs SanJoseState": {
    "stadium": "SpartanStadiumCA-SanJose-CA",
    "NewMexico": {
      "points": 21,
      "1st downs": 16,
      "rushing 1st downs": 9,
      "passing 1st downs": 4,
      "penalty 1st downs": 3,
      "rushing yards": 205,
      "rushing attempts": 32,
      "passing yards": 130,
      "passing attempts": 20,
      "passing completions": 8,
      "passing interceptions": 1,
      "total yards": 335,
      "total plays": 52,
      "fumbles": 1,
      "fumbles lost": 1,
      "penalties": 3,
      "penalty yards": 34,
      "punts": 4,
      "punt yards": 149,
      "punt returns": 1,
      "punt return yards": 23,
      "kickoff returns": 3,
      "kickoff return yards": 66,
      "interception returns": 0,
      "interception return yards": 0,
      "3rd down conversions": 2,
      "3rd down attempts": 8,
      "4th down conversions": 0,
      "4th down attempts": 0
    },
    "SanJoseState": {
      "points": 31,
      "1st downs": 25,
      "rushing 1st downs": 15,
      "passing 1st downs": 8,
      "penalty 1st downs": 2,
      "rushing yards": 317,
      "rushing attempts": 57,
      "passing yards": 181,
      "passing attempts": 20,
      "passing completions": 16,
      "passing interceptions": 0,
      "total yards": 498,
      "total plays": 77,
      "fumbles": 0,
      "fumbles lost": 0,
      "penalties": 5,
      "penalty yards": 50,
      "punts": 3,
      "punt yards": 116,
      "punt returns": 1,
      "punt return yards": 7,
      "kickoff returns": 3,
      "kickoff return yards": 50,
      "interception returns": 1,
      "interception return yards": 11,
      "3rd down conversions": 9,
      "3rd down attempts": 15,
      "4th down conversions": 0,
      "4th down attempts": 2
    }
  },
  "SouthAlabama vs TexasState": {
    "stadium": "JimWackerFieldatBobcatStadium-SanMarcos-TX",
    "SouthAlabama": {
      "points": 18,
      "1st downs": 22,
      "rushing 1st downs": 12,
      "passing 1st downs": 7,
      "penalty 1st downs": 3,
      "rushing yards": 272,
      "rushing attempts": 47,
      "passing yards": 196,
      "passing attempts": 27,
      "passing completions": 16,
      "passing interceptions": 0,
      "total yards": 468,
      "total plays": 74,
      "fumbles": 0,
      "fumbles lost": 0,
      "penalties": 16,
      "penalty yards": 127,
      "punts": 8,
      "punt yards": 347,
      "punt returns": 1,
      "punt return yards": 5,
      "kickoff returns": 2,
      "kickoff return yards": 34,
      "interception returns": 1,
      "interception return yards": 0,
      "3rd down conversions": 5,
      "3rd down attempts": 16,
      "4th down conversions": 1,
      "4th down attempts": 2
    },
    "TexasState": {
      "points": 36,
      "1st downs": 19,
      "rushing 1st downs": 13,
      "passing 1st downs": 4,
      "penalty 1st downs": 2,
      "rushing yards": 319,
      "rushing attempts": 43,
      "passing yards": 105,
      "passing attempts": 23,
      "passing completions": 13,
      "passing interceptions": 1,
      "total yards": 424,
      "total plays": 66,
      "fumbles": 0,
      "fumbles lost": 0,
      "penalties": 11,
      "penalty yards": 111,
      "punts": 7,
      "punt yards": 334,
      "punt returns": 2,
      "punt return yards": 3,
      "kickoff returns": 3,
      "kickoff return yards": 55,
      "interception returns": 0,
      "interception return yards": 0,
      "3rd down conversions": 5,
      "3rd down attempts": 15,
      "4th down conversions": 1,
      "4th down attempts": 1
    }
  },
  "FloridaState vs GeorgiaTech": {
    "stadium": "BobbyDoddStadium-Atlanta-GA",
    "FloridaState": {
      "points": 16,
      "1st downs": 17,
      "rushing 1st downs": 4,
      "passing 1st downs": 11,
      "penalty 1st downs": 2,
      "rushing yards": 70,
      "rushing attempts": 24,
      "passing yards": 210,
      "passing attempts": 31,
      "passing completions": 20,
      "passing interceptions": 1,
      "total yards": 280,
      "total plays": 55,
      "fumbles": 1,
      "fumbles lost": 0,
      "penalties": 6,
      "penalty yards": 45,
      "punts": 4,
      "punt yards": 200,
      "punt returns": 1,
      "punt return yards": 1,
      "kickoff returns": 0,
      "kickoff return yards": 0,
      "interception returns": 2,
      "interception return yards": 63,
      "3rd down conversions": 2,
      "3rd down attempts": 10,
      "4th down conversions": 0,
      "4th down attempts": 0
    },
    "GeorgiaTech": {
      "points": 22,
      "1st downs": 15,
      "rushing 1st downs": 12,
      "passing 1st downs": 2,
      "penalty 1st downs": 1,
      "rushing yards": 261,
      "rushing attempts": 49,
      "passing yards": 67,
      "passing attempts": 10,
      "passing completions": 4,
      "passing interceptions": 2,
      "total yards": 328,
      "total plays": 59,
      "fumbles": 0,
      "fumbles lost": 0,
      "penalties": 5,
      "penalty yards": 41,
      "punts": 3,
      "punt yards": 115,
      "punt returns": 3,
      "punt return yards": 13,
      "kickoff returns": 1,
      "kickoff return yards": 1,
      "interception returns": 1,
      "interception return yards": 0,
      "3rd down conversions": 5,
      "3rd down attempts": 14,
      "4th down conversions": 1,
      "4th down attempts": 1
    }
  },
  "WesternKentucky vs LSU": {
    "stadium": "TigerStadium-BatonRouge-LA",
    "WesternKentucky": {
      "points": 20,
      "1st downs": 23,
      "rushing 1st downs": 7,
      "passing 1st downs": 16,
      "penalty 1st downs": 0,
      "rushing yards": 103,
      "rushing attempts": 23,
      "passing yards": 325,
      "passing attempts": 61,
      "passing completions": 37,
      "passing interceptions": 1,
      "total yards": 428,
      "total plays": 84,
      "fumbles": 3,
      "fumbles lost": 1,
      "penalties": 7,
      "penalty yards": 62,
      "punts": 5,
      "punt yards": 234,
      "punt returns": 1,
      "punt return yards": 8,
      "kickoff returns": 7,
      "kickoff return yards": 125,
      "interception returns": 0,
      "interception return yards": 0,
      "3rd down conversions": 5,
      "3rd down attempts": 15,
      "4th down conversions": 1,
      "4th down attempts": 4
    },
    "LSU": {
      "points": 48,
      "1st downs": 22,
      "rushing 1st downs": 11,
      "passing 1st downs": 7,
      "penalty 1st downs": 4,
      "rushing yards": 211,
      "rushing attempts": 43,
      "passing yards": 286,
      "passing attempts": 20,
      "passing completions": 11,
      "passing interceptions": 0,
      "total yards": 497,
      "total plays": 63,
      "fumbles": 2,
      "fumbles lost": 0,
      "penalties": 7,
      "penalty yards": 65,
      "punts": 4,
      "punt yards": 161,
      "punt returns": 1,
      "punt return yards": 4,
      "kickoff returns": 3,
      "kickoff return yards": 47,
      "interception returns": 1,
      "interception return yards": 7,
      "3rd down conversions": 6,
      "3rd down attempts": 12,
      "4th down conversions": 0,
      "4th down attempts": 0
    }
  },
  "TexasAM vs OleMiss": {
    "stadium": "VaughtHemingwayStadium-University-MS",
    "TexasAM": {
      "points": 3,
      "1st downs": 12,
      "rushing 1st downs": 4,
      "passing 1st downs": 5,
      "penalty 1st downs": 3,
      "rushing yards": 58,
      "rushing attempts": 27,
      "passing yards": 134,
      "passing attempts": 45,
      "passing completions": 18,
      "passing interceptions": 1,
      "total yards": 192,
      "total plays": 72,
      "fumbles": 3,
      "fumbles lost": 2,
      "penalties": 13,
      "penalty yards": 100,
      "punts": 10,
      "punt yards": 479,
      "punt returns": 1,
      "punt return yards": -4,
      "kickoff returns": 2,
      "kickoff return yards": 31,
      "interception returns": 3,
      "interception return yards": 14,
      "3rd down conversions": 6,
      "3rd down attempts": 20,
      "4th down conversions": 0,
      "4th down attempts": 2
    },
    "OleMiss": {
      "points": 23,
      "1st downs": 28,
      "rushing 1st downs": 14,
      "passing 1st downs": 8,
      "penalty 1st downs": 6,
      "rushing yards": 230,
      "rushing attempts": 51,
      "passing yards": 241,
      "passing attempts": 41,
      "passing completions": 26,
      "passing interceptions": 3,
      "total yards": 471,
      "total plays": 92,
      "fumbles": 2,
      "fumbles lost": 1,
      "penalties": 10,
      "penalty yards": 108,
      "punts": 6,
      "punt yards": 302,
      "punt returns": 5,
      "punt return yards": 19,
      "kickoff returns": 0,
      "kickoff return yards": 0,
      "interception returns": 1,
      "interception return yards": -2,
      "3rd down conversions": 8,
      "3rd down attempts": 20,
      "4th down conversions": 0,
      "4th down attempts": 0
    }
  },
  "Kentucky vs MississippiState": {
    "stadium": "DavisWadeStadiumatScottField-Starkville-MS",
    "Kentucky": {
      "points": 16,
      "1st downs": 30,
      "rushing 1st downs": 12,
      "passing 1st downs": 14,
      "penalty 1st downs": 4,
      "rushing yards": 163,
      "rushing attempts": 33,
      "passing yards": 260,
      "passing attempts": 52,
      "passing completions": 30,
      "passing interceptions": 3,
      "total yards": 423,
      "total plays": 85,
      "fumbles": 0,
      "fumbles lost": 0,
      "penalties": 3,
      "penalty yards": 30,
      "punts": 4,
      "punt yards": 153,
      "punt returns": 0,
      "punt return yards": 0,
      "kickoff returns": 4,
      "kickoff return yards": 70,
      "interception returns": 1,
      "interception return yards": 0,
      "3rd down conversions": 8,
      "3rd down attempts": 16,
      "4th down conversions": 0,
      "4th down attempts": 0
    },
    "MississippiState": {
      "points": 42,
      "1st downs": 30,
      "rushing 1st downs": 11,
      "passing 1st downs": 19,
      "penalty 1st downs": 0,
      "rushing yards": 204,
      "rushing attempts": 36,
      "passing yards": 382,
      "passing attempts": 36,
      "passing completions": 26,
      "passing interceptions": 1,
      "total yards": 586,
      "total plays": 72,
      "fumbles": 0,
      "fumbles lost": 0,
      "penalties": 6,
      "penalty yards": 62,
      "punts": 3,
      "punt yards": 112,
      "punt returns": 1,
      "punt return yards": 0,
      "kickoff returns": 2,
      "kickoff return yards": 38,
      "interception returns": 3,
      "interception return yards": 9,
      "3rd down conversions": 5,
      "3rd down attempts": 11,
      "4th down conversions": 1,
      "4th down attempts": 2
    }
  },
  "Utah vs USC": {
    "stadium": "LosAngelesMemorialColiseum-LosAngeles-CA",
    "Utah": {
      "points": 24,
      "1st downs": 20,
      "rushing 1st downs": 8,
      "passing 1st downs": 9,
      "penalty 1st downs": 3,
      "rushing yards": 99,
      "rushing attempts": 28,
      "passing yards": 254,
      "passing attempts": 36,
      "passing completions": 24,
      "passing interceptions": 4,
      "total yards": 353,
      "total plays": 64,
      "fumbles": 2,
      "fumbles lost": 0,
      "penalties": 4,
      "penalty yards": 34,
      "punts": 5,
      "punt yards": 216,
      "punt returns": 2,
      "punt return yards": 43,
      "kickoff returns": 5,
      "kickoff return yards": 91,
      "interception returns": 0,
      "interception return yards": 0,
      "3rd down conversions": 3,
      "3rd down attempts": 11,
      "4th down conversions": 0,
      "4th down attempts": 2
    },
    "USC": {
      "points": 42,
      "1st downs": 21,
      "rushing 1st downs": 8,
      "passing 1st downs": 11,
      "penalty 1st downs": 2,
      "rushing yards": 116,
      "rushing attempts": 45,
      "passing yards": 264,
      "passing attempts": 29,
      "passing completions": 21,
      "passing interceptions": 0,
      "total yards": 380,
      "total plays": 74,
      "fumbles": 1,
      "fumbles lost": 0,
      "penalties": 5,
      "penalty yards": 49,
      "punts": 3,
      "punt yards": 117,
      "punt returns": 2,
      "punt return yards": -1,
      "kickoff returns": 4,
      "kickoff return yards": 45,
      "interception returns": 4,
      "interception return yards": 123,
      "3rd down conversions": 5,
      "3rd down attempts": 13,
      "4th down conversions": 2,
      "4th down attempts": 3
    }
  },
  "Troy vs NewMexicoState": {
    "stadium": "AggieMemorialStadium-LasCruces-NM",
    "Troy": {
      "points": 52,
      "1st downs": 23,
      "rushing 1st downs": 4,
      "passing 1st downs": 16,
      "penalty 1st downs": 3,
      "rushing yards": 166,
      "rushing attempts": 24,
      "passing yards": 316,
      "passing attempts": 42,
      "passing completions": 26,
      "passing interceptions": 0,
      "total yards": 482,
      "total plays": 66,
      "fumbles": 0,
      "fumbles lost": 0,
      "penalties": 5,
      "penalty yards": 27,
      "punts": 6,
      "punt yards": 282,
      "punt returns": 2,
      "punt return yards": 31,
      "kickoff returns": 1,
      "kickoff return yards": 16,
      "interception returns": 0,
      "interception return yards": 0,
      "3rd down conversions": 2,
      "3rd down attempts": 11,
      "4th down conversions": 2,
      "4th down attempts": 2
    },
    "NewMexicoState": {
      "points": 7,
      "1st downs": 20,
      "rushing 1st downs": 14,
      "passing 1st downs": 6,
      "penalty 1st downs": 0,
      "rushing yards": 231,
      "rushing attempts": 47,
      "passing yards": 161,
      "passing attempts": 34,
      "passing completions": 13,
      "passing interceptions": 0,
      "total yards": 392,
      "total plays": 81,
      "fumbles": 3,
      "fumbles lost": 2,
      "penalties": 8,
      "penalty yards": 82,
      "punts": 7,
      "punt yards": 278,
      "punt returns": 5,
      "punt return yards": 54,
      "kickoff returns": 2,
      "kickoff return yards": 20,
      "interception returns": 0,
      "interception return yards": 0,
      "3rd down conversions": 4,
      "3rd down attempts": 18,
      "4th down conversions": 1,
      "4th down attempts": 4
    }
  },
  "OhioState vs Rutgers": {
    "stadium": "HighPointSolutionsStadium-Piscataway-NJ",
    "OhioState": {
      "points": 49,
      "1st downs": 27,
      "rushing 1st downs": 13,
      "passing 1st downs": 12,
      "penalty 1st downs": 2,
      "rushing yards": 281,
      "rushing attempts": 49,
      "passing yards": 247,
      "passing attempts": 21,
      "passing completions": 17,
      "passing interceptions": 0,
      "total yards": 528,
      "total plays": 70,
      "fumbles": 1,
      "fumbles lost": 1,
      "penalties": 0,
      "penalty yards": 0,
      "punts": 1,
      "punt yards": 29,
      "punt returns": 2,
      "punt return yards": 28,
      "kickoff returns": 1,
      "kickoff return yards": 20,
      "interception returns": 1,
      "interception return yards": 0,
      "3rd down conversions": 5,
      "3rd down attempts": 10,
      "4th down conversions": 2,
      "4th down attempts": 3
    },
    "Rutgers": {
      "points": 7,
      "1st downs": 12,
      "rushing 1st downs": 6,
      "passing 1st downs": 6,
      "penalty 1st downs": 0,
      "rushing yards": 104,
      "rushing attempts": 29,
      "passing yards": 189,
      "passing attempts": 27,
      "passing completions": 13,
      "passing interceptions": 1,
      "total yards": 293,
      "total plays": 56,
      "fumbles": 0,
      "fumbles lost": 0,
      "penalties": 7,
      "penalty yards": 55,
      "punts": 7,
      "punt yards": 275,
      "punt returns": 0,
      "punt return yards": 0,
      "kickoff returns": 5,
      "kickoff return yards": 64,
      "interception returns": 0,
      "interception return yards": 0,
      "3rd down conversions": 5,
      "3rd down attempts": 15,
      "4th down conversions": 1,
      "4th down attempts": 1
    }
  },
  "Wyoming vs BoiseState": {
    "stadium": "AlbertsonsStadium-Boise-ID",
    "Wyoming": {
      "points": 14,
      "1st downs": 16,
      "rushing 1st downs": 6,
      "passing 1st downs": 6,
      "penalty 1st downs": 4,
      "rushing yards": 110,
      "rushing attempts": 33,
      "passing yards": 123,
      "passing attempts": 21,
      "passing completions": 12,
      "passing interceptions": 1,
      "total yards": 233,
      "total plays": 54,
      "fumbles": 1,
      "fumbles lost": 0,
      "penalties": 5,
      "penalty yards": 35,
      "punts": 7,
      "punt yards": 267,
      "punt returns": 0,
      "punt return yards": 0,
      "kickoff returns": 4,
      "kickoff return yards": 80,
      "interception returns": 0,
      "interception return yards": 0,
      "3rd down conversions": 3,
      "3rd down attempts": 10,
      "4th down conversions": 0,
      "4th down attempts": 0
    },
    "BoiseState": {
      "points": 34,
      "1st downs": 24,
      "rushing 1st downs": 12,
      "passing 1st downs": 11,
      "penalty 1st downs": 1,
      "rushing yards": 207,
      "rushing attempts": 47,
      "passing yards": 211,
      "passing attempts": 28,
      "passing completions": 22,
      "passing interceptions": 0,
      "total yards": 418,
      "total plays": 75,
      "fumbles": 2,
      "fumbles lost": 1,
      "penalties": 8,
      "penalty yards": 74,
      "punts": 3,
      "punt yards": 123,
      "punt returns": 3,
      "punt return yards": 12,
      "kickoff returns": 2,
      "kickoff return yards": 58,
      "interception returns": 1,
      "interception return yards": 45,
      "3rd down conversions": 12,
      "3rd down attempts": 19,
      "4th down conversions": 1,
      "4th down attempts": 1
    }
  },
  "Colorado vs OregonState": {
    "stadium": "ReserStadium-Corvallis-OR",
    "Colorado": {
      "points": 17,
      "1st downs": 20,
      "rushing 1st downs": 11,
      "passing 1st downs": 8,
      "penalty 1st downs": 1,
      "rushing yards": 188,
      "rushing attempts": 45,
      "passing yards": 140,
      "passing attempts": 23,
      "passing completions": 16,
      "passing interceptions": 0,
      "total yards": 328,
      "total plays": 68,
      "fumbles": 1,
      "fumbles lost": 0,
      "penalties": 9,
      "penalty yards": 80,
      "punts": 6,
      "punt yards": 252,
      "punt returns": 0,
      "punt return yards": 0,
      "kickoff returns": 3,
      "kickoff return yards": 58,
      "interception returns": 1,
      "interception return yards": 0,
      "3rd down conversions": 5,
      "3rd down attempts": 14,
      "4th down conversions": 1,
      "4th down attempts": 1
    },
    "OregonState": {
      "points": 13,
      "1st downs": 17,
      "rushing 1st downs": 9,
      "passing 1st downs": 7,
      "penalty 1st downs": 1,
      "rushing yards": 202,
      "rushing attempts": 41,
      "passing yards": 199,
      "passing attempts": 32,
      "passing completions": 13,
      "passing interceptions": 1,
      "total yards": 401,
      "total plays": 73,
      "fumbles": 1,
      "fumbles lost": 0,
      "penalties": 8,
      "penalty yards": 65,
      "punts": 3,
      "punt yards": 110,
      "punt returns": 0,
      "punt return yards": 0,
      "kickoff returns": 4,
      "kickoff return yards": 110,
      "interception returns": 0,
      "interception return yards": 0,
      "3rd down conversions": 6,
      "3rd down attempts": 15,
      "4th down conversions": 0,
      "4th down attempts": 3
    }
  },
  "Washington vs Stanford": {
    "stadium": "StanfordStadium-Stanford-CA",
    "Washington": {
      "points": 14,
      "1st downs": 11,
      "rushing 1st downs": 6,
      "passing 1st downs": 5,
      "penalty 1st downs": 0,
      "rushing yards": 113,
      "rushing attempts": 24,
      "passing yards": 118,
      "passing attempts": 21,
      "passing completions": 9,
      "passing interceptions": 0,
      "total yards": 231,
      "total plays": 45,
      "fumbles": 0,
      "fumbles lost": 0,
      "penalties": 3,
      "penalty yards": 30,
      "punts": 7,
      "punt yards": 314,
      "punt returns": 2,
      "punt return yards": -3,
      "kickoff returns": 4,
      "kickoff return yards": 104,
      "interception returns": 1,
      "interception return yards": 0,
      "3rd down conversions": 4,
      "3rd down attempts": 11,
      "4th down conversions": 0,
      "4th down attempts": 0
    },
    "Stanford": {
      "points": 31,
      "1st downs": 25,
      "rushing 1st downs": 9,
      "passing 1st downs": 14,
      "penalty 1st downs": 2,
      "rushing yards": 188,
      "rushing attempts": 48,
      "passing yards": 290,
      "passing attempts": 24,
      "passing completions": 17,
      "passing interceptions": 1,
      "total yards": 478,
      "total plays": 72,
      "fumbles": 0,
      "fumbles lost": 0,
      "penalties": 6,
      "penalty yards": 53,
      "punts": 3,
      "punt yards": 144,
      "punt returns": 0,
      "punt return yards": 0,
      "kickoff returns": 3,
      "kickoff return yards": 79,
      "interception returns": 0,
      "interception return yards": 0,
      "3rd down conversions": 6,
      "3rd down attempts": 14,
      "4th down conversions": 2,
      "4th down attempts": 2
    }
  }
}