{
  "games": [
    {"game": {
      "away": {
        "conferenceNames": {
          "conferenceDisplay": "Sun Belt Conference",
          "conferenceDivision": "fbs",
          "conferenceName": "Sun Belt",
          "conferenceSeo": "sun-belt"
        },
        "description": "(3-3)",
        "names": {
          "char6": "ARK ST",
          "full": "Arkansas State University",
          "seo": "arkansas-st",
          "short": "Arkansas St."
        },
        "rank": "",
        "score": "49",
        "seed": "",
        "winner": true
      },
      "bracketId": "",
      "bracketRegion": "",
      "bracketRound": "",
      "contestClock": "0:00",
      "currentPeriod": "Final",
      "finalMessage": "Final",
      "gameID": "76f90c56-e971-42ec-9c2e-fb2d06884e4a",
      "gameState": "final",
      "home": {
        "conferenceNames": {
          "conferenceDisplay": "Sun Belt Conference",
          "conferenceDivision": "fbs",
          "conferenceName": "Sun Belt",
          "conferenceSeo": "sun-belt"
        },
        "description": "(3-3)",
        "names": {
          "char6": "S ALA",
          "full": "University of South Alabama",
          "seo": "south-ala",
          "short": "South Ala."
        },
        "rank": "",
        "score": "31",
        "seed": "",
        "winner": false
      },
      "liveVideoEnabled": false,
      "network": "",
      "startDate": "10-13-2015",
      "startTime": "08:00PM ET",
      "startTimeEpoch": "1444780800",
      "title": "South Ala. Arkansas St.",
      "url": "/game/football/fbs/2015/10/13/arkansas-st-south-ala",
      "videoState": ""
    }},
    {"game": {
      "away": {
        "conferenceNames": {
          "conferenceDisplay": "Southeastern Conference",
          "conferenceDivision": "fbs",
          "conferenceName": "SEC",
          "conferenceSeo": "southeastern"
        },
        "description": "(4-2)",
        "names": {
          "char6": "AUBURN",
          "full": "Auburn University",
          "seo": "auburn",
          "short": "Auburn"
        },
        "rank": "",
        "score": "30",
        "seed": "",
        "winner": true
      },
      "bracketId": "",
      "bracketRegion": "",
      "bracketRound": "",
      "contestClock": "0:00",
      "currentPeriod": "Final",
      "finalMessage": "Final",
      "gameID": "a575c4a3-47d5-4f6a-a901-496eb78903dd",
      "gameState": "final",
      "home": {
        "conferenceNames": {
          "conferenceDisplay": "Southeastern Conference",
          "conferenceDivision": "fbs",
          "conferenceName": "SEC",
          "conferenceSeo": "southeastern"
        },
        "description": "(4-2)",
        "names": {
          "char6": "UK",
          "full": "University of Kentucky",
          "seo": "kentucky",
          "short": "Kentucky"
        },
        "rank": "",
        "score": "27",
        "seed": "",
        "winner": false
      },
      "liveVideoEnabled": false,
      "network": "",
      "startDate": "10-15-2015",
      "startTime": "07:00PM ET",
      "startTimeEpoch": "1444950000",
      "title": "Kentucky Auburn",
      "url": "/game/football/fbs/2015/10/15/auburn-kentucky",
      "videoState": ""
    }},
    {"game": {
      "away": {
        "conferenceNames": {
          "conferenceDisplay": "Conference USA",
          "conferenceDivision": "fbs",
          "conferenceName": "C-USA",
          "conferenceSeo": "conference-usa"
        },
        "description": "(6-1)",
        "names": {
          "char6": "W KY",
          "full": "Western Kentucky University",
          "seo": "western-ky",
          "short": "Western Ky."
        },
        "rank": "",
        "score": "55",
        "seed": "",
        "winner": true
      },
      "bracketId": "",
      "bracketRegion": "",
      "bracketRound": "",
      "contestClock": "0:00",
      "currentPeriod": "Final",
      "finalMessage": "Final",
      "gameID": "c91de43f-0f77-4fbf-8ca0-e8386725b69c",
      "gameState": "final",
      "home": {
        "conferenceNames": {
          "conferenceDisplay": "Conference USA",
          "conferenceDivision": "fbs",
          "conferenceName": "C-USA",
          "conferenceSeo": "conference-usa"
        },
        "description": "(0-6)",
        "names": {
          "char6": "NO TEX",
          "full": "University of North Texas",
          "seo": "north-texas",
          "short": "North Texas"
        },
        "rank": "",
        "score": "28",
        "seed": "",
        "winner": false
      },
      "liveVideoEnabled": false,
      "network": "",
      "startDate": "10-15-2015",
      "startTime": "07:30PM ET",
      "startTimeEpoch": "1444951800",
      "title": "North Texas Western Ky.",
      "url": "/game/football/fbs/2015/10/15/western-ky-north-texas",
      "videoState": ""
    }},
    {"game": {
      "away": {
        "conferenceNames": {
          "conferenceDisplay": "Pac-12 Conference",
          "conferenceDivision": "fbs",
          "conferenceName": "Pac-12",
          "conferenceSeo": "pac-12"
        },
        "description": "(4-2)",
        "names": {
          "char6": "UCLA",
          "full": "University of California, Los Angeles",
          "seo": "ucla",
          "short": "UCLA"
        },
        "rank": "18",
        "score": "35",
        "seed": "",
        "winner": false
      },
      "bracketId": "",
      "bracketRegion": "",
      "bracketRound": "",
      "contestClock": "0:00",
      "currentPeriod": "Final",
      "finalMessage": "Final",
      "gameID": "af7b774b-1ccc-4b79-9641-528efee2468b",
      "gameState": "final",
      "home": {
        "conferenceNames": {
          "conferenceDisplay": "Pac-12 Conference",
          "conferenceDivision": "fbs",
          "conferenceName": "Pac-12",
          "conferenceSeo": "pac-12"
        },
        "description": "(5-1)",
        "names": {
          "char6": "STAN",
          "full": "Stanford University",
          "seo": "stanford",
          "short": "Stanford"
        },
        "rank": "15",
        "score": "56",
        "seed": "",
        "winner": true
      },
      "liveVideoEnabled": false,
      "network": "",
      "startDate": "10-15-2015",
      "startTime": "10:30PM ET",
      "startTimeEpoch": "1444962600",
      "title": "Stanford UCLA",
      "url": "/game/football/fbs/2015/10/15/ucla-stanford",
      "videoState": ""
    }},
    {"game": {
      "away": {
        "conferenceNames": {
          "conferenceDisplay": "American Athletic Conference",
          "conferenceDivision": "fbs",
          "conferenceName": "AAC",
          "conferenceSeo": "american-athletic"
        },
        "description": "(3-3)",
        "names": {
          "char6": "CINCY",
          "full": "University of Cincinnati",
          "seo": "cincinnati",
          "short": "Cincinnati"
        },
        "rank": "",
        "score": "24",
        "seed": "",
        "winner": false
      },
      "bracketId": "",
      "bracketRegion": "",
      "bracketRound": "",
      "contestClock": "0:00",
      "currentPeriod": "Final",
      "finalMessage": "Final",
      "gameID": "d9e66227-eea3-4edd-a194-f7774025fdf1",
      "gameState": "final",
      "home": {
        "conferenceNames": {
          "conferenceDisplay": "FBS Independent",
          "conferenceDivision": "fbs",
          "conferenceName": "IND",
          "conferenceSeo": "fbs-independent"
        },
        "description": "(5-2)",
        "names": {
          "char6": "BYU",
          "full": "Brigham Young University",
          "seo": "byu",
          "short": "BYU"
        },
        "rank": "",
        "score": "38",
        "seed": "",
        "winner": true
      },
      "liveVideoEnabled": false,
      "network": "",
      "startDate": "10-16-2015",
      "startTime": "08:00PM ET",
      "startTimeEpoch": "1445040000",
      "title": "BYU Cincinnati",
      "url": "/game/football/fbs/2015/10/16/cincinnati-byu",
      "videoState": ""
    }},
    {"game": {
      "away": {
        "conferenceNames": {
          "conferenceDisplay": "Mountain West Conference",
          "conferenceDivision": "fbs",
          "conferenceName": "MWC",
          "conferenceSeo": "mountain-west"
        },
        "description": "(5-2)",
        "names": {
          "char6": "BOISE",
          "full": "Boise State University",
          "seo": "boise-st",
          "short": "Boise St."
        },
        "rank": "21",
        "score": "26",
        "seed": "",
        "winner": false
      },
      "bracketId": "",
      "bracketRegion": "",
      "bracketRound": "",
      "contestClock": "0:00",
      "currentPeriod": "Final",
      "finalMessage": "Final",
      "gameID": "2fb24723-86e2-49e6-9aa9-3248fc6d445a",
      "gameState": "final",
      "home": {
        "conferenceNames": {
          "conferenceDisplay": "Mountain West Conference",
          "conferenceDivision": "fbs",
          "conferenceName": "MWC",
          "conferenceSeo": "mountain-west"
        },
        "description": "(4-2)",
        "names": {
          "char6": "UT ST",
          "full": "Utah State University",
          "seo": "utah-st",
          "short": "Utah St."
        },
        "rank": "",
        "score": "52",
        "seed": "",
        "winner": true
      },
      "liveVideoEnabled": false,
      "network": "",
      "startDate": "10-16-2015",
      "startTime": "09:00PM ET",
      "startTimeEpoch": "1445043600",
      "title": "Utah St. Boise St.",
      "url": "/game/football/fbs/2015/10/16/boise-st-utah-st",
      "videoState": ""
    }},
    {"game": {
      "away": {
        "conferenceNames": {
          "conferenceDisplay": "American Athletic Conference",
          "conferenceDivision": "fbs",
          "conferenceName": "AAC",
          "conferenceSeo": "american-athletic"
        },
        "description": "(6-0)",
        "names": {
          "char6": "HOU",
          "full": "University of Houston",
          "seo": "houston",
          "short": "Houston"
        },
        "rank": "24",
        "score": "42",
        "seed": "",
        "winner": true
      },
      "bracketId": "",
      "bracketRegion": "",
      "bracketRound": "",
      "contestClock": "0:00",
      "currentPeriod": "Final",
      "finalMessage": "Final",
      "gameID": "7f768056-0509-45d8-bb01-d68eda9bc62c",
      "gameState": "final",
      "home": {
        "conferenceNames": {
          "conferenceDisplay": "American Athletic Conference",
          "conferenceDivision": "fbs",
          "conferenceName": "AAC",
          "conferenceSeo": "american-athletic"
        },
        "description": "(2-4)",
        "names": {
          "char6": "TULANE",
          "full": "Tulane University",
          "seo": "tulane",
          "short": "Tulane"
        },
        "rank": "",
        "score": "7",
        "seed": "",
        "winner": false
      },
      "liveVideoEnabled": false,
      "network": "",
      "startDate": "10-16-2015",
      "startTime": "09:00PM ET",
      "startTimeEpoch": "1445043600",
      "title": "Tulane Houston",
      "url": "/game/football/fbs/2015/10/16/houston-tulane",
      "videoState": ""
    }},
    {"game": {
      "away": {
        "conferenceNames": {
          "conferenceDisplay": "Mountain West Conference",
          "conferenceDivision": "fbs",
          "conferenceName": "MWC",
          "conferenceSeo": "mountain-west"
        },
        "description": "(2-5)",
        "names": {
          "char6": "UNLV",
          "full": "University of Nevada, Las Vegas",
          "seo": "unlv",
          "short": "UNLV"
        },
        "rank": "",
        "score": "28",
        "seed": "",
        "winner": false
      },
      "bracketId": "",
      "bracketRegion": "",
      "bracketRound": "",
      "contestClock": "0:00",
      "currentPeriod": "Final",
      "finalMessage": "Final",
      "gameID": "21bf501e-f7fc-4156-9620-a3bc5a71dc31",
      "gameState": "final",
      "home": {
        "conferenceNames": {
          "conferenceDisplay": "Mountain West Conference",
          "conferenceDivision": "fbs",
          "conferenceName": "MWC",
          "conferenceSeo": "mountain-west"
        },
        "description": "(2-5)",
        "names": {
          "char6": "FRESNO",
          "full": "California State University, Fresno",
          "seo": "fresno-st",
          "short": "Fresno St."
        },
        "rank": "",
        "score": "31",
        "seed": "",
        "winner": true
      },
      "liveVideoEnabled": false,
      "network": "",
      "startDate": "10-16-2015",
      "startTime": "10:30PM ET",
      "startTimeEpoch": "1445049000",
      "title": "Fresno St. UNLV",
      "url": "/game/football/fbs/2015/10/16/unlv-fresno-st",
      "videoState": ""
    }},
    {"game": {
      "away": {
        "conferenceNames": {
          "conferenceDisplay": "Conference USA",
          "conferenceDivision": "fbs",
          "conferenceName": "C-USA",
          "conferenceSeo": "conference-usa"
        },
        "description": "(3-4)",
        "names": {
          "char6": "FIU",
          "full": "Florida International University",
          "seo": "fiu",
          "short": "FIU"
        },
        "rank": "",
        "score": "34",
        "seed": "",
        "winner": false
      },
      "bracketId": "",
      "bracketRegion": "",
      "bracketRound": "",
      "contestClock": "0:00",
      "currentPeriod": "Final",
      "finalMessage": "Final",
      "gameID": "da094c78-e5cc-4422-924e-135e6ac6ce97",
      "gameState": "final",
      "home": {
        "conferenceNames": {
          "conferenceDisplay": "Conference USA",
          "conferenceDivision": "fbs",
          "conferenceName": "C-USA",
          "conferenceSeo": "conference-usa"
        },
        "description": "(3-4)",
        "names": {
          "char6": "MIDTEN",
          "full": "Middle Tennessee State University",
          "seo": "middle-tenn",
          "short": "Middle Tenn."
        },
        "rank": "",
        "score": "42",
        "seed": "",
        "winner": true
      },
      "liveVideoEnabled": false,
      "network": "",
      "startDate": "10-17-2015",
      "startTime": "12:00PM ET",
      "startTimeEpoch": "1445097600",
      "title": "Middle Tenn. FIU",
      "url": "/game/football/fbs/2015/10/17/fiu-middle-tenn",
      "videoState": ""
    }},
    {"game": {
      "away": {
        "conferenceNames": {
          "conferenceDisplay": "Conference USA",
          "conferenceDivision": "fbs",
          "conferenceName": "C-USA",
          "conferenceSeo": "conference-usa"
        },
        "description": "(6-1)",
        "names": {
          "char6": "MARSH",
          "full": "Marshall University",
          "seo": "marshall",
          "short": "Marshall"
        },
        "rank": "",
        "score": "33",
        "seed": "",
        "winner": true
      },
      "bracketId": "",
      "bracketRegion": "",
      "bracketRound": "",
      "contestClock": "0:00",
      "currentPeriod": "Final",
      "finalMessage": "Final",
      "gameID": "4cecdf04-d5ca-452f-a290-7d334118ccf4",
      "gameState": "final",
      "home": {
        "conferenceNames": {
          "conferenceDisplay": "Conference USA",
          "conferenceDivision": "fbs",
          "conferenceName": "C-USA",
          "conferenceSeo": "conference-usa"
        },
        "description": "(1-5)",
        "names": {
          "char6": "FAU",
          "full": "Florida Atlantic University",
          "seo": "fla-atlantic",
          "short": "Fla. Atlantic"
        },
        "rank": "",
        "score": "17",
        "seed": "",
        "winner": false
      },
      "liveVideoEnabled": false,
      "network": "",
      "startDate": "10-17-2015",
      "startTime": "12:00PM ET",
      "startTimeEpoch": "1445097600",
      "title": "Fla. Atlantic Marshall",
      "url": "/game/football/fbs/2015/10/17/marshall-fla-atlantic",
      "videoState": ""
    }},
    {"game": {
      "away": {
        "conferenceNames": {
          "conferenceDisplay": "Big Ten Conference",
          "conferenceDivision": "fbs",
          "conferenceName": "Big Ten",
          "conferenceSeo": "big-ten"
        },
        "description": "(7-0)",
        "names": {
          "char6": "IOWA",
          "full": "University of Iowa",
          "seo": "iowa",
          "short": "Iowa"
        },
        "rank": "17",
        "score": "40",
        "seed": "",
        "winner": true
      },
      "bracketId": "",
      "bracketRegion": "",
      "bracketRound": "",
      "contestClock": "0:00",
      "currentPeriod": "Final",
      "finalMessage": "Final",
      "gameID": "48cb5be3-fefb-4ea1-95cf-e7658dd37b53",
      "gameState": "final",
      "home": {
        "conferenceNames": {
          "conferenceDisplay": "Big Ten Conference",
          "conferenceDivision": "fbs",
          "conferenceName": "Big Ten",
          "conferenceSeo": "big-ten"
        },
        "description": "(5-2)",
        "names": {
          "char6": "NWSTRN",
          "full": "Northwestern University",
          "seo": "northwestern",
          "short": "Northwestern"
        },
        "rank": "20",
        "score": "10",
        "seed": "",
        "winner": false
      },
      "liveVideoEnabled": false,
      "network": "",
      "startDate": "10-17-2015",
      "startTime": "12:00PM ET",
      "startTimeEpoch": "1445097600",
      "title": "Northwestern Iowa",
      "url": "/game/football/fbs/2015/10/17/iowa-northwestern",
      "videoState": ""
    }},
    {"game": {
      "away": {
        "conferenceNames": {
          "conferenceDisplay": "Mid-American Conference",
          "conferenceDivision": "fbs",
          "conferenceName": "MAC",
          "conferenceSeo": "mid-american"
        },
        "description": "(1-6)",
        "names": {
          "char6": "E MICH",
          "full": "Eastern Michigan University",
          "seo": "eastern-mich",
          "short": "Eastern Mich."
        },
        "rank": "",
        "score": "20",
        "seed": "",
        "winner": false
      },
      "bracketId": "",
      "bracketRegion": "",
      "bracketRound": "",
      "contestClock": "0:00",
      "currentPeriod": "Final",
      "finalMessage": "Final",
      "gameID": "67eb7b3f-6c64-47f8-98d5-f8a1265aa4f5",
      "gameState": "final",
      "home": {
        "conferenceNames": {
          "conferenceDisplay": "Mid-American Conference",
          "conferenceDivision": "fbs",
          "conferenceName": "MAC",
          "conferenceSeo": "mid-american"
        },
        "description": "(6-0)",
        "names": {
          "char6": "TOLEDO",
          "full": "University of Toledo",
          "seo": "toledo",
          "short": "Toledo"
        },
        "rank": "22",
        "score": "63",
        "seed": "",
        "winner": true
      },
      "liveVideoEnabled": false,
      "network": "",
      "startDate": "10-17-2015",
      "startTime": "12:00PM ET",
      "startTimeEpoch": "1445097600",
      "title": "Toledo Eastern Mich.",
      "url": "/game/football/fbs/2015/10/17/eastern-mich-toledo",
      "videoState": ""
    }},
    {"game": {
      "away": {
        "conferenceNames": {
          "conferenceDisplay": "American Athletic Conference",
          "conferenceDivision": "fbs",
          "conferenceName": "AAC",
          "conferenceSeo": "american-athletic"
        },
        "description": "(3-3)",
        "names": {
          "char6": "TULSA",
          "full": "University of Tulsa",
          "seo": "tulsa",
          "short": "Tulsa"
        },
        "rank": "",
        "score": "17",
        "seed": "",
        "winner": false
      },
      "bracketId": "",
      "bracketRegion": "",
      "bracketRound": "",
      "contestClock": "0:00",
      "currentPeriod": "Final",
      "finalMessage": "Final",
      "gameID": "823bc893-654f-4771-ba58-042044528cea",
      "gameState": "final",
      "home": {
        "conferenceNames": {
          "conferenceDisplay": "American Athletic Conference",
          "conferenceDivision": "fbs",
          "conferenceName": "AAC",
          "conferenceSeo": "american-athletic"
        },
        "description": "(4-3)",
        "names": {
          "char6": "E CAR",
          "full": "East Carolina University",
          "seo": "east-carolina",
          "short": "East Carolina"
        },
        "rank": "",
        "score": "30",
        "seed": "",
        "winner": true
      },
      "liveVideoEnabled": false,
      "network": "",
      "startDate": "10-17-2015",
      "startTime": "12:00PM ET",
      "startTimeEpoch": "1445097600",
      "title": "East Carolina Tulsa",
      "url": "/game/football/fbs/2015/10/17/tulsa-east-carolina",
      "videoState": ""
    }},
    {"game": {
      "away": {
        "conferenceNames": {
          "conferenceDisplay": "Big 12 Conference",
          "conferenceDivision": "fbs",
          "conferenceName": "Big 12",
          "conferenceSeo": "big-12"
        },
        "description": "(5-2)",
        "names": {
          "char6": "TXTECH",
          "full": "Texas Tech University",
          "seo": "texas-tech",
          "short": "Texas Tech"
        },
        "rank": "",
        "score": "30",
        "seed": "",
        "winner": true
      },
      "bracketId": "",
      "bracketRegion": "",
      "bracketRound": "",
      "contestClock": "0:00",
      "currentPeriod": "Final",
      "finalMessage": "Final",
      "gameID": "7f3a8243-265d-45bc-abba-19fb7b5e2eef",
      "gameState": "final",
      "home": {
        "conferenceNames": {
          "conferenceDisplay": "Big 12 Conference",
          "conferenceDivision": "fbs",
          "conferenceName": "Big 12",
          "conferenceSeo": "big-12"
        },
        "description": "(0-6)",
        "names": {
          "char6": "KANSAS",
          "full": "University of Kansas",
          "seo": "kansas",
          "short": "Kansas"
        },
        "rank": "",
        "score": "20",
        "seed": "",
        "winner": false
      },
      "liveVideoEnabled": false,
      "network": "",
      "startDate": "10-17-2015",
      "startTime": "12:00PM ET",
      "startTimeEpoch": "1445097600",
      "title": "Kansas Texas Tech",
      "url": "/game/football/fbs/2015/10/17/texas-tech-kansas",
      "videoState": ""
    }},
    {"game": {
      "away": {
        "conferenceNames": {
          "conferenceDisplay": "Southeastern Conference",
          "conferenceDivision": "fbs",
          "conferenceName": "SEC",
          "conferenceSeo": "southeastern"
        },
        "description": "(5-2)",
        "names": {
          "char6": "MISS",
          "full": "University of Mississippi",
          "seo": "ole-miss",
          "short": "Ole Miss"
        },
        "rank": "13",
        "score": "24",
        "seed": "",
        "winner": false
      },
      "bracketId": "",
      "bracketRegion": "",
      "bracketRound": "",
      "contestClock": "0:00",
      "currentPeriod": "Final",
      "finalMessage": "Final",
      "gameID": "45099eed-ea4b-4c2c-b597-81e2f4addd1a",
      "gameState": "final",
      "home": {
        "conferenceNames": {
          "conferenceDisplay": "American Athletic Conference",
          "conferenceDivision": "fbs",
          "conferenceName": "AAC",
          "conferenceSeo": "american-athletic"
        },
        "description": "(6-0)",
        "names": {
          "char6": "MEM",
          "full": "University of Memphis",
          "seo": "memphis",
          "short": "Memphis"
        },
        "rank": "",
        "score": "37",
        "seed": "",
        "winner": true
      },
      "liveVideoEnabled": false,
      "network": "",
      "startDate": "10-17-2015",
      "startTime": "12:00PM ET",
      "startTimeEpoch": "1445097600",
      "title": "Memphis Ole Miss",
      "url": "/game/football/fbs/2015/10/17/ole-miss-memphis",
      "videoState": ""
    }},
    {"game": {
      "away": {
        "conferenceNames": {
          "conferenceDisplay": "Big Ten Conference",
          "conferenceDivision": "fbs",
          "conferenceName": "Big Ten",
          "conferenceSeo": "big-ten"
        },
        "description": "(1-6)",
        "names": {
          "char6": "PURDUE",
          "full": "Purdue University",
          "seo": "purdue",
          "short": "Purdue"
        },
        "rank": "",
        "score": "7",
        "seed": "",
        "winner": false
      },
      "bracketId": "",
      "bracketRegion": "",
      "bracketRound": "",
      "contestClock": "0:00",
      "currentPeriod": "Final",
      "finalMessage": "Final",
      "gameID": "5872971f-bae0-479d-9294-36e0dbefbc9b",
      "gameState": "final",
      "home": {
        "conferenceNames": {
          "conferenceDisplay": "Big Ten Conference",
          "conferenceDivision": "fbs",
          "conferenceName": "Big Ten",
          "conferenceSeo": "big-ten"
        },
        "description": "(5-2)",
        "names": {
          "char6": "WISC",
          "full": "University of Wisconsin, Madison",
          "seo": "wisconsin",
          "short": "Wisconsin"
        },
        "rank": "",
        "score": "24",
        "seed": "",
        "winner": true
      },
      "liveVideoEnabled": false,
      "network": "",
      "startDate": "10-17-2015",
      "startTime": "12:00PM ET",
      "startTimeEpoch": "1445097600",
      "title": "Wisconsin Purdue",
      "url": "/game/football/fbs/2015/10/17/purdue-wisconsin",
      "videoState": ""
    }},
    {"game": {
      "away": {
        "conferenceNames": {
          "conferenceDisplay": "Mid-American Conference",
          "conferenceDivision": "fbs",
          "conferenceName": "MAC",
          "conferenceSeo": "mid-american"
        },
        "description": "(3-3)",
        "names": {
          "char6": "W MICH",
          "full": "Western Michigan University",
          "seo": "western-mich",
          "short": "Western Mich."
        },
        "rank": "",
        "score": "49",
        "seed": "",
        "winner": true
      },
      "bracketId": "",
      "bracketRegion": "",
      "bracketRound": "",
      "contestClock": "0:00",
      "currentPeriod": "Final",
      "finalMessage": "Final",
      "gameID": "5e886fa5-e3d7-4acc-8a10-19c1f0a44c6a",
      "gameState": "final",
      "home": {
        "conferenceNames": {
          "conferenceDisplay": "Mid-American Conference",
          "conferenceDivision": "fbs",
          "conferenceName": "MAC",
          "conferenceSeo": "mid-american"
        },
        "description": "(5-2)",
        "names": {
          "char6": "OHIO",
          "full": "Ohio University",
          "seo": "ohio",
          "short": "Ohio"
        },
        "rank": "",
        "score": "14",
        "seed": "",
        "winner": false
      },
      "liveVideoEnabled": false,
      "network": "",
      "startDate": "10-17-2015",
      "startTime": "12:00PM ET",
      "startTimeEpoch": "1445097600",
      "title": "Ohio Western Mich.",
      "url": "/game/football/fbs/2015/10/17/western-mich-ohio",
      "videoState": ""
    }},
    {"game": {
      "away": {
        "conferenceNames": {
          "conferenceDisplay": "Patriot League",
          "conferenceDivision": "fcs",
          "conferenceName": "Patriot League",
          "conferenceSeo": "patriot"
        },
        "description": "(3-3)",
        "names": {
          "char6": "BUCKNL",
          "full": "Bucknell University",
          "seo": "bucknell",
          "short": "Bucknell"
        },
        "rank": "",
        "score": "14",
        "seed": "",
        "winner": false
      },
      "bracketId": "",
      "bracketRegion": "",
      "bracketRound": "",
      "contestClock": "0:00",
      "currentPeriod": "Final",
      "finalMessage": "Final",
      "gameID": "0adaf61e-22f6-4984-8aea-618f1e207df8",
      "gameState": "final",
      "home": {
        "conferenceNames": {
          "conferenceDisplay": "FBS Independent",
          "conferenceDivision": "fbs",
          "conferenceName": "IND",
          "conferenceSeo": "fbs-independent"
        },
        "description": "(2-5)",
        "names": {
          "char6": "ARMY",
          "full": "U.S. Military Academy",
          "seo": "army",
          "short": "Army"
        },
        "rank": "",
        "score": "21",
        "seed": "",
        "winner": true
      },
      "liveVideoEnabled": false,
      "network": "",
      "startDate": "10-17-2015",
      "startTime": "12:00PM ET",
      "startTimeEpoch": "1445097600",
      "title": "Army Bucknell",
      "url": "/game/football/fbs/2015/10/17/bucknell-army",
      "videoState": ""
    }},
    {"game": {
      "away": {
        "conferenceNames": {
          "conferenceDisplay": "Big 12 Conference",
          "conferenceDivision": "fbs",
          "conferenceName": "Big 12",
          "conferenceSeo": "big-12"
        },
        "description": "(3-3)",
        "names": {
          "char6": "WVU",
          "full": "West Virginia University",
          "seo": "west-virginia",
          "short": "West Virginia"
        },
        "rank": "",
        "score": "38",
        "seed": "",
        "winner": false
      },
      "bracketId": "",
      "bracketRegion": "",
      "bracketRound": "",
      "contestClock": "0:00",
      "currentPeriod": "Final",
      "finalMessage": "Final",
      "gameID": "8dcfd747-4e43-4593-946c-460d1c245d8b",
      "gameState": "final",
      "home": {
        "conferenceNames": {
          "conferenceDisplay": "Big 12 Conference",
          "conferenceDivision": "fbs",
          "conferenceName": "Big 12",
          "conferenceSeo": "big-12"
        },
        "description": "(6-0)",
        "names": {
          "char6": "BAYLOR",
          "full": "Baylor University",
          "seo": "baylor",
          "short": "Baylor"
        },
        "rank": "2",
        "score": "62",
        "seed": "",
        "winner": true
      },
      "liveVideoEnabled": false,
      "network": "",
      "startDate": "10-17-2015",
      "startTime": "12:00PM ET",
      "startTimeEpoch": "1445097600",
      "title": "Baylor West Virginia",
      "url": "/game/football/fbs/2015/10/17/west-virginia-baylor",
      "videoState": ""
    }},
    {"game": {
      "away": {
        "conferenceNames": {
          "conferenceDisplay": "Conference USA",
          "conferenceDivision": "fbs",
          "conferenceName": "C-USA",
          "conferenceSeo": "conference-usa"
        },
        "description": "(4-3)",
        "names": {
          "char6": "LATECH",
          "full": "Louisiana Tech University",
          "seo": "louisiana-tech",
          "short": "Louisiana Tech"
        },
        "rank": "",
        "score": "20",
        "seed": "",
        "winner": false
      },
      "bracketId": "",
      "bracketRegion": "",
      "bracketRound": "",
      "contestClock": "0:00",
      "currentPeriod": "Final",
      "finalMessage": "Final",
      "gameID": "c524dc95-a915-4f42-83c1-23f1e7aaf319",
      "gameState": "final",
      "home": {
        "conferenceNames": {
          "conferenceDisplay": "Southeastern Conference",
          "conferenceDivision": "fbs",
          "conferenceName": "SEC",
          "conferenceSeo": "southeastern"
        },
        "description": "(5-2)",
        "names": {
          "char6": "MISSST",
          "full": "Mississippi State University",
          "seo": "mississippi-st",
          "short": "Mississippi St."
        },
        "rank": "",
        "score": "45",
        "seed": "",
        "winner": true
      },
      "liveVideoEnabled": false,
      "network": "",
      "startDate": "10-17-2015",
      "startTime": "12:00PM ET",
      "startTimeEpoch": "1445097600",
      "title": "Mississippi St. Louisiana Tech",
      "url": "/game/football/fbs/2015/10/17/louisiana-tech-mississippi-st",
      "videoState": ""
    }},
    {"game": {
      "away": {
        "conferenceNames": {
          "conferenceDisplay": "American Athletic Conference",
          "conferenceDivision": "fbs",
          "conferenceName": "AAC",
          "conferenceSeo": "american-athletic"
        },
        "description": "(3-3)",
        "names": {
          "char6": "USF",
          "full": "University of South Florida",
          "seo": "south-fla",
          "short": "South Fla."
        },
        "rank": "",
        "score": "28",
        "seed": "",
        "winner": true
      },
      "bracketId": "",
      "bracketRegion": "",
      "bracketRound": "",
      "contestClock": "0:00",
      "currentPeriod": "Final",
      "finalMessage": "Final",
      "gameID": "71577ebd-c474-473a-b370-b401e0213878",
      "gameState": "final",
      "home": {
        "conferenceNames": {
          "conferenceDisplay": "American Athletic Conference",
          "conferenceDivision": "fbs",
          "conferenceName": "AAC",
          "conferenceSeo": "american-athletic"
        },
        "description": "(3-4)",
        "names": {
          "char6": "UCONN",
          "full": "University of Connecticut",
          "seo": "uconn",
          "short": "UConn"
        },
        "rank": "",
        "score": "20",
        "seed": "",
        "winner": false
      },
      "liveVideoEnabled": false,
      "network": "",
      "startDate": "10-17-2015",
      "startTime": "12:00PM ET",
      "startTimeEpoch": "1445097600",
      "title": "UConn South Fla.",
      "url": "/game/football/fbs/2015/10/17/south-fla-uconn",
      "videoState": ""
    }},
    {"game": {
      "away": {
        "conferenceNames": {
          "conferenceDisplay": "Atlantic Coast Conference",
          "conferenceDivision": "fbs",
          "conferenceName": "ACC",
          "conferenceSeo": "atlantic-coast"
        },
        "description": "(2-4)",
        "names": {
          "char6": "LOUIS",
          "full": "University of Louisville",
          "seo": "louisville",
          "short": "Louisville"
        },
        "rank": "",
        "score": "21",
        "seed": "",
        "winner": false
      },
      "bracketId": "",
      "bracketRegion": "",
      "bracketRound": "",
      "contestClock": "0:00",
      "currentPeriod": "Final",
      "finalMessage": "Final",
      "gameID": "9de04fcc-70c8-40a7-9ef4-64f9851857df",
      "gameState": "final",
      "home": {
        "conferenceNames": {
          "conferenceDisplay": "Atlantic Coast Conference",
          "conferenceDivision": "fbs",
          "conferenceName": "ACC",
          "conferenceSeo": "atlantic-coast"
        },
        "description": "(6-0)",
        "names": {
          "char6": "FSU",
          "full": "Florida State University",
          "seo": "florida-st",
          "short": "Florida St."
        },
        "rank": "11",
        "score": "41",
        "seed": "",
        "winner": true
      },
      "liveVideoEnabled": false,
      "network": "",
      "startDate": "10-17-2015",
      "startTime": "12:00PM ET",
      "startTimeEpoch": "1445097600",
      "title": "Florida St. Louisville",
      "url": "/game/football/fbs/2015/10/17/louisville-florida-st",
      "videoState": ""
    }},
    {"game": {
      "away": {
        "conferenceNames": {
          "conferenceDisplay": "Atlantic Coast Conference",
          "conferenceDivision": "fbs",
          "conferenceName": "ACC",
          "conferenceSeo": "atlantic-coast"
        },
        "description": "(5-1)",
        "names": {
          "char6": "PITT",
          "full": "University of Pittsburgh",
          "seo": "pittsburgh",
          "short": "Pittsburgh"
        },
        "rank": "",
        "score": "31",
        "seed": "",
        "winner": true
      },
      "bracketId": "",
      "bracketRegion": "",
      "bracketRound": "",
      "contestClock": "0:00",
      "currentPeriod": "Final",
      "finalMessage": "Final",
      "gameID": "191d4eee-8229-4c23-af67-3efa5987cdf4",
      "gameState": "final",
      "home": {
        "conferenceNames": {
          "conferenceDisplay": "Atlantic Coast Conference",
          "conferenceDivision": "fbs",
          "conferenceName": "ACC",
          "conferenceSeo": "atlantic-coast"
        },
        "description": "(2-5)",
        "names": {
          "char6": "GATECH",
          "full": "Georgia Institute of Technology",
          "seo": "georgia-tech",
          "short": "Georgia Tech"
        },
        "rank": "",
        "score": "28",
        "seed": "",
        "winner": false
      },
      "liveVideoEnabled": false,
      "network": "",
      "startDate": "10-17-2015",
      "startTime": "12:30PM ET",
      "startTimeEpoch": "1445099400",
      "title": "Georgia Tech Pittsburgh",
      "url": "/game/football/fbs/2015/10/17/pittsburgh-georgia-tech",
      "videoState": ""
    }},
    {"game": {
      "away": {
        "conferenceNames": {
          "conferenceDisplay": "Mid-American Conference",
          "conferenceDivision": "fbs",
          "conferenceName": "MAC",
          "conferenceSeo": "mid-american"
        },
        "description": "(2-4)",
        "names": {
          "char6": "BUFF",
          "full": "University at Buffalo, the State University of New York",
          "seo": "buffalo",
          "short": "Buffalo"
        },
        "rank": "",
        "score": "14",
        "seed": "",
        "winner": false
      },
      "bracketId": "",
      "bracketRegion": "",
      "bracketRound": "",
      "contestClock": "0:00",
      "currentPeriod": "Final",
      "finalMessage": "Final",
      "gameID": "4e5d6057-f001-491b-b0f6-cda9d417de25",
      "gameState": "final",
      "home": {
        "conferenceNames": {
          "conferenceDisplay": "Mid-American Conference",
          "conferenceDivision": "fbs",
          "conferenceName": "MAC",
          "conferenceSeo": "mid-american"
        },
        "description": "(3-4)",
        "names": {
          "char6": "C MICH",
          "full": "Central Michigan University",
          "seo": "central-mich",
          "short": "Central Mich."
        },
        "rank": "",
        "score": "51",
        "seed": "",
        "winner": true
      },
      "liveVideoEnabled": false,
      "network": "",
      "startDate": "10-17-2015",
      "startTime": "01:00PM ET",
      "startTimeEpoch": "1445101200",
      "title": "Central Mich. Buffalo",
      "url": "/game/football/fbs/2015/10/17/buffalo-central-mich",
      "videoState": ""
    }},
    {"game": {
      "away": {
        "conferenceNames": {
          "conferenceDisplay": "Mid-American Conference",
          "conferenceDivision": "fbs",
          "conferenceName": "MAC",
          "conferenceSeo": "mid-american"
        },
        "description": "(3-4)",
        "names": {
          "char6": "AKRON",
          "full": "University of Akron",
          "seo": "akron",
          "short": "Akron"
        },
        "rank": "",
        "score": "10",
        "seed": "",
        "winner": false
      },
      "bracketId": "",
      "bracketRegion": "",
      "bracketRound": "",
      "contestClock": "0:00",
      "currentPeriod": "Final",
      "finalMessage": "Final",
      "gameID": "75fe7c2f-c113-4f59-ad08-11550395a340",
      "gameState": "final",
      "home": {
        "conferenceNames": {
          "conferenceDisplay": "Mid-American Conference",
          "conferenceDivision": "fbs",
          "conferenceName": "MAC",
          "conferenceSeo": "mid-american"
        },
        "description": "(5-2)",
        "names": {
          "char6": "BGSU",
          "full": "Bowling Green State University",
          "seo": "bowling-green",
          "short": "Bowling Green"
        },
        "rank": "",
        "score": "59",
        "seed": "",
        "winner": true
      },
      "liveVideoEnabled": false,
      "network": "",
      "startDate": "10-17-2015",
      "startTime": "03:00PM ET",
      "startTimeEpoch": "1445108400",
      "title": "Bowling Green Akron",
      "url": "/game/football/fbs/2015/10/17/akron-bowling-green",
      "videoState": ""
    }},
    {"game": {
      "away": {
        "conferenceNames": {
          "conferenceDisplay": "Sun Belt Conference",
          "conferenceDivision": "fbs",
          "conferenceName": "Sun Belt",
          "conferenceSeo": "sun-belt"
        },
        "description": "(2-4)",
        "names": {
          "char6": "GA ST",
          "full": "Georgia State University",
          "seo": "georgia-st",
          "short": "Georgia St."
        },
        "rank": "",
        "score": "31",
        "seed": "",
        "winner": true
      },
      "bracketId": "",
      "bracketRegion": "",
      "bracketRound": "",
      "contestClock": "0:00",
      "currentPeriod": "Final",
      "finalMessage": "Final",
      "gameID": "516c15de-ee79-482c-8520-607ff5c0ede6",
      "gameState": "final",
      "home": {
        "conferenceNames": {
          "conferenceDisplay": "Mid-American Conference",
          "conferenceDivision": "fbs",
          "conferenceName": "MAC",
          "conferenceSeo": "mid-american"
        },
        "description": "(2-5)",
        "names": {
          "char6": "BALLST",
          "full": "Ball State University",
          "seo": "ball-st",
          "short": "Ball St."
        },
        "rank": "",
        "score": "19",
        "seed": "",
        "winner": false
      },
      "liveVideoEnabled": false,
      "network": "",
      "startDate": "10-17-2015",
      "startTime": "03:00PM ET",
      "startTimeEpoch": "1445108400",
      "title": "Ball St. Georgia St.",
      "url": "/game/football/fbs/2015/10/17/georgia-st-ball-st",
      "videoState": ""
    }},
    {"game": {
      "away": {
        "conferenceNames": {
          "conferenceDisplay": "Mountain West Conference",
          "conferenceDivision": "fbs",
          "conferenceName": "MWC",
          "conferenceSeo": "mountain-west"
        },
        "description": "(3-3)",
        "names": {
          "char6": "AIRFOR",
          "full": "U.S. Air Force Academy",
          "seo": "air-force",
          "short": "Air Force"
        },
        "rank": "",
        "score": "23",
        "seed": "",
        "winner": false
      },
      "bracketId": "",
      "bracketRegion": "",
      "bracketRound": "",
      "contestClock": "0:00",
      "currentPeriod": "Final",
      "finalMessage": "Final",
      "gameID": "1dad727a-e9b3-412f-9e3f-cf10e72b66e6",
      "gameState": "final",
      "home": {
        "conferenceNames": {
          "conferenceDisplay": "Mountain West Conference",
          "conferenceDivision": "fbs",
          "conferenceName": "MWC",
          "conferenceSeo": "mountain-west"
        },
        "description": "(3-4)",
        "names": {
          "char6": "CO ST",
          "full": "Colorado State University",
          "seo": "colorado-st",
          "short": "Colorado St."
        },
        "rank": "",
        "score": "38",
        "seed": "",
        "winner": true
      },
      "liveVideoEnabled": false,
      "network": "",
      "startDate": "10-17-2015",
      "startTime": "03:30PM ET",
      "startTimeEpoch": "1445110200",
      "title": "Colorado St. Air Force",
      "url": "/game/football/fbs/2015/10/17/air-force-colorado-st",
      "videoState": ""
    }},
    {"game": {
      "away": {
        "conferenceNames": {
          "conferenceDisplay": "Atlantic Coast Conference",
          "conferenceDivision": "fbs",
          "conferenceName": "ACC",
          "conferenceSeo": "atlantic-coast"
        },
        "description": "(3-3)",
        "names": {
          "char6": "SYR",
          "full": "Syracuse University",
          "seo": "syracuse",
          "short": "Syracuse"
        },
        "rank": "",
        "score": "38",
        "seed": "",
        "winner": false
      },
      "bracketId": "",
      "bracketRegion": "",
      "bracketRound": "",
      "contestClock": "0:00",
      "currentPeriod": "Final (3OT)",
      "finalMessage": "Final (3OT)",
      "gameID": "a5120834-c53a-4a83-97c1-5e543f37341f",
      "gameState": "final",
      "home": {
        "conferenceNames": {
          "conferenceDisplay": "Atlantic Coast Conference",
          "conferenceDivision": "fbs",
          "conferenceName": "ACC",
          "conferenceSeo": "atlantic-coast"
        },
        "description": "(2-4)",
        "names": {
          "char6": "UVA",
          "full": "University of Virginia",
          "seo": "virginia",
          "short": "Virginia"
        },
        "rank": "",
        "score": "44",
        "seed": "",
        "winner": true
      },
      "liveVideoEnabled": false,
      "network": "",
      "startDate": "10-17-2015",
      "startTime": "03:30PM ET",
      "startTimeEpoch": "1445110200",
      "title": "Virginia Syracuse",
      "url": "/game/football/fbs/2015/10/17/syracuse-virginia",
      "videoState": ""
    }},
    {"game": {
      "away": {
        "conferenceNames": {
          "conferenceDisplay": "Big Ten Conference",
          "conferenceDivision": "fbs",
          "conferenceName": "Big Ten",
          "conferenceSeo": "big-ten"
        },
        "description": "(3-4)",
        "names": {
          "char6": "NEB",
          "full": "University of Nebraska, Lincoln",
          "seo": "nebraska",
          "short": "Nebraska"
        },
        "rank": "",
        "score": "48",
        "seed": "",
        "winner": true
      },
      "bracketId": "",
      "bracketRegion": "",
      "bracketRound": "",
      "contestClock": "0:00",
      "currentPeriod": "Final",
      "finalMessage": "Final",
      "gameID": "eb332688-234e-4cae-a8f3-eb163d95ec84",
      "gameState": "final",
      "home": {
        "conferenceNames": {
          "conferenceDisplay": "Big Ten Conference",
          "conferenceDivision": "fbs",
          "conferenceName": "Big Ten",
          "conferenceSeo": "big-ten"
        },
        "description": "(4-3)",
        "names": {
          "char6": "MINN",
          "full": "University of Minnesota, Twin Cities",
          "seo": "minnesota",
          "short": "Minnesota"
        },
        "rank": "",
        "score": "25",
        "seed": "",
        "winner": false
      },
      "liveVideoEnabled": false,
      "network": "",
      "startDate": "10-17-2015",
      "startTime": "03:30PM ET",
      "startTimeEpoch": "1445110200",
      "title": "Minnesota Nebraska",
      "url": "/game/football/fbs/2015/10/17/nebraska-minnesota",
      "videoState": ""
    }},
    {"game": {
      "away": {
        "conferenceNames": {
          "conferenceDisplay": "Mid-American Conference",
          "conferenceDivision": "fbs",
          "conferenceName": "MAC",
          "conferenceSeo": "mid-american"
        },
        "description": "(3-4)",
        "names": {
          "char6": "KENT",
          "full": "Kent State University",
          "seo": "kent-st",
          "short": "Kent St."
        },
        "rank": "",
        "score": "15",
        "seed": "",
        "winner": true
      },
      "bracketId": "",
      "bracketRegion": "",
      "bracketRound": "",
      "contestClock": "0:00",
      "currentPeriod": "Final",
      "finalMessage": "Final",
      "gameID": "18c9ea12-aa08-47a2-8231-8bf6b8dfa676",
      "gameState": "final",
      "home": {
        "conferenceNames": {
          "conferenceDisplay": "FBS Independent",
          "conferenceDivision": "fbs",
          "conferenceName": "IND",
          "conferenceSeo": "fbs-independent"
        },
        "description": "(1-5)",
        "names": {
          "char6": "UMASS",
          "full": "University of Massachusetts, Amherst",
          "seo": "massachusetts",
          "short": "Massachusetts"
        },
        "rank": "",
        "score": "10",
        "seed": "",
        "winner": false
      },
      "liveVideoEnabled": false,
      "network": "",
      "startDate": "10-17-2015",
      "startTime": "03:30PM ET",
      "startTimeEpoch": "1445110200",
      "title": "Massachusetts Kent St.",
      "url": "/game/football/fbs/2015/10/17/kent-st-massachusetts",
      "videoState": ""
    }},
    {"game": {
      "away": {
        "conferenceNames": {
          "conferenceDisplay": "Big Ten Conference",
          "conferenceDivision": "fbs",
          "conferenceName": "Big Ten",
          "conferenceSeo": "big-ten"
        },
        "description": "(3-3)",
        "names": {
          "char6": "RUTGER",
          "full": "Rutgers, State Univ of New Jersey, New Brunswick",
          "seo": "rutgers",
          "short": "Rutgers"
        },
        "rank": "",
        "score": "55",
        "seed": "",
        "winner": true
      },
      "bracketId": "",
      "bracketRegion": "",
      "bracketRound": "",
      "contestClock": "0:00",
      "currentPeriod": "Final",
      "finalMessage": "Final",
      "gameID": "2985439b-1fb4-45cd-8387-2e7ef827d676",
      "gameState": "final",
      "home": {
        "conferenceNames": {
          "conferenceDisplay": "Big Ten Conference",
          "conferenceDivision": "fbs",
          "conferenceName": "Big Ten",
          "conferenceSeo": "big-ten"
        },
        "description": "(4-3)",
        "names": {
          "char6": "IND",
          "full": "Indiana University, Bloomington",
          "seo": "indiana",
          "short": "Indiana"
        },
        "rank": "",
        "score": "52",
        "seed": "",
        "winner": false
      },
      "liveVideoEnabled": false,
      "network": "",
      "startDate": "10-17-2015",
      "startTime": "03:30PM ET",
      "startTimeEpoch": "1445110200",
      "title": "Indiana Rutgers",
      "url": "/game/football/fbs/2015/10/17/rutgers-indiana",
      "videoState": ""
    }},
    {"game": {
      "away": {
        "conferenceNames": {
          "conferenceDisplay": "Sun Belt Conference",
          "conferenceDivision": "fbs",
          "conferenceName": "Sun Belt",
          "conferenceSeo": "sun-belt"
        },
        "description": "(2-4)",
        "names": {
          "char6": "IDAHO",
          "full": "University of Idaho",
          "seo": "idaho",
          "short": "Idaho"
        },
        "rank": "",
        "score": "19",
        "seed": "",
        "winner": true
      },
      "bracketId": "",
      "bracketRegion": "",
      "bracketRound": "",
      "contestClock": "0:00",
      "currentPeriod": "Final",
      "finalMessage": "Final",
      "gameID": "ea099e40-e434-4bb0-a41a-15de26b37cee",
      "gameState": "final",
      "home": {
        "conferenceNames": {
          "conferenceDisplay": "Sun Belt Conference",
          "conferenceDivision": "fbs",
          "conferenceName": "Sun Belt",
          "conferenceSeo": "sun-belt"
        },
        "description": "(1-5)",
        "names": {
          "char6": "TROY",
          "full": "Troy University",
          "seo": "troy",
          "short": "Troy"
        },
        "rank": "",
        "score": "16",
        "seed": "",
        "winner": false
      },
      "liveVideoEnabled": false,
      "network": "",
      "startDate": "10-17-2015",
      "startTime": "03:30PM ET",
      "startTimeEpoch": "1445110200",
      "title": "Troy Idaho",
      "url": "/game/football/fbs/2015/10/17/idaho-troy",
      "videoState": ""
    }},
    {"game": {
      "away": {
        "conferenceNames": {
          "conferenceDisplay": "Atlantic Coast Conference",
          "conferenceDivision": "fbs",
          "conferenceName": "ACC",
          "conferenceSeo": "atlantic-coast"
        },
        "description": "(3-4)",
        "names": {
          "char6": "VATECH",
          "full": "Virginia Polytechnic Institute & State University",
          "seo": "virginia-tech",
          "short": "Virginia Tech"
        },
        "rank": "",
        "score": "20",
        "seed": "",
        "winner": false
      },
      "bracketId": "",
      "bracketRegion": "",
      "bracketRound": "",
      "contestClock": "0:00",
      "currentPeriod": "Final",
      "finalMessage": "Final",
      "gameID": "963f75b2-e5f2-4dd8-b0d5-da6f12e29c24",
      "gameState": "final",
      "home": {
        "conferenceNames": {
          "conferenceDisplay": "Atlantic Coast Conference",
          "conferenceDivision": "fbs",
          "conferenceName": "ACC",
          "conferenceSeo": "atlantic-coast"
        },
        "description": "(4-2)",
        "names": {
          "char6": "MIAMI",
          "full": "University of Miami (Florida)",
          "seo": "miami-fl",
          "short": "Miami (FL)"
        },
        "rank": "",
        "score": "30",
        "seed": "",
        "winner": true
      },
      "liveVideoEnabled": false,
      "network": "",
      "startDate": "10-17-2015",
      "startTime": "03:30PM ET",
      "startTimeEpoch": "1445110200",
      "title": "Miami (FL) Virginia Tech",
      "url": "/game/football/fbs/2015/10/17/virginia-tech-miami-fl",
      "videoState": ""
    }},
    {"game": {
      "away": {
        "conferenceNames": {
          "conferenceDisplay": "Southeastern Conference",
          "conferenceDivision": "fbs",
          "conferenceName": "SEC",
          "conferenceSeo": "southeastern"
        },
        "description": "(6-1)",
        "names": {
          "char6": "ALA",
          "full": "University of Alabama",
          "seo": "alabama",
          "short": "Alabama"
        },
        "rank": "10",
        "score": "41",
        "seed": "",
        "winner": true
      },
      "bracketId": "",
      "bracketRegion": "",
      "bracketRound": "",
      "contestClock": "0:00",
      "currentPeriod": "Final",
      "finalMessage": "Final",
      "gameID": "2d4327e0-7dfa-4160-aeaa-bd1a9443fd53",
      "gameState": "final",
      "home": {
        "conferenceNames": {
          "conferenceDisplay": "Southeastern Conference",
          "conferenceDivision": "fbs",
          "conferenceName": "SEC",
          "conferenceSeo": "southeastern"
        },
        "description": "(5-1)",
        "names": {
          "char6": "TX A&M",
          "full": "Texas A&M University, College Station",
          "seo": "texas-am",
          "short": "Texas A&M"
        },
        "rank": "9",
        "score": "23",
        "seed": "",
        "winner": false
      },
      "liveVideoEnabled": false,
      "network": "",
      "startDate": "10-17-2015",
      "startTime": "03:30PM ET",
      "startTimeEpoch": "1445110200",
      "title": "Texas A&M Alabama",
      "url": "/game/football/fbs/2015/10/17/alabama-texas-am",
      "videoState": ""
    }},
    {"game": {
      "away": {
        "conferenceNames": {
          "conferenceDisplay": "Big 12 Conference",
          "conferenceDivision": "fbs",
          "conferenceName": "Big 12",
          "conferenceSeo": "big-12"
        },
        "description": "(5-1)",
        "names": {
          "char6": "OKLA",
          "full": "University of Oklahoma",
          "seo": "oklahoma",
          "short": "Oklahoma"
        },
        "rank": "19",
        "score": "55",
        "seed": "",
        "winner": true
      },
      "bracketId": "",
      "bracketRegion": "",
      "bracketRound": "",
      "contestClock": "0:00",
      "currentPeriod": "Final",
      "finalMessage": "Final",
      "gameID": "5909447b-6995-4e97-99c6-023f2457090f",
      "gameState": "final",
      "home": {
        "conferenceNames": {
          "conferenceDisplay": "Big 12 Conference",
          "conferenceDivision": "fbs",
          "conferenceName": "Big 12",
          "conferenceSeo": "big-12"
        },
        "description": "(3-3)",
        "names": {
          "char6": "KAN ST",
          "full": "Kansas State University",
          "seo": "kansas-st",
          "short": "Kansas St."
        },
        "rank": "",
        "score": "0",
        "seed": "",
        "winner": false
      },
      "liveVideoEnabled": false,
      "network": "",
      "startDate": "10-17-2015",
      "startTime": "03:30PM ET",
      "startTimeEpoch": "1445110200",
      "title": "Kansas St. Oklahoma",
      "url": "/game/football/fbs/2015/10/17/oklahoma-kansas-st",
      "videoState": ""
    }},
    {"game": {
      "away": {
        "conferenceNames": {
          "conferenceDisplay": "Conference USA",
          "conferenceDivision": "fbs",
          "conferenceName": "C-USA",
          "conferenceSeo": "conference-usa"
        },
        "description": "(2-4)",
        "names": {
          "char6": "CHAR",
          "full": "University of North Carolina, Charlotte",
          "seo": "charlotte",
          "short": "Charlotte"
        },
        "rank": "",
        "score": "34",
        "seed": "",
        "winner": false
      },
      "bracketId": "",
      "bracketRegion": "",
      "bracketRound": "",
      "contestClock": "0:00",
      "currentPeriod": "Final",
      "finalMessage": "Final",
      "gameID": "49a23c9b-1055-44eb-b11b-f7809ea9046e",
      "gameState": "final",
      "home": {
        "conferenceNames": {
          "conferenceDisplay": "Conference USA",
          "conferenceDivision": "fbs",
          "conferenceName": "C-USA",
          "conferenceSeo": "conference-usa"
        },
        "description": "(3-3)",
        "names": {
          "char6": "ODU",
          "full": "Old Dominion University",
          "seo": "old-dominion",
          "short": "Old Dominion"
        },
        "rank": "",
        "score": "37",
        "seed": "",
        "winner": true
      },
      "liveVideoEnabled": false,
      "network": "",
      "startDate": "10-17-2015",
      "startTime": "03:30PM ET",
      "startTimeEpoch": "1445110200",
      "title": "Old Dominion Charlotte",
      "url": "/game/football/fbs/2015/10/17/charlotte-old-dominion",
      "videoState": ""
    }},
    {"game": {
      "away": {
        "conferenceNames": {
          "conferenceDisplay": "Big Ten Conference",
          "conferenceDivision": "fbs",
          "conferenceName": "Big Ten",
          "conferenceSeo": "big-ten"
        },
        "description": "(7-0)",
        "names": {
          "char6": "MICHST",
          "full": "Michigan State University",
          "seo": "michigan-st",
          "short": "Michigan St."
        },
        "rank": "7",
        "score": "27",
        "seed": "",
        "winner": true
      },
      "bracketId": "",
      "bracketRegion": "",
      "bracketRound": "",
      "contestClock": "0:00",
      "currentPeriod": "Final",
      "finalMessage": "Final",
      "gameID": "fcd16a68-d1c0-490d-b219-007969749f0b",
      "gameState": "final",
      "home": {
        "conferenceNames": {
          "conferenceDisplay": "Big Ten Conference",
          "conferenceDivision": "fbs",
          "conferenceName": "Big Ten",
          "conferenceSeo": "big-ten"
        },
        "description": "(5-2)",
        "names": {
          "char6": "MICH",
          "full": "University of Michigan",
          "seo": "michigan",
          "short": "Michigan"
        },
        "rank": "12",
        "score": "23",
        "seed": "",
        "winner": false
      },
      "liveVideoEnabled": false,
      "network": "",
      "startDate": "10-17-2015",
      "startTime": "03:30PM ET",
      "startTimeEpoch": "1445110200",
      "title": "Michigan Michigan St.",
      "url": "/game/football/fbs/2015/10/17/michigan-st-michigan",
      "videoState": ""
    }},
    {"game": {
      "away": {
        "conferenceNames": {
          "conferenceDisplay": "Mountain West Conference",
          "conferenceDivision": "fbs",
          "conferenceName": "MWC",
          "conferenceSeo": "mountain-west"
        },
        "description": "(3-4)",
        "names": {
          "char6": "NEVADA",
          "full": "University of Nevada",
          "seo": "nevada",
          "short": "Nevada"
        },
        "rank": "",
        "score": "21",
        "seed": "",
        "winner": false
      },
      "bracketId": "",
      "bracketRegion": "",
      "bracketRound": "",
      "contestClock": "0:00",
      "currentPeriod": "Final",
      "finalMessage": "Final",
      "gameID": "54fadc55-65a6-496d-ab4f-3ff9b5717345",
      "gameState": "final",
      "home": {
        "conferenceNames": {
          "conferenceDisplay": "Mountain West Conference",
          "conferenceDivision": "fbs",
          "conferenceName": "MWC",
          "conferenceSeo": "mountain-west"
        },
        "description": "(1-6)",
        "names": {
          "char6": "WYO",
          "full": "University of Wyoming",
          "seo": "wyoming",
          "short": "Wyoming"
        },
        "rank": "",
        "score": "28",
        "seed": "",
        "winner": true
      },
      "liveVideoEnabled": false,
      "network": "",
      "startDate": "10-17-2015",
      "startTime": "04:00PM ET",
      "startTimeEpoch": "1445112000",
      "title": "Wyoming Nevada",
      "url": "/game/football/fbs/2015/10/17/nevada-wyoming",
      "videoState": ""
    }},
    {"game": {
      "away": {
        "conferenceNames": {
          "conferenceDisplay": "Southeastern Conference",
          "conferenceDivision": "fbs",
          "conferenceName": "SEC",
          "conferenceSeo": "southeastern"
        },
        "description": "(2-4)",
        "names": {
          "char6": "VANDY",
          "full": "Vanderbilt University",
          "seo": "vanderbilt",
          "short": "Vanderbilt"
        },
        "rank": "",
        "score": "10",
        "seed": "",
        "winner": false
      },
      "bracketId": "",
      "bracketRegion": "",
      "bracketRound": "",
      "contestClock": "0:00",
      "currentPeriod": "Final",
      "finalMessage": "Final",
      "gameID": "b3aff483-6352-4944-8269-ae4f9af1a5ed",
      "gameState": "final",
      "home": {
        "conferenceNames": {
          "conferenceDisplay": "Southeastern Conference",
          "conferenceDivision": "fbs",
          "conferenceName": "SEC",
          "conferenceSeo": "southeastern"
        },
        "description": "(3-4)",
        "names": {
          "char6": "S CAR",
          "full": "University of South Carolina, Columbia",
          "seo": "south-carolina",
          "short": "South Carolina"
        },
        "rank": "",
        "score": "19",
        "seed": "",
        "winner": true
      },
      "liveVideoEnabled": false,
      "network": "",
      "startDate": "10-17-2015",
      "startTime": "04:00PM ET",
      "startTimeEpoch": "1445112000",
      "title": "South Carolina Vanderbilt",
      "url": "/game/football/fbs/2015/10/17/vanderbilt-south-carolina",
      "videoState": ""
    }},
    {"game": {
      "away": {
        "conferenceNames": {
          "conferenceDisplay": "Pac-12 Conference",
          "conferenceDivision": "fbs",
          "conferenceName": "Pac-12",
          "conferenceSeo": "pac-12"
        },
        "description": "(2-4)",
        "names": {
          "char6": "ORE ST",
          "full": "Oregon State University",
          "seo": "oregon-st",
          "short": "Oregon St."
        },
        "rank": "",
        "score": "31",
        "seed": "",
        "winner": false
      },
      "bracketId": "",
      "bracketRegion": "",
      "bracketRound": "",
      "contestClock": "0:00",
      "currentPeriod": "Final",
      "finalMessage": "Final",
      "gameID": "c960d8e8-a6af-4fef-add8-49780db8510c",
      "gameState": "final",
      "home": {
        "conferenceNames": {
          "conferenceDisplay": "Pac-12 Conference",
          "conferenceDivision": "fbs",
          "conferenceName": "Pac-12",
          "conferenceSeo": "pac-12"
        },
        "description": "(4-2)",
        "names": {
          "char6": "WASHST",
          "full": "Washington State University",
          "seo": "washington-st",
          "short": "Washington St."
        },
        "rank": "",
        "score": "52",
        "seed": "",
        "winner": true
      },
      "liveVideoEnabled": false,
      "network": "",
      "startDate": "10-17-2015",
      "startTime": "04:00PM ET",
      "startTimeEpoch": "1445112000",
      "title": "Washington St. Oregon St.",
      "url": "/game/football/fbs/2015/10/17/oregon-st-washington-st",
      "videoState": ""
    }},
    {"game": {
      "away": {
        "conferenceNames": {
          "conferenceDisplay": "Sun Belt Conference",
          "conferenceDivision": "fbs",
          "conferenceName": "Sun Belt",
          "conferenceSeo": "sun-belt"
        },
        "description": "(0-6)",
        "names": {
          "char6": "NM ST",
          "full": "New Mexico State University",
          "seo": "new-mexico-st",
          "short": "New Mexico St."
        },
        "rank": "",
        "score": "26",
        "seed": "",
        "winner": false
      },
      "bracketId": "",
      "bracketRegion": "",
      "bracketRound": "",
      "contestClock": "0:00",
      "currentPeriod": "Final",
      "finalMessage": "Final",
      "gameID": "ad1148c3-dbbb-4bf9-a948-6cbb87e66e4e",
      "gameState": "final",
      "home": {
        "conferenceNames": {
          "conferenceDisplay": "Sun Belt Conference",
          "conferenceDivision": "fbs",
          "conferenceName": "Sun Belt",
          "conferenceSeo": "sun-belt"
        },
        "description": "(5-1)",
        "names": {
          "char6": "GA SOU",
          "full": "Georgia Southern University",
          "seo": "ga-southern",
          "short": "Ga. Southern"
        },
        "rank": "",
        "score": "56",
        "seed": "",
        "winner": true
      },
      "liveVideoEnabled": false,
      "network": "",
      "startDate": "10-17-2015",
      "startTime": "06:00PM ET",
      "startTimeEpoch": "1445119200",
      "title": "Ga. Southern New Mexico St.",
      "url": "/game/football/fbs/2015/10/17/new-mexico-st-ga-southern",
      "videoState": ""
    }},
    {"game": {
      "away": {
        "conferenceNames": {
          "conferenceDisplay": "Conference USA",
          "conferenceDivision": "fbs",
          "conferenceName": "C-USA",
          "conferenceSeo": "conference-usa"
        },
        "description": "(1-6)",
        "names": {
          "char6": "UTSA",
          "full": "University of Texas at San Antonio",
          "seo": "utsa",
          "short": "UTSA"
        },
        "rank": "",
        "score": "10",
        "seed": "",
        "winner": false
      },
      "bracketId": "",
      "bracketRegion": "",
      "bracketRound": "",
      "contestClock": "0:00",
      "currentPeriod": "Final",
      "finalMessage": "Final",
      "gameID": "951ba05b-d96d-496b-a0a2-d993c9c5c872",
      "gameState": "final",
      "home": {
        "conferenceNames": {
          "conferenceDisplay": "Conference USA",
          "conferenceDivision": "fbs",
          "conferenceName": "C-USA",
          "conferenceSeo": "conference-usa"
        },
        "description": "(4-3)",
        "names": {
          "char6": "S MISS",
          "full": "University of Southern Mississippi",
          "seo": "southern-miss",
          "short": "Southern Miss."
        },
        "rank": "",
        "score": "32",
        "seed": "",
        "winner": true
      },
      "liveVideoEnabled": false,
      "network": "",
      "startDate": "10-17-2015",
      "startTime": "07:00PM ET",
      "startTimeEpoch": "1445122800",
      "title": "Southern Miss. UTSA",
      "url": "/game/football/fbs/2015/10/17/utsa-southern-miss",
      "videoState": ""
    }},
    {"game": {
      "away": {
        "conferenceNames": {
          "conferenceDisplay": "Atlantic Coast Conference",
          "conferenceDivision": "fbs",
          "conferenceName": "ACC",
          "conferenceSeo": "atlantic-coast"
        },
        "description": "(3-4)",
        "names": {
          "char6": "BC",
          "full": "Boston College",
          "seo": "boston-college",
          "short": "Boston College"
        },
        "rank": "",
        "score": "17",
        "seed": "",
        "winner": false
      },
      "bracketId": "",
      "bracketRegion": "",
      "bracketRound": "",
      "contestClock": "0:00",
      "currentPeriod": "Final",
      "finalMessage": "Final",
      "gameID": "ded96c0b-ed14-437d-b06e-1730028fd323",
      "gameState": "final",
      "home": {
        "conferenceNames": {
          "conferenceDisplay": "Atlantic Coast Conference",
          "conferenceDivision": "fbs",
          "conferenceName": "ACC",
          "conferenceSeo": "atlantic-coast"
        },
        "description": "(6-0)",
        "names": {
          "char6": "CLEM",
          "full": "Clemson University",
          "seo": "clemson",
          "short": "Clemson"
        },
        "rank": "5",
        "score": "34",
        "seed": "",
        "winner": true
      },
      "liveVideoEnabled": false,
      "network": "",
      "startDate": "10-17-2015",
      "startTime": "07:00PM ET",
      "startTimeEpoch": "1445122800",
      "title": "Clemson Boston College",
      "url": "/game/football/fbs/2015/10/17/boston-college-clemson",
      "videoState": ""
    }},
    {"game": {
      "away": {
        "conferenceNames": {
          "conferenceDisplay": "Southeastern Conference",
          "conferenceDivision": "fbs",
          "conferenceName": "SEC",
          "conferenceSeo": "southeastern"
        },
        "description": "(6-1)",
        "names": {
          "char6": "FLA",
          "full": "University of Florida",
          "seo": "florida",
          "short": "Florida"
        },
        "rank": "8",
        "score": "28",
        "seed": "",
        "winner": false
      },
      "bracketId": "",
      "bracketRegion": "",
      "bracketRound": "",
      "contestClock": "0:00",
      "currentPeriod": "Final",
      "finalMessage": "Final",
      "gameID": "e7bef71b-0e3e-4a1c-b2ff-520411e50eb6",
      "gameState": "final",
      "home": {
        "conferenceNames": {
          "conferenceDisplay": "Southeastern Conference",
          "conferenceDivision": "fbs",
          "conferenceName": "SEC",
          "conferenceSeo": "southeastern"
        },
        "description": "(6-0)",
        "names": {
          "char6": "LSU",
          "full": "Louisiana State University",
          "seo": "lsu",
          "short": "LSU"
        },
        "rank": "6",
        "score": "35",
        "seed": "",
        "winner": true
      },
      "liveVideoEnabled": false,
      "network": "",
      "startDate": "10-17-2015",
      "startTime": "07:00PM ET",
      "startTimeEpoch": "1445122800",
      "title": "LSU Florida",
      "url": "/game/football/fbs/2015/10/17/florida-lsu",
      "videoState": ""
    }},
    {"game": {
      "away": {
        "conferenceNames": {
          "conferenceDisplay": "Big 12 Conference",
          "conferenceDivision": "fbs",
          "conferenceName": "Big 12",
          "conferenceSeo": "big-12"
        },
        "description": "(7-0)",
        "names": {
          "char6": "TCU",
          "full": "Texas Christian University",
          "seo": "tcu",
          "short": "TCU"
        },
        "rank": "3",
        "score": "45",
        "seed": "",
        "winner": true
      },
      "bracketId": "",
      "bracketRegion": "",
      "bracketRound": "",
      "contestClock": "0:00",
      "currentPeriod": "Final",
      "finalMessage": "Final",
      "gameID": "6950313c-74ce-49cb-81a3-b3a3007daf95",
      "gameState": "final",
      "home": {
        "conferenceNames": {
          "conferenceDisplay": "Big 12 Conference",
          "conferenceDivision": "fbs",
          "conferenceName": "Big 12",
          "conferenceSeo": "big-12"
        },
        "description": "(2-4)",
        "names": {
          "char6": "IOWAST",
          "full": "Iowa State University",
          "seo": "iowa-st",
          "short": "Iowa St."
        },
        "rank": "",
        "score": "21",
        "seed": "",
        "winner": false
      },
      "liveVideoEnabled": false,
      "network": "",
      "startDate": "10-17-2015",
      "startTime": "07:00PM ET",
      "startTimeEpoch": "1445122800",
      "title": "Iowa St. TCU",
      "url": "/game/football/fbs/2015/10/17/tcu-iowa-st",
      "videoState": ""
    }},
    {"game": {
      "away": {
        "conferenceNames": {
          "conferenceDisplay": "Sun Belt Conference",
          "conferenceDivision": "fbs",
          "conferenceName": "Sun Belt",
          "conferenceSeo": "sun-belt"
        },
        "description": "(5-1)",
        "names": {
          "char6": "APP ST",
          "full": "Appalachian State University",
          "seo": "appalachian-st",
          "short": "Appalachian St."
        },
        "rank": "",
        "score": "59",
        "seed": "",
        "winner": true
      },
      "bracketId": "",
      "bracketRegion": "",
      "bracketRound": "",
      "contestClock": "0:00",
      "currentPeriod": "Final",
      "finalMessage": "Final",
      "gameID": "fd674ab0-330a-45da-8ffe-b21a99797bdb",
      "gameState": "final",
      "home": {
        "conferenceNames": {
          "conferenceDisplay": "Sun Belt Conference",
          "conferenceDivision": "fbs",
          "conferenceName": "Sun Belt",
          "conferenceSeo": "sun-belt"
        },
        "description": "(1-5)",
        "names": {
          "char6": "LA MON",
          "full": "University of Louisiana at Monroe",
          "seo": "la-monroe",
          "short": "La.-Monroe"
        },
        "rank": "",
        "score": "14",
        "seed": "",
        "winner": false
      },
      "liveVideoEnabled": false,
      "network": "",
      "startDate": "10-17-2015",
      "startTime": "07:00PM ET",
      "startTimeEpoch": "1445122800",
      "title": "La.-Monroe Appalachian St.",
      "url": "/game/football/fbs/2015/10/17/appalachian-st-la-monroe",
      "videoState": ""
    }},
    {"game": {
      "away": {
        "conferenceNames": {
          "conferenceDisplay": "Atlantic Coast Conference",
          "conferenceDivision": "fbs",
          "conferenceName": "ACC",
          "conferenceSeo": "atlantic-coast"
        },
        "description": "(3-4)",
        "names": {
          "char6": "WAKE",
          "full": "Wake Forest University",
          "seo": "wake-forest",
          "short": "Wake Forest"
        },
        "rank": "",
        "score": "14",
        "seed": "",
        "winner": false
      },
      "bracketId": "",
      "bracketRegion": "",
      "bracketRound": "",
      "contestClock": "0:00",
      "currentPeriod": "Final",
      "finalMessage": "Final",
      "gameID": "78e74911-5c4e-4f30-a8cf-9a81fa87bf04",
      "gameState": "final",
      "home": {
        "conferenceNames": {
          "conferenceDisplay": "Atlantic Coast Conference",
          "conferenceDivision": "fbs",
          "conferenceName": "ACC",
          "conferenceSeo": "atlantic-coast"
        },
        "description": "(5-1)",
        "names": {
          "char6": "UNC",
          "full": "University of North Carolina, Chapel Hill",
          "seo": "north-carolina",
          "short": "North Carolina"
        },
        "rank": "",
        "score": "50",
        "seed": "",
        "winner": true
      },
      "liveVideoEnabled": false,
      "network": "",
      "startDate": "10-17-2015",
      "startTime": "07:00PM ET",
      "startTimeEpoch": "1445122800",
      "title": "North Carolina Wake Forest",
      "url": "/game/football/fbs/2015/10/17/wake-forest-north-carolina",
      "videoState": ""
    }},
    {"game": {
      "away": {
        "conferenceNames": {
          "conferenceDisplay": "Mountain West Conference",
          "conferenceDivision": "fbs",
          "conferenceName": "MWC",
          "conferenceSeo": "mountain-west"
        },
        "description": "(2-5)",
        "names": {
          "char6": "HAWAII",
          "full": "University of Hawaii, Manoa",
          "seo": "hawaii",
          "short": "Hawaii"
        },
        "rank": "",
        "score": "27",
        "seed": "",
        "winner": false
      },
      "bracketId": "",
      "bracketRegion": "",
      "bracketRound": "",
      "contestClock": "0:00",
      "currentPeriod": "Final",
      "finalMessage": "Final",
      "gameID": "71aabe8f-9ec0-4a59-aad3-04643e15632c",
      "gameState": "final",
      "home": {
        "conferenceNames": {
          "conferenceDisplay": "Mountain West Conference",
          "conferenceDivision": "fbs",
          "conferenceName": "MWC",
          "conferenceSeo": "mountain-west"
        },
        "description": "(4-3)",
        "names": {
          "char6": "N MEX",
          "full": "University of New Mexico",
          "seo": "new-mexico",
          "short": "New Mexico"
        },
        "rank": "",
        "score": "28",
        "seed": "",
        "winner": true
      },
      "liveVideoEnabled": false,
      "network": "",
      "startDate": "10-17-2015",
      "startTime": "07:00PM ET",
      "startTimeEpoch": "1445122800",
      "title": "New Mexico Hawaii",
      "url": "/game/football/fbs/2015/10/17/hawaii-new-mexico",
      "videoState": ""
    }},
    {"game": {
      "away": {
        "conferenceNames": {
          "conferenceDisplay": "Pac-12 Conference",
          "conferenceDivision": "fbs",
          "conferenceName": "Pac-12",
          "conferenceSeo": "pac-12"
        },
        "description": "(3-3)",
        "names": {
          "char6": "USC",
          "full": "University of Southern California",
          "seo": "southern-california",
          "short": "Southern California"
        },
        "rank": "",
        "score": "31",
        "seed": "",
        "winner": false
      },
      "bracketId": "",
      "bracketRegion": "",
      "bracketRound": "",
      "contestClock": "0:00",
      "currentPeriod": "Final",
      "finalMessage": "Final",
      "gameID": "2c7f8754-0a89-4aa1-89a3-e5e61a1161cd",
      "gameState": "final",
      "home": {
        "conferenceNames": {
          "conferenceDisplay": "FBS Independent",
          "conferenceDivision": "fbs",
          "conferenceName": "IND",
          "conferenceSeo": "fbs-independent"
        },
        "description": "(6-1)",
        "names": {
          "char6": "N DAME",
          "full": "University of Notre Dame",
          "seo": "notre-dame",
          "short": "Notre Dame"
        },
        "rank": "14",
        "score": "41",
        "seed": "",
        "winner": true
      },
      "liveVideoEnabled": false,
      "network": "",
      "startDate": "10-17-2015",
      "startTime": "07:30PM ET",
      "startTimeEpoch": "1445124600",
      "title": "Notre Dame Southern California",
      "url": "/game/football/fbs/2015/10/17/southern-california-notre-dame",
      "videoState": ""
    }},
    {"game": {
      "away": {
        "conferenceNames": {
          "conferenceDisplay": "Southeastern Conference",
          "conferenceDivision": "fbs",
          "conferenceName": "SEC",
          "conferenceSeo": "southeastern"
        },
        "description": "(4-3)",
        "names": {
          "char6": "MIZZOU",
          "full": "University of Missouri, Columbia",
          "seo": "missouri",
          "short": "Missouri"
        },
        "rank": "",
        "score": "6",
        "seed": "",
        "winner": false
      },
      "bracketId": "",
      "bracketRegion": "",
      "bracketRound": "",
      "contestClock": "0:00",
      "currentPeriod": "Final",
      "finalMessage": "Final",
      "gameID": "b2aa81b7-aa09-403d-89ae-6d40f19e3979",
      "gameState": "final",
      "home": {
        "conferenceNames": {
          "conferenceDisplay": "Southeastern Conference",
          "conferenceDivision": "fbs",
          "conferenceName": "SEC",
          "conferenceSeo": "southeastern"
        },
        "description": "(5-2)",
        "names": {
          "char6": "UGA",
          "full": "University of Georgia",
          "seo": "georgia",
          "short": "Georgia"
        },
        "rank": "",
        "score": "9",
        "seed": "",
        "winner": true
      },
      "liveVideoEnabled": false,
      "network": "",
      "startDate": "10-17-2015",
      "startTime": "07:30PM ET",
      "startTimeEpoch": "1445124600",
      "title": "Georgia Missouri",
      "url": "/game/football/fbs/2015/10/17/missouri-georgia",
      "videoState": ""
    }},
    {"game": {
      "away": {
        "conferenceNames": {
          "conferenceDisplay": "American Athletic Conference",
          "conferenceDivision": "fbs",
          "conferenceName": "AAC",
          "conferenceSeo": "american-athletic"
        },
        "description": "(0-7)",
        "names": {
          "char6": "UCF",
          "full": "University of Central Florida",
          "seo": "ucf",
          "short": "UCF"
        },
        "rank": "",
        "score": "16",
        "seed": "",
        "winner": false
      },
      "bracketId": "",
      "bracketRegion": "",
      "bracketRound": "",
      "contestClock": "0:00",
      "currentPeriod": "Final",
      "finalMessage": "Final",
      "gameID": "db6faccf-f06c-4f0a-a034-ec3fab327034",
      "gameState": "final",
      "home": {
        "conferenceNames": {
          "conferenceDisplay": "American Athletic Conference",
          "conferenceDivision": "fbs",
          "conferenceName": "AAC",
          "conferenceSeo": "american-athletic"
        },
        "description": "(6-0)",
        "names": {
          "char6": "TEMPLE",
          "full": "Temple University",
          "seo": "temple",
          "short": "Temple"
        },
        "rank": "",
        "score": "30",
        "seed": "",
        "winner": true
      },
      "liveVideoEnabled": false,
      "network": "",
      "startDate": "10-17-2015",
      "startTime": "07:30PM ET",
      "startTimeEpoch": "1445124600",
      "title": "Temple UCF",
      "url": "/game/football/fbs/2015/10/17/ucf-temple",
      "videoState": ""
    }},
    {"game": {
      "away": {
        "conferenceNames": {
          "conferenceDisplay": "Big Ten Conference",
          "conferenceDivision": "fbs",
          "conferenceName": "Big Ten",
          "conferenceSeo": "big-ten"
        },
        "description": "(5-2)",
        "names": {
          "char6": "PENNST",
          "full": "Pennsylvania State University",
          "seo": "penn-st",
          "short": "Penn St."
        },
        "rank": "",
        "score": "10",
        "seed": "",
        "winner": false
      },
      "bracketId": "",
      "bracketRegion": "",
      "bracketRound": "",
      "contestClock": "0:00",
      "currentPeriod": "Final",
      "finalMessage": "Final",
      "gameID": "fad22db4-1b32-4ab2-b451-a9df7f31f137",
      "gameState": "final",
      "home": {
        "conferenceNames": {
          "conferenceDisplay": "Big Ten Conference",
          "conferenceDivision": "fbs",
          "conferenceName": "Big Ten",
          "conferenceSeo": "big-ten"
        },
        "description": "(7-0)",
        "names": {
          "char6": "OHIOST",
          "full": "The Ohio State University",
          "seo": "ohio-st",
          "short": "Ohio St."
        },
        "rank": "1",
        "score": "38",
        "seed": "",
        "winner": true
      },
      "liveVideoEnabled": false,
      "network": "",
      "startDate": "10-17-2015",
      "startTime": "08:00PM ET",
      "startTimeEpoch": "1445126400",
      "title": "Ohio St. Penn St.",
      "url": "/game/football/fbs/2015/10/17/penn-st-ohio-st",
      "videoState": ""
    }},
    {"game": {
      "away": {
        "conferenceNames": {
          "conferenceDisplay": "Pac-12 Conference",
          "conferenceDivision": "fbs",
          "conferenceName": "Pac-12",
          "conferenceSeo": "pac-12"
        },
        "description": "(5-2)",
        "names": {
          "char6": "ARIZ",
          "full": "University of Arizona",
          "seo": "arizona",
          "short": "Arizona"
        },
        "rank": "",
        "score": "38",
        "seed": "",
        "winner": true
      },
      "bracketId": "",
      "bracketRegion": "",
      "bracketRound": "",
      "contestClock": "0:00",
      "currentPeriod": "Final",
      "finalMessage": "Final",
      "gameID": "8089e7f2-5d88-4624-90f1-dcfcc7a4a01f",
      "gameState": "final",
      "home": {
        "conferenceNames": {
          "conferenceDisplay": "Pac-12 Conference",
          "conferenceDivision": "fbs",
          "conferenceName": "Pac-12",
          "conferenceSeo": "pac-12"
        },
        "description": "(3-4)",
        "names": {
          "char6": "COLO",
          "full": "University of Colorado, Boulder",
          "seo": "colorado",
          "short": "Colorado"
        },
        "rank": "",
        "score": "31",
        "seed": "",
        "winner": false
      },
      "liveVideoEnabled": false,
      "network": "",
      "startDate": "10-17-2015",
      "startTime": "09:00PM ET",
      "startTimeEpoch": "1445130000",
      "title": "Colorado Arizona",
      "url": "/game/football/fbs/2015/10/17/arizona-colorado",
      "videoState": ""
    }},
    {"game": {
      "away": {
        "conferenceNames": {
          "conferenceDisplay": "Pac-12 Conference",
          "conferenceDivision": "fbs",
          "conferenceName": "Pac-12",
          "conferenceSeo": "pac-12"
        },
        "description": "(4-3)",
        "names": {
          "char6": "AZ ST",
          "full": "Arizona State University",
          "seo": "arizona-st",
          "short": "Arizona St."
        },
        "rank": "",
        "score": "18",
        "seed": "",
        "winner": false
      },
      "bracketId": "",
      "bracketRegion": "",
      "bracketRound": "",
      "contestClock": "0:00",
      "currentPeriod": "Final",
      "finalMessage": "Final",
      "gameID": "1fec4f3e-df07-4460-8d08-027e3a982439",
      "gameState": "final",
      "home": {
        "conferenceNames": {
          "conferenceDisplay": "Pac-12 Conference",
          "conferenceDivision": "fbs",
          "conferenceName": "Pac-12",
          "conferenceSeo": "pac-12"
        },
        "description": "(6-0)",
        "names": {
          "char6": "UTAH",
          "full": "University of Utah",
          "seo": "utah",
          "short": "Utah"
        },
        "rank": "4",
        "score": "34",
        "seed": "",
        "winner": true
      },
      "liveVideoEnabled": false,
      "network": "",
      "startDate": "10-17-2015",
      "startTime": "10:00PM ET",
      "startTimeEpoch": "1445133600",
      "title": "Utah Arizona St.",
      "url": "/game/football/fbs/2015/10/17/arizona-st-utah",
      "videoState": ""
    }},
    {"game": {
      "away": {
        "conferenceNames": {
          "conferenceDisplay": "Pac-12 Conference",
          "conferenceDivision": "fbs",
          "conferenceName": "Pac-12",
          "conferenceSeo": "pac-12"
        },
        "description": "(4-3)",
        "names": {
          "char6": "OREGN",
          "full": "University of Oregon",
          "seo": "oregon",
          "short": "Oregon"
        },
        "rank": "",
        "score": "26",
        "seed": "",
        "winner": true
      },
      "bracketId": "",
      "bracketRegion": "",
      "bracketRound": "",
      "contestClock": "0:00",
      "currentPeriod": "Final",
      "finalMessage": "Final",
      "gameID": "2a179c9a-6de6-4a48-9a25-116a1bc06d47",
      "gameState": "final",
      "home": {
        "conferenceNames": {
          "conferenceDisplay": "Pac-12 Conference",
          "conferenceDivision": "fbs",
          "conferenceName": "Pac-12",
          "conferenceSeo": "pac-12"
        },
        "description": "(3-3)",
        "names": {
          "char6": "WASH",
          "full": "University of Washington",
          "seo": "washington",
          "short": "Washington"
        },
        "rank": "",
        "score": "20",
        "seed": "",
        "winner": false
      },
      "liveVideoEnabled": false,
      "network": "",
      "startDate": "10-17-2015",
      "startTime": "10:30PM ET",
      "startTimeEpoch": "1445135400",
      "title": "Washington Oregon",
      "url": "/game/football/fbs/2015/10/17/oregon-washington",
      "videoState": ""
    }},
    {"game": {
      "away": {
        "conferenceNames": {
          "conferenceDisplay": "Mountain West Conference",
          "conferenceDivision": "fbs",
          "conferenceName": "MWC",
          "conferenceSeo": "mountain-west"
        },
        "description": "(4-3)",
        "names": {
          "char6": "SDSU",
          "full": "San Diego State University",
          "seo": "san-diego-st",
          "short": "San Diego St."
        },
        "rank": "",
        "score": "30",
        "seed": "",
        "winner": true
      },
      "bracketId": "",
      "bracketRegion": "",
      "bracketRound": "",
      "contestClock": "0:00",
      "currentPeriod": "Final",
      "finalMessage": "Final",
      "gameID": "a45a93fb-d9bc-4c1e-9fca-feeeae25474a",
      "gameState": "final",
      "home": {
        "conferenceNames": {
          "conferenceDisplay": "Mountain West Conference",
          "conferenceDivision": "fbs",
          "conferenceName": "MWC",
          "conferenceSeo": "mountain-west"
        },
        "description": "(3-4)",
        "names": {
          "char6": "SJSU",
          "full": "San Jose State University",
          "seo": "san-jose-st",
          "short": "San Jose St."
        },
        "rank": "",
        "score": "7",
        "seed": "",
        "winner": false
      },
      "liveVideoEnabled": false,
      "network": "",
      "startDate": "10-17-2015",
      "startTime": "10:30PM ET",
      "startTimeEpoch": "1445135400",
      "title": "San Jose St. San Diego St.",
      "url": "/game/football/fbs/2015/10/17/san-diego-st-san-jose-st",
      "videoState": ""
    }}
  ],
  "inputMD5Sum": "99656409426e51ba2b8d884f90e58c39"
}