{
  "games": [
    {"game": {
      "away": {
        "conferences": [{
          "conferenceName": "MAC",
          "conferenceSeo": "mac"
        }],
        "description": "(5-6)",
        "names": {
          "char6": "OHIO",
          "full": "Ohio University",
          "seo": "ohio",
          "short": "Ohio"
        },
        "rank": "",
        "score": "52",
        "seed": "",
        "winner": true
      },
      "bracketId": "",
      "bracketRegion": "",
      "bracketRound": "",
      "contestClock": "0:00",
      "currentPeriod": "FINAL",
      "finalMessage": "FINAL",
      "gameID": "e38ccb21-7b15-430b-8992-bd2bb6b59d29",
      "gameState": "final",
      "home": {
        "conferences": [{
          "conferenceName": "MAC",
          "conferenceSeo": "mac"
        }],
        "description": "(0-11)",
        "names": {
          "char6": "AKRON",
          "full": "University of Akron",
          "seo": "akron",
          "short": "Akron"
        },
        "rank": "",
        "score": "3",
        "seed": "",
        "winner": false
      },
      "liveVideoEnabled": false,
      "network": "",
      "startDate": "11-26-2019",
      "startTime": "06:00PM ET",
      "startTimeEpoch": "1574809200",
      "title": "Akron Ohio",
      "url": "/game/3785201",
      "videoState": ""
    }},
    {"game": {
      "away": {
        "conferences": [{
          "conferenceName": "MAC",
          "conferenceSeo": "mac"
        }],
        "description": "(7-4)",
        "names": {
          "char6": "W MICH",
          "full": "Western Michigan University",
          "seo": "western-mich",
          "short": "Western Mich."
        },
        "rank": "",
        "score": "14",
        "seed": "",
        "winner": false
      },
      "bracketId": "",
      "bracketRegion": "",
      "bracketRound": "",
      "contestClock": "0:00",
      "currentPeriod": "FINAL",
      "finalMessage": "FINAL",
      "gameID": "36b199b2-4ebc-400a-b64d-f9c91aa00cc5",
      "gameState": "final",
      "home": {
        "conferences": [{
          "conferenceName": "MAC",
          "conferenceSeo": "mac"
        }],
        "description": "(4-7)",
        "names": {
          "char6": "NIU",
          "full": "Northern Illinois University",
          "seo": "northern-ill",
          "short": "Northern Ill."
        },
        "rank": "",
        "score": "17",
        "seed": "",
        "winner": true
      },
      "liveVideoEnabled": false,
      "network": "",
      "startDate": "11-26-2019",
      "startTime": "07:00PM ET",
      "startTimeEpoch": "1574812800",
      "title": "Northern Ill. Western Mich.",
      "url": "/game/3785561",
      "videoState": ""
    }},
    {"game": {
      "away": {
        "conferences": [{
          "conferenceName": "SEC",
          "conferenceSeo": "sec"
        }],
        "description": "(4-7)",
        "names": {
          "char6": "MISS",
          "full": "University of Mississippi",
          "seo": "ole-miss",
          "short": "Ole Miss"
        },
        "rank": "",
        "score": "20",
        "seed": "",
        "winner": false
      },
      "bracketId": "",
      "bracketRegion": "",
      "bracketRound": "",
      "contestClock": "0:00",
      "currentPeriod": "FINAL",
      "finalMessage": "FINAL",
      "gameID": "ef7608d9-2b3e-40ce-892e-6e773f2510b9",
      "gameState": "final",
      "home": {
        "conferences": [{
          "conferenceName": "SEC",
          "conferenceSeo": "sec"
        }],
        "description": "(5-6)",
        "names": {
          "char6": "MISSST",
          "full": "Mississippi State University",
          "seo": "mississippi-st",
          "short": "Mississippi St."
        },
        "rank": "",
        "score": "21",
        "seed": "",
        "winner": true
      },
      "liveVideoEnabled": false,
      "network": "",
      "startDate": "11-28-2019",
      "startTime": "07:30PM ET",
      "startTimeEpoch": "1574987400",
      "title": "Mississippi St. Ole Miss",
      "url": "/game/3784843",
      "videoState": ""
    }},
    {"game": {
      "away": {
        "conferences": [{
          "conferenceName": "MAC",
          "conferenceSeo": "mac"
        }],
        "description": "(6-5)",
        "names": {
          "char6": "TOLEDO",
          "full": "University of Toledo",
          "seo": "toledo",
          "short": "Toledo"
        },
        "rank": "",
        "score": "7",
        "seed": "",
        "winner": false
      },
      "bracketId": "",
      "bracketRegion": "",
      "bracketRound": "",
      "contestClock": "0:00",
      "currentPeriod": "FINAL",
      "finalMessage": "FINAL",
      "gameID": "99ee3c6a-6ebb-455e-8fb2-0cbf41eb157a",
      "gameState": "final",
      "home": {
        "conferences": [{
          "conferenceName": "MAC",
          "conferenceSeo": "mac"
        }],
        "description": "(7-4)",
        "names": {
          "char6": "C MICH",
          "full": "Central Michigan University",
          "seo": "central-mich",
          "short": "Central Mich."
        },
        "rank": "",
        "score": "49",
        "seed": "",
        "winner": true
      },
      "liveVideoEnabled": false,
      "network": "",
      "startDate": "11-29-2019",
      "startTime": "12:00PM ET",
      "startTimeEpoch": "1575046800",
      "title": "Central Mich. Toledo",
      "url": "/game/3785693",
      "videoState": ""
    }},
    {"game": {
      "away": {
        "conferences": [
          {
            "conferenceName": "ACC",
            "conferenceSeo": "acc"
          },
          {
            "conferenceName": "Top 25",
            "conferenceSeo": "top-25"
          }
        ],
        "description": "(8-3)",
        "names": {
          "char6": "VT",
          "full": "Virginia Polytechnic Institute and State University",
          "seo": "virginia-tech",
          "short": "Virginia Tech"
        },
        "rank": "24",
        "score": "30",
        "seed": "",
        "winner": false
      },
      "bracketId": "",
      "bracketRegion": "",
      "bracketRound": "",
      "contestClock": "0:00",
      "currentPeriod": "FINAL",
      "finalMessage": "FINAL",
      "gameID": "d4253856-395d-49b6-a374-807b321d0346",
      "gameState": "final",
      "home": {
        "conferences": [{
          "conferenceName": "ACC",
          "conferenceSeo": "acc"
        }],
        "description": "(8-3)",
        "names": {
          "char6": "UVA",
          "full": "University of Virginia",
          "seo": "virginia",
          "short": "Virginia"
        },
        "rank": "",
        "score": "39",
        "seed": "",
        "winner": true
      },
      "liveVideoEnabled": false,
      "network": "",
      "startDate": "11-29-2019",
      "startTime": "12:00PM ET",
      "startTimeEpoch": "1575046800",
      "title": "Virginia Virginia Tech",
      "url": "/game/3785679",
      "videoState": ""
    }},
    {"game": {
      "away": {
        "conferences": [{
          "conferenceName": "Big 12",
          "conferenceSeo": "big-12"
        }],
        "description": "(4-7)",
        "names": {
          "char6": "TXTECH",
          "full": "Texas Tech University",
          "seo": "texas-tech",
          "short": "Texas Tech"
        },
        "rank": "",
        "score": "24",
        "seed": "",
        "winner": false
      },
      "bracketId": "",
      "bracketRegion": "",
      "bracketRound": "",
      "contestClock": "0:00",
      "currentPeriod": "FINAL",
      "finalMessage": "FINAL",
      "gameID": "0d16744a-3f53-47c7-b868-d2ea48b3aa07",
      "gameState": "final",
      "home": {
        "conferences": [{
          "conferenceName": "Big 12",
          "conferenceSeo": "big-12"
        }],
        "description": "(6-5)",
        "names": {
          "char6": "TEXAS",
          "full": "University of Texas at Austin",
          "seo": "texas",
          "short": "Texas"
        },
        "rank": "",
        "score": "49",
        "seed": "",
        "winner": true
      },
      "liveVideoEnabled": false,
      "network": "",
      "startDate": "11-29-2019",
      "startTime": "12:00PM ET",
      "startTimeEpoch": "1575046800",
      "title": "Texas Texas Tech",
      "url": "/game/3784618",
      "videoState": ""
    }},
    {"game": {
      "away": {
        "conferences": [{
          "conferenceName": "MAC",
          "conferenceSeo": "mac"
        }],
        "description": "(7-4)",
        "names": {
          "char6": "MIA OH",
          "full": "Miami University (Ohio)",
          "seo": "miami-oh",
          "short": "Miami (OH)"
        },
        "rank": "",
        "score": "27",
        "seed": "",
        "winner": false
      },
      "bracketId": "",
      "bracketRegion": "",
      "bracketRound": "",
      "contestClock": "0:00",
      "currentPeriod": "FINAL",
      "finalMessage": "FINAL",
      "gameID": "0af75842-4968-474f-a057-40041f3a496b",
      "gameState": "final",
      "home": {
        "conferences": [{
          "conferenceName": "MAC",
          "conferenceSeo": "mac"
        }],
        "description": "(4-7)",
        "names": {
          "char6": "BALLST",
          "full": "Ball State University",
          "seo": "ball-st",
          "short": "Ball St."
        },
        "rank": "",
        "score": "41",
        "seed": "",
        "winner": true
      },
      "liveVideoEnabled": false,
      "network": "",
      "startDate": "11-29-2019",
      "startTime": "12:00PM ET",
      "startTimeEpoch": "1575046800",
      "title": "Ball St. Miami (OH)",
      "url": "/game/3785095",
      "videoState": ""
    }},
    {"game": {
      "away": {
        "conferences": [{
          "conferenceName": "MAC",
          "conferenceSeo": "mac"
        }],
        "description": "(3-8)",
        "names": {
          "char6": "BGSU",
          "full": "Bowling Green State University",
          "seo": "bowling-green",
          "short": "Bowling Green"
        },
        "rank": "",
        "score": "7",
        "seed": "",
        "winner": false
      },
      "bracketId": "",
      "bracketRegion": "",
      "bracketRound": "",
      "contestClock": "0:00",
      "currentPeriod": "FINAL",
      "finalMessage": "FINAL",
      "gameID": "d18e826c-7ad3-4975-9df4-d64197f4303d",
      "gameState": "final",
      "home": {
        "conferences": [{
          "conferenceName": "MAC",
          "conferenceSeo": "mac"
        }],
        "description": "(6-5)",
        "names": {
          "char6": "BUFF",
          "full": "University at Buffalo, the State University of New York",
          "seo": "buffalo",
          "short": "Buffalo"
        },
        "rank": "",
        "score": "49",
        "seed": "",
        "winner": true
      },
      "liveVideoEnabled": false,
      "network": "",
      "startDate": "11-29-2019",
      "startTime": "12:00PM ET",
      "startTimeEpoch": "1575046800",
      "title": "Buffalo Bowling Green",
      "url": "/game/3784788",
      "videoState": ""
    }},
    {"game": {
      "away": {
        "conferences": [{
          "conferenceName": "MAC",
          "conferenceSeo": "mac"
        }],
        "description": "(5-6)",
        "names": {
          "char6": "KENT",
          "full": "Kent State University",
          "seo": "kent-st",
          "short": "Kent St."
        },
        "rank": "",
        "score": "34",
        "seed": "",
        "winner": true
      },
      "bracketId": "",
      "bracketRegion": "",
      "bracketRound": "",
      "contestClock": "0:00",
      "currentPeriod": "FINAL",
      "finalMessage": "FINAL",
      "gameID": "8e22b309-a307-47c0-8f76-21872c77cc62",
      "gameState": "final",
      "home": {
        "conferences": [{
          "conferenceName": "MAC",
          "conferenceSeo": "mac"
        }],
        "description": "(6-5)",
        "names": {
          "char6": "E MICH",
          "full": "Eastern Michigan University",
          "seo": "eastern-mich",
          "short": "Eastern Mich."
        },
        "rank": "",
        "score": "26",
        "seed": "",
        "winner": false
      },
      "liveVideoEnabled": false,
      "network": "",
      "startDate": "11-29-2019",
      "startTime": "12:00PM ET",
      "startTimeEpoch": "1575046800",
      "title": "Eastern Mich. Kent St.",
      "url": "/game/3784687",
      "videoState": ""
    }},
    {"game": {
      "away": {
        "conferences": [{
          "conferenceName": "SEC",
          "conferenceSeo": "sec"
        }],
        "description": "(5-6)",
        "names": {
          "char6": "MIZZOU",
          "full": "University of Missouri, Columbia",
          "seo": "missouri",
          "short": "Missouri"
        },
        "rank": "",
        "score": "24",
        "seed": "",
        "winner": true
      },
      "bracketId": "",
      "bracketRegion": "",
      "bracketRound": "",
      "contestClock": "0:00",
      "currentPeriod": "FINAL",
      "finalMessage": "FINAL",
      "gameID": "ecab7fb7-5193-47fc-a174-a5dd4c4b2d1b",
      "gameState": "final",
      "home": {
        "conferences": [{
          "conferenceName": "SEC",
          "conferenceSeo": "sec"
        }],
        "description": "(2-9)",
        "names": {
          "char6": "ARK",
          "full": "University of Arkansas, Fayetteville",
          "seo": "arkansas",
          "short": "Arkansas"
        },
        "rank": "",
        "score": "14",
        "seed": "",
        "winner": false
      },
      "liveVideoEnabled": false,
      "network": "",
      "startDate": "11-29-2019",
      "startTime": "02:30PM ET",
      "startTimeEpoch": "1575055800",
      "title": "Arkansas Missouri",
      "url": "/game/3785597",
      "videoState": ""
    }},
    {"game": {
      "away": {
        "conferences": [
          {
            "conferenceName": "Big Ten",
            "conferenceSeo": "big-ten"
          },
          {
            "conferenceName": "Top 25",
            "conferenceSeo": "top-25"
          }
        ],
        "description": "(8-3)",
        "names": {
          "char6": "IOWA",
          "full": "University of Iowa",
          "seo": "iowa",
          "short": "Iowa"
        },
        "rank": "17",
        "score": "27",
        "seed": "",
        "winner": true
      },
      "bracketId": "",
      "bracketRegion": "",
      "bracketRound": "",
      "contestClock": "0:00",
      "currentPeriod": "FINAL",
      "finalMessage": "FINAL",
      "gameID": "b36184de-d30f-4bbf-80cc-233b41292470",
      "gameState": "final",
      "home": {
        "conferences": [{
          "conferenceName": "Big Ten",
          "conferenceSeo": "big-ten"
        }],
        "description": "(5-6)",
        "names": {
          "char6": "NEB",
          "full": "University of Nebraska, Lincoln",
          "seo": "nebraska",
          "short": "Nebraska"
        },
        "rank": "",
        "score": "24",
        "seed": "",
        "winner": false
      },
      "liveVideoEnabled": false,
      "network": "",
      "startDate": "11-29-2019",
      "startTime": "02:30PM ET",
      "startTimeEpoch": "1575055800",
      "title": "Nebraska Iowa",
      "url": "/game/3784658",
      "videoState": ""
    }},
    {"game": {
      "away": {
        "conferences": [
          {
            "conferenceName": "Mountain West",
            "conferenceSeo": "mountain-west"
          },
          {
            "conferenceName": "Top 25",
            "conferenceSeo": "top-25"
          }
        ],
        "description": "(10-1)",
        "names": {
          "char6": "BOISE",
          "full": "Boise State University",
          "seo": "boise-st",
          "short": "Boise St."
        },
        "rank": "20",
        "score": "31",
        "seed": "",
        "winner": true
      },
      "bracketId": "",
      "bracketRegion": "",
      "bracketRound": "",
      "contestClock": "0:00",
      "currentPeriod": "FINAL",
      "finalMessage": "FINAL",
      "gameID": "9d08f82a-0a34-487c-a339-d927486ebcee",
      "gameState": "final",
      "home": {
        "conferences": [{
          "conferenceName": "Mountain West",
          "conferenceSeo": "mountain-west"
        }],
        "description": "(4-7)",
        "names": {
          "char6": "CO ST",
          "full": "Colorado State University",
          "seo": "colorado-st",
          "short": "Colorado St."
        },
        "rank": "",
        "score": "24",
        "seed": "",
        "winner": false
      },
      "liveVideoEnabled": false,
      "network": "",
      "startDate": "11-29-2019",
      "startTime": "03:30PM ET",
      "startTimeEpoch": "1575059400",
      "title": "Colorado St. Boise St.",
      "url": "/game/3785580",
      "videoState": ""
    }},
    {"game": {
      "away": {
        "conferences": [
          {
            "conferenceName": "AAC",
            "conferenceSeo": "aac"
          },
          {
            "conferenceName": "Top 25",
            "conferenceSeo": "top-25"
          }
        ],
        "description": "(10-1)",
        "names": {
          "char6": "CINCY",
          "full": "University of Cincinnati",
          "seo": "cincinnati",
          "short": "Cincinnati"
        },
        "rank": "19",
        "score": "24",
        "seed": "",
        "winner": false
      },
      "bracketId": "",
      "bracketRegion": "",
      "bracketRound": "",
      "contestClock": "0:00",
      "currentPeriod": "FINAL",
      "finalMessage": "FINAL",
      "gameID": "282463b0-4c3a-4ad7-8352-4d3d697e7274",
      "gameState": "final",
      "home": {
        "conferences": [
          {
            "conferenceName": "AAC",
            "conferenceSeo": "aac"
          },
          {
            "conferenceName": "Top 25",
            "conferenceSeo": "top-25"
          }
        ],
        "description": "(10-1)",
        "names": {
          "char6": "MEM",
          "full": "University of Memphis",
          "seo": "memphis",
          "short": "Memphis"
        },
        "rank": "18",
        "score": "34",
        "seed": "",
        "winner": true
      },
      "liveVideoEnabled": false,
      "network": "",
      "startDate": "11-29-2019",
      "startTime": "03:30PM ET",
      "startTimeEpoch": "1575059400",
      "title": "Memphis Cincinnati",
      "url": "/game/3785468",
      "videoState": ""
    }},
    {"game": {
      "away": {
        "conferences": [{
          "conferenceName": "Pac-12",
          "conferenceSeo": "pac-12"
        }],
        "description": "(6-5)",
        "names": {
          "char6": "WASHST",
          "full": "Washington State University",
          "seo": "washington-st",
          "short": "Washington St."
        },
        "rank": "",
        "score": "13",
        "seed": "",
        "winner": false
      },
      "bracketId": "",
      "bracketRegion": "",
      "bracketRound": "",
      "contestClock": "0:00",
      "currentPeriod": "FINAL",
      "finalMessage": "FINAL",
      "gameID": "342f97ef-7f26-488b-a462-05ba378761ac",
      "gameState": "final",
      "home": {
        "conferences": [{
          "conferenceName": "Pac-12",
          "conferenceSeo": "pac-12"
        }],
        "description": "(6-5)",
        "names": {
          "char6": "WASH",
          "full": "University of Washington",
          "seo": "washington",
          "short": "Washington"
        },
        "rank": "",
        "score": "31",
        "seed": "",
        "winner": true
      },
      "liveVideoEnabled": false,
      "network": "",
      "startDate": "11-29-2019",
      "startTime": "04:00PM ET",
      "startTimeEpoch": "1575061200",
      "title": "Washington Washington St.",
      "url": "/game/3786019",
      "videoState": ""
    }},
    {"game": {
      "away": {
        "conferences": [{
          "conferenceName": "Big 12",
          "conferenceSeo": "big-12"
        }],
        "description": "(4-7)",
        "names": {
          "char6": "WVU",
          "full": "West Virginia University",
          "seo": "west-virginia",
          "short": "West Virginia"
        },
        "rank": "",
        "score": "20",
        "seed": "",
        "winner": true
      },
      "bracketId": "",
      "bracketRegion": "",
      "bracketRound": "",
      "contestClock": "0:00",
      "currentPeriod": "FINAL",
      "finalMessage": "FINAL",
      "gameID": "7ac7262b-8139-4f66-874a-a4be2f724068",
      "gameState": "final",
      "home": {
        "conferences": [{
          "conferenceName": "Big 12",
          "conferenceSeo": "big-12"
        }],
        "description": "(5-6)",
        "names": {
          "char6": "TCU",
          "full": "Texas Christian University",
          "seo": "tcu",
          "short": "TCU"
        },
        "rank": "",
        "score": "17",
        "seed": "",
        "winner": false
      },
      "liveVideoEnabled": false,
      "network": "",
      "startDate": "11-29-2019",
      "startTime": "04:15PM ET",
      "startTimeEpoch": "1575062100",
      "title": "TCU West Virginia",
      "url": "/game/3784789",
      "videoState": ""
    }},
    {"game": {
      "away": {
        "conferences": [{
          "conferenceName": "Sun Belt",
          "conferenceSeo": "sun-belt"
        }],
        "description": "(7-4)",
        "names": {
          "char6": "ARK ST",
          "full": "Arkansas State University",
          "seo": "arkansas-st",
          "short": "Arkansas St."
        },
        "rank": "",
        "score": "30",
        "seed": "",
        "winner": false
      },
      "bracketId": "",
      "bracketRegion": "",
      "bracketRound": "",
      "contestClock": "0:00",
      "currentPeriod": "FINAL",
      "finalMessage": "FINAL",
      "gameID": "bbeb4817-ee69-43f7-920e-f2e4d3a2a6e0",
      "gameState": "final",
      "home": {
        "conferences": [{
          "conferenceName": "Sun Belt",
          "conferenceSeo": "sun-belt"
        }],
        "description": "(1-10)",
        "names": {
          "char6": "S ALA",
          "full": "University of South Alabama",
          "seo": "south-ala",
          "short": "South Alabama"
        },
        "rank": "",
        "score": "34",
        "seed": "",
        "winner": true
      },
      "liveVideoEnabled": false,
      "network": "",
      "startDate": "11-29-2019",
      "startTime": "05:00PM ET",
      "startTimeEpoch": "1575064800",
      "title": "South Alabama Arkansas St.",
      "url": "/game/3786076",
      "videoState": ""
    }},
    {"game": {
      "away": {
        "conferences": [
          {
            "conferenceName": "Sun Belt",
            "conferenceSeo": "sun-belt"
          },
          {
            "conferenceName": "Top 25",
            "conferenceSeo": "top-25"
          }
        ],
        "description": "(10-1)",
        "names": {
          "char6": "APP ST",
          "full": "Appalachian State University",
          "seo": "appalachian-st",
          "short": "Appalachian St."
        },
        "rank": "25",
        "score": "48",
        "seed": "",
        "winner": true
      },
      "bracketId": "",
      "bracketRegion": "",
      "bracketRound": "",
      "contestClock": "0:00",
      "currentPeriod": "FINAL",
      "finalMessage": "FINAL",
      "gameID": "7cc2b8ad-9d9b-486c-a568-13592cfd23bb",
      "gameState": "final",
      "home": {
        "conferences": [{
          "conferenceName": "Sun Belt",
          "conferenceSeo": "sun-belt"
        }],
        "description": "(5-6)",
        "names": {
          "char6": "TROY",
          "full": "Troy University",
          "seo": "troy",
          "short": "Troy"
        },
        "rank": "",
        "score": "13",
        "seed": "",
        "winner": false
      },
      "liveVideoEnabled": false,
      "network": "",
      "startDate": "11-29-2019",
      "startTime": "06:00PM ET",
      "startTimeEpoch": "1575068400",
      "title": "Troy Appalachian St.",
      "url": "/game/3785227",
      "videoState": ""
    }},
    {"game": {
      "away": {
        "conferences": [{
          "conferenceName": "AAC",
          "conferenceSeo": "aac"
        }],
        "description": "(4-7)",
        "names": {
          "char6": "USF",
          "full": "University of South Florida",
          "seo": "south-fla",
          "short": "South Fla."
        },
        "rank": "",
        "score": "7",
        "seed": "",
        "winner": false
      },
      "bracketId": "",
      "bracketRegion": "",
      "bracketRound": "",
      "contestClock": "0:00",
      "currentPeriod": "FINAL",
      "finalMessage": "FINAL",
      "gameID": "f6ce33ee-61e3-4ac8-897c-d80435afdaff",
      "gameState": "final",
      "home": {
        "conferences": [{
          "conferenceName": "AAC",
          "conferenceSeo": "aac"
        }],
        "description": "(8-3)",
        "names": {
          "char6": "UCF",
          "full": "University of Central Florida",
          "seo": "ucf",
          "short": "UCF"
        },
        "rank": "",
        "score": "34",
        "seed": "",
        "winner": true
      },
      "liveVideoEnabled": false,
      "network": "",
      "startDate": "11-29-2019",
      "startTime": "08:00PM ET",
      "startTimeEpoch": "1575075600",
      "title": "UCF South Fla.",
      "url": "/game/3785599",
      "videoState": ""
    }},
    {"game": {
      "away": {
        "conferences": [{
          "conferenceName": "ACC",
          "conferenceSeo": "acc"
        }],
        "description": "(7-4)",
        "names": {
          "char6": "LOUIS",
          "full": "University of Louisville",
          "seo": "louisville",
          "short": "Louisville"
        },
        "rank": "",
        "score": "13",
        "seed": "",
        "winner": false
      },
      "bracketId": "",
      "bracketRegion": "",
      "bracketRound": "",
      "contestClock": "0:00",
      "currentPeriod": "FINAL",
      "finalMessage": "FINAL",
      "gameID": "c0bb6d7d-c3ca-4cbc-8f49-879fd9838821",
      "gameState": "final",
      "home": {
        "conferences": [{
          "conferenceName": "SEC",
          "conferenceSeo": "sec"
        }],
        "description": "(6-5)",
        "names": {
          "char6": "UK",
          "full": "University of Kentucky",
          "seo": "kentucky",
          "short": "Kentucky"
        },
        "rank": "",
        "score": "45",
        "seed": "",
        "winner": true
      },
      "liveVideoEnabled": false,
      "network": "",
      "startDate": "11-30-2019",
      "startTime": "12:00PM ET",
      "startTimeEpoch": "1575133200",
      "title": "Kentucky Louisville",
      "url": "/game/3784695",
      "videoState": ""
    }},
    {"game": {
      "away": {
        "conferences": [
          {
            "conferenceName": "ACC",
            "conferenceSeo": "acc"
          },
          {
            "conferenceName": "Top 25",
            "conferenceSeo": "top-25"
          }
        ],
        "description": "(11-0)",
        "names": {
          "char6": "CLEM",
          "full": "Clemson University",
          "seo": "clemson",
          "short": "Clemson"
        },
        "rank": "3",
        "score": "38",
        "seed": "",
        "winner": true
      },
      "bracketId": "",
      "bracketRegion": "",
      "bracketRound": "",
      "contestClock": "0:00",
      "currentPeriod": "FINAL",
      "finalMessage": "FINAL",
      "gameID": "f434cf40-2c5a-4b07-bfdd-e07fc1e8508e",
      "gameState": "final",
      "home": {
        "conferences": [{
          "conferenceName": "SEC",
          "conferenceSeo": "sec"
        }],
        "description": "(4-7)",
        "names": {
          "char6": "S CAR",
          "full": "University of South Carolina, Columbia",
          "seo": "south-carolina",
          "short": "South Carolina"
        },
        "rank": "",
        "score": "3",
        "seed": "",
        "winner": false
      },
      "liveVideoEnabled": false,
      "network": "",
      "startDate": "11-30-2019",
      "startTime": "12:00PM ET",
      "startTimeEpoch": "1575133200",
      "title": "South Carolina Clemson",
      "url": "/game/3785701",
      "videoState": ""
    }},
    {"game": {
      "away": {
        "conferences": [{
          "conferenceName": "Sun Belt",
          "conferenceSeo": "sun-belt"
        }],
        "description": "(3-8)",
        "names": {
          "char6": "TX ST",
          "full": "Texas State University",
          "seo": "texas-st",
          "short": "Texas St."
        },
        "rank": "",
        "score": "21",
        "seed": "",
        "winner": false
      },
      "bracketId": "",
      "bracketRegion": "",
      "bracketRound": "",
      "contestClock": "0:00",
      "currentPeriod": "FINAL",
      "finalMessage": "FINAL",
      "gameID": "eeeba7e5-1366-4ee8-9489-affdb0f4a8e1",
      "gameState": "final",
      "home": {
        "conferences": [{
          "conferenceName": "Sun Belt",
          "conferenceSeo": "sun-belt"
        }],
        "description": "(4-7)",
        "names": {
          "char6": "CO CAR",
          "full": "Coastal Carolina University",
          "seo": "coastal-caro",
          "short": "Coastal Carolina"
        },
        "rank": "",
        "score": "24",
        "seed": "",
        "winner": true
      },
      "liveVideoEnabled": false,
      "network": "",
      "startDate": "11-30-2019",
      "startTime": "12:00PM ET",
      "startTimeEpoch": "1575133200",
      "title": "Coastal Carolina Texas St.",
      "url": "/game/3784632",
      "videoState": ""
    }},
    {"game": {
      "away": {
        "conferences": [
          {
            "conferenceName": "SEC",
            "conferenceSeo": "sec"
          },
          {
            "conferenceName": "Top 25",
            "conferenceSeo": "top-25"
          }
        ],
        "description": "(10-1)",
        "names": {
          "char6": "UGA",
          "full": "University of Georgia",
          "seo": "georgia",
          "short": "Georgia"
        },
        "rank": "4",
        "score": "52",
        "seed": "",
        "winner": true
      },
      "bracketId": "",
      "bracketRegion": "",
      "bracketRound": "",
      "contestClock": "0:00",
      "currentPeriod": "FINAL",
      "finalMessage": "FINAL",
      "gameID": "f6447024-38cd-490e-99f5-850e158e1fd6",
      "gameState": "final",
      "home": {
        "conferences": [{
          "conferenceName": "ACC",
          "conferenceSeo": "acc"
        }],
        "description": "(3-8)",
        "names": {
          "char6": "GATECH",
          "full": "Georgia Institute of Technology",
          "seo": "georgia-tech",
          "short": "Georgia Tech"
        },
        "rank": "",
        "score": "7",
        "seed": "",
        "winner": false
      },
      "liveVideoEnabled": false,
      "network": "",
      "startDate": "11-30-2019",
      "startTime": "12:00PM ET",
      "startTimeEpoch": "1575133200",
      "title": "Georgia Tech Georgia",
      "url": "/game/3785445",
      "videoState": ""
    }},
    {"game": {
      "away": {
        "conferences": [{
          "conferenceName": "Big Ten",
          "conferenceSeo": "big-ten"
        }],
        "description": "(2-9)",
        "names": {
          "char6": "NWSTRN",
          "full": "Northwestern University",
          "seo": "northwestern",
          "short": "Northwestern"
        },
        "rank": "",
        "score": "29",
        "seed": "",
        "winner": true
      },
      "bracketId": "",
      "bracketRegion": "",
      "bracketRound": "",
      "contestClock": "0:00",
      "currentPeriod": "FINAL",
      "finalMessage": "FINAL",
      "gameID": "576fceb4-bb77-4da2-93dd-b5783694f14b",
      "gameState": "final",
      "home": {
        "conferences": [{
          "conferenceName": "Big Ten",
          "conferenceSeo": "big-ten"
        }],
        "description": "(6-5)",
        "names": {
          "char6": "ILL",
          "full": "University of Illinois Urbana-Champaign",
          "seo": "illinois",
          "short": "Illinois"
        },
        "rank": "",
        "score": "10",
        "seed": "",
        "winner": false
      },
      "liveVideoEnabled": false,
      "network": "",
      "startDate": "11-30-2019",
      "startTime": "12:00PM ET",
      "startTimeEpoch": "1575133200",
      "title": "Illinois Northwestern",
      "url": "/game/3786125",
      "videoState": ""
    }},
    {"game": {
      "away": {
        "conferences": [
          {
            "conferenceName": "Big Ten",
            "conferenceSeo": "big-ten"
          },
          {
            "conferenceName": "Top 25",
            "conferenceSeo": "top-25"
          }
        ],
        "description": "(11-0)",
        "names": {
          "char6": "OHIOST",
          "full": "The Ohio State University",
          "seo": "ohio-st",
          "short": "Ohio St."
        },
        "rank": "1",
        "score": "56",
        "seed": "",
        "winner": true
      },
      "bracketId": "",
      "bracketRegion": "",
      "bracketRound": "",
      "contestClock": "0:00",
      "currentPeriod": "FINAL",
      "finalMessage": "FINAL",
      "gameID": "7d593572-b412-4fd2-bfce-4437c8bbd170",
      "gameState": "final",
      "home": {
        "conferences": [
          {
            "conferenceName": "Big Ten",
            "conferenceSeo": "big-ten"
          },
          {
            "conferenceName": "Top 25",
            "conferenceSeo": "top-25"
          }
        ],
        "description": "(9-2)",
        "names": {
          "char6": "MICH",
          "full": "University of Michigan",
          "seo": "michigan",
          "short": "Michigan"
        },
        "rank": "13",
        "score": "27",
        "seed": "",
        "winner": false
      },
      "liveVideoEnabled": false,
      "network": "",
      "startDate": "11-30-2019",
      "startTime": "12:00PM ET",
      "startTimeEpoch": "1575133200",
      "title": "Michigan Ohio St.",
      "url": "/game/3784927",
      "videoState": ""
    }},
    {"game": {
      "away": {
        "conferences": [{
          "conferenceName": "Big Ten",
          "conferenceSeo": "big-ten"
        }],
        "description": "(7-4)",
        "names": {
          "char6": "IND",
          "full": "Indiana University, Bloomington",
          "seo": "indiana",
          "short": "Indiana"
        },
        "rank": "",
        "score": "44",
        "seed": "",
        "winner": true
      },
      "bracketId": "",
      "bracketRegion": "",
      "bracketRound": "",
      "contestClock": "",
      "currentPeriod": "FINAL (2OT)",
      "finalMessage": "FINAL (2OT)",
      "gameID": "f10108c5-560f-468f-a9ed-0b13aa434a97",
      "gameState": "final",
      "home": {
        "conferences": [{
          "conferenceName": "Big Ten",
          "conferenceSeo": "big-ten"
        }],
        "description": "(4-7)",
        "names": {
          "char6": "PURDUE",
          "full": "Purdue University",
          "seo": "purdue",
          "short": "Purdue"
        },
        "rank": "",
        "score": "41",
        "seed": "",
        "winner": false
      },
      "liveVideoEnabled": false,
      "network": "",
      "startDate": "11-30-2019",
      "startTime": "12:00PM ET",
      "startTimeEpoch": "1575133200",
      "title": "Purdue Indiana",
      "url": "/game/3786080",
      "videoState": ""
    }},
    {"game": {
      "away": {
        "conferences": [{
          "conferenceName": "C-USA",
          "conferenceSeo": "c-usa"
        }],
        "description": "(6-5)",
        "names": {
          "char6": "FIU",
          "full": "Florida International University",
          "seo": "fiu",
          "short": "FIU"
        },
        "rank": "",
        "score": "27",
        "seed": "",
        "winner": false
      },
      "bracketId": "",
      "bracketRegion": "",
      "bracketRound": "",
      "contestClock": "",
      "currentPeriod": "FINAL (OT)",
      "finalMessage": "FINAL (OT)",
      "gameID": "c9984813-6937-48d7-b962-5d8597fc773d",
      "gameState": "final",
      "home": {
        "conferences": [{
          "conferenceName": "C-USA",
          "conferenceSeo": "c-usa"
        }],
        "description": "(7-4)",
        "names": {
          "char6": "MARSH",
          "full": "Marshall University",
          "seo": "marshall",
          "short": "Marshall"
        },
        "rank": "",
        "score": "30",
        "seed": "",
        "winner": true
      },
      "liveVideoEnabled": false,
      "network": "",
      "startDate": "11-30-2019",
      "startTime": "12:00PM ET",
      "startTimeEpoch": "1575133200",
      "title": "Marshall FIU",
      "url": "/game/3785280",
      "videoState": ""
    }},
    {"game": {
      "away": {
        "conferences": [{
          "conferenceName": "AAC",
          "conferenceSeo": "aac"
        }],
        "description": "(3-8)",
        "names": {
          "char6": "TULSA",
          "full": "The University of Tulsa",
          "seo": "tulsa",
          "short": "Tulsa"
        },
        "rank": "",
        "score": "49",
        "seed": "",
        "winner": true
      },
      "bracketId": "",
      "bracketRegion": "",
      "bracketRound": "",
      "contestClock": "0:00",
      "currentPeriod": "FINAL",
      "finalMessage": "FINAL",
      "gameID": "598044e2-681c-40da-8ef2-ff13dca2cc96",
      "gameState": "final",
      "home": {
        "conferences": [{
          "conferenceName": "AAC",
          "conferenceSeo": "aac"
        }],
        "description": "(4-7)",
        "names": {
          "char6": "E CAR",
          "full": "East Carolina University",
          "seo": "east-carolina",
          "short": "East Carolina"
        },
        "rank": "",
        "score": "24",
        "seed": "",
        "winner": false
      },
      "liveVideoEnabled": false,
      "network": "",
      "startDate": "11-30-2019",
      "startTime": "12:00PM ET",
      "startTimeEpoch": "1575133200",
      "title": "East Carolina Tulsa",
      "url": "/game/3785418",
      "videoState": ""
    }},
    {"game": {
      "away": {
        "conferences": [{
          "conferenceName": "ACC",
          "conferenceSeo": "acc"
        }],
        "description": "(8-3)",
        "names": {
          "char6": "WAKE",
          "full": "Wake Forest University",
          "seo": "wake-forest",
          "short": "Wake Forest"
        },
        "rank": "",
        "score": "30",
        "seed": "",
        "winner": false
      },
      "bracketId": "",
      "bracketRegion": "",
      "bracketRound": "",
      "contestClock": "",
      "currentPeriod": "FINAL (OT)",
      "finalMessage": "FINAL (OT)",
      "gameID": "f7e9a625-3513-442d-8a26-34e73fb13ab1",
      "gameState": "final",
      "home": {
        "conferences": [{
          "conferenceName": "ACC",
          "conferenceSeo": "acc"
        }],
        "description": "(4-7)",
        "names": {
          "char6": "SYR",
          "full": "Syracuse University",
          "seo": "syracuse",
          "short": "Syracuse"
        },
        "rank": "",
        "score": "39",
        "seed": "",
        "winner": true
      },
      "liveVideoEnabled": false,
      "network": "",
      "startDate": "11-30-2019",
      "startTime": "12:30PM ET",
      "startTimeEpoch": "1575135000",
      "title": "Syracuse Wake Forest",
      "url": "/game/3785762",
      "videoState": ""
    }},
    {"game": {
      "away": {
        "conferences": [{
          "conferenceName": "C-USA",
          "conferenceSeo": "c-usa"
        }],
        "description": "(4-7)",
        "names": {
          "char6": "MIDTEN",
          "full": "Middle Tennessee State University",
          "seo": "middle-tenn",
          "short": "Middle Tenn."
        },
        "rank": "",
        "score": "26",
        "seed": "",
        "winner": false
      },
      "bracketId": "",
      "bracketRegion": "",
      "bracketRound": "",
      "contestClock": "0:00",
      "currentPeriod": "FINAL",
      "finalMessage": "FINAL",
      "gameID": "9b728f2a-983c-42d3-8bf8-9e706aefb5e4",
      "gameState": "final",
      "home": {
        "conferences": [{
          "conferenceName": "C-USA",
          "conferenceSeo": "c-usa"
        }],
        "description": "(7-4)",
        "names": {
          "char6": "W KY",
          "full": "Western Kentucky University",
          "seo": "western-ky",
          "short": "Western Ky."
        },
        "rank": "",
        "score": "31",
        "seed": "",
        "winner": true
      },
      "liveVideoEnabled": false,
      "network": "",
      "startDate": "11-30-2019",
      "startTime": "02:00PM ET",
      "startTimeEpoch": "1575140400",
      "title": "Western Ky. Middle Tenn.",
      "url": "/game/3784623",
      "videoState": ""
    }},
    {"game": {
      "away": {
        "conferences": [{
          "conferenceName": "FBS Independent",
          "conferenceSeo": "fbs-independent"
        }],
        "description": "(2-9)",
        "names": {
          "char6": "NM ST",
          "full": "New Mexico State University",
          "seo": "new-mexico-st",
          "short": "New Mexico St."
        },
        "rank": "",
        "score": "28",
        "seed": "",
        "winner": false
      },
      "bracketId": "",
      "bracketRegion": "",
      "bracketRound": "",
      "contestClock": "0:00",
      "currentPeriod": "FINAL",
      "finalMessage": "FINAL",
      "gameID": "9881d455-d2cf-4170-8fb4-bd5251ab41a1",
      "gameState": "final",
      "home": {
        "conferences": [{
          "conferenceName": "FBS Independent",
          "conferenceSeo": "fbs-independent"
        }],
        "description": "(6-5)",
        "names": {
          "char6": "LIBRTY",
          "full": "Liberty University",
          "seo": "liberty",
          "short": "Liberty"
        },
        "rank": "",
        "score": "49",
        "seed": "",
        "winner": true
      },
      "liveVideoEnabled": false,
      "network": "",
      "startDate": "11-30-2019",
      "startTime": "02:00PM ET",
      "startTimeEpoch": "1575140400",
      "title": "Liberty New Mexico St.",
      "url": "/game/3785105",
      "videoState": ""
    }},
    {"game": {
      "away": {
        "conferences": [{
          "conferenceName": "Mountain West",
          "conferenceSeo": "mountain-west"
        }],
        "description": "(7-4)",
        "names": {
          "char6": "WYO",
          "full": "University of Wyoming",
          "seo": "wyoming",
          "short": "Wyoming"
        },
        "rank": "",
        "score": "6",
        "seed": "",
        "winner": false
      },
      "bracketId": "",
      "bracketRegion": "",
      "bracketRound": "",
      "contestClock": "0:00",
      "currentPeriod": "FINAL",
      "finalMessage": "FINAL",
      "gameID": "86300066-1885-4362-b96e-5a47e333b772",
      "gameState": "final",
      "home": {
        "conferences": [{
          "conferenceName": "Mountain West",
          "conferenceSeo": "mountain-west"
        }],
        "description": "(9-2)",
        "names": {
          "char6": "AIRFOR",
          "full": "U.S. Air Force Academy",
          "seo": "air-force",
          "short": "Air Force"
        },
        "rank": "",
        "score": "20",
        "seed": "",
        "winner": true
      },
      "liveVideoEnabled": false,
      "network": "",
      "startDate": "11-30-2019",
      "startTime": "02:00PM ET",
      "startTimeEpoch": "1575140400",
      "title": "Air Force Wyoming",
      "url": "/game/3786050",
      "videoState": ""
    }},
    {"game": {
      "away": {
        "conferences": [{
          "conferenceName": "C-USA",
          "conferenceSeo": "c-usa"
        }],
        "description": "(6-5)",
        "names": {
          "char6": "CHAR",
          "full": "The University of North Carolina at Charlotte",
          "seo": "charlotte",
          "short": "Charlotte"
        },
        "rank": "",
        "score": "38",
        "seed": "",
        "winner": true
      },
      "bracketId": "",
      "bracketRegion": "",
      "bracketRound": "",
      "contestClock": "0:00",
      "currentPeriod": "FINAL",
      "finalMessage": "FINAL",
      "gameID": "7ba35205-3012-446f-bfb1-7cf7b54ae2e9",
      "gameState": "final",
      "home": {
        "conferences": [{
          "conferenceName": "C-USA",
          "conferenceSeo": "c-usa"
        }],
        "description": "(1-10)",
        "names": {
          "char6": "ODU",
          "full": "Old Dominion University",
          "seo": "old-dominion",
          "short": "Old Dominion"
        },
        "rank": "",
        "score": "22",
        "seed": "",
        "winner": false
      },
      "liveVideoEnabled": false,
      "network": "",
      "startDate": "11-30-2019",
      "startTime": "02:00PM ET",
      "startTimeEpoch": "1575140400",
      "title": "Old Dominion Charlotte",
      "url": "/game/3785096",
      "videoState": ""
    }},
    {"game": {
      "away": {
        "conferences": [{
          "conferenceName": "C-USA",
          "conferenceSeo": "c-usa"
        }],
        "description": "(2-9)",
        "names": {
          "char6": "RICE",
          "full": "Rice University",
          "seo": "rice",
          "short": "Rice"
        },
        "rank": "",
        "score": "30",
        "seed": "",
        "winner": true
      },
      "bracketId": "",
      "bracketRegion": "",
      "bracketRound": "",
      "contestClock": "0:00",
      "currentPeriod": "FINAL",
      "finalMessage": "FINAL",
      "gameID": "f20463f0-15ac-4069-82c4-28f23047942f",
      "gameState": "final",
      "home": {
        "conferences": [{
          "conferenceName": "C-USA",
          "conferenceSeo": "c-usa"
        }],
        "description": "(1-10)",
        "names": {
          "char6": "UTEP",
          "full": "University of Texas at El Paso",
          "seo": "utep",
          "short": "UTEP"
        },
        "rank": "",
        "score": "16",
        "seed": "",
        "winner": false
      },
      "liveVideoEnabled": false,
      "network": "",
      "startDate": "11-30-2019",
      "startTime": "03:00PM ET",
      "startTimeEpoch": "1575144000",
      "title": "UTEP Rice",
      "url": "/game/3785193",
      "videoState": ""
    }},
    {"game": {
      "away": {
        "conferences": [{
          "conferenceName": "Mountain West",
          "conferenceSeo": "mountain-west"
        }],
        "description": "(3-8)",
        "names": {
          "char6": "UNLV",
          "full": "University of Nevada, Las Vegas",
          "seo": "unlv",
          "short": "UNLV"
        },
        "rank": "",
        "score": "33",
        "seed": "",
        "winner": true
      },
      "bracketId": "",
      "bracketRegion": "",
      "bracketRound": "",
      "contestClock": "",
      "currentPeriod": "FINAL (OT)",
      "finalMessage": "FINAL (OT)",
      "gameID": "d27621d5-7819-49ed-99c8-6fafc7d9a10a",
      "gameState": "final",
      "home": {
        "conferences": [{
          "conferenceName": "Mountain West",
          "conferenceSeo": "mountain-west"
        }],
        "description": "(7-4)",
        "names": {
          "char6": "NEVADA",
          "full": "University of Nevada, Reno",
          "seo": "nevada",
          "short": "Nevada"
        },
        "rank": "",
        "score": "30",
        "seed": "",
        "winner": false
      },
      "liveVideoEnabled": false,
      "network": "",
      "startDate": "11-30-2019",
      "startTime": "03:00PM ET",
      "startTimeEpoch": "1575144000",
      "title": "Nevada UNLV",
      "url": "/game/3784660",
      "videoState": ""
    }},
    {"game": {
      "away": {
        "conferences": [{
          "conferenceName": "C-USA",
          "conferenceSeo": "c-usa"
        }],
        "description": "(7-4)",
        "names": {
          "char6": "S MISS",
          "full": "The University of Southern Mississippi",
          "seo": "southern-miss",
          "short": "Southern Miss."
        },
        "rank": "",
        "score": "17",
        "seed": "",
        "winner": false
      },
      "bracketId": "",
      "bracketRegion": "",
      "bracketRound": "",
      "contestClock": "0:00",
      "currentPeriod": "FINAL",
      "finalMessage": "FINAL",
      "gameID": "52b0ad3b-e947-44f8-b288-c1f79dd55b82",
      "gameState": "final",
      "home": {
        "conferences": [{
          "conferenceName": "C-USA",
          "conferenceSeo": "c-usa"
        }],
        "description": "(8-3)",
        "names": {
          "char6": "FAU",
          "full": "Florida Atlantic University",
          "seo": "fla-atlantic",
          "short": "Fla. Atlantic"
        },
        "rank": "",
        "score": "34",
        "seed": "",
        "winner": true
      },
      "liveVideoEnabled": false,
      "network": "",
      "startDate": "11-30-2019",
      "startTime": "03:30PM ET",
      "startTimeEpoch": "1575145800",
      "title": "Fla. Atlantic Southern Miss.",
      "url": "/game/3785292",
      "videoState": ""
    }},
    {"game": {
      "away": {
        "conferences": [
          {
            "conferenceName": "SEC",
            "conferenceSeo": "sec"
          },
          {
            "conferenceName": "Top 25",
            "conferenceSeo": "top-25"
          }
        ],
        "description": "(10-1)",
        "names": {
          "char6": "ALA",
          "full": "University of Alabama",
          "seo": "alabama",
          "short": "Alabama"
        },
        "rank": "5",
        "score": "45",
        "seed": "",
        "winner": false
      },
      "bracketId": "",
      "bracketRegion": "",
      "bracketRound": "",
      "contestClock": "0:00",
      "currentPeriod": "FINAL",
      "finalMessage": "FINAL",
      "gameID": "44e7780c-0296-40cb-a134-61a79554aeba",
      "gameState": "final",
      "home": {
        "conferences": [
          {
            "conferenceName": "SEC",
            "conferenceSeo": "sec"
          },
          {
            "conferenceName": "Top 25",
            "conferenceSeo": "top-25"
          }
        ],
        "description": "(8-3)",
        "names": {
          "char6": "AUBURN",
          "full": "Auburn University",
          "seo": "auburn",
          "short": "Auburn"
        },
        "rank": "15",
        "score": "48",
        "seed": "",
        "winner": true
      },
      "liveVideoEnabled": false,
      "network": "",
      "startDate": "11-30-2019",
      "startTime": "03:30PM ET",
      "startTimeEpoch": "1575145800",
      "title": "Auburn Alabama",
      "url": "/game/3785897",
      "videoState": ""
    }},
    {"game": {
      "away": {
        "conferences": [
          {
            "conferenceName": "Big 12",
            "conferenceSeo": "big-12"
          },
          {
            "conferenceName": "Top 25",
            "conferenceSeo": "top-25"
          }
        ],
        "description": "(10-1)",
        "names": {
          "char6": "BAYLOR",
          "full": "Baylor University",
          "seo": "baylor",
          "short": "Baylor"
        },
        "rank": "9",
        "score": "61",
        "seed": "",
        "winner": true
      },
      "bracketId": "",
      "bracketRegion": "",
      "bracketRound": "",
      "contestClock": "0:00",
      "currentPeriod": "FINAL",
      "finalMessage": "FINAL",
      "gameID": "c3d94df6-9950-45fd-b285-e76d42c4b48e",
      "gameState": "final",
      "home": {
        "conferences": [{
          "conferenceName": "Big 12",
          "conferenceSeo": "big-12"
        }],
        "description": "(3-8)",
        "names": {
          "char6": "KANSAS",
          "full": "University of Kansas",
          "seo": "kansas",
          "short": "Kansas"
        },
        "rank": "",
        "score": "6",
        "seed": "",
        "winner": false
      },
      "liveVideoEnabled": false,
      "network": "",
      "startDate": "11-30-2019",
      "startTime": "03:30PM ET",
      "startTimeEpoch": "1575145800",
      "title": "Kansas Baylor",
      "url": "/game/3785113",
      "videoState": ""
    }},
    {"game": {
      "away": {
        "conferences": [
          {
            "conferenceName": "Big Ten",
            "conferenceSeo": "big-ten"
          },
          {
            "conferenceName": "Top 25",
            "conferenceSeo": "top-25"
          }
        ],
        "description": "(9-2)",
        "names": {
          "char6": "WISC",
          "full": "University of Wisconsin-Madison",
          "seo": "wisconsin",
          "short": "Wisconsin"
        },
        "rank": "12",
        "score": "38",
        "seed": "",
        "winner": true
      },
      "bracketId": "",
      "bracketRegion": "",
      "bracketRound": "",
      "contestClock": "0:00",
      "currentPeriod": "FINAL",
      "finalMessage": "FINAL",
      "gameID": "b695abe3-0d75-4477-9444-7c1361904af3",
      "gameState": "final",
      "home": {
        "conferences": [
          {
            "conferenceName": "Big Ten",
            "conferenceSeo": "big-ten"
          },
          {
            "conferenceName": "Top 25",
            "conferenceSeo": "top-25"
          }
        ],
        "description": "(10-1)",
        "names": {
          "char6": "MINN",
          "full": "University of Minnesota, Twin Cities",
          "seo": "minnesota",
          "short": "Minnesota"
        },
        "rank": "8",
        "score": "17",
        "seed": "",
        "winner": false
      },
      "liveVideoEnabled": false,
      "network": "",
      "startDate": "11-30-2019",
      "startTime": "03:30PM ET",
      "startTimeEpoch": "1575145800",
      "title": "Minnesota Wisconsin",
      "url": "/game/3784998",
      "videoState": ""
    }},
    {"game": {
      "away": {
        "conferences": [{
          "conferenceName": "ACC",
          "conferenceSeo": "acc"
        }],
        "description": "(6-5)",
        "names": {
          "char6": "MIAMI",
          "full": "University of Miami (Florida)",
          "seo": "miami-fl",
          "short": "Miami (FL)"
        },
        "rank": "",
        "score": "17",
        "seed": "",
        "winner": false
      },
      "bracketId": "",
      "bracketRegion": "",
      "bracketRound": "",
      "contestClock": "0:00",
      "currentPeriod": "FINAL",
      "finalMessage": "FINAL",
      "gameID": "9e2fff8e-882a-4fe9-ba09-babe335ed780",
      "gameState": "final",
      "home": {
        "conferences": [{
          "conferenceName": "ACC",
          "conferenceSeo": "acc"
        }],
        "description": "(4-7)",
        "names": {
          "char6": "DUKE",
          "full": "Duke University",
          "seo": "duke",
          "short": "Duke"
        },
        "rank": "",
        "score": "27",
        "seed": "",
        "winner": true
      },
      "liveVideoEnabled": false,
      "network": "",
      "startDate": "11-30-2019",
      "startTime": "03:30PM ET",
      "startTimeEpoch": "1575145800",
      "title": "Duke Miami (FL)",
      "url": "/game/3784868",
      "videoState": ""
    }},
    {"game": {
      "away": {
        "conferences": [{
          "conferenceName": "AAC",
          "conferenceSeo": "aac"
        }],
        "description": "(2-9)",
        "names": {
          "char6": "UCONN",
          "full": "University of Connecticut",
          "seo": "uconn",
          "short": "UConn"
        },
        "rank": "",
        "score": "17",
        "seed": "",
        "winner": false
      },
      "bracketId": "",
      "bracketRegion": "",
      "bracketRound": "",
      "contestClock": "0:00",
      "currentPeriod": "FINAL",
      "finalMessage": "FINAL",
      "gameID": "e5ddcc00-2fa7-4f9b-bfb4-7bddf82fa7a4",
      "gameState": "final",
      "home": {
        "conferences": [{
          "conferenceName": "AAC",
          "conferenceSeo": "aac"
        }],
        "description": "(7-4)",
        "names": {
          "char6": "TEMPLE",
          "full": "Temple University",
          "seo": "temple",
          "short": "Temple"
        },
        "rank": "",
        "score": "49",
        "seed": "",
        "winner": true
      },
      "liveVideoEnabled": false,
      "network": "",
      "startDate": "11-30-2019",
      "startTime": "03:30PM ET",
      "startTimeEpoch": "1575145800",
      "title": "Temple UConn",
      "url": "/game/3785219",
      "videoState": ""
    }},
    {"game": {
      "away": {
        "conferences": [{
          "conferenceName": "Big Ten",
          "conferenceSeo": "big-ten"
        }],
        "description": "(2-9)",
        "names": {
          "char6": "RUTGER",
          "full": "Rutgers, The State University of New Jersey, New Brunswick",
          "seo": "rutgers",
          "short": "Rutgers"
        },
        "rank": "",
        "score": "6",
        "seed": "",
        "winner": false
      },
      "bracketId": "",
      "bracketRegion": "",
      "bracketRound": "",
      "contestClock": "0:00",
      "currentPeriod": "FINAL",
      "finalMessage": "FINAL",
      "gameID": "f4f36ff2-8f80-4951-a6d3-d40cae8d86d0",
      "gameState": "final",
      "home": {
        "conferences": [
          {
            "conferenceName": "Big Ten",
            "conferenceSeo": "big-ten"
          },
          {
            "conferenceName": "Top 25",
            "conferenceSeo": "top-25"
          }
        ],
        "description": "(9-2)",
        "names": {
          "char6": "PENNST",
          "full": "Pennsylvania State University",
          "seo": "penn-st",
          "short": "Penn St."
        },
        "rank": "10",
        "score": "27",
        "seed": "",
        "winner": true
      },
      "liveVideoEnabled": false,
      "network": "",
      "startDate": "11-30-2019",
      "startTime": "03:30PM ET",
      "startTimeEpoch": "1575145800",
      "title": "Penn St. Rutgers",
      "url": "/game/3785082",
      "videoState": ""
    }},
    {"game": {
      "away": {
        "conferences": [{
          "conferenceName": "C-USA",
          "conferenceSeo": "c-usa"
        }],
        "description": "(4-7)",
        "names": {
          "char6": "UTSA",
          "full": "University of Texas at San Antonio",
          "seo": "utsa",
          "short": "UTSA"
        },
        "rank": "",
        "score": "27",
        "seed": "",
        "winner": false
      },
      "bracketId": "",
      "bracketRegion": "",
      "bracketRound": "",
      "contestClock": "0:00",
      "currentPeriod": "FINAL",
      "finalMessage": "FINAL",
      "gameID": "b896fbb9-fafd-427a-b0ac-4d912cad9748",
      "gameState": "final",
      "home": {
        "conferences": [{
          "conferenceName": "C-USA",
          "conferenceSeo": "c-usa"
        }],
        "description": "(8-3)",
        "names": {
          "char6": "LATECH",
          "full": "Louisiana Tech University",
          "seo": "louisiana-tech",
          "short": "Louisiana Tech"
        },
        "rank": "",
        "score": "41",
        "seed": "",
        "winner": true
      },
      "liveVideoEnabled": false,
      "network": "",
      "startDate": "11-30-2019",
      "startTime": "03:30PM ET",
      "startTimeEpoch": "1575145800",
      "title": "Louisiana Tech UTSA",
      "url": "/game/3785056",
      "videoState": ""
    }},
    {"game": {
      "away": {
        "conferences": [{
          "conferenceName": "ACC",
          "conferenceSeo": "acc"
        }],
        "description": "(5-6)",
        "names": {
          "char6": "BC",
          "full": "Boston College",
          "seo": "boston-college",
          "short": "Boston College"
        },
        "rank": "",
        "score": "26",
        "seed": "",
        "winner": true
      },
      "bracketId": "",
      "bracketRegion": "",
      "bracketRound": "",
      "contestClock": "0:00",
      "currentPeriod": "FINAL",
      "finalMessage": "FINAL",
      "gameID": "27cb542c-7232-4ab0-88af-4f6122d73ac1",
      "gameState": "final",
      "home": {
        "conferences": [{
          "conferenceName": "ACC",
          "conferenceSeo": "acc"
        }],
        "description": "(7-4)",
        "names": {
          "char6": "PITT",
          "full": "University of Pittsburgh",
          "seo": "pittsburgh",
          "short": "Pittsburgh"
        },
        "rank": "",
        "score": "19",
        "seed": "",
        "winner": false
      },
      "liveVideoEnabled": false,
      "network": "",
      "startDate": "11-30-2019",
      "startTime": "03:30PM ET",
      "startTimeEpoch": "1575145800",
      "title": "Pittsburgh Boston College",
      "url": "/game/3785437",
      "videoState": ""
    }},
    {"game": {
      "away": {
        "conferences": [{
          "conferenceName": "Big Ten",
          "conferenceSeo": "big-ten"
        }],
        "description": "(3-8)",
        "names": {
          "char6": "MD",
          "full": "University of Maryland, College Park",
          "seo": "maryland",
          "short": "Maryland"
        },
        "rank": "",
        "score": "16",
        "seed": "",
        "winner": false
      },
      "bracketId": "",
      "bracketRegion": "",
      "bracketRound": "",
      "contestClock": "0:00",
      "currentPeriod": "FINAL",
      "finalMessage": "FINAL",
      "gameID": "6c76c4a6-c227-4ad4-bbf2-3e61b0833a1b",
      "gameState": "final",
      "home": {
        "conferences": [{
          "conferenceName": "Big Ten",
          "conferenceSeo": "big-ten"
        }],
        "description": "(5-6)",
        "names": {
          "char6": "MICHST",
          "full": "Michigan State University",
          "seo": "michigan-st",
          "short": "Michigan St."
        },
        "rank": "",
        "score": "19",
        "seed": "",
        "winner": true
      },
      "liveVideoEnabled": false,
      "network": "",
      "startDate": "11-30-2019",
      "startTime": "03:30PM ET",
      "startTimeEpoch": "1575145800",
      "title": "Michigan St. Maryland",
      "url": "/game/3786041",
      "videoState": ""
    }},
    {"game": {
      "away": {
        "conferences": [{
          "conferenceName": "SEC",
          "conferenceSeo": "sec"
        }],
        "description": "(3-8)",
        "names": {
          "char6": "VANDY",
          "full": "Vanderbilt University",
          "seo": "vanderbilt",
          "short": "Vanderbilt"
        },
        "rank": "",
        "score": "10",
        "seed": "",
        "winner": false
      },
      "bracketId": "",
      "bracketRegion": "",
      "bracketRound": "",
      "contestClock": "0:00",
      "currentPeriod": "FINAL",
      "finalMessage": "FINAL",
      "gameID": "ff4cbccd-59a8-48ec-93f3-ed6b556ff96b",
      "gameState": "final",
      "home": {
        "conferences": [{
          "conferenceName": "SEC",
          "conferenceSeo": "sec"
        }],
        "description": "(6-5)",
        "names": {
          "char6": "TENN",
          "full": "University of Tennessee, Knoxville",
          "seo": "tennessee",
          "short": "Tennessee"
        },
        "rank": "",
        "score": "28",
        "seed": "",
        "winner": true
      },
      "liveVideoEnabled": false,
      "network": "",
      "startDate": "11-30-2019",
      "startTime": "04:00PM ET",
      "startTimeEpoch": "1575147600",
      "title": "Tennessee Vanderbilt",
      "url": "/game/3785293",
      "videoState": ""
    }},
    {"game": {
      "away": {
        "conferences": [{
          "conferenceName": "Pac-12",
          "conferenceSeo": "pac-12"
        }],
        "description": "(5-6)",
        "names": {
          "char6": "ORE ST",
          "full": "Oregon State University",
          "seo": "oregon-st",
          "short": "Oregon St."
        },
        "rank": "",
        "score": "10",
        "seed": "",
        "winner": false
      },
      "bracketId": "",
      "bracketRegion": "",
      "bracketRound": "",
      "contestClock": "0:00",
      "currentPeriod": "FINAL",
      "finalMessage": "FINAL",
      "gameID": "8598eaa6-6888-4050-9333-fb808c836753",
      "gameState": "final",
      "home": {
        "conferences": [
          {
            "conferenceName": "Pac-12",
            "conferenceSeo": "pac-12"
          },
          {
            "conferenceName": "Top 25",
            "conferenceSeo": "top-25"
          }
        ],
        "description": "(9-2)",
        "names": {
          "char6": "OREGN",
          "full": "University of Oregon",
          "seo": "oregon",
          "short": "Oregon"
        },
        "rank": "14",
        "score": "24",
        "seed": "",
        "winner": true
      },
      "liveVideoEnabled": false,
      "network": "",
      "startDate": "11-30-2019",
      "startTime": "04:00PM ET",
      "startTimeEpoch": "1575147600",
      "title": "Oregon Oregon St.",
      "url": "/game/3784656",
      "videoState": ""
    }},
    {"game": {
      "away": {
        "conferences": [
          {
            "conferenceName": "FBS Independent",
            "conferenceSeo": "fbs-independent"
          },
          {
            "conferenceName": "Top 25",
            "conferenceSeo": "top-25"
          }
        ],
        "description": "(9-2)",
        "names": {
          "char6": "N DAME",
          "full": "University of Notre Dame",
          "seo": "notre-dame",
          "short": "Notre Dame"
        },
        "rank": "16",
        "score": "45",
        "seed": "",
        "winner": true
      },
      "bracketId": "",
      "bracketRegion": "",
      "bracketRound": "",
      "contestClock": "0:00",
      "currentPeriod": "FINAL",
      "finalMessage": "FINAL",
      "gameID": "b0989039-1808-4bfd-98a5-187c41b76075",
      "gameState": "final",
      "home": {
        "conferences": [{
          "conferenceName": "Pac-12",
          "conferenceSeo": "pac-12"
        }],
        "description": "(4-7)",
        "names": {
          "char6": "STAN",
          "full": "Stanford University",
          "seo": "stanford",
          "short": "Stanford"
        },
        "rank": "",
        "score": "24",
        "seed": "",
        "winner": false
      },
      "liveVideoEnabled": false,
      "network": "",
      "startDate": "11-30-2019",
      "startTime": "04:00PM ET",
      "startTimeEpoch": "1575147600",
      "title": "Stanford Notre Dame",
      "url": "/game/3785898",
      "videoState": ""
    }},
    {"game": {
      "away": {
        "conferences": [{
          "conferenceName": "Mountain West",
          "conferenceSeo": "mountain-west"
        }],
        "description": "(6-5)",
        "names": {
          "char6": "UT ST",
          "full": "Utah State University",
          "seo": "utah-st",
          "short": "Utah St."
        },
        "rank": "",
        "score": "38",
        "seed": "",
        "winner": true
      },
      "bracketId": "",
      "bracketRegion": "",
      "bracketRound": "",
      "contestClock": "0:00",
      "currentPeriod": "FINAL",
      "finalMessage": "FINAL",
      "gameID": "01d5d5ed-fe17-4916-ac0a-4ae5576e6685",
      "gameState": "final",
      "home": {
        "conferences": [{
          "conferenceName": "Mountain West",
          "conferenceSeo": "mountain-west"
        }],
        "description": "(2-9)",
        "names": {
          "char6": "N MEX",
          "full": "University of New Mexico",
          "seo": "new-mexico",
          "short": "New Mexico"
        },
        "rank": "",
        "score": "25",
        "seed": "",
        "winner": false
      },
      "liveVideoEnabled": false,
      "network": "",
      "startDate": "11-30-2019",
      "startTime": "04:00PM ET",
      "startTimeEpoch": "1575147600",
      "title": "New Mexico Utah St.",
      "url": "/game/3784901",
      "videoState": ""
    }},
    {"game": {
      "away": {
        "conferences": [{
          "conferenceName": "C-USA",
          "conferenceSeo": "c-usa"
        }],
        "description": "(8-3)",
        "names": {
          "char6": "UAB",
          "full": "University of Alabama at Birmingham",
          "seo": "uab",
          "short": "UAB"
        },
        "rank": "",
        "score": "26",
        "seed": "",
        "winner": true
      },
      "bracketId": "",
      "bracketRegion": "",
      "bracketRound": "",
      "contestClock": "0:00",
      "currentPeriod": "FINAL",
      "finalMessage": "FINAL",
      "gameID": "7f4769cc-bc3f-4315-aae3-01bfb5ede7ff",
      "gameState": "final",
      "home": {
        "conferences": [{
          "conferenceName": "C-USA",
          "conferenceSeo": "c-usa"
        }],
        "description": "(4-7)",
        "names": {
          "char6": "NO TEX",
          "full": "University of North Texas",
          "seo": "north-texas",
          "short": "North Texas"
        },
        "rank": "",
        "score": "21",
        "seed": "",
        "winner": false
      },
      "liveVideoEnabled": false,
      "network": "",
      "startDate": "11-30-2019",
      "startTime": "04:00PM ET",
      "startTimeEpoch": "1575147600",
      "title": "North Texas UAB",
      "url": "/game/3784715",
      "videoState": ""
    }},
    {"game": {
      "away": {
        "conferences": [{
          "conferenceName": "AAC",
          "conferenceSeo": "aac"
        }],
        "description": "(6-5)",
        "names": {
          "char6": "TULANE",
          "full": "Tulane University",
          "seo": "tulane",
          "short": "Tulane"
        },
        "rank": "",
        "score": "20",
        "seed": "",
        "winner": false
      },
      "bracketId": "",
      "bracketRegion": "",
      "bracketRound": "",
      "contestClock": "0:00",
      "currentPeriod": "FINAL",
      "finalMessage": "FINAL",
      "gameID": "44a20b2e-f318-416d-ae94-f2724e666627",
      "gameState": "final",
      "home": {
        "conferences": [{
          "conferenceName": "AAC",
          "conferenceSeo": "aac"
        }],
        "description": "(9-2)",
        "names": {
          "char6": "SMU",
          "full": "Southern Methodist University",
          "seo": "smu",
          "short": "SMU"
        },
        "rank": "",
        "score": "37",
        "seed": "",
        "winner": true
      },
      "liveVideoEnabled": false,
      "network": "",
      "startDate": "11-30-2019",
      "startTime": "04:00PM ET",
      "startTimeEpoch": "1575147600",
      "title": "SMU Tulane",
      "url": "/game/3785189",
      "videoState": ""
    }},
    {"game": {
      "away": {
        "conferences": [{
          "conferenceName": "Sun Belt",
          "conferenceSeo": "sun-belt"
        }],
        "description": "(7-4)",
        "names": {
          "char6": "GA ST",
          "full": "Georgia State University",
          "seo": "georgia-st",
          "short": "Georgia St."
        },
        "rank": "",
        "score": "10",
        "seed": "",
        "winner": false
      },
      "bracketId": "",
      "bracketRegion": "",
      "bracketRound": "",
      "contestClock": "0:00",
      "currentPeriod": "FINAL",
      "finalMessage": "FINAL",
      "gameID": "0523d94f-4552-4d66-a551-e8a62c5ae867",
      "gameState": "final",
      "home": {
        "conferences": [{
          "conferenceName": "Sun Belt",
          "conferenceSeo": "sun-belt"
        }],
        "description": "(6-5)",
        "names": {
          "char6": "GA SOU",
          "full": "Georgia Southern University",
          "seo": "ga-southern",
          "short": "Ga. Southern"
        },
        "rank": "",
        "score": "38",
        "seed": "",
        "winner": true
      },
      "liveVideoEnabled": false,
      "network": "",
      "startDate": "11-30-2019",
      "startTime": "06:00PM ET",
      "startTimeEpoch": "1575154800",
      "title": "Ga. Southern Georgia St.",
      "url": "/game/3784812",
      "videoState": ""
    }},
    {"game": {
      "away": {
        "conferences": [{
          "conferenceName": "ACC",
          "conferenceSeo": "acc"
        }],
        "description": "(5-6)",
        "names": {
          "char6": "UNC",
          "full": "University of North Carolina, Chapel Hill",
          "seo": "north-carolina",
          "short": "North Carolina"
        },
        "rank": "",
        "score": "41",
        "seed": "",
        "winner": true
      },
      "bracketId": "",
      "bracketRegion": "",
      "bracketRound": "",
      "contestClock": "0:00",
      "currentPeriod": "FINAL",
      "finalMessage": "FINAL",
      "gameID": "9845ca45-277e-4e58-be46-989409d85428",
      "gameState": "final",
      "home": {
        "conferences": [{
          "conferenceName": "ACC",
          "conferenceSeo": "acc"
        }],
        "description": "(4-7)",
        "names": {
          "char6": "NC ST",
          "full": "North Carolina State University",
          "seo": "north-carolina-st",
          "short": "NC State"
        },
        "rank": "",
        "score": "10",
        "seed": "",
        "winner": false
      },
      "liveVideoEnabled": false,
      "network": "",
      "startDate": "11-30-2019",
      "startTime": "07:00PM ET",
      "startTimeEpoch": "1575158400",
      "title": "NC State North Carolina",
      "url": "/game/3786040",
      "videoState": ""
    }},
    {"game": {
      "away": {
        "conferences": [{
          "conferenceName": "AAC",
          "conferenceSeo": "aac"
        }],
        "description": "(8-2)",
        "names": {
          "char6": "NAVY",
          "full": "U.S. Naval Academy",
          "seo": "navy",
          "short": "Navy"
        },
        "rank": "",
        "score": "56",
        "seed": "",
        "winner": true
      },
      "bracketId": "",
      "bracketRegion": "",
      "bracketRound": "",
      "contestClock": "0:00",
      "currentPeriod": "FINAL",
      "finalMessage": "FINAL",
      "gameID": "5c454bc4-267e-492d-999d-583636430bd0",
      "gameState": "final",
      "home": {
        "conferences": [{
          "conferenceName": "AAC",
          "conferenceSeo": "aac"
        }],
        "description": "(4-7)",
        "names": {
          "char6": "HOU",
          "full": "University of Houston",
          "seo": "houston",
          "short": "Houston"
        },
        "rank": "",
        "score": "41",
        "seed": "",
        "winner": false
      },
      "liveVideoEnabled": false,
      "network": "",
      "startDate": "11-30-2019",
      "startTime": "07:00PM ET",
      "startTimeEpoch": "1575158400",
      "title": "Houston Navy",
      "url": "/game/3785645",
      "videoState": ""
    }},
    {"game": {
      "away": {
        "conferences": [
          {
            "conferenceName": "Big 12",
            "conferenceSeo": "big-12"
          },
          {
            "conferenceName": "Top 25",
            "conferenceSeo": "top-25"
          }
        ],
        "description": "(7-4)",
        "names": {
          "char6": "IOWAST",
          "full": "Iowa State University",
          "seo": "iowa-st",
          "short": "Iowa St."
        },
        "rank": "23",
        "score": "17",
        "seed": "",
        "winner": false
      },
      "bracketId": "",
      "bracketRegion": "",
      "bracketRound": "",
      "contestClock": "0:00",
      "currentPeriod": "FINAL",
      "finalMessage": "FINAL",
      "gameID": "51b27857-5ebb-41d9-bff2-6968be3a9122",
      "gameState": "final",
      "home": {
        "conferences": [{
          "conferenceName": "Big 12",
          "conferenceSeo": "big-12"
        }],
        "description": "(7-4)",
        "names": {
          "char6": "KAN ST",
          "full": "Kansas State University",
          "seo": "kansas-st",
          "short": "Kansas St."
        },
        "rank": "",
        "score": "27",
        "seed": "",
        "winner": true
      },
      "liveVideoEnabled": false,
      "network": "",
      "startDate": "11-30-2019",
      "startTime": "07:00PM ET",
      "startTimeEpoch": "1575158400",
      "title": "Kansas St. Iowa St.",
      "url": "/game/3786068",
      "videoState": ""
    }},
    {"game": {
      "away": {
        "conferences": [{
          "conferenceName": "SEC",
          "conferenceSeo": "sec"
        }],
        "description": "(7-4)",
        "names": {
          "char6": "TX A&M",
          "full": "Texas A&M University, College Station",
          "seo": "texas-am",
          "short": "Texas A&M"
        },
        "rank": "",
        "score": "7",
        "seed": "",
        "winner": false
      },
      "bracketId": "",
      "bracketRegion": "",
      "bracketRound": "",
      "contestClock": "0:00",
      "currentPeriod": "FINAL",
      "finalMessage": "FINAL",
      "gameID": "59f6b577-dcd8-4280-b091-4a22a3c88681",
      "gameState": "final",
      "home": {
        "conferences": [
          {
            "conferenceName": "SEC",
            "conferenceSeo": "sec"
          },
          {
            "conferenceName": "Top 25",
            "conferenceSeo": "top-25"
          }
        ],
        "description": "(11-0)",
        "names": {
          "char6": "LSU",
          "full": "Louisiana State University",
          "seo": "lsu",
          "short": "LSU"
        },
        "rank": "2",
        "score": "50",
        "seed": "",
        "winner": true
      },
      "liveVideoEnabled": false,
      "network": "",
      "startDate": "11-30-2019",
      "startTime": "07:00PM ET",
      "startTimeEpoch": "1575158400",
      "title": "LSU Texas A&M",
      "url": "/game/3785554",
      "videoState": ""
    }},
    {"game": {
      "away": {
        "conferences": [{
          "conferenceName": "ACC",
          "conferenceSeo": "acc"
        }],
        "description": "(6-5)",
        "names": {
          "char6": "FSU",
          "full": "Florida State University",
          "seo": "florida-st",
          "short": "Florida St."
        },
        "rank": "",
        "score": "17",
        "seed": "",
        "winner": false
      },
      "bracketId": "",
      "bracketRegion": "",
      "bracketRound": "",
      "contestClock": "0:00",
      "currentPeriod": "FINAL",
      "finalMessage": "FINAL",
      "gameID": "64ac01ee-fbd0-4e93-9b75-7ad065c790f6",
      "gameState": "final",
      "home": {
        "conferences": [
          {
            "conferenceName": "SEC",
            "conferenceSeo": "sec"
          },
          {
            "conferenceName": "Top 25",
            "conferenceSeo": "top-25"
          }
        ],
        "description": "(9-2)",
        "names": {
          "char6": "FLA",
          "full": "University of Florida",
          "seo": "florida",
          "short": "Florida"
        },
        "rank": "11",
        "score": "40",
        "seed": "",
        "winner": true
      },
      "liveVideoEnabled": false,
      "network": "",
      "startDate": "11-30-2019",
      "startTime": "07:30PM ET",
      "startTimeEpoch": "1575160200",
      "title": "Florida Florida St.",
      "url": "/game/3785608",
      "videoState": ""
    }},
    {"game": {
      "away": {
        "conferences": [{
          "conferenceName": "Pac-12",
          "conferenceSeo": "pac-12"
        }],
        "description": "(5-6)",
        "names": {
          "char6": "COLO",
          "full": "University of Colorado, Boulder",
          "seo": "colorado",
          "short": "Colorado"
        },
        "rank": "",
        "score": "15",
        "seed": "",
        "winner": false
      },
      "bracketId": "",
      "bracketRegion": "",
      "bracketRound": "",
      "contestClock": "0:00",
      "currentPeriod": "FINAL",
      "finalMessage": "FINAL",
      "gameID": "4e3a4f34-87d0-4ec5-9742-fca943b9c113",
      "gameState": "final",
      "home": {
        "conferences": [
          {
            "conferenceName": "Pac-12",
            "conferenceSeo": "pac-12"
          },
          {
            "conferenceName": "Top 25",
            "conferenceSeo": "top-25"
          }
        ],
        "description": "(10-1)",
        "names": {
          "char6": "UTAH",
          "full": "University of Utah",
          "seo": "utah",
          "short": "Utah"
        },
        "rank": "6",
        "score": "45",
        "seed": "",
        "winner": true
      },
      "liveVideoEnabled": false,
      "network": "",
      "startDate": "11-30-2019",
      "startTime": "07:30PM ET",
      "startTimeEpoch": "1575160200",
      "title": "Utah Colorado",
      "url": "/game/3786132",
      "videoState": ""
    }},
    {"game": {
      "away": {
        "conferences": [{
          "conferenceName": "Sun Belt",
          "conferenceSeo": "sun-belt"
        }],
        "description": "(5-6)",
        "names": {
          "char6": "LA MON",
          "full": "University of Louisiana Monroe",
          "seo": "la-monroe",
          "short": "La.-Monroe"
        },
        "rank": "",
        "score": "30",
        "seed": "",
        "winner": false
      },
      "bracketId": "",
      "bracketRegion": "",
      "bracketRound": "",
      "contestClock": "0:00",
      "currentPeriod": "FINAL",
      "finalMessage": "FINAL",
      "gameID": "4bfadb0c-228e-4802-8830-d7daf1f518a9",
      "gameState": "final",
      "home": {
        "conferences": [{
          "conferenceName": "Sun Belt",
          "conferenceSeo": "sun-belt"
        }],
        "description": "(9-2)",
        "names": {
          "char6": "ULL",
          "full": "University of Louisiana at Lafayette",
          "seo": "la-lafayette",
          "short": "Louisiana"
        },
        "rank": "",
        "score": "31",
        "seed": "",
        "winner": true
      },
      "liveVideoEnabled": false,
      "network": "",
      "startDate": "11-30-2019",
      "startTime": "07:30PM ET",
      "startTimeEpoch": "1575160200",
      "title": "Louisiana La.-Monroe",
      "url": "/game/3784777",
      "videoState": ""
    }},
    {"game": {
      "away": {
        "conferences": [
          {
            "conferenceName": "Big 12",
            "conferenceSeo": "big-12"
          },
          {
            "conferenceName": "Top 25",
            "conferenceSeo": "top-25"
          }
        ],
        "description": "(10-1)",
        "names": {
          "char6": "OKLA",
          "full": "University of Oklahoma",
          "seo": "oklahoma",
          "short": "Oklahoma"
        },
        "rank": "7",
        "score": "34",
        "seed": "",
        "winner": true
      },
      "bracketId": "",
      "bracketRegion": "",
      "bracketRound": "",
      "contestClock": "0:00",
      "currentPeriod": "FINAL",
      "finalMessage": "FINAL",
      "gameID": "08c76fe2-7af5-44f4-adfa-50f08aedc047",
      "gameState": "final",
      "home": {
        "conferences": [
          {
            "conferenceName": "Big 12",
            "conferenceSeo": "big-12"
          },
          {
            "conferenceName": "Top 25",
            "conferenceSeo": "top-25"
          }
        ],
        "description": "(8-3)",
        "names": {
          "char6": "OKLAST",
          "full": "Oklahoma State University",
          "seo": "oklahoma-st",
          "short": "Oklahoma St."
        },
        "rank": "21",
        "score": "16",
        "seed": "",
        "winner": false
      },
      "liveVideoEnabled": false,
      "network": "",
      "startDate": "11-30-2019",
      "startTime": "08:00PM ET",
      "startTimeEpoch": "1575162000",
      "title": "Oklahoma St. Oklahoma",
      "url": "/game/3785924",
      "videoState": ""
    }},
    {"game": {
      "away": {
        "conferences": [{
          "conferenceName": "FBS Independent",
          "conferenceSeo": "fbs-independent"
        }],
        "description": "(7-4)",
        "names": {
          "char6": "BYU",
          "full": "Brigham Young University",
          "seo": "byu",
          "short": "BYU"
        },
        "rank": "",
        "score": "3",
        "seed": "",
        "winner": false
      },
      "bracketId": "",
      "bracketRegion": "",
      "bracketRound": "",
      "contestClock": "0:00",
      "currentPeriod": "FINAL",
      "finalMessage": "FINAL",
      "gameID": "56e0a16a-7019-4ff4-8a59-16e8931cea20",
      "gameState": "final",
      "home": {
        "conferences": [{
          "conferenceName": "Mountain West",
          "conferenceSeo": "mountain-west"
        }],
        "description": "(8-3)",
        "names": {
          "char6": "SDSU",
          "full": "San Diego State University",
          "seo": "san-diego-st",
          "short": "San Diego St."
        },
        "rank": "",
        "score": "13",
        "seed": "",
        "winner": true
      },
      "liveVideoEnabled": false,
      "network": "",
      "startDate": "11-30-2019",
      "startTime": "09:00PM ET",
      "startTimeEpoch": "1575165600",
      "title": "San Diego St. BYU",
      "url": "/game/3785083",
      "videoState": ""
    }},
    {"game": {
      "away": {
        "conferences": [{
          "conferenceName": "Pac-12",
          "conferenceSeo": "pac-12"
        }],
        "description": "(4-7)",
        "names": {
          "char6": "ARIZ",
          "full": "University of Arizona",
          "seo": "arizona",
          "short": "Arizona"
        },
        "rank": "",
        "score": "14",
        "seed": "",
        "winner": false
      },
      "bracketId": "",
      "bracketRegion": "",
      "bracketRound": "",
      "contestClock": "0:00",
      "currentPeriod": "FINAL",
      "finalMessage": "FINAL",
      "gameID": "3545d82a-3f3b-43a4-a925-805b630de893",
      "gameState": "final",
      "home": {
        "conferences": [{
          "conferenceName": "Pac-12",
          "conferenceSeo": "pac-12"
        }],
        "description": "(6-5)",
        "names": {
          "char6": "AZ ST",
          "full": "Arizona State University",
          "seo": "arizona-st",
          "short": "Arizona St."
        },
        "rank": "",
        "score": "24",
        "seed": "",
        "winner": true
      },
      "liveVideoEnabled": false,
      "network": "",
      "startDate": "11-30-2019",
      "startTime": "10:00PM ET",
      "startTimeEpoch": "1575169200",
      "title": "Arizona St. Arizona",
      "url": "/game/3786081",
      "videoState": ""
    }},
    {"game": {
      "away": {
        "conferences": [{
          "conferenceName": "Pac-12",
          "conferenceSeo": "pac-12"
        }],
        "description": "(6-5)",
        "names": {
          "char6": "CAL",
          "full": "University of California, Berkeley",
          "seo": "california",
          "short": "California"
        },
        "rank": "",
        "score": "28",
        "seed": "",
        "winner": true
      },
      "bracketId": "",
      "bracketRegion": "",
      "bracketRound": "",
      "contestClock": "0:00",
      "currentPeriod": "FINAL",
      "finalMessage": "FINAL",
      "gameID": "3d5dabe2-aabf-4b65-a814-842eece54af7",
      "gameState": "final",
      "home": {
        "conferences": [{
          "conferenceName": "Pac-12",
          "conferenceSeo": "pac-12"
        }],
        "description": "(4-7)",
        "names": {
          "char6": "UCLA",
          "full": "University of California, Los Angeles",
          "seo": "ucla",
          "short": "UCLA"
        },
        "rank": "",
        "score": "18",
        "seed": "",
        "winner": false
      },
      "liveVideoEnabled": false,
      "network": "",
      "startDate": "11-30-2019",
      "startTime": "10:30PM ET",
      "startTimeEpoch": "1575171000",
      "title": "UCLA California",
      "url": "/game/3785725",
      "videoState": ""
    }},
    {"game": {
      "away": {
        "conferences": [{
          "conferenceName": "Mountain West",
          "conferenceSeo": "mountain-west"
        }],
        "description": "(4-7)",
        "names": {
          "char6": "FRESNO",
          "full": "California State University, Fresno",
          "seo": "fresno-st",
          "short": "Fresno St."
        },
        "rank": "",
        "score": "16",
        "seed": "",
        "winner": false
      },
      "bracketId": "",
      "bracketRegion": "",
      "bracketRound": "",
      "contestClock": "0:00",
      "currentPeriod": "FINAL",
      "finalMessage": "FINAL",
      "gameID": "1538e7f3-1838-4610-8c64-e0e44ebeb71a",
      "gameState": "final",
      "home": {
        "conferences": [{
          "conferenceName": "Mountain West",
          "conferenceSeo": "mountain-west"
        }],
        "description": "(4-7)",
        "names": {
          "char6": "SJSU",
          "full": "San Jose State University",
          "seo": "san-jose-st",
          "short": "San Jose St."
        },
        "rank": "",
        "score": "17",
        "seed": "",
        "winner": true
      },
      "liveVideoEnabled": false,
      "network": "",
      "startDate": "11-30-2019",
      "startTime": "10:30PM ET",
      "startTimeEpoch": "1575171000",
      "title": "San Jose St. Fresno St.",
      "url": "/game/3786028",
      "videoState": ""
    }},
    {"game": {
      "away": {
        "conferences": [{
          "conferenceName": "FBS Independent",
          "conferenceSeo": "fbs-independent"
        }],
        "description": "(5-6)",
        "names": {
          "char6": "ARMY",
          "full": "U.S. Military Academy",
          "seo": "army",
          "short": "Army West Point"
        },
        "rank": "",
        "score": "31",
        "seed": "",
        "winner": false
      },
      "bracketId": "",
      "bracketRegion": "",
      "bracketRound": "",
      "contestClock": "0:00",
      "currentPeriod": "FINAL",
      "finalMessage": "FINAL",
      "gameID": "be114f20-052a-4f18-94ce-51cdaeca91f4",
      "gameState": "final",
      "home": {
        "conferences": [{
          "conferenceName": "Mountain West",
          "conferenceSeo": "mountain-west"
        }],
        "description": "(8-4)",
        "names": {
          "char6": "HAWAII",
          "full": "University of Hawaii, Manoa",
          "seo": "hawaii",
          "short": "Hawaii"
        },
        "rank": "",
        "score": "52",
        "seed": "",
        "winner": true
      },
      "liveVideoEnabled": false,
      "network": "",
      "startDate": "12-01-2019",
      "startTime": "12:30AM ET",
      "startTimeEpoch": "1575178200",
      "title": "Hawaii Army West Point",
      "url": "/game/3784913",
      "videoState": ""
    }}
  ],
  "inputMD5Sum": "36814841888f831a3a3eb085b6ad121d",
  "updated_at": "12-01-2019 14:33:02"
}