{
  "inputMD5Sum": "125086dfe4dd08fd1650eedc631e141d",
  "updated_at": "09-08-2020 13:19:00",
  "games": [
    {"game": {
      "gameID": "0f23d300-5bec-4dc2-a7b0-1b8e05751d11",
      "away": {
        "score": "35",
        "names": {
          "char6": "C ARK",
          "short": "Central Ark.",
          "seo": "central-ark",
          "full": "University of Central Arkansas"
        },
        "winner": false,
        "seed": "",
        "description": "(1-1)",
        "rank": "",
        "conferences": [{
          "conferenceName": "Southland",
          "conferenceSeo": "southland"
        }]
      },
      "finalMessage": "FINAL",
      "bracketRound": "",
      "title": "UAB Central Ark.",
      "url": "/game/4060914",
      "network": "",
      "home": {
        "score": "45",
        "names": {
          "char6": "UAB",
          "short": "UAB",
          "seo": "uab",
          "full": "University of Alabama at Birmingham"
        },
        "winner": true,
        "seed": "",
        "description": "(1-0)",
        "rank": "",
        "conferences": [{
          "conferenceName": "C-USA",
          "conferenceSeo": "c-usa"
        }]
      },
      "liveVideoEnabled": false,
      "startTime": "08:00PM ET",
      "startTimeEpoch": "1599177600",
      "bracketId": "",
      "gameState": "final",
      "startDate": "09-03-2020",
      "currentPeriod": "FINAL",
      "videoState": "",
      "bracketRegion": "",
      "contestClock": "0:00"
    }},
    {"game": {
      "gameID": "f151c812-4312-4302-8823-a2fbf0143959",
      "away": {
        "score": "32",
        "names": {
          "char6": "S ALA",
          "short": "South Alabama",
          "seo": "south-ala",
          "full": "University of South Alabama"
        },
        "winner": true,
        "seed": "",
        "description": "(1-0)",
        "rank": "",
        "conferences": [{
          "conferenceName": "Sun Belt",
          "conferenceSeo": "sun-belt"
        }]
      },
      "finalMessage": "FINAL",
      "bracketRound": "",
      "title": "Southern Miss. South Alabama",
      "url": "/game/4060502",
      "network": "",
      "home": {
        "score": "21",
        "names": {
          "char6": "S MISS",
          "short": "Southern Miss.",
          "seo": "southern-miss",
          "full": "The University of Southern Mississippi"
        },
        "winner": false,
        "seed": "",
        "description": "(0-1)",
        "rank": "",
        "conferences": [{
          "conferenceName": "C-USA",
          "conferenceSeo": "c-usa"
        }]
      },
      "liveVideoEnabled": false,
      "startTime": "09:00PM ET",
      "startTimeEpoch": "1599181200",
      "bracketId": "",
      "gameState": "final",
      "startDate": "09-03-2020",
      "currentPeriod": "FINAL",
      "videoState": "",
      "bracketRegion": "",
      "contestClock": "0:00"
    }},
    {"game": {
      "gameID": "168f0d04-bbe3-4058-8d1f-1956ef7d37e5",
      "away": {
        "score": "0",
        "names": {
          "char6": "E KY",
          "short": "Eastern Ky.",
          "seo": "eastern-ky",
          "full": "Eastern Kentucky University"
        },
        "winner": false,
        "seed": "",
        "description": "(0-1)",
        "rank": "",
        "conferences": [{
          "conferenceName": "OVC",
          "conferenceSeo": "ovc"
        }]
      },
      "finalMessage": "FINAL",
      "bracketRound": "",
      "title": "Marshall Eastern Ky.",
      "url": "/game/4060907",
      "network": "",
      "home": {
        "score": "59",
        "names": {
          "char6": "MARSH",
          "short": "Marshall",
          "seo": "marshall",
          "full": "Marshall University"
        },
        "winner": true,
        "seed": "",
        "description": "(1-0)",
        "rank": "",
        "conferences": [{
          "conferenceName": "C-USA",
          "conferenceSeo": "c-usa"
        }]
      },
      "liveVideoEnabled": false,
      "startTime": "01:00PM ET",
      "startTimeEpoch": "1599325200",
      "bracketId": "",
      "gameState": "final",
      "startDate": "09-05-2020",
      "currentPeriod": "FINAL",
      "videoState": "",
      "bracketRegion": "",
      "contestClock": "0:00"
    }},
    {"game": {
      "gameID": "594671a9-309d-4f07-9b92-9c907a80a5cc",
      "away": {
        "score": "0",
        "names": {
          "char6": "MIDTEN",
          "short": "Middle Tenn.",
          "seo": "middle-tenn",
          "full": "Middle Tennessee State University"
        },
        "winner": false,
        "seed": "",
        "description": "(0-1)",
        "rank": "",
        "conferences": [{
          "conferenceName": "C-USA",
          "conferenceSeo": "c-usa"
        }]
      },
      "finalMessage": "FINAL",
      "bracketRound": "",
      "title": "Army West Point Middle Tenn.",
      "url": "/game/4060503",
      "network": "",
      "home": {
        "score": "42",
        "names": {
          "char6": "ARMY",
          "short": "Army West Point",
          "seo": "army",
          "full": "U.S. Military Academy"
        },
        "winner": true,
        "seed": "",
        "description": "(1-0)",
        "rank": "",
        "conferences": [{
          "conferenceName": "FBS Independent",
          "conferenceSeo": "fbs-independent"
        }]
      },
      "liveVideoEnabled": false,
      "startTime": "01:30PM ET",
      "startTimeEpoch": "1599327000",
      "bracketId": "",
      "gameState": "final",
      "startDate": "09-05-2020",
      "currentPeriod": "FINAL",
      "videoState": "",
      "bracketRegion": "",
      "contestClock": "0:00"
    }},
    {"game": {
      "gameID": "c2ba5a72-d39a-4e12-8980-0a192f756f04",
      "away": {
        "score": "31",
        "names": {
          "char6": "SMU",
          "short": "SMU",
          "seo": "smu",
          "full": "Southern Methodist University"
        },
        "winner": true,
        "seed": "",
        "description": "(1-0)",
        "rank": "",
        "conferences": [{
          "conferenceName": "AAC",
          "conferenceSeo": "aac"
        }]
      },
      "finalMessage": "FINAL",
      "bracketRound": "",
      "title": "Texas St. SMU",
      "url": "/game/4060508",
      "network": "",
      "home": {
        "score": "24",
        "names": {
          "char6": "TX ST",
          "short": "Texas St.",
          "seo": "texas-st",
          "full": "Texas State University"
        },
        "winner": false,
        "seed": "",
        "description": "(0-1)",
        "rank": "",
        "conferences": [{
          "conferenceName": "Sun Belt",
          "conferenceSeo": "sun-belt"
        }]
      },
      "liveVideoEnabled": false,
      "startTime": "04:30PM ET",
      "startTimeEpoch": "1599337800",
      "bracketId": "",
      "gameState": "final",
      "startDate": "09-05-2020",
      "currentPeriod": "FINAL",
      "videoState": "",
      "bracketRegion": "",
      "contestClock": "0:00"
    }},
    {"game": {
      "gameID": "eacdf0f5-b2be-4361-bb11-b6ec29c8cbf4",
      "away": {
        "score": "",
        "names": {
          "char6": "LA MON",
          "short": "ULM",
          "seo": "la-monroe",
          "full": "University of Louisiana Monroe"
        },
        "winner": false,
        "seed": "",
        "description": "(-)",
        "rank": "",
        "conferences": [{
          "conferenceName": "Sun Belt",
          "conferenceSeo": "sun-belt"
        }]
      },
      "finalMessage": "",
      "bracketRound": "",
      "title": "Troy ULM",
      "url": "/game/4060918",
      "network": "",
      "home": {
        "score": "",
        "names": {
          "char6": "TROY",
          "short": "Troy",
          "seo": "troy",
          "full": "Troy University"
        },
        "winner": false,
        "seed": "",
        "description": "(-)",
        "rank": "",
        "conferences": [{
          "conferenceName": "Sun Belt",
          "conferenceSeo": "sun-belt"
        }]
      },
      "liveVideoEnabled": false,
      "startTime": "07:00PM ET",
      "startTimeEpoch": "1599346800",
      "bracketId": "",
      "gameState": "postponed",
      "startDate": "09-05-2020",
      "currentPeriod": "",
      "videoState": "",
      "bracketRegion": "",
      "contestClock": ""
    }},
    {"game": {
      "gameID": "115ee726-7d6a-4d42-b3d7-96aeac88c839",
      "away": {
        "score": "31",
        "names": {
          "char6": "HOUBAP",
          "short": "Houston Baptist",
          "seo": "houston-baptist",
          "full": "Houston Baptist University"
        },
        "winner": false,
        "seed": "",
        "description": "(0-1)",
        "rank": "",
        "conferences": [{
          "conferenceName": "Southland",
          "conferenceSeo": "southland"
        }]
      },
      "finalMessage": "FINAL",
      "bracketRound": "",
      "title": "North Texas Houston Baptist",
      "url": "/game/4060507",
      "network": "",
      "home": {
        "score": "57",
        "names": {
          "char6": "NO TEX",
          "short": "North Texas",
          "seo": "north-texas",
          "full": "University of North Texas"
        },
        "winner": true,
        "seed": "",
        "description": "(1-0)",
        "rank": "",
        "conferences": [{
          "conferenceName": "C-USA",
          "conferenceSeo": "c-usa"
        }]
      },
      "liveVideoEnabled": false,
      "startTime": "07:30PM ET",
      "startTimeEpoch": "1599348600",
      "bracketId": "",
      "gameState": "final",
      "startDate": "09-05-2020",
      "currentPeriod": "FINAL",
      "videoState": "",
      "bracketRegion": "",
      "contestClock": "0:00"
    }},
    {"game": {
      "gameID": "3390167e-324d-4074-aa8c-e77f3c2bc318",
      "away": {
        "score": "24",
        "names": {
          "char6": "ARK ST",
          "short": "Arkansas St.",
          "seo": "arkansas-st",
          "full": "Arkansas State University"
        },
        "winner": false,
        "seed": "",
        "description": "(0-1)",
        "rank": "",
        "conferences": [{
          "conferenceName": "Sun Belt",
          "conferenceSeo": "sun-belt"
        }]
      },
      "finalMessage": "FINAL",
      "bracketRound": "",
      "title": "Memphis Arkansas St.",
      "url": "/game/4060505",
      "network": "",
      "home": {
        "score": "37",
        "names": {
          "char6": "MEM",
          "short": "Memphis",
          "seo": "memphis",
          "full": "University of Memphis"
        },
        "winner": true,
        "seed": "",
        "description": "(1-0)",
        "rank": "",
        "conferences": [{
          "conferenceName": "AAC",
          "conferenceSeo": "aac"
        }]
      },
      "liveVideoEnabled": false,
      "startTime": "08:00PM ET",
      "startTimeEpoch": "1599350400",
      "bracketId": "",
      "gameState": "final",
      "startDate": "09-05-2020",
      "currentPeriod": "FINAL",
      "videoState": "",
      "bracketRegion": "",
      "contestClock": "0:00"
    }},
    {"game": {
      "gameID": "a51e730d-1b3a-44ea-a6c7-b83c20ae575a",
      "away": {
        "score": "14",
        "names": {
          "char6": "SFA",
          "short": "SFA",
          "seo": "stephen-f-austin",
          "full": "Stephen F. Austin State University"
        },
        "winner": false,
        "seed": "",
        "description": "(0-1)",
        "rank": "",
        "conferences": [{
          "conferenceName": "Southland",
          "conferenceSeo": "southland"
        }]
      },
      "finalMessage": "FINAL",
      "bracketRound": "",
      "title": "UTEP SFA",
      "url": "/game/4066306",
      "network": "",
      "home": {
        "score": "24",
        "names": {
          "char6": "UTEP",
          "short": "UTEP",
          "seo": "utep",
          "full": "University of Texas at El Paso"
        },
        "winner": true,
        "seed": "",
        "description": "(1-0)",
        "rank": "",
        "conferences": [{
          "conferenceName": "C-USA",
          "conferenceSeo": "c-usa"
        }]
      },
      "liveVideoEnabled": false,
      "startTime": "09:00PM ET",
      "startTimeEpoch": "1599354000",
      "bracketId": "",
      "gameState": "final",
      "startDate": "09-05-2020",
      "currentPeriod": "FINAL",
      "videoState": "",
      "bracketRegion": "",
      "contestClock": "0:00"
    }},
    {"game": {
      "gameID": "52f2b1e4-7cb2-4637-b2df-8e3db7c69e8f",
      "away": {
        "score": "55",
        "names": {
          "char6": "BYU",
          "short": "BYU",
          "seo": "byu",
          "full": "Brigham Young University"
        },
        "winner": true,
        "seed": "",
        "description": "(1-0)",
        "rank": "",
        "conferences": [{
          "conferenceName": "FBS Independent",
          "conferenceSeo": "fbs-independent"
        }]
      },
      "finalMessage": "FINAL",
      "bracketRound": "",
      "title": "Navy BYU",
      "url": "/game/4060509",
      "network": "",
      "home": {
        "score": "3",
        "names": {
          "char6": "NAVY",
          "short": "Navy",
          "seo": "navy",
          "full": "U.S. Naval Academy"
        },
        "winner": false,
        "seed": "",
        "description": "(0-1)",
        "rank": "",
        "conferences": [{
          "conferenceName": "AAC",
          "conferenceSeo": "aac"
        }]
      },
      "liveVideoEnabled": false,
      "startTime": "08:00PM ET",
      "startTimeEpoch": "1599523200",
      "bracketId": "",
      "gameState": "final",
      "startDate": "09-07-2020",
      "currentPeriod": "FINAL",
      "videoState": "",
      "bracketRegion": "",
      "contestClock": "0:00"
    }}
  ]
}