{
  "games": [
    {
      "game": {
        "away": {
          "names": {
            "short": "WesternKentucky",
            "standard": "WesternKentucky"
          },
          "score": "31"
        },
        "gameState": "final",
        "home": {
          "names": {
            "short": "Troy",
            "standard": "Troy"
          },
          "score": "26"
        },
        "startDate": "10-11-2012",
        "startTime": "12:00PM ET",
        "url": "/fbs/2012/10/11/western-ky-troy",
        "location": "MovieGalleryVeteransStadiumTroyAlabama"
      }
    },
    {
      "game": {
        "away": {
          "names": {
            "short": "UTEP",
            "standard": "UTEP"
          },
          "score": "11"
        },
        "gameState": "final",
        "home": {
          "names": {
            "short": "Tulsa",
            "standard": "Tulsa"
          },
          "score": "33"
        },
        "startDate": "10-11-2012",
        "startTime": "12:00PM ET",
        "url": "/fbs/2012/10/11/utep-tulsa",
        "location": "SkellyFieldatHAChapmanStadiumTulsaOklahoma"
      }
    },
    {
      "game": {
        "away": {
          "names": {
            "short": "ArizonaState",
            "standard": "ArizonaState"
          },
          "score": "51"
        },
        "gameState": "final",
        "home": {
          "names": {
            "short": "Colorado",
            "standard": "Colorado"
          },
          "score": "17"
        },
        "startDate": "10-11-2012",
        "startTime": "12:00PM ET",
        "url": "/fbs/2012/10/11/arizona-st-colorado",
        "location": "FolsomFieldBoulderColorado"
      }
    },
    {
      "game": {
        "away": {
          "names": {
            "short": "Navy",
            "standard": "Navy"
          },
          "score": "31"
        },
        "gameState": "final",
        "home": {
          "names": {
            "short": "CentralMichigan",
            "standard": "CentralMichigan"
          },
          "score": "13"
        },
        "startDate": "10-12-2012",
        "startTime": "12:00PM ET",
        "url": "/fbs/2012/10/12/navy-central-mich",
        "location": "KellyShortsStadiumMountPleasantMichigan"
      }
    },
    {
      "game": {
        "away": {
          "names": {
            "short": "Louisville",
            "standard": "Louisville"
          },
          "score": "45"
        },
        "gameState": "final",
        "home": {
          "names": {
            "short": "Pittsburgh",
            "standard": "Pittsburgh"
          },
          "score": "35"
        },
        "startDate": "10-13-2012",
        "startTime": "12:00PM ET",
        "url": "/fbs/2012/10/13/louisville-pittsburgh",
        "location": "HeinzFieldPittsburghPennsylvania"
      }
    },
    {
      "game": {
        "away": {
          "names": {
            "short": "Iowa",
            "standard": "Iowa"
          },
          "score": "19"
        },
        "gameState": "final",
        "home": {
          "names": {
            "short": "MichiganState",
            "standard": "MichiganState"
          },
          "score": "16"
        },
        "startDate": "10-13-2012",
        "startTime": "12:00PM ET",
        "url": "/fbs/2012/10/13/iowa-michigan-st",
        "location": "SpartanStadiumEastLansingMichigan"
      }
    },
    {
      "game": {
        "away": {
          "names": {
            "short": "KentState",
            "standard": "KentState"
          },
          "score": "31"
        },
        "gameState": "final",
        "home": {
          "names": {
            "short": "Army",
            "standard": "Army"
          },
          "score": "17"
        },
        "startDate": "10-13-2012",
        "startTime": "12:00PM ET",
        "url": "/fbs/2012/10/13/kent-st-army",
        "location": "BlaikFieldatMichieStadiumWestPointNewYork"
      }
    },
    {
      "game": {
        "away": {
          "names": {
            "short": "Texas",
            "standard": "Texas"
          },
          "score": "21"
        },
        "gameState": "final",
        "home": {
          "names": {
            "short": "Oklahoma",
            "standard": "Oklahoma"
          },
          "score": "63"
        },
        "startDate": "10-13-2012",
        "startTime": "12:00PM ET",
        "url": "/fbs/2012/10/13/texas-oklahoma",
        "location": "CottonBowlDallasTexas"
      }
    },
    {
      "game": {
        "away": {
          "names": {
            "short": "Northwestern",
            "standard": "Northwestern"
          },
          "score": "21"
        },
        "gameState": "final",
        "home": {
          "names": {
            "short": "Minnesota",
            "standard": "Minnesota"
          },
          "score": "13"
        },
        "startDate": "10-13-2012",
        "startTime": "12:00PM ET",
        "url": "/fbs/2012/10/13/northwestern-minnesota",
        "location": "TCFBankStadiumMinneapolisMinnesota"
      }
    },
    {
      "game": {
        "away": {
          "names": {
            "short": "Syracuse",
            "standard": "Syracuse"
          },
          "score": "15"
        },
        "gameState": "final",
        "home": {
          "names": {
            "short": "Rutgers",
            "standard": "Rutgers"
          },
          "score": "23"
        },
        "startDate": "10-13-2012",
        "startTime": "12:00PM ET",
        "url": "/fbs/2012/10/13/syracuse-rutgers",
        "location": "HighPointSolutionsStadiumPiscatawayNewJersey"
      }
    },
    {
      "game": {
        "away": {
          "names": {
            "short": "KansasState",
            "standard": "KansasState"
          },
          "score": "27"
        },
        "gameState": "final",
        "home": {
          "names": {
            "short": "IowaState",
            "standard": "IowaState"
          },
          "score": "21"
        },
        "startDate": "10-13-2012",
        "startTime": "12:00PM ET",
        "url": "/fbs/2012/10/13/kansas-st-iowa-st",
        "location": "JackTriceStadiumAmesIowa"
      }
    },
    {
      "game": {
        "away": {
          "names": {
            "short": "UAB",
            "standard": "UAB"
          },
          "score": "17"
        },
        "gameState": "final",
        "home": {
          "names": {
            "short": "Houston",
            "standard": "Houston"
          },
          "score": "39"
        },
        "startDate": "10-13-2012",
        "startTime": "12:00PM ET",
        "url": "/fbs/2012/10/13/uab-houston",
        "location": "OQuinnFieldatRobertsonStadiumHoustonTexas"
      }
    },
    {
      "game": {
        "away": {
          "names": {
            "short": "Wisconsin",
            "standard": "Wisconsin"
          },
          "score": "38"
        },
        "gameState": "final",
        "home": {
          "names": {
            "short": "Purdue",
            "standard": "Purdue"
          },
          "score": "14"
        },
        "startDate": "10-13-2012",
        "startTime": "12:00PM ET",
        "url": "/fbs/2012/10/13/wisconsin-purdue",
        "location": "RossAdeStadiumWestLafayetteIndiana"
      }
    },
    {
      "game": {
        "away": {
          "names": {
            "short": "Auburn",
            "standard": "Auburn"
          },
          "score": "20"
        },
        "gameState": "final",
        "home": {
          "names": {
            "short": "OleMiss",
            "standard": "OleMiss"
          },
          "score": "41"
        },
        "startDate": "10-13-2012",
        "startTime": "12:00PM ET",
        "url": "/fbs/2012/10/13/auburn-ole-miss",
        "location": "VaughtHemingwayStadiumatHollingsworthFieldOxfordMississippi"
      }
    },
    {
      "game": {
        "away": {
          "names": {
            "short": "Duke",
            "standard": "Duke"
          },
          "score": "20"
        },
        "gameState": "final",
        "home": {
          "names": {
            "short": "VirginiaTech",
            "standard": "VirginiaTech"
          },
          "score": "41"
        },
        "startDate": "10-13-2012",
        "startTime": "12:00PM ET",
        "url": "/fbs/2012/10/13/duke-virginia-tech",
        "location": "LaneStadiumWorshamFieldBlacksburgVirginia"
      }
    },
    {
      "game": {
        "away": {
          "names": {
            "short": "Toledo",
            "standard": "Toledo"
          },
          "score": "52"
        },
        "gameState": "final",
        "home": {
          "names": {
            "short": "EasternMichigan",
            "standard": "EasternMichigan"
          },
          "score": "47"
        },
        "startDate": "10-13-2012",
        "startTime": "12:00PM ET",
        "url": "/fbs/2012/10/13/toledo-eastern-mich",
        "location": "RynearsonStadiumYpsilantiMichigan"
      }
    },
    {
      "game": {
        "away": {
          "names": {
            "short": "SouthernMethodist",
            "standard": "SouthernMethodist"
          },
          "score": "26"
        },
        "gameState": "final",
        "home": {
          "names": {
            "short": "Tulane",
            "standard": "Tulane"
          },
          "score": "27"
        },
        "startDate": "10-13-2012",
        "startTime": "12:00PM ET",
        "url": "/fbs/2012/10/13/smu-tulane",
        "location": "MercedesBenzSuperdomeNewOrleansLouisiana"
      }
    },
    {
      "game": {
        "away": {
          "names": {
            "short": "Temple",
            "standard": "Temple"
          },
          "score": "17"
        },
        "gameState": "final",
        "home": {
          "names": {
            "short": "Connecticut",
            "standard": "Connecticut"
          },
          "score": "14"
        },
        "startDate": "10-13-2012",
        "startTime": "12:00PM ET",
        "url": "/fbs/2012/10/13/temple-connecticut",
        "location": "RentschlerFieldEastHartfordConnecticut"
      }
    },
    {
      "game": {
        "away": {
          "names": {
            "short": "Akron",
            "standard": "Akron"
          },
          "score": "28"
        },
        "gameState": "final",
        "home": {
          "names": {
            "short": "Ohio",
            "standard": "Ohio"
          },
          "score": "34"
        },
        "startDate": "10-13-2012",
        "startTime": "12:00PM ET",
        "url": "/fbs/2012/10/13/akron-ohio",
        "location": "PedenStadiumAthensOhio"
      }
    },
    {
      "game": {
        "away": {
          "names": {
            "short": "NorthCarolina",
            "standard": "NorthCarolina"
          },
          "score": "18"
        },
        "gameState": "final",
        "home": {
          "names": {
            "short": "MiamiFL",
            "standard": "MiamiFL"
          },
          "score": "14"
        },
        "startDate": "10-13-2012",
        "startTime": "12:00PM ET",
        "url": "/fbs/2012/10/13/north-carolina-miami-fl",
        "location": "SunLifeStadiumMiamiGardensFlorida"
      }
    },
    {
      "game": {
        "away": {
          "names": {
            "short": "WesternMichigan",
            "standard": "WesternMichigan"
          },
          "score": "24"
        },
        "gameState": "final",
        "home": {
          "names": {
            "short": "BallState",
            "standard": "BallState"
          },
          "score": "30"
        },
        "startDate": "10-13-2012",
        "startTime": "12:00PM ET",
        "url": "/fbs/2012/10/13/western-mich-ball-st",
        "location": "ScheumannStadiumMuncieIndiana"
      }
    },
    {
      "game": {
        "away": {
          "names": {
            "short": "Nevada",
            "standard": "Nevada"
          },
          "score": "42"
        },
        "gameState": "final",
        "home": {
          "names": {
            "short": "UNLV",
            "standard": "UNLV"
          },
          "score": "37"
        },
        "startDate": "10-13-2012",
        "startTime": "12:00PM ET",
        "url": "/fbs/2012/10/13/nevada-unlv",
        "location": "SamBoydStadiumLasVegasNevada"
      }
    },
    {
      "game": {
        "away": {
          "names": {
            "short": "Utah",
            "standard": "Utah"
          },
          "score": "14"
        },
        "gameState": "final",
        "home": {
          "names": {
            "short": "UCLA",
            "standard": "UCLA"
          },
          "score": "21"
        },
        "startDate": "10-13-2012",
        "startTime": "12:00PM ET",
        "url": "/fbs/2012/10/13/utah-ucla",
        "location": "RoseBowlPasadenaCalifornia"
      }
    },
    {
      "game": {
        "away": {
          "names": {
            "short": "Maryland",
            "standard": "Maryland"
          },
          "score": "27"
        },
        "gameState": "final",
        "home": {
          "names": {
            "short": "Virginia",
            "standard": "Virginia"
          },
          "score": "20"
        },
        "startDate": "10-13-2012",
        "startTime": "12:00PM ET",
        "url": "/fbs/2012/10/13/maryland-virginia",
        "location": "DavidAHarrisonIIIFieldatScottStadiumCharlottesvilleVirginia"
      }
    },
    {
      "game": {
        "away": {
          "names": {
            "short": "Alabama",
            "standard": "Alabama"
          },
          "score": "42"
        },
        "gameState": "final",
        "home": {
          "names": {
            "short": "Missouri",
            "standard": "Missouri"
          },
          "score": "10"
        },
        "startDate": "10-13-2012",
        "startTime": "12:00PM ET",
        "url": "/fbs/2012/10/13/alabama-missouri",
        "location": "MemorialStadiumatFaurotFieldColumbiaMissouri"
      }
    },
    {
      "game": {
        "away": {
          "names": {
            "short": "Buffalo",
            "standard": "Buffalo"
          },
          "score": "3"
        },
        "gameState": "final",
        "home": {
          "names": {
            "short": "NorthernIllinois",
            "standard": "NorthernIllinois"
          },
          "score": "45"
        },
        "startDate": "10-13-2012",
        "startTime": "12:00PM ET",
        "url": "/fbs/2012/10/13/buffalo-northern-ill",
        "location": "BrighamFieldatHuskieStadiumDeKalbIllinois"
      }
    },
    {
      "game": {
        "away": {
          "names": {
            "short": "FresnoState",
            "standard": "FresnoState"
          },
          "score": "10"
        },
        "gameState": "final",
        "home": {
          "names": {
            "short": "BoiseState",
            "standard": "BoiseState"
          },
          "score": "20"
        },
        "startDate": "10-13-2012",
        "startTime": "12:00PM ET",
        "url": "/fbs/2012/10/13/fresno-st-boise-st",
        "location": "BroncoStadiumBoiseIdaho"
      }
    },
    {
      "game": {
        "away": {
          "names": {
            "short": "WestVirginia",
            "standard": "WestVirginia"
          },
          "score": "14"
        },
        "gameState": "final",
        "home": {
          "names": {
            "short": "TexasTech",
            "standard": "TexasTech"
          },
          "score": "49"
        },
        "startDate": "10-13-2012",
        "startTime": "12:00PM ET",
        "url": "/fbs/2012/10/13/west-virginia-texas-tech",
        "location": "JonesATTStadiumLubbockTexas"
      }
    },
    {
      "game": {
        "away": {
          "names": {
            "short": "Illinois",
            "standard": "Illinois"
          },
          "score": "0"
        },
        "gameState": "final",
        "home": {
          "names": {
            "short": "Michigan",
            "standard": "Michigan"
          },
          "score": "45"
        },
        "startDate": "10-13-2012",
        "startTime": "12:00PM ET",
        "url": "/fbs/2012/10/13/illinois-michigan",
        "location": "MichiganStadiumAnnArborMichigan"
      }
    },
    {
      "game": {
        "away": {
          "names": {
            "short": "MiamiOH",
            "standard": "MiamiOH"
          },
          "score": "12"
        },
        "gameState": "final",
        "home": {
          "names": {
            "short": "BowlingGreen",
            "standard": "BowlingGreen"
          },
          "score": "37"
        },
        "startDate": "10-13-2012",
        "startTime": "12:00PM ET",
        "url": "/fbs/2012/10/13/miami-oh-bowling-green",
        "location": "DoytLPerryStadiumBowlingGreenOhio"
      }
    },
    {
      "game": {
        "away": {
          "names": {
            "short": "OklahomaState",
            "standard": "OklahomaState"
          },
          "score": "20"
        },
        "gameState": "final",
        "home": {
          "names": {
            "short": "Kansas",
            "standard": "Kansas"
          },
          "score": "14"
        },
        "startDate": "10-13-2012",
        "startTime": "12:00PM ET",
        "url": "/fbs/2012/10/13/oklahoma-st-kansas",
        "location": "MemorialStadiumLawrenceKansas"
      }
    },
    {
      "game": {
        "away": {
          "names": {
            "short": "OregonState",
            "standard": "OregonState"
          },
          "score": "42"
        },
        "gameState": "final",
        "home": {
          "names": {
            "short": "BrighamYoung",
            "standard": "BrighamYoung"
          },
          "score": "24"
        },
        "startDate": "10-13-2012",
        "startTime": "12:00PM ET",
        "url": "/fbs/2012/10/13/oregon-st-byu",
        "location": "LaVellEdwardsStadiumProvoUtah"
      }
    },
    {
      "game": {
        "away": {
          "names": {
            "short": "Stanford",
            "standard": "Stanford"
          },
          "score": "13"
        },
        "gameState": "final",
        "home": {
          "names": {
            "short": "NotreDame",
            "standard": "NotreDame"
          },
          "score": "20"
        },
        "startDate": "10-13-2012",
        "startTime": "12:00PM ET",
        "url": "/fbs/2012/10/13/stanford-notre-dame",
        "location": "NotreDameStadiumSouthBendIndiana"
      }
    },
    {
      "game": {
        "away": {
          "names": {
            "short": "UTSA",
            "standard": "UTSA"
          },
          "score": "14"
        },
        "gameState": "final",
        "home": {
          "names": {
            "short": "Rice",
            "standard": "Rice"
          },
          "score": "34"
        },
        "startDate": "10-13-2012",
        "startTime": "12:00PM ET",
        "url": "/fbs/2012/10/13/utsa-rice",
        "location": "RiceStadiumHoustonTexas"
      }
    },
    {
      "game": {
        "away": {
          "names": {
            "short": "UtahState",
            "standard": "UtahState"
          },
          "score": "49"
        },
        "gameState": "final",
        "home": {
          "names": {
            "short": "SanJoseState",
            "standard": "SanJoseState"
          },
          "score": "27"
        },
        "startDate": "10-13-2012",
        "startTime": "12:00PM ET",
        "url": "/fbs/2012/10/13/utah-st-san-jose-st",
        "location": "SpartanStadiumSanJoseCalifornia"
      }
    },
    {
      "game": {
        "away": {
          "names": {
            "short": "Memphis",
            "standard": "Memphis"
          },
          "score": "7"
        },
        "gameState": "final",
        "home": {
          "names": {
            "short": "EastCarolina",
            "standard": "EastCarolina"
          },
          "score": "41"
        },
        "startDate": "10-13-2012",
        "startTime": "12:00PM ET",
        "url": "/fbs/2012/10/13/memphis-east-carolina",
        "location": "DowdyFicklenStadiumGreenvilleNorthCarolina"
      }
    },
    {
      "game": {
        "away": {
          "names": {
            "short": "BostonCollege",
            "standard": "BostonCollege"
          },
          "score": "7"
        },
        "gameState": "final",
        "home": {
          "names": {
            "short": "FloridaState",
            "standard": "FloridaState"
          },
          "score": "51"
        },
        "startDate": "10-13-2012",
        "startTime": "12:00PM ET",
        "url": "/fbs/2012/10/13/boston-college-florida-st",
        "location": "BobbyBowdenFieldatDoakCampbellStadiumTallahasseeFlorida"
      }
    },
    {
      "game": {
        "away": {
          "names": {
            "short": "MiddleTennessee",
            "standard": "MiddleTennessee"
          },
          "score": "34"
        },
        "gameState": "final",
        "home": {
          "names": {
            "short": "FloridaInternational",
            "standard": "FloridaInternational"
          },
          "score": "30"
        },
        "startDate": "10-13-2012",
        "startTime": "12:00PM ET",
        "url": "/fbs/2012/10/13/middle-tenn-fiu",
        "location": "FIUStadiumMiamiFlorida"
      }
    },
    {
      "game": {
        "away": {
          "names": {
            "short": "Florida",
            "standard": "Florida"
          },
          "score": "31"
        },
        "gameState": "final",
        "home": {
          "names": {
            "short": "Vanderbilt",
            "standard": "Vanderbilt"
          },
          "score": "17"
        },
        "startDate": "10-13-2012",
        "startTime": "12:00PM ET",
        "url": "/fbs/2012/10/13/florida-vanderbilt",
        "location": "VanderbiltStadiumNashvilleTennessee"
      }
    },
    {
      "game": {
        "away": {
          "names": {
            "short": "ColoradoState",
            "standard": "ColoradoState"
          },
          "score": "14"
        },
        "gameState": "final",
        "home": {
          "names": {
            "short": "SanDiegoState",
            "standard": "SanDiegoState"
          },
          "score": "38"
        },
        "startDate": "10-13-2012",
        "startTime": "12:00PM ET",
        "url": "/fbs/2012/10/13/colorado-st-san-diego-st",
        "location": "QualcommStadiumSanDiegoCalifornia"
      }
    },
    {
      "game": {
        "away": {
          "names": {
            "short": "AirForce",
            "standard": "AirForce"
          },
          "score": "28"
        },
        "gameState": "final",
        "home": {
          "names": {
            "short": "Wyoming",
            "standard": "Wyoming"
          },
          "score": "27"
        },
        "startDate": "10-13-2012",
        "startTime": "12:00PM ET",
        "url": "/fbs/2012/10/13/air-force-wyoming",
        "location": "JonahFieldatWarMemorialStadiumLaramieWyoming"
      }
    },
    {
      "game": {
        "away": {
          "names": {
            "short": "Idaho",
            "standard": "Idaho"
          },
          "score": "7"
        },
        "gameState": "final",
        "home": {
          "names": {
            "short": "TexasState",
            "standard": "TexasState"
          },
          "score": "38"
        },
        "startDate": "10-13-2012",
        "startTime": "12:00PM ET",
        "url": "/fbs/2012/10/13/idaho-texas-st",
        "location": "JimWackerFieldatBobcatStadiumSanMarcosTexas"
      }
    },
    {
      "game": {
        "away": {
          "names": {
            "short": "SouthAlabama",
            "standard": "SouthAlabama"
          },
          "score": "29"
        },
        "gameState": "final",
        "home": {
          "names": {
            "short": "ArkansasState",
            "standard": "ArkansasState"
          },
          "score": "36"
        },
        "startDate": "10-13-2012",
        "startTime": "12:00PM ET",
        "url": "/fbs/2012/10/13/south-ala-arkansas-st",
        "location": "LibertyBankStadiumJonesboroArkansas"
      }
    },
    {
      "game": {
        "away": {
          "names": {
            "short": "Kentucky",
            "standard": "Kentucky"
          },
          "score": "7"
        },
        "gameState": "final",
        "home": {
          "names": {
            "short": "Arkansas",
            "standard": "Arkansas"
          },
          "score": "49"
        },
        "startDate": "10-13-2012",
        "startTime": "12:00PM ET",
        "url": "/fbs/2012/10/13/kentucky-arkansas",
        "location": "ReynoldsRazorbackStadiumFayettevilleArkansas"
      }
    },
    {
      "game": {
        "away": {
          "names": {
            "short": "USC",
            "standard": "USC"
          },
          "score": "24"
        },
        "gameState": "final",
        "home": {
          "names": {
            "short": "Washington",
            "standard": "Washington"
          },
          "score": "14"
        },
        "startDate": "10-13-2012",
        "startTime": "12:00PM ET",
        "url": "/fbs/2012/10/13/southern-california-washington",
        "location": "CenturyLinkFieldSeattleWashington"
      }
    },
    {
      "game": {
        "away": {
          "names": {
            "short": "TCU",
            "standard": "TCU"
          },
          "score": "49"
        },
        "gameState": "final",
        "home": {
          "names": {
            "short": "Baylor",
            "standard": "Baylor"
          },
          "score": "21"
        },
        "startDate": "10-13-2012",
        "startTime": "12:00PM ET",
        "url": "/fbs/2012/10/13/tcu-baylor",
        "location": "FloydCaseyStadiumWacoTexas"
      }
    },
    {
      "game": {
        "away": {
          "names": {
            "short": "Fordham",
            "standard": "Fordham"
          },
          "score": "17"
        },
        "gameState": "final",
        "home": {
          "names": {
            "short": "Cincinnati",
            "standard": "Cincinnati"
          },
          "score": "49"
        },
        "startDate": "10-13-2012",
        "startTime": "12:00PM ET",
        "url": "/fbs/2012/10/13/fordham-cincinnati",
        "location": "NippertStadiumCincinnatiOhio"
      }
    },
    {
      "game": {
        "away": {
          "names": {
            "short": "FloridaAtlantic",
            "standard": "FloridaAtlantic"
          },
          "score": "14"
        },
        "gameState": "final",
        "home": {
          "names": {
            "short": "LouisianaMonroe",
            "standard": "LouisianaMonroe"
          },
          "score": "35"
        },
        "startDate": "10-13-2012",
        "startTime": "12:00PM ET",
        "url": "/fbs/2012/10/13/fla-atlantic-la-monroe",
        "location": "JamesLMaloneStadiumMonroeLouisiana"
      }
    },
    {
      "game": {
        "away": {
          "names": {
            "short": "SouthCarolina",
            "standard": "SouthCarolina"
          },
          "score": "21"
        },
        "gameState": "final",
        "home": {
          "names": {
            "short": "LSU",
            "standard": "LSU"
          },
          "score": "23"
        },
        "startDate": "10-13-2012",
        "startTime": "12:00PM ET",
        "url": "/fbs/2012/10/13/south-carolina-lsu",
        "location": "TigerStadiumBatonRougeLouisiana"
      }
    },
    {
      "game": {
        "away": {
          "names": {
            "short": "SouthernMiss",
            "standard": "SouthernMiss"
          },
          "score": "31"
        },
        "gameState": "final",
        "home": {
          "names": {
            "short": "UCF",
            "standard": "UCF"
          },
          "score": "38"
        },
        "startDate": "10-13-2012",
        "startTime": "12:00PM ET",
        "url": "/fbs/2012/10/13/southern-miss-ucf",
        "location": "BrightHouseNetworksStadiumOrlandoFlorida"
      }
    },
    {
      "game": {
        "away": {
          "names": {
            "short": "OhioState",
            "standard": "OhioState"
          },
          "score": "52"
        },
        "gameState": "final",
        "home": {
          "names": {
            "short": "Indiana",
            "standard": "Indiana"
          },
          "score": "49"
        },
        "startDate": "10-13-2012",
        "startTime": "12:00PM ET",
        "url": "/fbs/2012/10/13/ohio-st-indiana",
        "location": "MemorialStadiumBloomingtonIndiana"
      }
    },
    {
      "game": {
        "away": {
          "names": {
            "short": "Tennessee",
            "standard": "Tennessee"
          },
          "score": "31"
        },
        "gameState": "final",
        "home": {
          "names": {
            "short": "MississippiState",
            "standard": "MississippiState"
          },
          "score": "41"
        },
        "startDate": "10-13-2012",
        "startTime": "12:00PM ET",
        "url": "/fbs/2012/10/13/tennessee-mississippi-st",
        "location": "DavisWadeStadiumatScottFieldStarkvilleMississippi"
      }
    },
    {
      "game": {
        "away": {
          "names": {
            "short": "TexasAM",
            "standard": "TexasAM"
          },
          "score": "59"
        },
        "gameState": "final",
        "home": {
          "names": {
            "short": "LouisianaTech",
            "standard": "LouisianaTech"
          },
          "score": "57"
        },
        "startDate": "10-13-2012",
        "startTime": "12:00PM ET",
        "url": "/fbs/2012/10/13/texas-am-louisiana-tech",
        "location": "IndependenceStadiumShreveportLouisiana"
      }
    },
    {
      "game": {
        "away": {
          "names": {
            "short": "California",
            "standard": "California"
          },
          "score": "31"
        },
        "gameState": "final",
        "home": {
          "names": {
            "short": "WashingtonState",
            "standard": "WashingtonState"
          },
          "score": "17"
        },
        "startDate": "10-13-2012",
        "startTime": "12:00PM ET",
        "url": "/fbs/2012/10/13/california-washington-st",
        "location": "ClarenceDMartinStadiumPullmanWashington"
      }
    },
    {
      "game": {
        "away": {
          "names": {
            "short": "NewMexico",
            "standard": "NewMexico"
          },
          "score": "35"
        },
        "gameState": "final",
        "home": {
          "names": {
            "short": "Hawaii",
            "standard": "Hawaii"
          },
          "score": "23"
        },
        "startDate": "10-13-2012",
        "startTime": "12:00PM ET",
        "url": "/fbs/2012/10/13/new-mexico-hawaii",
        "location": "AlohaStadiumHonoluluHawaii"
      }
    }
  ]
}