{
  "Army vs Navy": {
    "stadium": "FCS-FCS-FCS",
    "Army": {
      "points": 13,
      "1st downs": 11,
      "rushing 1st downs": 5,
      "passing 1st downs": 5,
      "penalty 1st downs": 1,
      "rushing yards": 124,
      "rushing attempts": 33,
      "passing yards": 108,
      "passing attempts": 16,
      "passing completions": 7,
      "passing interceptions": 0,
      "total yards": 232,
      "total plays": 49,
      "fumbles": 0,
      "fumbles lost": 0,
      "penalties": 2,
      "penalty yards": 10,
      "punts": 5,
      "punt yards": 216,
      "punt returns": 2,
      "punt return yards": 9,
      "kickoff returns": 0,
      "kickoff return yards": 0,
      "interception returns": 0,
      "interception return yards": 0,
      "3rd down conversions": 4,
      "3rd down attempts": 12,
      "4th down conversions": 0,
      "4th down attempts": 1
    },
    "Navy": {
      "points": 17,
      "1st downs": 13,
      "rushing 1st downs": 10,
      "passing 1st downs": 3,
      "penalty 1st downs": 0,
      "rushing yards": 196,
      "rushing attempts": 52,
      "passing yards": 82,
      "passing attempts": 6,
      "passing completions": 4,
      "passing interceptions": 0,
      "total yards": 278,
      "total plays": 58,
      "fumbles": 0,
      "fumbles lost": 0,
      "penalties": 5,
      "penalty yards": 40,
      "punts": 4,
      "punt yards": 163,
      "punt returns": 2,
      "punt return yards": 22,
      "kickoff returns": 4,
      "kickoff return yards": 54,
      "interception returns": 0,
      "interception return yards": 0,
      "3rd down conversions": 6,
      "3rd down attempts": 15,
      "4th down conversions": 2,
      "4th down attempts": 2
    }
  }
}