{
  "inputMD5Sum": "294321a51ecf43a78c7f5f51b5279a55",
  "updated_at": "12-01-2021 22:15:43",
  "games": [
    {"game": {
      "gameID": "353890",
      "away": {
        "score": "42",
        "names": {
          "char6": "W MICH",
          "short": "Western Mich.",
          "seo": "western-mich",
          "full": "Western Michigan University"
        },
        "winner": true,
        "seed": "",
        "description": "(7-5)",
        "rank": "",
        "conferences": [{
          "conferenceName": "MAC",
          "conferenceSeo": "mac"
        }]
      },
      "finalMessage": "FINAL",
      "bracketRound": "",
      "title": "Northern Ill. Western Mich.",
      "url": "/game/5851468",
      "network": "",
      "home": {
        "score": "21",
        "names": {
          "char6": "NIU",
          "short": "Northern Ill.",
          "seo": "northern-ill",
          "full": "Northern Illinois University"
        },
        "winner": false,
        "seed": "",
        "description": "(8-4)",
        "rank": "",
        "conferences": [{
          "conferenceName": "MAC",
          "conferenceSeo": "mac"
        }]
      },
      "liveVideoEnabled": false,
      "startTime": "07:00PM ET",
      "startTimeEpoch": "1637712000",
      "bracketId": "",
      "gameState": "final",
      "startDate": "11-23-2021",
      "currentPeriod": "FINAL",
      "videoState": "",
      "bracketRegion": "",
      "contestClock": "0:00"
    }},
    {"game": {
      "gameID": "353850",
      "away": {
        "score": "3",
        "names": {
          "char6": "BUFF",
          "short": "Buffalo",
          "seo": "buffalo",
          "full": "University at Buffalo, the State University of New York"
        },
        "winner": false,
        "seed": "",
        "description": "(4-8)",
        "rank": "",
        "conferences": [{
          "conferenceName": "MAC",
          "conferenceSeo": "mac"
        }]
      },
      "finalMessage": "FINAL",
      "bracketRound": "",
      "title": "Ball St. Buffalo",
      "url": "/game/5851469",
      "network": "",
      "home": {
        "score": "20",
        "names": {
          "char6": "BALLST",
          "short": "Ball St.",
          "seo": "ball-st",
          "full": "Ball State University"
        },
        "winner": true,
        "seed": "",
        "description": "(6-6)",
        "rank": "",
        "conferences": [{
          "conferenceName": "MAC",
          "conferenceSeo": "mac"
        }]
      },
      "liveVideoEnabled": false,
      "startTime": "07:00PM ET",
      "startTimeEpoch": "1637712000",
      "bracketId": "",
      "gameState": "final",
      "startDate": "11-23-2021",
      "currentPeriod": "FINAL",
      "videoState": "",
      "bracketRegion": "",
      "contestClock": "0:00"
    }},
    {"game": {
      "gameID": "353444",
      "away": {
        "score": "40",
        "names": {
          "char6": "FRESNO",
          "short": "Fresno St.",
          "seo": "fresno-st",
          "full": "California State University, Fresno"
        },
        "winner": true,
        "seed": "",
        "description": "(9-3)",
        "rank": "",
        "conferences": [{
          "conferenceName": "Mountain West",
          "conferenceSeo": "mountain-west"
        }]
      },
      "finalMessage": "FINAL",
      "bracketRound": "",
      "title": "San Jose St. Fresno St.",
      "url": "/game/5851470",
      "network": "",
      "home": {
        "score": "9",
        "names": {
          "char6": "SJSU",
          "short": "San Jose St.",
          "seo": "san-jose-st",
          "full": "San Jose State University"
        },
        "winner": false,
        "seed": "",
        "description": "(5-7)",
        "rank": "",
        "conferences": [{
          "conferenceName": "Mountain West",
          "conferenceSeo": "mountain-west"
        }]
      },
      "liveVideoEnabled": false,
      "startTime": "03:30PM ET",
      "startTimeEpoch": "1637872200",
      "bracketId": "",
      "gameState": "final",
      "startDate": "11-25-2021",
      "currentPeriod": "FINAL",
      "videoState": "",
      "bracketRegion": "",
      "contestClock": "0:00"
    }},
    {"game": {
      "gameID": "352480",
      "away": {
        "score": "31",
        "names": {
          "char6": "MISS",
          "short": "Ole Miss",
          "seo": "ole-miss",
          "full": "University of Mississippi"
        },
        "winner": true,
        "seed": "",
        "description": "(10-2)",
        "rank": "9",
        "conferences": [
          {
            "conferenceName": "SEC",
            "conferenceSeo": "sec"
          },
          {
            "conferenceName": "Top 25",
            "conferenceSeo": "top-25"
          }
        ]
      },
      "finalMessage": "FINAL",
      "bracketRound": "",
      "title": "Mississippi St. Ole Miss",
      "url": "/game/5851471",
      "network": "",
      "home": {
        "score": "21",
        "names": {
          "char6": "MISSST",
          "short": "Mississippi St.",
          "seo": "mississippi-st",
          "full": "Mississippi State University"
        },
        "winner": false,
        "seed": "",
        "description": "(7-5)",
        "rank": "",
        "conferences": [{
          "conferenceName": "SEC",
          "conferenceSeo": "sec"
        }]
      },
      "liveVideoEnabled": false,
      "startTime": "07:30PM ET",
      "startTimeEpoch": "1637886600",
      "bracketId": "",
      "gameState": "final",
      "startDate": "11-25-2021",
      "currentPeriod": "FINAL",
      "videoState": "",
      "bracketRegion": "",
      "contestClock": "0:00"
    }},
    {"game": {
      "gameID": "353417",
      "away": {
        "score": "16",
        "names": {
          "char6": "BOISE",
          "short": "Boise St.",
          "seo": "boise-st",
          "full": "Boise State University"
        },
        "winner": false,
        "seed": "",
        "description": "(7-5)",
        "rank": "",
        "conferences": [{
          "conferenceName": "Mountain West",
          "conferenceSeo": "mountain-west"
        }]
      },
      "finalMessage": "FINAL",
      "bracketRound": "",
      "title": "San Diego St. Boise St.",
      "url": "/game/5851480",
      "network": "",
      "home": {
        "score": "27",
        "names": {
          "char6": "SDSU",
          "short": "San Diego St.",
          "seo": "san-diego-st",
          "full": "San Diego State University"
        },
        "winner": true,
        "seed": "",
        "description": "(11-1)",
        "rank": "21",
        "conferences": [
          {
            "conferenceName": "Mountain West",
            "conferenceSeo": "mountain-west"
          },
          {
            "conferenceName": "Top 25",
            "conferenceSeo": "top-25"
          }
        ]
      },
      "liveVideoEnabled": false,
      "startTime": "12:00PM ET",
      "startTimeEpoch": "1637946000",
      "bracketId": "",
      "gameState": "final",
      "startDate": "11-26-2021",
      "currentPeriod": "FINAL",
      "videoState": "",
      "bracketRegion": "",
      "contestClock": "0:00"
    }},
    {"game": {
      "gameID": "353543",
      "away": {
        "score": "17",
        "names": {
          "char6": "KAN ST",
          "short": "Kansas St.",
          "seo": "kansas-st",
          "full": "Kansas State University"
        },
        "winner": false,
        "seed": "",
        "description": "(7-5)",
        "rank": "",
        "conferences": [{
          "conferenceName": "Big 12",
          "conferenceSeo": "big-12"
        }]
      },
      "finalMessage": "FINAL",
      "bracketRound": "",
      "title": "Texas Kansas St.",
      "url": "/game/5851482",
      "network": "",
      "home": {
        "score": "22",
        "names": {
          "char6": "TEXAS",
          "short": "Texas",
          "seo": "texas",
          "full": "University of Texas at Austin"
        },
        "winner": true,
        "seed": "",
        "description": "(5-7)",
        "rank": "",
        "conferences": [{
          "conferenceName": "Big 12",
          "conferenceSeo": "big-12"
        }]
      },
      "liveVideoEnabled": false,
      "startTime": "12:00PM ET",
      "startTimeEpoch": "1637946000",
      "bracketId": "",
      "gameState": "final",
      "startDate": "11-26-2021",
      "currentPeriod": "FINAL",
      "videoState": "",
      "bracketRegion": "",
      "contestClock": "0:00"
    }},
    {"game": {
      "gameID": "353862",
      "away": {
        "score": "10",
        "names": {
          "char6": "E MICH",
          "short": "Eastern Mich.",
          "seo": "eastern-mich",
          "full": "Eastern Michigan University"
        },
        "winner": false,
        "seed": "",
        "description": "(7-5)",
        "rank": "",
        "conferences": [{
          "conferenceName": "MAC",
          "conferenceSeo": "mac"
        }]
      },
      "finalMessage": "FINAL",
      "bracketRound": "",
      "title": "Central Mich. Eastern Mich.",
      "url": "/game/5851483",
      "network": "",
      "home": {
        "score": "31",
        "names": {
          "char6": "C MICH",
          "short": "Central Mich.",
          "seo": "central-mich",
          "full": "Central Michigan University"
        },
        "winner": true,
        "seed": "",
        "description": "(8-4)",
        "rank": "",
        "conferences": [{
          "conferenceName": "MAC",
          "conferenceSeo": "mac"
        }]
      },
      "liveVideoEnabled": false,
      "startTime": "12:00PM ET",
      "startTimeEpoch": "1637946000",
      "bracketId": "",
      "gameState": "final",
      "startDate": "11-26-2021",
      "currentPeriod": "FINAL",
      "videoState": "",
      "bracketRegion": "",
      "contestClock": "0:00"
    }},
    {"game": {
      "gameID": "353856",
      "away": {
        "score": "10",
        "names": {
          "char6": "OHIO",
          "short": "Ohio",
          "seo": "ohio",
          "full": "Ohio University"
        },
        "winner": false,
        "seed": "",
        "description": "(3-9)",
        "rank": "",
        "conferences": [{
          "conferenceName": "MAC",
          "conferenceSeo": "mac"
        }]
      },
      "finalMessage": "FINAL",
      "bracketRound": "",
      "title": "Bowling Green Ohio",
      "url": "/game/5851484",
      "network": "",
      "home": {
        "score": "21",
        "names": {
          "char6": "BGSU",
          "short": "Bowling Green",
          "seo": "bowling-green",
          "full": "Bowling Green State University"
        },
        "winner": true,
        "seed": "",
        "description": "(4-8)",
        "rank": "",
        "conferences": [{
          "conferenceName": "MAC",
          "conferenceSeo": "mac"
        }]
      },
      "liveVideoEnabled": false,
      "startTime": "12:00PM ET",
      "startTimeEpoch": "1637946000",
      "bracketId": "",
      "gameState": "final",
      "startDate": "11-26-2021",
      "currentPeriod": "FINAL",
      "videoState": "",
      "bracketRegion": "",
      "contestClock": "0:00"
    }},
    {"game": {
      "gameID": "353176",
      "away": {
        "score": "35",
        "names": {
          "char6": "UT ST",
          "short": "Utah St.",
          "seo": "utah-st",
          "full": "Utah State University"
        },
        "winner": true,
        "seed": "",
        "description": "(9-3)",
        "rank": "",
        "conferences": [{
          "conferenceName": "Mountain West",
          "conferenceSeo": "mountain-west"
        }]
      },
      "finalMessage": "FINAL",
      "bracketRound": "",
      "title": "New Mexico Utah St.",
      "url": "/game/5851481",
      "network": "",
      "home": {
        "score": "10",
        "names": {
          "char6": "N MEX",
          "short": "New Mexico",
          "seo": "new-mexico",
          "full": "University of New Mexico"
        },
        "winner": false,
        "seed": "",
        "description": "(3-9)",
        "rank": "",
        "conferences": [{
          "conferenceName": "Mountain West",
          "conferenceSeo": "mountain-west"
        }]
      },
      "liveVideoEnabled": false,
      "startTime": "01:00PM ET",
      "startTimeEpoch": "1637949600",
      "bracketId": "",
      "gameState": "final",
      "startDate": "11-26-2021",
      "currentPeriod": "FINAL",
      "videoState": "",
      "bracketRegion": "",
      "contestClock": "0:00"
    }},
    {"game": {
      "gameID": "353170",
      "away": {
        "score": "28",
        "names": {
          "char6": "IOWA",
          "short": "Iowa",
          "seo": "iowa",
          "full": "University of Iowa"
        },
        "winner": true,
        "seed": "",
        "description": "(10-2)",
        "rank": "16",
        "conferences": [
          {
            "conferenceName": "Big Ten",
            "conferenceSeo": "big-ten"
          },
          {
            "conferenceName": "Top 25",
            "conferenceSeo": "top-25"
          }
        ]
      },
      "finalMessage": "FINAL",
      "bracketRound": "",
      "title": "Nebraska Iowa",
      "url": "/game/5851485",
      "network": "",
      "home": {
        "score": "21",
        "names": {
          "char6": "NEB",
          "short": "Nebraska",
          "seo": "nebraska",
          "full": "University of Nebraska, Lincoln"
        },
        "winner": false,
        "seed": "",
        "description": "(3-9)",
        "rank": "",
        "conferences": [{
          "conferenceName": "Big Ten",
          "conferenceSeo": "big-ten"
        }]
      },
      "liveVideoEnabled": false,
      "startTime": "01:30PM ET",
      "startTimeEpoch": "1637951400",
      "bracketId": "",
      "gameState": "final",
      "startDate": "11-26-2021",
      "currentPeriod": "FINAL",
      "videoState": "",
      "bracketRegion": "",
      "contestClock": "0:00"
    }},
    {"game": {
      "gameID": "352450",
      "away": {
        "score": "25",
        "names": {
          "char6": "UTEP",
          "short": "UTEP",
          "seo": "utep",
          "full": "University of Texas at El Paso"
        },
        "winner": false,
        "seed": "",
        "description": "(7-5)",
        "rank": "",
        "conferences": [{
          "conferenceName": "C-USA",
          "conferenceSeo": "c-usa"
        }]
      },
      "finalMessage": "FINAL",
      "bracketRound": "",
      "title": "UAB UTEP",
      "url": "/game/5851511",
      "network": "",
      "home": {
        "score": "42",
        "names": {
          "char6": "UAB",
          "short": "UAB",
          "seo": "uab",
          "full": "University of Alabama at Birmingham"
        },
        "winner": true,
        "seed": "",
        "description": "(8-4)",
        "rank": "",
        "conferences": [{
          "conferenceName": "C-USA",
          "conferenceSeo": "c-usa"
        }]
      },
      "liveVideoEnabled": false,
      "startTime": "02:00PM ET",
      "startTimeEpoch": "1637953200",
      "bracketId": "",
      "gameState": "final",
      "startDate": "11-26-2021",
      "currentPeriod": "FINAL",
      "videoState": "",
      "bracketRegion": "",
      "contestClock": "0:00"
    }},
    {"game": {
      "gameID": "352742",
      "away": {
        "score": "35",
        "names": {
          "char6": "CINCY",
          "short": "Cincinnati",
          "seo": "cincinnati",
          "full": "University of Cincinnati"
        },
        "winner": true,
        "seed": "",
        "description": "(12-0)",
        "rank": "4",
        "conferences": [
          {
            "conferenceName": "AAC",
            "conferenceSeo": "aac"
          },
          {
            "conferenceName": "Top 25",
            "conferenceSeo": "top-25"
          }
        ]
      },
      "finalMessage": "FINAL",
      "bracketRound": "",
      "title": "East Carolina Cincinnati",
      "url": "/game/5851473",
      "network": "",
      "home": {
        "score": "13",
        "names": {
          "char6": "E CAR",
          "short": "East Carolina",
          "seo": "east-carolina",
          "full": "East Carolina University"
        },
        "winner": false,
        "seed": "",
        "description": "(7-5)",
        "rank": "",
        "conferences": [{
          "conferenceName": "AAC",
          "conferenceSeo": "aac"
        }]
      },
      "liveVideoEnabled": false,
      "startTime": "03:30PM ET",
      "startTimeEpoch": "1637958600",
      "bracketId": "",
      "gameState": "final",
      "startDate": "11-26-2021",
      "currentPeriod": "FINAL",
      "videoState": "",
      "bracketRegion": "",
      "contestClock": "2:32"
    }},
    {"game": {
      "gameID": "353642",
      "away": {
        "score": "13",
        "names": {
          "char6": "USF",
          "short": "South Fla.",
          "seo": "south-fla",
          "full": "University of South Florida"
        },
        "winner": false,
        "seed": "",
        "description": "(2-10)",
        "rank": "",
        "conferences": [{
          "conferenceName": "AAC",
          "conferenceSeo": "aac"
        }]
      },
      "finalMessage": "FINAL",
      "bracketRound": "",
      "title": "UCF South Fla.",
      "url": "/game/5851475",
      "network": "",
      "home": {
        "score": "17",
        "names": {
          "char6": "UCF",
          "short": "UCF",
          "seo": "ucf",
          "full": "University of Central Florida"
        },
        "winner": true,
        "seed": "",
        "description": "(8-4)",
        "rank": "",
        "conferences": [{
          "conferenceName": "AAC",
          "conferenceSeo": "aac"
        }]
      },
      "liveVideoEnabled": false,
      "startTime": "03:30PM ET",
      "startTimeEpoch": "1637958600",
      "bracketId": "",
      "gameState": "final",
      "startDate": "11-26-2021",
      "currentPeriod": "FINAL",
      "videoState": "",
      "bracketRegion": "",
      "contestClock": "0:00"
    }},
    {"game": {
      "gameID": "353381",
      "away": {
        "score": "27",
        "names": {
          "char6": "CO CAR",
          "short": "Coastal Carolina",
          "seo": "coastal-caro",
          "full": "Coastal Carolina University"
        },
        "winner": true,
        "seed": "",
        "description": "(10-2)",
        "rank": "",
        "conferences": [{
          "conferenceName": "Sun Belt",
          "conferenceSeo": "sun-belt"
        }]
      },
      "finalMessage": "FINAL (OT)",
      "bracketRound": "",
      "title": "South Alabama Coastal Carolina",
      "url": "/game/5851479",
      "network": "",
      "home": {
        "score": "21",
        "names": {
          "char6": "S ALA",
          "short": "South Alabama",
          "seo": "south-ala",
          "full": "University of South Alabama"
        },
        "winner": false,
        "seed": "",
        "description": "(5-7)",
        "rank": "",
        "conferences": [{
          "conferenceName": "Sun Belt",
          "conferenceSeo": "sun-belt"
        }]
      },
      "liveVideoEnabled": false,
      "startTime": "03:30PM ET",
      "startTimeEpoch": "1637958600",
      "bracketId": "",
      "gameState": "final",
      "startDate": "11-26-2021",
      "currentPeriod": "FINAL (OT)",
      "videoState": "",
      "bracketRegion": "",
      "contestClock": ""
    }},
    {"game": {
      "gameID": "352423",
      "away": {
        "score": "14",
        "names": {
          "char6": "UNLV",
          "short": "UNLV",
          "seo": "unlv",
          "full": "University of Nevada, Las Vegas"
        },
        "winner": false,
        "seed": "",
        "description": "(2-10)",
        "rank": "",
        "conferences": [{
          "conferenceName": "Mountain West",
          "conferenceSeo": "mountain-west"
        }]
      },
      "finalMessage": "FINAL",
      "bracketRound": "",
      "title": "Air Force UNLV",
      "url": "/game/5851486",
      "network": "",
      "home": {
        "score": "48",
        "names": {
          "char6": "AIRFOR",
          "short": "Air Force",
          "seo": "air-force",
          "full": "U.S. Air Force Academy"
        },
        "winner": true,
        "seed": "",
        "description": "(9-3)",
        "rank": "",
        "conferences": [{
          "conferenceName": "Mountain West",
          "conferenceSeo": "mountain-west"
        }]
      },
      "liveVideoEnabled": false,
      "startTime": "03:30PM ET",
      "startTimeEpoch": "1637958600",
      "bracketId": "",
      "gameState": "final",
      "startDate": "11-26-2021",
      "currentPeriod": "FINAL",
      "videoState": "",
      "bracketRegion": "",
      "contestClock": "0:00"
    }},
    {"game": {
      "gameID": "352582",
      "away": {
        "score": "17",
        "names": {
          "char6": "MIZZOU",
          "short": "Missouri",
          "seo": "missouri",
          "full": "University of Missouri, Columbia"
        },
        "winner": false,
        "seed": "",
        "description": "(6-6)",
        "rank": "",
        "conferences": [{
          "conferenceName": "SEC",
          "conferenceSeo": "sec"
        }]
      },
      "finalMessage": "FINAL",
      "bracketRound": "",
      "title": "Arkansas Missouri",
      "url": "/game/5851487",
      "network": "",
      "home": {
        "score": "34",
        "names": {
          "char6": "ARK",
          "short": "Arkansas",
          "seo": "arkansas",
          "full": "University of Arkansas, Fayetteville"
        },
        "winner": true,
        "seed": "",
        "description": "(8-4)",
        "rank": "25",
        "conferences": [
          {
            "conferenceName": "SEC",
            "conferenceSeo": "sec"
          },
          {
            "conferenceName": "Top 25",
            "conferenceSeo": "top-25"
          }
        ]
      },
      "liveVideoEnabled": false,
      "startTime": "03:30PM ET",
      "startTimeEpoch": "1637958600",
      "bracketId": "",
      "gameState": "final",
      "startDate": "11-26-2021",
      "currentPeriod": "FINAL",
      "videoState": "",
      "bracketRegion": "",
      "contestClock": "0:00"
    }},
    {"game": {
      "gameID": "353697",
      "away": {
        "score": "13",
        "names": {
          "char6": "COLO",
          "short": "Colorado",
          "seo": "colorado",
          "full": "University of Colorado, Boulder"
        },
        "winner": false,
        "seed": "",
        "description": "(4-8)",
        "rank": "",
        "conferences": [{
          "conferenceName": "Pac-12",
          "conferenceSeo": "pac-12"
        }]
      },
      "finalMessage": "FINAL",
      "bracketRound": "",
      "title": "Utah Colorado",
      "url": "/game/5851477",
      "network": "",
      "home": {
        "score": "28",
        "names": {
          "char6": "UTAH",
          "short": "Utah",
          "seo": "utah",
          "full": "University of Utah"
        },
        "winner": true,
        "seed": "",
        "description": "(9-3)",
        "rank": "19",
        "conferences": [
          {
            "conferenceName": "Pac-12",
            "conferenceSeo": "pac-12"
          },
          {
            "conferenceName": "Top 25",
            "conferenceSeo": "top-25"
          }
        ]
      },
      "liveVideoEnabled": false,
      "startTime": "04:00PM ET",
      "startTimeEpoch": "1637960400",
      "bracketId": "",
      "gameState": "final",
      "startDate": "11-26-2021",
      "currentPeriod": "FINAL",
      "videoState": "",
      "bracketRegion": "",
      "contestClock": "0:00"
    }},
    {"game": {
      "gameID": "352889",
      "away": {
        "score": "14",
        "names": {
          "char6": "TCU",
          "short": "TCU",
          "seo": "tcu",
          "full": "Texas Christian University"
        },
        "winner": false,
        "seed": "",
        "description": "(5-7)",
        "rank": "",
        "conferences": [{
          "conferenceName": "Big 12",
          "conferenceSeo": "big-12"
        }]
      },
      "finalMessage": "FINAL",
      "bracketRound": "",
      "title": "Iowa St. TCU",
      "url": "/game/5851474",
      "network": "",
      "home": {
        "score": "48",
        "names": {
          "char6": "IOWAST",
          "short": "Iowa St.",
          "seo": "iowa-st",
          "full": "Iowa State University"
        },
        "winner": true,
        "seed": "",
        "description": "(7-5)",
        "rank": "",
        "conferences": [{
          "conferenceName": "Big 12",
          "conferenceSeo": "big-12"
        }]
      },
      "liveVideoEnabled": false,
      "startTime": "04:30PM ET",
      "startTimeEpoch": "1637962200",
      "bracketId": "",
      "gameState": "final",
      "startDate": "11-26-2021",
      "currentPeriod": "FINAL",
      "videoState": "",
      "bracketRegion": "",
      "contestClock": "0:00"
    }},
    {"game": {
      "gameID": "353149",
      "away": {
        "score": "30",
        "names": {
          "char6": "UNC",
          "short": "North Carolina",
          "seo": "north-carolina",
          "full": "University of North Carolina, Chapel Hill"
        },
        "winner": false,
        "seed": "",
        "description": "(6-6)",
        "rank": "",
        "conferences": [{
          "conferenceName": "ACC",
          "conferenceSeo": "acc"
        }]
      },
      "finalMessage": "FINAL",
      "bracketRound": "",
      "title": "NC State North Carolina",
      "url": "/game/5851476",
      "network": "",
      "home": {
        "score": "34",
        "names": {
          "char6": "NC ST",
          "short": "NC State",
          "seo": "north-carolina-st",
          "full": "North Carolina State University"
        },
        "winner": true,
        "seed": "",
        "description": "(9-3)",
        "rank": "20",
        "conferences": [
          {
            "conferenceName": "ACC",
            "conferenceSeo": "acc"
          },
          {
            "conferenceName": "Top 25",
            "conferenceSeo": "top-25"
          }
        ]
      },
      "liveVideoEnabled": false,
      "startTime": "07:00PM ET",
      "startTimeEpoch": "1637971200",
      "bracketId": "",
      "gameState": "final",
      "startDate": "11-26-2021",
      "currentPeriod": "FINAL",
      "videoState": "",
      "bracketRegion": "",
      "contestClock": "0:00"
    }},
    {"game": {
      "gameID": "353769",
      "away": {
        "score": "40",
        "names": {
          "char6": "WASHST",
          "short": "Washington St.",
          "seo": "washington-st",
          "full": "Washington State University"
        },
        "winner": true,
        "seed": "",
        "description": "(7-5)",
        "rank": "",
        "conferences": [{
          "conferenceName": "Pac-12",
          "conferenceSeo": "pac-12"
        }]
      },
      "finalMessage": "FINAL",
      "bracketRound": "",
      "title": "Washington Washington St.",
      "url": "/game/5851478",
      "network": "",
      "home": {
        "score": "13",
        "names": {
          "char6": "WASH",
          "short": "Washington",
          "seo": "washington",
          "full": "University of Washington"
        },
        "winner": false,
        "seed": "",
        "description": "(4-8)",
        "rank": "",
        "conferences": [{
          "conferenceName": "Pac-12",
          "conferenceSeo": "pac-12"
        }]
      },
      "liveVideoEnabled": false,
      "startTime": "08:00PM ET",
      "startTimeEpoch": "1637974800",
      "bracketId": "",
      "gameState": "final",
      "startDate": "11-26-2021",
      "currentPeriod": "FINAL",
      "videoState": "",
      "bracketRegion": "",
      "contestClock": "0:00"
    }},
    {"game": {
      "gameID": "353571",
      "away": {
        "score": "14",
        "names": {
          "char6": "AKRON",
          "short": "Akron",
          "seo": "akron",
          "full": "University of Akron"
        },
        "winner": false,
        "seed": "",
        "description": "(2-10)",
        "rank": "",
        "conferences": [{
          "conferenceName": "MAC",
          "conferenceSeo": "mac"
        }]
      },
      "finalMessage": "FINAL",
      "bracketRound": "",
      "title": "Toledo Akron",
      "url": "/game/5851488",
      "network": "",
      "home": {
        "score": "49",
        "names": {
          "char6": "TOLEDO",
          "short": "Toledo",
          "seo": "toledo",
          "full": "University of Toledo"
        },
        "winner": true,
        "seed": "",
        "description": "(7-5)",
        "rank": "",
        "conferences": [{
          "conferenceName": "MAC",
          "conferenceSeo": "mac"
        }]
      },
      "liveVideoEnabled": false,
      "startTime": "12:00PM ET",
      "startTimeEpoch": "1638032400",
      "bracketId": "",
      "gameState": "final",
      "startDate": "11-27-2021",
      "currentPeriod": "FINAL",
      "videoState": "",
      "bracketRegion": "",
      "contestClock": "0:00"
    }},
    {"game": {
      "gameID": "353514",
      "away": {
        "score": "38",
        "names": {
          "char6": "NAVY",
          "short": "Navy",
          "seo": "navy",
          "full": "U.S. Naval Academy"
        },
        "winner": true,
        "seed": "",
        "description": "(3-8)",
        "rank": "",
        "conferences": [{
          "conferenceName": "AAC",
          "conferenceSeo": "aac"
        }]
      },
      "finalMessage": "FINAL",
      "bracketRound": "",
      "title": "Temple Navy",
      "url": "/game/5851491",
      "network": "",
      "home": {
        "score": "14",
        "names": {
          "char6": "TEMPLE",
          "short": "Temple",
          "seo": "temple",
          "full": "Temple University"
        },
        "winner": false,
        "seed": "",
        "description": "(3-9)",
        "rank": "",
        "conferences": [{
          "conferenceName": "AAC",
          "conferenceSeo": "aac"
        }]
      },
      "liveVideoEnabled": false,
      "startTime": "12:00PM ET",
      "startTimeEpoch": "1638032400",
      "bracketId": "",
      "gameState": "final",
      "startDate": "11-27-2021",
      "currentPeriod": "FINAL",
      "videoState": "",
      "bracketRegion": "",
      "contestClock": "0:00"
    }},
    {"game": {
      "gameID": "352841",
      "away": {
        "score": "45",
        "names": {
          "char6": "UGA",
          "short": "Georgia",
          "seo": "georgia",
          "full": "University of Georgia"
        },
        "winner": true,
        "seed": "",
        "description": "(12-0)",
        "rank": "1",
        "conferences": [
          {
            "conferenceName": "SEC",
            "conferenceSeo": "sec"
          },
          {
            "conferenceName": "Top 25",
            "conferenceSeo": "top-25"
          }
        ]
      },
      "finalMessage": "FINAL",
      "bracketRound": "",
      "title": "Georgia Tech Georgia",
      "url": "/game/5851494",
      "network": "",
      "home": {
        "score": "0",
        "names": {
          "char6": "GATECH",
          "short": "Georgia Tech",
          "seo": "georgia-tech",
          "full": "Georgia Institute of Technology"
        },
        "winner": false,
        "seed": "",
        "description": "(3-9)",
        "rank": "",
        "conferences": [{
          "conferenceName": "ACC",
          "conferenceSeo": "acc"
        }]
      },
      "liveVideoEnabled": false,
      "startTime": "12:00PM ET",
      "startTimeEpoch": "1638032400",
      "bracketId": "",
      "gameState": "final",
      "startDate": "11-27-2021",
      "currentPeriod": "FINAL",
      "videoState": "",
      "bracketRegion": "",
      "contestClock": "0:00"
    }},
    {"game": {
      "gameID": "352574",
      "away": {
        "score": "41",
        "names": {
          "char6": "WAKE",
          "short": "Wake Forest",
          "seo": "wake-forest",
          "full": "Wake Forest University"
        },
        "winner": true,
        "seed": "",
        "description": "(10-2)",
        "rank": "18",
        "conferences": [
          {
            "conferenceName": "ACC",
            "conferenceSeo": "acc"
          },
          {
            "conferenceName": "Top 25",
            "conferenceSeo": "top-25"
          }
        ]
      },
      "finalMessage": "FINAL",
      "bracketRound": "",
      "title": "Boston College Wake Forest",
      "url": "/game/5851496",
      "network": "",
      "home": {
        "score": "10",
        "names": {
          "char6": "BC",
          "short": "Boston College",
          "seo": "boston-college",
          "full": "Boston College"
        },
        "winner": false,
        "seed": "",
        "description": "(6-6)",
        "rank": "",
        "conferences": [{
          "conferenceName": "ACC",
          "conferenceSeo": "acc"
        }]
      },
      "liveVideoEnabled": false,
      "startTime": "12:00PM ET",
      "startTimeEpoch": "1638032400",
      "bracketId": "",
      "gameState": "final",
      "startDate": "11-27-2021",
      "currentPeriod": "FINAL",
      "videoState": "",
      "bracketRegion": "",
      "contestClock": "0:00"
    }},
    {"game": {
      "gameID": "352568",
      "away": {
        "score": "24",
        "names": {
          "char6": "TXTECH",
          "short": "Texas Tech",
          "seo": "texas-tech",
          "full": "Texas Tech University"
        },
        "winner": false,
        "seed": "",
        "description": "(6-6)",
        "rank": "",
        "conferences": [{
          "conferenceName": "Big 12",
          "conferenceSeo": "big-12"
        }]
      },
      "finalMessage": "FINAL",
      "bracketRound": "",
      "title": "Baylor Texas Tech",
      "url": "/game/5851497",
      "network": "",
      "home": {
        "score": "27",
        "names": {
          "char6": "BAYLOR",
          "short": "Baylor",
          "seo": "baylor",
          "full": "Baylor University"
        },
        "winner": true,
        "seed": "",
        "description": "(10-2)",
        "rank": "8",
        "conferences": [
          {
            "conferenceName": "Big 12",
            "conferenceSeo": "big-12"
          },
          {
            "conferenceName": "Top 25",
            "conferenceSeo": "top-25"
          }
        ]
      },
      "liveVideoEnabled": false,
      "startTime": "12:00PM ET",
      "startTimeEpoch": "1638032400",
      "bracketId": "",
      "gameState": "final",
      "startDate": "11-27-2021",
      "currentPeriod": "FINAL",
      "videoState": "",
      "bracketRegion": "",
      "contestClock": "13:45"
    }},
    {"game": {
      "gameID": "352784",
      "away": {
        "score": "21",
        "names": {
          "char6": "FSU",
          "short": "Florida St.",
          "seo": "florida-st",
          "full": "Florida State University"
        },
        "winner": false,
        "seed": "",
        "description": "(5-7)",
        "rank": "",
        "conferences": [{
          "conferenceName": "ACC",
          "conferenceSeo": "acc"
        }]
      },
      "finalMessage": "FINAL",
      "bracketRound": "",
      "title": "Florida Florida St.",
      "url": "/game/5851498",
      "network": "",
      "home": {
        "score": "24",
        "names": {
          "char6": "FLA",
          "short": "Florida",
          "seo": "florida",
          "full": "University of Florida"
        },
        "winner": true,
        "seed": "",
        "description": "(6-6)",
        "rank": "",
        "conferences": [{
          "conferenceName": "SEC",
          "conferenceSeo": "sec"
        }]
      },
      "liveVideoEnabled": false,
      "startTime": "12:00PM ET",
      "startTimeEpoch": "1638032400",
      "bracketId": "",
      "gameState": "final",
      "startDate": "11-27-2021",
      "currentPeriod": "FINAL",
      "videoState": "",
      "bracketRegion": "",
      "contestClock": "0:00"
    }},
    {"game": {
      "gameID": "353037",
      "away": {
        "score": "27",
        "names": {
          "char6": "OHIOST",
          "short": "Ohio St.",
          "seo": "ohio-st",
          "full": "The Ohio State University"
        },
        "winner": false,
        "seed": "",
        "description": "(10-2)",
        "rank": "2",
        "conferences": [
          {
            "conferenceName": "Big Ten",
            "conferenceSeo": "big-ten"
          },
          {
            "conferenceName": "Top 25",
            "conferenceSeo": "top-25"
          }
        ]
      },
      "finalMessage": "FINAL",
      "bracketRound": "",
      "title": "Michigan Ohio St.",
      "url": "/game/5851505",
      "network": "",
      "home": {
        "score": "42",
        "names": {
          "char6": "MICH",
          "short": "Michigan",
          "seo": "michigan",
          "full": "University of Michigan"
        },
        "winner": true,
        "seed": "",
        "description": "(11-1)",
        "rank": "5",
        "conferences": [
          {
            "conferenceName": "Big Ten",
            "conferenceSeo": "big-ten"
          },
          {
            "conferenceName": "Top 25",
            "conferenceSeo": "top-25"
          }
        ]
      },
      "liveVideoEnabled": false,
      "startTime": "12:00PM ET",
      "startTimeEpoch": "1638032400",
      "bracketId": "",
      "gameState": "final",
      "startDate": "11-27-2021",
      "currentPeriod": "FINAL",
      "videoState": "",
      "bracketRegion": "",
      "contestClock": "0:00"
    }},
    {"game": {
      "gameID": "353873",
      "away": {
        "score": "47",
        "names": {
          "char6": "MIA OH",
          "short": "Miami (OH)",
          "seo": "miami-oh",
          "full": "Miami University (Ohio)"
        },
        "winner": false,
        "seed": "",
        "description": "(6-6)",
        "rank": "",
        "conferences": [{
          "conferenceName": "MAC",
          "conferenceSeo": "mac"
        }]
      },
      "finalMessage": "FINAL (OT)",
      "bracketRound": "",
      "title": "Kent St. Miami (OH)",
      "url": "/game/5851510",
      "network": "",
      "home": {
        "score": "48",
        "names": {
          "char6": "KENT",
          "short": "Kent St.",
          "seo": "kent-st",
          "full": "Kent State University"
        },
        "winner": true,
        "seed": "",
        "description": "(7-5)",
        "rank": "",
        "conferences": [{
          "conferenceName": "MAC",
          "conferenceSeo": "mac"
        }]
      },
      "liveVideoEnabled": false,
      "startTime": "12:00PM ET",
      "startTimeEpoch": "1638032400",
      "bracketId": "",
      "gameState": "final",
      "startDate": "11-27-2021",
      "currentPeriod": "FINAL (OT)",
      "videoState": "",
      "bracketRegion": "",
      "contestClock": ""
    }},
    {"game": {
      "gameID": "352980",
      "away": {
        "score": "31",
        "names": {
          "char6": "ARMY",
          "short": "Army West Point",
          "seo": "army",
          "full": "U.S. Military Academy"
        },
        "winner": true,
        "seed": "",
        "description": "(8-3)",
        "rank": "",
        "conferences": [{
          "conferenceName": "FBS Independent",
          "conferenceSeo": "fbs-independent"
        }]
      },
      "finalMessage": "FINAL",
      "bracketRound": "",
      "title": "Liberty Army West Point",
      "url": "/game/5851512",
      "network": "",
      "home": {
        "score": "16",
        "names": {
          "char6": "LIBRTY",
          "short": "Liberty",
          "seo": "liberty",
          "full": "Liberty University"
        },
        "winner": false,
        "seed": "",
        "description": "(7-5)",
        "rank": "",
        "conferences": [{
          "conferenceName": "FBS Independent",
          "conferenceSeo": "fbs-independent"
        }]
      },
      "liveVideoEnabled": false,
      "startTime": "12:00PM ET",
      "startTimeEpoch": "1638032400",
      "bracketId": "",
      "gameState": "final",
      "startDate": "11-27-2021",
      "currentPeriod": "FINAL",
      "videoState": "",
      "bracketRegion": "",
      "contestClock": "0:00"
    }},
    {"game": {
      "gameID": "353373",
      "away": {
        "score": "40",
        "names": {
          "char6": "MD",
          "short": "Maryland",
          "seo": "maryland",
          "full": "University of Maryland, College Park"
        },
        "winner": true,
        "seed": "",
        "description": "(6-6)",
        "rank": "",
        "conferences": [{
          "conferenceName": "Big Ten",
          "conferenceSeo": "big-ten"
        }]
      },
      "finalMessage": "FINAL",
      "bracketRound": "",
      "title": "Rutgers Maryland",
      "url": "/game/5851521",
      "network": "",
      "home": {
        "score": "16",
        "names": {
          "char6": "RUTGER",
          "short": "Rutgers",
          "seo": "rutgers",
          "full": "Rutgers, The State University of New Jersey, New Brunswick"
        },
        "winner": false,
        "seed": "",
        "description": "(5-7)",
        "rank": "",
        "conferences": [{
          "conferenceName": "Big Ten",
          "conferenceSeo": "big-ten"
        }]
      },
      "liveVideoEnabled": false,
      "startTime": "12:00PM ET",
      "startTimeEpoch": "1638032400",
      "bracketId": "",
      "gameState": "final",
      "startDate": "11-27-2021",
      "currentPeriod": "FINAL",
      "videoState": "",
      "bracketRegion": "",
      "contestClock": "0:00"
    }},
    {"game": {
      "gameID": "352679",
      "away": {
        "score": "45",
        "names": {
          "char6": "HOU",
          "short": "Houston",
          "seo": "houston",
          "full": "University of Houston"
        },
        "winner": true,
        "seed": "",
        "description": "(11-1)",
        "rank": "24",
        "conferences": [
          {
            "conferenceName": "AAC",
            "conferenceSeo": "aac"
          },
          {
            "conferenceName": "Top 25",
            "conferenceSeo": "top-25"
          }
        ]
      },
      "finalMessage": "FINAL",
      "bracketRound": "",
      "title": "UConn Houston",
      "url": "/game/5851524",
      "network": "",
      "home": {
        "score": "17",
        "names": {
          "char6": "UCONN",
          "short": "UConn",
          "seo": "uconn",
          "full": "University of Connecticut"
        },
        "winner": false,
        "seed": "",
        "description": "(1-11)",
        "rank": "",
        "conferences": [{
          "conferenceName": "FBS Independent",
          "conferenceSeo": "fbs-independent"
        }]
      },
      "liveVideoEnabled": false,
      "startTime": "12:00PM ET",
      "startTimeEpoch": "1638032400",
      "bracketId": "",
      "gameState": "final",
      "startDate": "11-27-2021",
      "currentPeriod": "FINAL",
      "videoState": "",
      "bracketRegion": "",
      "contestClock": "0:00"
    }},
    {"game": {
      "gameID": "352736",
      "away": {
        "score": "47",
        "names": {
          "char6": "MIAMI",
          "short": "Miami (FL)",
          "seo": "miami-fl",
          "full": "University of Miami (Florida)"
        },
        "winner": true,
        "seed": "",
        "description": "(7-5)",
        "rank": "",
        "conferences": [{
          "conferenceName": "ACC",
          "conferenceSeo": "acc"
        }]
      },
      "finalMessage": "FINAL",
      "bracketRound": "",
      "title": "Duke Miami (FL)",
      "url": "/game/5851509",
      "network": "",
      "home": {
        "score": "10",
        "names": {
          "char6": "DUKE",
          "short": "Duke",
          "seo": "duke",
          "full": "Duke University"
        },
        "winner": false,
        "seed": "",
        "description": "(3-9)",
        "rank": "",
        "conferences": [{
          "conferenceName": "ACC",
          "conferenceSeo": "acc"
        }]
      },
      "liveVideoEnabled": false,
      "startTime": "12:30PM ET",
      "startTimeEpoch": "1638034200",
      "bracketId": "",
      "gameState": "final",
      "startDate": "11-27-2021",
      "currentPeriod": "FINAL",
      "videoState": "",
      "bracketRegion": "",
      "contestClock": "0:00"
    }},
    {"game": {
      "gameID": "353323",
      "away": {
        "score": "31",
        "names": {
          "char6": "LATECH",
          "short": "Louisiana Tech",
          "seo": "louisiana-tech",
          "full": "Louisiana Tech University"
        },
        "winner": false,
        "seed": "",
        "description": "(3-9)",
        "rank": "",
        "conferences": [{
          "conferenceName": "C-USA",
          "conferenceSeo": "c-usa"
        }]
      },
      "finalMessage": "FINAL",
      "bracketRound": "",
      "title": "Rice Louisiana Tech",
      "url": "/game/5851523",
      "network": "",
      "home": {
        "score": "35",
        "names": {
          "char6": "RICE",
          "short": "Rice",
          "seo": "rice",
          "full": "Rice University"
        },
        "winner": true,
        "seed": "",
        "description": "(4-8)",
        "rank": "",
        "conferences": [{
          "conferenceName": "C-USA",
          "conferenceSeo": "c-usa"
        }]
      },
      "liveVideoEnabled": false,
      "startTime": "01:00PM ET",
      "startTimeEpoch": "1638036000",
      "bracketId": "",
      "gameState": "final",
      "startDate": "11-27-2021",
      "currentPeriod": "FINAL",
      "videoState": "",
      "bracketRegion": "",
      "contestClock": "0:00"
    }},
    {"game": {
      "gameID": "352847",
      "away": {
        "score": "10",
        "names": {
          "char6": "TROY",
          "short": "Troy",
          "seo": "troy",
          "full": "Troy University"
        },
        "winner": false,
        "seed": "",
        "description": "(5-7)",
        "rank": "",
        "conferences": [{
          "conferenceName": "Sun Belt",
          "conferenceSeo": "sun-belt"
        }]
      },
      "finalMessage": "FINAL",
      "bracketRound": "",
      "title": "Georgia St. Troy",
      "url": "/game/5851489",
      "network": "",
      "home": {
        "score": "37",
        "names": {
          "char6": "GA ST",
          "short": "Georgia St.",
          "seo": "georgia-st",
          "full": "Georgia State University"
        },
        "winner": true,
        "seed": "",
        "description": "(7-5)",
        "rank": "",
        "conferences": [{
          "conferenceName": "Sun Belt",
          "conferenceSeo": "sun-belt"
        }]
      },
      "liveVideoEnabled": false,
      "startTime": "02:00PM ET",
      "startTimeEpoch": "1638039600",
      "bracketId": "",
      "gameState": "final",
      "startDate": "11-27-2021",
      "currentPeriod": "FINAL",
      "videoState": "",
      "bracketRegion": "",
      "contestClock": "0:00"
    }},
    {"game": {
      "gameID": "352465",
      "away": {
        "score": "24",
        "names": {
          "char6": "TX ST",
          "short": "Texas St.",
          "seo": "texas-st",
          "full": "Texas State University"
        },
        "winner": true,
        "seed": "",
        "description": "(4-8)",
        "rank": "",
        "conferences": [{
          "conferenceName": "Sun Belt",
          "conferenceSeo": "sun-belt"
        }]
      },
      "finalMessage": "FINAL",
      "bracketRound": "",
      "title": "Arkansas St. Texas St.",
      "url": "/game/5851506",
      "network": "",
      "home": {
        "score": "22",
        "names": {
          "char6": "ARK ST",
          "short": "Arkansas St.",
          "seo": "arkansas-st",
          "full": "Arkansas State University"
        },
        "winner": false,
        "seed": "",
        "description": "(2-10)",
        "rank": "",
        "conferences": [{
          "conferenceName": "Sun Belt",
          "conferenceSeo": "sun-belt"
        }]
      },
      "liveVideoEnabled": false,
      "startTime": "02:00PM ET",
      "startTimeEpoch": "1638039600",
      "bracketId": "",
      "gameState": "final",
      "startDate": "11-27-2021",
      "currentPeriod": "FINAL",
      "videoState": "",
      "bracketRegion": "",
      "contestClock": "0:00"
    }},
    {"game": {
      "gameID": "353197",
      "away": {
        "score": "23",
        "names": {
          "char6": "UTSA",
          "short": "UTSA",
          "seo": "utsa",
          "full": "University of Texas at San Antonio"
        },
        "winner": false,
        "seed": "",
        "description": "(11-1)",
        "rank": "22",
        "conferences": [
          {
            "conferenceName": "C-USA",
            "conferenceSeo": "c-usa"
          },
          {
            "conferenceName": "Top 25",
            "conferenceSeo": "top-25"
          }
        ]
      },
      "finalMessage": "FINAL",
      "bracketRound": "",
      "title": "North Texas UTSA",
      "url": "/game/5851525",
      "network": "",
      "home": {
        "score": "45",
        "names": {
          "char6": "NO TEX",
          "short": "North Texas",
          "seo": "north-texas",
          "full": "University of North Texas"
        },
        "winner": true,
        "seed": "",
        "description": "(6-6)",
        "rank": "",
        "conferences": [{
          "conferenceName": "C-USA",
          "conferenceSeo": "c-usa"
        }]
      },
      "liveVideoEnabled": false,
      "startTime": "02:00PM ET",
      "startTimeEpoch": "1638039600",
      "bracketId": "",
      "gameState": "final",
      "startDate": "11-27-2021",
      "currentPeriod": "FINAL",
      "videoState": "",
      "bracketRegion": "",
      "contestClock": "0:00"
    }},
    {"game": {
      "gameID": "353239",
      "away": {
        "score": "34",
        "names": {
          "char6": "CHAR",
          "short": "Charlotte",
          "seo": "charlotte",
          "full": "The University of North Carolina at Charlotte"
        },
        "winner": false,
        "seed": "",
        "description": "(5-7)",
        "rank": "",
        "conferences": [{
          "conferenceName": "C-USA",
          "conferenceSeo": "c-usa"
        }]
      },
      "finalMessage": "FINAL",
      "bracketRound": "",
      "title": "Old Dominion Charlotte",
      "url": "/game/5851528",
      "network": "",
      "home": {
        "score": "56",
        "names": {
          "char6": "ODU",
          "short": "Old Dominion",
          "seo": "old-dominion",
          "full": "Old Dominion University"
        },
        "winner": true,
        "seed": "",
        "description": "(6-6)",
        "rank": "",
        "conferences": [{
          "conferenceName": "C-USA",
          "conferenceSeo": "c-usa"
        }]
      },
      "liveVideoEnabled": false,
      "startTime": "02:00PM ET",
      "startTimeEpoch": "1638039600",
      "bracketId": "",
      "gameState": "final",
      "startDate": "11-27-2021",
      "currentPeriod": "FINAL",
      "videoState": "",
      "bracketRegion": "",
      "contestClock": "0:00"
    }},
    {"game": {
      "gameID": "352437",
      "away": {
        "score": "3",
        "names": {
          "char6": "GA SOU",
          "short": "Ga. Southern",
          "seo": "ga-southern",
          "full": "Georgia Southern University"
        },
        "winner": false,
        "seed": "",
        "description": "(3-9)",
        "rank": "",
        "conferences": [{
          "conferenceName": "Sun Belt",
          "conferenceSeo": "sun-belt"
        }]
      },
      "finalMessage": "FINAL",
      "bracketRound": "",
      "title": "App State Ga. Southern",
      "url": "/game/5851529",
      "network": "",
      "home": {
        "score": "27",
        "names": {
          "char6": "APP ST",
          "short": "App State",
          "seo": "appalachian-st",
          "full": "Appalachian State University"
        },
        "winner": true,
        "seed": "",
        "description": "(10-2)",
        "rank": "",
        "conferences": [{
          "conferenceName": "Sun Belt",
          "conferenceSeo": "sun-belt"
        }]
      },
      "liveVideoEnabled": false,
      "startTime": "02:30PM ET",
      "startTimeEpoch": "1638041400",
      "bracketId": "",
      "gameState": "final",
      "startDate": "11-27-2021",
      "currentPeriod": "FINAL",
      "videoState": "",
      "bracketRegion": "",
      "contestClock": "0:00"
    }},
    {"game": {
      "gameID": "353182",
      "away": {
        "score": "27",
        "names": {
          "char6": "UMASS",
          "short": "Massachusetts",
          "seo": "massachusetts",
          "full": "University of Massachusetts, Amherst"
        },
        "winner": false,
        "seed": "",
        "description": "(1-11)",
        "rank": "",
        "conferences": [{
          "conferenceName": "FBS Independent",
          "conferenceSeo": "fbs-independent"
        }]
      },
      "finalMessage": "FINAL",
      "bracketRound": "",
      "title": "New Mexico St. Massachusetts",
      "url": "/game/5851490",
      "network": "",
      "home": {
        "score": "44",
        "names": {
          "char6": "NM ST",
          "short": "New Mexico St.",
          "seo": "new-mexico-st",
          "full": "New Mexico State University"
        },
        "winner": true,
        "seed": "",
        "description": "(2-10)",
        "rank": "",
        "conferences": [{
          "conferenceName": "FBS Independent",
          "conferenceSeo": "fbs-independent"
        }]
      },
      "liveVideoEnabled": false,
      "startTime": "03:00PM ET",
      "startTimeEpoch": "1638043200",
      "bracketId": "",
      "gameState": "final",
      "startDate": "11-27-2021",
      "currentPeriod": "FINAL",
      "videoState": "",
      "bracketRegion": "",
      "contestClock": "0:00"
    }},
    {"game": {
      "gameID": "353831",
      "away": {
        "score": "38",
        "names": {
          "char6": "HAWAII",
          "short": "Hawaii",
          "seo": "hawaii",
          "full": "University of Hawaii, Manoa"
        },
        "winner": true,
        "seed": "",
        "description": "(6-7)",
        "rank": "",
        "conferences": [{
          "conferenceName": "Mountain West",
          "conferenceSeo": "mountain-west"
        }]
      },
      "finalMessage": "FINAL",
      "bracketRound": "",
      "title": "Wyoming Hawaii",
      "url": "/game/5851526",
      "network": "",
      "home": {
        "score": "14",
        "names": {
          "char6": "WYO",
          "short": "Wyoming",
          "seo": "wyoming",
          "full": "University of Wyoming"
        },
        "winner": false,
        "seed": "",
        "description": "(6-6)",
        "rank": "",
        "conferences": [{
          "conferenceName": "Mountain West",
          "conferenceSeo": "mountain-west"
        }]
      },
      "liveVideoEnabled": false,
      "startTime": "03:00PM ET",
      "startTimeEpoch": "1638043200",
      "bracketId": "",
      "gameState": "final",
      "startDate": "11-27-2021",
      "currentPeriod": "FINAL",
      "videoState": "",
      "bracketRegion": "",
      "contestClock": "0:00"
    }},
    {"game": {
      "gameID": "353451",
      "away": {
        "score": "17",
        "names": {
          "char6": "FIU",
          "short": "FIU",
          "seo": "fiu",
          "full": "Florida International University"
        },
        "winner": false,
        "seed": "",
        "description": "(1-11)",
        "rank": "",
        "conferences": [{
          "conferenceName": "C-USA",
          "conferenceSeo": "c-usa"
        }]
      },
      "finalMessage": "FINAL",
      "bracketRound": "",
      "title": "Southern Miss. FIU",
      "url": "/game/5851527",
      "network": "",
      "home": {
        "score": "37",
        "names": {
          "char6": "S MISS",
          "short": "Southern Miss.",
          "seo": "southern-miss",
          "full": "The University of Southern Mississippi"
        },
        "winner": true,
        "seed": "",
        "description": "(3-9)",
        "rank": "",
        "conferences": [{
          "conferenceName": "C-USA",
          "conferenceSeo": "c-usa"
        }]
      },
      "liveVideoEnabled": false,
      "startTime": "03:00PM ET",
      "startTimeEpoch": "1638043200",
      "bracketId": "",
      "gameState": "final",
      "startDate": "11-27-2021",
      "currentPeriod": "FINAL",
      "videoState": "",
      "bracketRegion": "",
      "contestClock": "0:00"
    }},
    {"game": {
      "gameID": "352589",
      "away": {
        "score": "24",
        "names": {
          "char6": "ALA",
          "short": "Alabama",
          "seo": "alabama",
          "full": "University of Alabama"
        },
        "winner": true,
        "seed": "",
        "description": "(11-1)",
        "rank": "3",
        "conferences": [
          {
            "conferenceName": "SEC",
            "conferenceSeo": "sec"
          },
          {
            "conferenceName": "Top 25",
            "conferenceSeo": "top-25"
          }
        ]
      },
      "finalMessage": "FINAL (OT)",
      "bracketRound": "",
      "title": "Auburn Alabama",
      "url": "/game/5851495",
      "network": "",
      "home": {
        "score": "22",
        "names": {
          "char6": "AUBURN",
          "short": "Auburn",
          "seo": "auburn",
          "full": "Auburn University"
        },
        "winner": false,
        "seed": "",
        "description": "(6-6)",
        "rank": "",
        "conferences": [{
          "conferenceName": "SEC",
          "conferenceSeo": "sec"
        }]
      },
      "liveVideoEnabled": false,
      "startTime": "03:30PM ET",
      "startTimeEpoch": "1638045000",
      "bracketId": "",
      "gameState": "final",
      "startDate": "11-27-2021",
      "currentPeriod": "FINAL (OT)",
      "videoState": "",
      "bracketRegion": "",
      "contestClock": ""
    }},
    {"game": {
      "gameID": "353254",
      "away": {
        "score": "29",
        "names": {
          "char6": "ORE ST",
          "short": "Oregon St.",
          "seo": "oregon-st",
          "full": "Oregon State University"
        },
        "winner": false,
        "seed": "",
        "description": "(7-5)",
        "rank": "",
        "conferences": [{
          "conferenceName": "Pac-12",
          "conferenceSeo": "pac-12"
        }]
      },
      "finalMessage": "FINAL",
      "bracketRound": "",
      "title": "Oregon Oregon St.",
      "url": "/game/5851500",
      "network": "",
      "home": {
        "score": "38",
        "names": {
          "char6": "OREGN",
          "short": "Oregon",
          "seo": "oregon",
          "full": "University of Oregon"
        },
        "winner": true,
        "seed": "",
        "description": "(10-2)",
        "rank": "11",
        "conferences": [
          {
            "conferenceName": "Pac-12",
            "conferenceSeo": "pac-12"
          },
          {
            "conferenceName": "Top 25",
            "conferenceSeo": "top-25"
          }
        ]
      },
      "liveVideoEnabled": false,
      "startTime": "03:30PM ET",
      "startTimeEpoch": "1638045000",
      "bracketId": "",
      "gameState": "final",
      "startDate": "11-27-2021",
      "currentPeriod": "FINAL",
      "videoState": "",
      "bracketRegion": "",
      "contestClock": "0:00"
    }},
    {"game": {
      "gameID": "352904",
      "away": {
        "score": "14",
        "names": {
          "char6": "NWSTRN",
          "short": "Northwestern",
          "seo": "northwestern",
          "full": "Northwestern University"
        },
        "winner": false,
        "seed": "",
        "description": "(3-9)",
        "rank": "",
        "conferences": [{
          "conferenceName": "Big Ten",
          "conferenceSeo": "big-ten"
        }]
      },
      "finalMessage": "FINAL",
      "bracketRound": "",
      "title": "Illinois Northwestern",
      "url": "/game/5851515",
      "network": "",
      "home": {
        "score": "47",
        "names": {
          "char6": "ILL",
          "short": "Illinois",
          "seo": "illinois",
          "full": "University of Illinois Urbana-Champaign"
        },
        "winner": true,
        "seed": "",
        "description": "(5-7)",
        "rank": "",
        "conferences": [{
          "conferenceName": "Big Ten",
          "conferenceSeo": "big-ten"
        }]
      },
      "liveVideoEnabled": false,
      "startTime": "03:30PM ET",
      "startTimeEpoch": "1638045000",
      "bracketId": "",
      "gameState": "final",
      "startDate": "11-27-2021",
      "currentPeriod": "FINAL",
      "videoState": "",
      "bracketRegion": "",
      "contestClock": "0:00"
    }},
    {"game": {
      "gameID": "353309",
      "away": {
        "score": "7",
        "names": {
          "char6": "IND",
          "short": "Indiana",
          "seo": "indiana",
          "full": "Indiana University, Bloomington"
        },
        "winner": false,
        "seed": "",
        "description": "(2-10)",
        "rank": "",
        "conferences": [{
          "conferenceName": "Big Ten",
          "conferenceSeo": "big-ten"
        }]
      },
      "finalMessage": "FINAL",
      "bracketRound": "",
      "title": "Purdue Indiana",
      "url": "/game/5851519",
      "network": "",
      "home": {
        "score": "44",
        "names": {
          "char6": "PURDUE",
          "short": "Purdue",
          "seo": "purdue",
          "full": "Purdue University"
        },
        "winner": true,
        "seed": "",
        "description": "(8-4)",
        "rank": "",
        "conferences": [{
          "conferenceName": "Big Ten",
          "conferenceSeo": "big-ten"
        }]
      },
      "liveVideoEnabled": false,
      "startTime": "03:30PM ET",
      "startTimeEpoch": "1638045000",
      "bracketId": "",
      "gameState": "final",
      "startDate": "11-27-2021",
      "currentPeriod": "FINAL",
      "videoState": "",
      "bracketRegion": "",
      "contestClock": "0:00"
    }},
    {"game": {
      "gameID": "353100",
      "away": {
        "score": "27",
        "names": {
          "char6": "PENNST",
          "short": "Penn St.",
          "seo": "penn-st",
          "full": "Pennsylvania State University"
        },
        "winner": false,
        "seed": "",
        "description": "(7-5)",
        "rank": "",
        "conferences": [{
          "conferenceName": "Big Ten",
          "conferenceSeo": "big-ten"
        }]
      },
      "finalMessage": "FINAL",
      "bracketRound": "",
      "title": "Michigan St. Penn St.",
      "url": "/game/5851520",
      "network": "",
      "home": {
        "score": "30",
        "names": {
          "char6": "MICHST",
          "short": "Michigan St.",
          "seo": "michigan-st",
          "full": "Michigan State University"
        },
        "winner": true,
        "seed": "",
        "description": "(10-2)",
        "rank": "12",
        "conferences": [
          {
            "conferenceName": "Big Ten",
            "conferenceSeo": "big-ten"
          },
          {
            "conferenceName": "Top 25",
            "conferenceSeo": "top-25"
          }
        ]
      },
      "liveVideoEnabled": false,
      "startTime": "03:30PM ET",
      "startTimeEpoch": "1638045000",
      "bracketId": "",
      "gameState": "final",
      "startDate": "11-27-2021",
      "currentPeriod": "FINAL",
      "videoState": "",
      "bracketRegion": "",
      "contestClock": "0:00"
    }},
    {"game": {
      "gameID": "353008",
      "away": {
        "score": "53",
        "names": {
          "char6": "W KY",
          "short": "Western Ky.",
          "seo": "western-ky",
          "full": "Western Kentucky University"
        },
        "winner": true,
        "seed": "",
        "description": "(8-4)",
        "rank": "",
        "conferences": [{
          "conferenceName": "C-USA",
          "conferenceSeo": "c-usa"
        }]
      },
      "finalMessage": "FINAL",
      "bracketRound": "",
      "title": "Marshall Western Ky.",
      "url": "/game/5851530",
      "network": "",
      "home": {
        "score": "21",
        "names": {
          "char6": "MARSH",
          "short": "Marshall",
          "seo": "marshall",
          "full": "Marshall University"
        },
        "winner": false,
        "seed": "",
        "description": "(7-5)",
        "rank": "",
        "conferences": [{
          "conferenceName": "C-USA",
          "conferenceSeo": "c-usa"
        }]
      },
      "liveVideoEnabled": false,
      "startTime": "03:30PM ET",
      "startTimeEpoch": "1638045000",
      "bracketId": "",
      "gameState": "final",
      "startDate": "11-27-2021",
      "currentPeriod": "FINAL",
      "videoState": "",
      "bracketRegion": "",
      "contestClock": "0:00"
    }},
    {"game": {
      "gameID": "353530",
      "away": {
        "score": "21",
        "names": {
          "char6": "VANDY",
          "short": "Vanderbilt",
          "seo": "vanderbilt",
          "full": "Vanderbilt University"
        },
        "winner": false,
        "seed": "",
        "description": "(2-10)",
        "rank": "",
        "conferences": [{
          "conferenceName": "SEC",
          "conferenceSeo": "sec"
        }]
      },
      "finalMessage": "FINAL",
      "bracketRound": "",
      "title": "Tennessee Vanderbilt",
      "url": "/game/5851492",
      "network": "",
      "home": {
        "score": "45",
        "names": {
          "char6": "TENN",
          "short": "Tennessee",
          "seo": "tennessee",
          "full": "University of Tennessee, Knoxville"
        },
        "winner": true,
        "seed": "",
        "description": "(7-5)",
        "rank": "",
        "conferences": [{
          "conferenceName": "SEC",
          "conferenceSeo": "sec"
        }]
      },
      "liveVideoEnabled": false,
      "startTime": "03:45PM ET",
      "startTimeEpoch": "1638045900",
      "bracketId": "",
      "gameState": "final",
      "startDate": "11-27-2021",
      "currentPeriod": "FINAL",
      "videoState": "",
      "bracketRegion": "",
      "contestClock": "0:00"
    }},
    {"game": {
      "gameID": "359686",
      "away": {
        "score": "29",
        "names": {
          "char6": "VT",
          "short": "Virginia Tech",
          "seo": "virginia-tech",
          "full": "Virginia Polytechnic Institute and State University"
        },
        "winner": true,
        "seed": "",
        "description": "(6-6)",
        "rank": "",
        "conferences": [{
          "conferenceName": "ACC",
          "conferenceSeo": "acc"
        }]
      },
      "finalMessage": "FINAL",
      "bracketRound": "",
      "title": "Virginia Virginia Tech",
      "url": "/game/5851516",
      "network": "",
      "home": {
        "score": "24",
        "names": {
          "char6": "UVA",
          "short": "Virginia",
          "seo": "virginia",
          "full": "University of Virginia"
        },
        "winner": false,
        "seed": "",
        "description": "(6-6)",
        "rank": "",
        "conferences": [{
          "conferenceName": "ACC",
          "conferenceSeo": "acc"
        }]
      },
      "liveVideoEnabled": false,
      "startTime": "03:45PM ET",
      "startTimeEpoch": "1638045900",
      "bracketId": "",
      "gameState": "final",
      "startDate": "11-27-2021",
      "currentPeriod": "FINAL",
      "videoState": "",
      "bracketRegion": "",
      "contestClock": "0:00"
    }},
    {"game": {
      "gameID": "353458",
      "away": {
        "score": "34",
        "names": {
          "char6": "TULSA",
          "short": "Tulsa",
          "seo": "tulsa",
          "full": "The University of Tulsa"
        },
        "winner": true,
        "seed": "",
        "description": "(6-6)",
        "rank": "",
        "conferences": [{
          "conferenceName": "AAC",
          "conferenceSeo": "aac"
        }]
      },
      "finalMessage": "FINAL",
      "bracketRound": "",
      "title": "SMU Tulsa",
      "url": "/game/5851472",
      "network": "",
      "home": {
        "score": "31",
        "names": {
          "char6": "SMU",
          "short": "SMU",
          "seo": "smu",
          "full": "Southern Methodist University"
        },
        "winner": false,
        "seed": "",
        "description": "(8-4)",
        "rank": "",
        "conferences": [{
          "conferenceName": "AAC",
          "conferenceSeo": "aac"
        }]
      },
      "liveVideoEnabled": false,
      "startTime": "04:00PM ET",
      "startTimeEpoch": "1638046800",
      "bracketId": "",
      "gameState": "final",
      "startDate": "11-27-2021",
      "currentPeriod": "FINAL",
      "videoState": "",
      "bracketRegion": "",
      "contestClock": "0:00"
    }},
    {"game": {
      "gameID": "353051",
      "away": {
        "score": "13",
        "names": {
          "char6": "WISC",
          "short": "Wisconsin",
          "seo": "wisconsin",
          "full": "University of Wisconsin-Madison"
        },
        "winner": false,
        "seed": "",
        "description": "(8-4)",
        "rank": "14",
        "conferences": [
          {
            "conferenceName": "Big Ten",
            "conferenceSeo": "big-ten"
          },
          {
            "conferenceName": "Top 25",
            "conferenceSeo": "top-25"
          }
        ]
      },
      "finalMessage": "FINAL",
      "bracketRound": "",
      "title": "Minnesota Wisconsin",
      "url": "/game/5851493",
      "network": "",
      "home": {
        "score": "23",
        "names": {
          "char6": "MINN",
          "short": "Minnesota",
          "seo": "minnesota",
          "full": "University of Minnesota, Twin Cities"
        },
        "winner": true,
        "seed": "",
        "description": "(8-4)",
        "rank": "",
        "conferences": [{
          "conferenceName": "Big Ten",
          "conferenceSeo": "big-ten"
        }]
      },
      "liveVideoEnabled": false,
      "startTime": "04:00PM ET",
      "startTimeEpoch": "1638046800",
      "bracketId": "",
      "gameState": "final",
      "startDate": "11-27-2021",
      "currentPeriod": "FINAL",
      "videoState": "",
      "bracketRegion": "",
      "contestClock": "0:00"
    }},
    {"game": {
      "gameID": "352445",
      "away": {
        "score": "15",
        "names": {
          "char6": "ARIZ",
          "short": "Arizona",
          "seo": "arizona",
          "full": "University of Arizona"
        },
        "winner": false,
        "seed": "",
        "description": "(1-11)",
        "rank": "",
        "conferences": [{
          "conferenceName": "Pac-12",
          "conferenceSeo": "pac-12"
        }]
      },
      "finalMessage": "FINAL",
      "bracketRound": "",
      "title": "Arizona St. Arizona",
      "url": "/game/5851514",
      "network": "",
      "home": {
        "score": "38",
        "names": {
          "char6": "AZ ST",
          "short": "Arizona St.",
          "seo": "arizona-st",
          "full": "Arizona State University"
        },
        "winner": true,
        "seed": "",
        "description": "(8-4)",
        "rank": "",
        "conferences": [{
          "conferenceName": "Pac-12",
          "conferenceSeo": "pac-12"
        }]
      },
      "liveVideoEnabled": false,
      "startTime": "04:00PM ET",
      "startTimeEpoch": "1638046800",
      "bracketId": "",
      "gameState": "final",
      "startDate": "11-27-2021",
      "currentPeriod": "FINAL",
      "videoState": "",
      "bracketRegion": "",
      "contestClock": "0:00"
    }},
    {"game": {
      "gameID": "353655",
      "away": {
        "score": "16",
        "names": {
          "char6": "LA MON",
          "short": "ULM",
          "seo": "la-monroe",
          "full": "University of Louisiana Monroe"
        },
        "winner": false,
        "seed": "",
        "description": "(4-8)",
        "rank": "",
        "conferences": [{
          "conferenceName": "Sun Belt",
          "conferenceSeo": "sun-belt"
        }]
      },
      "finalMessage": "FINAL",
      "bracketRound": "",
      "title": "Louisiana ULM",
      "url": "/game/5851522",
      "network": "",
      "home": {
        "score": "21",
        "names": {
          "char6": "ULL",
          "short": "Louisiana",
          "seo": "la-lafayette",
          "full": "University of Louisiana at Lafayette"
        },
        "winner": true,
        "seed": "",
        "description": "(11-1)",
        "rank": "",
        "conferences": [{
          "conferenceName": "Sun Belt",
          "conferenceSeo": "sun-belt"
        }]
      },
      "liveVideoEnabled": false,
      "startTime": "04:00PM ET",
      "startTimeEpoch": "1638046800",
      "bracketId": "",
      "gameState": "final",
      "startDate": "11-27-2021",
      "currentPeriod": "FINAL",
      "videoState": "",
      "bracketRegion": "",
      "contestClock": "0:00"
    }},
    {"game": {
      "gameID": "352995",
      "away": {
        "score": "24",
        "names": {
          "char6": "TX A&M",
          "short": "Texas A&M",
          "seo": "texas-am",
          "full": "Texas A&M University, College Station"
        },
        "winner": false,
        "seed": "",
        "description": "(8-4)",
        "rank": "15",
        "conferences": [
          {
            "conferenceName": "SEC",
            "conferenceSeo": "sec"
          },
          {
            "conferenceName": "Top 25",
            "conferenceSeo": "top-25"
          }
        ]
      },
      "finalMessage": "FINAL",
      "bracketRound": "",
      "title": "LSU Texas A&M",
      "url": "/game/5851503",
      "network": "",
      "home": {
        "score": "27",
        "names": {
          "char6": "LSU",
          "short": "LSU",
          "seo": "lsu",
          "full": "Louisiana State University"
        },
        "winner": true,
        "seed": "",
        "description": "(6-6)",
        "rank": "",
        "conferences": [{
          "conferenceName": "SEC",
          "conferenceSeo": "sec"
        }]
      },
      "liveVideoEnabled": false,
      "startTime": "07:00PM ET",
      "startTimeEpoch": "1638057600",
      "bracketId": "",
      "gameState": "final",
      "startDate": "11-27-2021",
      "currentPeriod": "FINAL",
      "videoState": "",
      "bracketRegion": "",
      "contestClock": "0:00"
    }},
    {"game": {
      "gameID": "352945",
      "away": {
        "score": "34",
        "names": {
          "char6": "WVU",
          "short": "West Virginia",
          "seo": "west-virginia",
          "full": "West Virginia University"
        },
        "winner": true,
        "seed": "",
        "description": "(6-6)",
        "rank": "",
        "conferences": [{
          "conferenceName": "Big 12",
          "conferenceSeo": "big-12"
        }]
      },
      "finalMessage": "FINAL",
      "bracketRound": "",
      "title": "Kansas West Virginia",
      "url": "/game/5851517",
      "network": "",
      "home": {
        "score": "28",
        "names": {
          "char6": "KANSAS",
          "short": "Kansas",
          "seo": "kansas",
          "full": "University of Kansas"
        },
        "winner": false,
        "seed": "",
        "description": "(2-10)",
        "rank": "",
        "conferences": [{
          "conferenceName": "Big 12",
          "conferenceSeo": "big-12"
        }]
      },
      "liveVideoEnabled": false,
      "startTime": "07:00PM ET",
      "startTimeEpoch": "1638057600",
      "bracketId": "",
      "gameState": "final",
      "startDate": "11-27-2021",
      "currentPeriod": "FINAL",
      "videoState": "",
      "bracketRegion": "",
      "contestClock": "0:25"
    }},
    {"game": {
      "gameID": "352777",
      "away": {
        "score": "27",
        "names": {
          "char6": "MIDTEN",
          "short": "Middle Tenn.",
          "seo": "middle-tenn",
          "full": "Middle Tennessee State University"
        },
        "winner": true,
        "seed": "",
        "description": "(6-6)",
        "rank": "",
        "conferences": [{
          "conferenceName": "C-USA",
          "conferenceSeo": "c-usa"
        }]
      },
      "finalMessage": "FINAL",
      "bracketRound": "",
      "title": "Fla. Atlantic Middle Tenn.",
      "url": "/game/5851532",
      "network": "",
      "home": {
        "score": "17",
        "names": {
          "char6": "FAU",
          "short": "Fla. Atlantic",
          "seo": "fla-atlantic",
          "full": "Florida Atlantic University"
        },
        "winner": false,
        "seed": "",
        "description": "(5-7)",
        "rank": "",
        "conferences": [{
          "conferenceName": "C-USA",
          "conferenceSeo": "c-usa"
        }]
      },
      "liveVideoEnabled": false,
      "startTime": "07:00PM ET",
      "startTimeEpoch": "1638057600",
      "bracketId": "",
      "gameState": "final",
      "startDate": "11-27-2021",
      "currentPeriod": "FINAL",
      "videoState": "",
      "bracketRegion": "",
      "contestClock": "0:00"
    }},
    {"game": {
      "gameID": "353403",
      "away": {
        "score": "30",
        "names": {
          "char6": "CLEM",
          "short": "Clemson",
          "seo": "clemson",
          "full": "Clemson University"
        },
        "winner": true,
        "seed": "",
        "description": "(9-3)",
        "rank": "23",
        "conferences": [
          {
            "conferenceName": "ACC",
            "conferenceSeo": "acc"
          },
          {
            "conferenceName": "Top 25",
            "conferenceSeo": "top-25"
          }
        ]
      },
      "finalMessage": "FINAL",
      "bracketRound": "",
      "title": "South Carolina Clemson",
      "url": "/game/5851502",
      "network": "",
      "home": {
        "score": "0",
        "names": {
          "char6": "S CAR",
          "short": "South Carolina",
          "seo": "south-carolina",
          "full": "University of South Carolina, Columbia"
        },
        "winner": false,
        "seed": "",
        "description": "(6-6)",
        "rank": "",
        "conferences": [{
          "conferenceName": "SEC",
          "conferenceSeo": "sec"
        }]
      },
      "liveVideoEnabled": false,
      "startTime": "07:30PM ET",
      "startTimeEpoch": "1638059400",
      "bracketId": "",
      "gameState": "final",
      "startDate": "11-27-2021",
      "currentPeriod": "FINAL",
      "videoState": "",
      "bracketRegion": "",
      "contestClock": "0:00"
    }},
    {"game": {
      "gameID": "352988",
      "away": {
        "score": "52",
        "names": {
          "char6": "UK",
          "short": "Kentucky",
          "seo": "kentucky",
          "full": "University of Kentucky"
        },
        "winner": true,
        "seed": "",
        "description": "(9-3)",
        "rank": "",
        "conferences": [{
          "conferenceName": "SEC",
          "conferenceSeo": "sec"
        }]
      },
      "finalMessage": "FINAL",
      "bracketRound": "",
      "title": "Louisville Kentucky",
      "url": "/game/5851504",
      "network": "",
      "home": {
        "score": "21",
        "names": {
          "char6": "LOUIS",
          "short": "Louisville",
          "seo": "louisville",
          "full": "University of Louisville"
        },
        "winner": false,
        "seed": "",
        "description": "(6-6)",
        "rank": "",
        "conferences": [{
          "conferenceName": "ACC",
          "conferenceSeo": "acc"
        }]
      },
      "liveVideoEnabled": false,
      "startTime": "07:30PM ET",
      "startTimeEpoch": "1638059400",
      "bracketId": "",
      "gameState": "final",
      "startDate": "11-27-2021",
      "currentPeriod": "FINAL",
      "videoState": "",
      "bracketRegion": "",
      "contestClock": "0:00"
    }},
    {"game": {
      "gameID": "353023",
      "away": {
        "score": "28",
        "names": {
          "char6": "TULANE",
          "short": "Tulane",
          "seo": "tulane",
          "full": "Tulane University"
        },
        "winner": false,
        "seed": "",
        "description": "(2-10)",
        "rank": "",
        "conferences": [{
          "conferenceName": "AAC",
          "conferenceSeo": "aac"
        }]
      },
      "finalMessage": "FINAL",
      "bracketRound": "",
      "title": "Memphis Tulane",
      "url": "/game/5851507",
      "network": "",
      "home": {
        "score": "33",
        "names": {
          "char6": "MEM",
          "short": "Memphis",
          "seo": "memphis",
          "full": "University of Memphis"
        },
        "winner": true,
        "seed": "",
        "description": "(6-6)",
        "rank": "",
        "conferences": [{
          "conferenceName": "AAC",
          "conferenceSeo": "aac"
        }]
      },
      "liveVideoEnabled": false,
      "startTime": "07:30PM ET",
      "startTimeEpoch": "1638059400",
      "bracketId": "",
      "gameState": "final",
      "startDate": "11-27-2021",
      "currentPeriod": "FINAL",
      "videoState": "",
      "bracketRegion": "",
      "contestClock": "0:00"
    }},
    {"game": {
      "gameID": "353480",
      "away": {
        "score": "31",
        "names": {
          "char6": "PITT",
          "short": "Pittsburgh",
          "seo": "pittsburgh",
          "full": "University of Pittsburgh"
        },
        "winner": true,
        "seed": "",
        "description": "(10-2)",
        "rank": "17",
        "conferences": [
          {
            "conferenceName": "ACC",
            "conferenceSeo": "acc"
          },
          {
            "conferenceName": "Top 25",
            "conferenceSeo": "top-25"
          }
        ]
      },
      "finalMessage": "FINAL",
      "bracketRound": "",
      "title": "Syracuse Pittsburgh",
      "url": "/game/5851508",
      "network": "",
      "home": {
        "score": "14",
        "names": {
          "char6": "SYR",
          "short": "Syracuse",
          "seo": "syracuse",
          "full": "Syracuse University"
        },
        "winner": false,
        "seed": "",
        "description": "(5-7)",
        "rank": "",
        "conferences": [{
          "conferenceName": "ACC",
          "conferenceSeo": "acc"
        }]
      },
      "liveVideoEnabled": false,
      "startTime": "07:30PM ET",
      "startTimeEpoch": "1638059400",
      "bracketId": "",
      "gameState": "final",
      "startDate": "11-27-2021",
      "currentPeriod": "FINAL",
      "videoState": "",
      "bracketRegion": "",
      "contestClock": "0:00"
    }},
    {"game": {
      "gameID": "353233",
      "away": {
        "score": "33",
        "names": {
          "char6": "OKLA",
          "short": "Oklahoma",
          "seo": "oklahoma",
          "full": "University of Oklahoma"
        },
        "winner": false,
        "seed": "",
        "description": "(10-2)",
        "rank": "10",
        "conferences": [
          {
            "conferenceName": "Big 12",
            "conferenceSeo": "big-12"
          },
          {
            "conferenceName": "Top 25",
            "conferenceSeo": "top-25"
          }
        ]
      },
      "finalMessage": "FINAL",
      "bracketRound": "",
      "title": "Oklahoma St. Oklahoma",
      "url": "/game/5851518",
      "network": "",
      "home": {
        "score": "37",
        "names": {
          "char6": "OKLAST",
          "short": "Oklahoma St.",
          "seo": "oklahoma-st",
          "full": "Oklahoma State University"
        },
        "winner": true,
        "seed": "",
        "description": "(11-1)",
        "rank": "7",
        "conferences": [
          {
            "conferenceName": "Big 12",
            "conferenceSeo": "big-12"
          },
          {
            "conferenceName": "Top 25",
            "conferenceSeo": "top-25"
          }
        ]
      },
      "liveVideoEnabled": false,
      "startTime": "07:30PM ET",
      "startTimeEpoch": "1638059400",
      "bracketId": "",
      "gameState": "final",
      "startDate": "11-27-2021",
      "currentPeriod": "FINAL",
      "videoState": "",
      "bracketRegion": "",
      "contestClock": "0:00"
    }},
    {"game": {
      "gameID": "353465",
      "away": {
        "score": "45",
        "names": {
          "char6": "N DAME",
          "short": "Notre Dame",
          "seo": "notre-dame",
          "full": "University of Notre Dame"
        },
        "winner": true,
        "seed": "",
        "description": "(11-1)",
        "rank": "6",
        "conferences": [
          {
            "conferenceName": "FBS Independent",
            "conferenceSeo": "fbs-independent"
          },
          {
            "conferenceName": "Top 25",
            "conferenceSeo": "top-25"
          }
        ]
      },
      "finalMessage": "FINAL",
      "bracketRound": "",
      "title": "Stanford Notre Dame",
      "url": "/game/5851513",
      "network": "",
      "home": {
        "score": "14",
        "names": {
          "char6": "STAN",
          "short": "Stanford",
          "seo": "stanford",
          "full": "Stanford University"
        },
        "winner": false,
        "seed": "",
        "description": "(3-9)",
        "rank": "",
        "conferences": [{
          "conferenceName": "Pac-12",
          "conferenceSeo": "pac-12"
        }]
      },
      "liveVideoEnabled": false,
      "startTime": "08:00PM ET",
      "startTimeEpoch": "1638061200",
      "bracketId": "",
      "gameState": "final",
      "startDate": "11-27-2021",
      "currentPeriod": "FINAL",
      "videoState": "",
      "bracketRegion": "",
      "contestClock": "0:00"
    }},
    {"game": {
      "gameID": "352700",
      "away": {
        "score": "52",
        "names": {
          "char6": "NEVADA",
          "short": "Nevada",
          "seo": "nevada",
          "full": "University of Nevada, Reno"
        },
        "winner": true,
        "seed": "",
        "description": "(8-4)",
        "rank": "",
        "conferences": [{
          "conferenceName": "Mountain West",
          "conferenceSeo": "mountain-west"
        }]
      },
      "finalMessage": "FINAL",
      "bracketRound": "",
      "title": "Colorado St. Nevada",
      "url": "/game/5851531",
      "network": "",
      "home": {
        "score": "10",
        "names": {
          "char6": "CO ST",
          "short": "Colorado St.",
          "seo": "colorado-st",
          "full": "Colorado State University"
        },
        "winner": false,
        "seed": "",
        "description": "(3-9)",
        "rank": "",
        "conferences": [{
          "conferenceName": "Mountain West",
          "conferenceSeo": "mountain-west"
        }]
      },
      "liveVideoEnabled": false,
      "startTime": "09:00PM ET",
      "startTimeEpoch": "1638064800",
      "bracketId": "",
      "gameState": "final",
      "startDate": "11-27-2021",
      "currentPeriod": "FINAL",
      "videoState": "",
      "bracketRegion": "",
      "contestClock": "0:00"
    }},
    {"game": {
      "gameID": "364345",
      "away": {
        "score": "35",
        "names": {
          "char6": "BYU",
          "short": "BYU",
          "seo": "byu",
          "full": "Brigham Young University"
        },
        "winner": true,
        "seed": "",
        "description": "(10-2)",
        "rank": "13",
        "conferences": [
          {
            "conferenceName": "FBS Independent",
            "conferenceSeo": "fbs-independent"
          },
          {
            "conferenceName": "Top 25",
            "conferenceSeo": "top-25"
          }
        ]
      },
      "finalMessage": "FINAL",
      "bracketRound": "",
      "title": "Southern California BYU",
      "url": "/game/5851499",
      "network": "",
      "home": {
        "score": "31",
        "names": {
          "char6": "USC",
          "short": "Southern California",
          "seo": "southern-california",
          "full": "University of Southern California"
        },
        "winner": false,
        "seed": "",
        "description": "(4-7)",
        "rank": "",
        "conferences": [{
          "conferenceName": "Pac-12",
          "conferenceSeo": "pac-12"
        }]
      },
      "liveVideoEnabled": false,
      "startTime": "10:30PM ET",
      "startTimeEpoch": "1638070200",
      "bracketId": "",
      "gameState": "final",
      "startDate": "11-27-2021",
      "currentPeriod": "FINAL",
      "videoState": "",
      "bracketRegion": "",
      "contestClock": "0:00"
    }},
    {"game": {
      "gameID": "353649",
      "away": {
        "score": "14",
        "names": {
          "char6": "CAL",
          "short": "California",
          "seo": "california",
          "full": "University of California, Berkeley"
        },
        "winner": false,
        "seed": "",
        "description": "(4-7)",
        "rank": "",
        "conferences": [{
          "conferenceName": "Pac-12",
          "conferenceSeo": "pac-12"
        }]
      },
      "finalMessage": "FINAL",
      "bracketRound": "",
      "title": "UCLA California",
      "url": "/game/5851501",
      "network": "",
      "home": {
        "score": "42",
        "names": {
          "char6": "UCLA",
          "short": "UCLA",
          "seo": "ucla",
          "full": "University of California, Los Angeles"
        },
        "winner": true,
        "seed": "",
        "description": "(8-4)",
        "rank": "",
        "conferences": [{
          "conferenceName": "Pac-12",
          "conferenceSeo": "pac-12"
        }]
      },
      "liveVideoEnabled": false,
      "startTime": "10:30PM ET",
      "startTimeEpoch": "1638070200",
      "bracketId": "",
      "gameState": "final",
      "startDate": "11-27-2021",
      "currentPeriod": "FINAL",
      "videoState": "",
      "bracketRegion": "",
      "contestClock": "0:00"
    }}
  ]
}