{
  "AppalachianState vs LouisianaLafayette": {
    "stadium": "CajunField-Lafayette-LA",
    "AppalachianState": {
      "points": 17,
      "1st downs": 21,
      "rushing 1st downs": 12,
      "passing 1st downs": 8,
      "penalty 1st downs": 1,
      "rushing yards": 196,
      "rushing attempts": 53,
      "passing yards": 147,
      "passing attempts": 17,
      "passing completions": 11,
      "passing interceptions": 0,
      "total yards": 343,
      "total plays": 70,
      "fumbles": 0,
      "fumbles lost": 0,
      "penalties": 3,
      "penalty yards": 42,
      "punts": 6,
      "punt yards": 246,
      "punt returns": 1,
      "punt return yards": -1,
      "kickoff returns": 1,
      "kickoff return yards": 11,
      "interception returns": 0,
      "interception return yards": 0,
      "3rd down conversions": 7,
      "3rd down attempts": 16,
      "4th down conversions": 1,
      "4th down attempts": 1
    },
    "LouisianaLafayette": {
      "points": 7,
      "1st downs": 16,
      "rushing 1st downs": 6,
      "passing 1st downs": 8,
      "penalty 1st downs": 2,
      "rushing yards": 123,
      "rushing attempts": 33,
      "passing yards": 131,
      "passing attempts": 24,
      "passing completions": 13,
      "passing interceptions": 0,
      "total yards": 254,
      "total plays": 57,
      "fumbles": 0,
      "fumbles lost": 0,
      "penalties": 4,
      "penalty yards": 30,
      "punts": 6,
      "punt yards": 296,
      "punt returns": 3,
      "punt return yards": 26,
      "kickoff returns": 4,
      "kickoff return yards": 109,
      "interception returns": 0,
      "interception return yards": 0,
      "3rd down conversions": 4,
      "3rd down attempts": 13,
      "4th down conversions": 0,
      "4th down attempts": 2
    }
  },
  "Syracuse vs NorthCarolinaState": {
    "stadium": "WayneDayFamilyFieldatCarterFinleyStadium-Raleigh-NC",
    "Syracuse": {
      "points": 10,
      "1st downs": 21,
      "rushing 1st downs": 6,
      "passing 1st downs": 13,
      "penalty 1st downs": 2,
      "rushing yards": 41,
      "rushing attempts": 37,
      "passing yards": 300,
      "passing attempts": 39,
      "passing completions": 29,
      "passing interceptions": 0,
      "total yards": 341,
      "total plays": 76,
      "fumbles": 0,
      "fumbles lost": 0,
      "penalties": 12,
      "penalty yards": 59,
      "punts": 7,
      "punt yards": 307,
      "punt returns": 0,
      "punt return yards": 0,
      "kickoff returns": 2,
      "kickoff return yards": 33,
      "interception returns": 1,
      "interception return yards": 6,
      "3rd down conversions": 5,
      "3rd down attempts": 16,
      "4th down conversions": 1,
      "4th down attempts": 2
    },
    "NorthCarolinaState": {
      "points": 16,
      "1st downs": 21,
      "rushing 1st downs": 8,
      "passing 1st downs": 12,
      "penalty 1st downs": 1,
      "rushing yards": 104,
      "rushing attempts": 34,
      "passing yards": 260,
      "passing attempts": 31,
      "passing completions": 18,
      "passing interceptions": 1,
      "total yards": 364,
      "total plays": 65,
      "fumbles": 0,
      "fumbles lost": 0,
      "penalties": 4,
      "penalty yards": 47,
      "punts": 6,
      "punt yards": 293,
      "punt returns": 0,
      "punt return yards": 0,
      "kickoff returns": 2,
      "kickoff return yards": 41,
      "interception returns": 0,
      "interception return yards": 0,
      "3rd down conversions": 4,
      "3rd down attempts": 15,
      "4th down conversions": 0,
      "4th down attempts": 0
    }
  },
  "LouisianaMonroe vs TexasState": {
    "stadium": "JimWackerFieldatBobcatStadium-SanMarcos-TX",
    "LouisianaMonroe": {
      "points": 24,
      "1st downs": 24,
      "rushing 1st downs": 8,
      "passing 1st downs": 12,
      "penalty 1st downs": 4,
      "rushing yards": 204,
      "rushing attempts": 42,
      "passing yards": 225,
      "passing attempts": 33,
      "passing completions": 18,
      "passing interceptions": 1,
      "total yards": 429,
      "total plays": 75,
      "fumbles": 1,
      "fumbles lost": 1,
      "penalties": 10,
      "penalty yards": 59,
      "punts": 7,
      "punt yards": 310,
      "punt returns": 0,
      "punt return yards": 0,
      "kickoff returns": 2,
      "kickoff return yards": 29,
      "interception returns": 1,
      "interception return yards": 25,
      "3rd down conversions": 6,
      "3rd down attempts": 15,
      "4th down conversions": 0,
      "4th down attempts": 0
    },
    "TexasState": {
      "points": 14,
      "1st downs": 15,
      "rushing 1st downs": 7,
      "passing 1st downs": 6,
      "penalty 1st downs": 2,
      "rushing yards": 92,
      "rushing attempts": 28,
      "passing yards": 246,
      "passing attempts": 39,
      "passing completions": 20,
      "passing interceptions": 1,
      "total yards": 338,
      "total plays": 67,
      "fumbles": 1,
      "fumbles lost": 1,
      "penalties": 6,
      "penalty yards": 63,
      "punts": 7,
      "punt yards": 310,
      "punt returns": 1,
      "punt return yards": 0,
      "kickoff returns": 2,
      "kickoff return yards": 32,
      "interception returns": 1,
      "interception return yards": 0,
      "3rd down conversions": 7,
      "3rd down attempts": 18,
      "4th down conversions": 1,
      "4th down attempts": 3
    }
  },
  "ColoradoState vs NewMexico": {
    "stadium": "DreamstyleStadium-Albuquerque-NM",
    "ColoradoState": {
      "points": 35,
      "1st downs": 23,
      "rushing 1st downs": 5,
      "passing 1st downs": 15,
      "penalty 1st downs": 3,
      "rushing yards": 131,
      "rushing attempts": 38,
      "passing yards": 420,
      "passing attempts": 34,
      "passing completions": 25,
      "passing interceptions": 0,
      "total yards": 551,
      "total plays": 72,
      "fumbles": 4,
      "fumbles lost": 2,
      "penalties": 10,
      "penalty yards": 117,
      "punts": 5,
      "punt yards": 228,
      "punt returns": 1,
      "punt return yards": 0,
      "kickoff returns": 3,
      "kickoff return yards": 62,
      "interception returns": 1,
      "interception return yards": 17,
      "3rd down conversions": 8,
      "3rd down attempts": 15,
      "4th down conversions": 1,
      "4th down attempts": 1
    },
    "NewMexico": {
      "points": 21,
      "1st downs": 22,
      "rushing 1st downs": 10,
      "passing 1st downs": 4,
      "penalty 1st downs": 8,
      "rushing yards": 256,
      "rushing attempts": 49,
      "passing yards": 89,
      "passing attempts": 17,
      "passing completions": 8,
      "passing interceptions": 1,
      "total yards": 345,
      "total plays": 66,
      "fumbles": 3,
      "fumbles lost": 2,
      "penalties": 11,
      "penalty yards": 102,
      "punts": 7,
      "punt yards": 303,
      "punt returns": 0,
      "punt return yards": 0,
      "kickoff returns": 0,
      "kickoff return yards": 0,
      "interception returns": 0,
      "interception return yards": 0,
      "3rd down conversions": 3,
      "3rd down attempts": 12,
      "4th down conversions": 1,
      "4th down attempts": 1
    }
  },
  "Virginia vs MiamiFL": {
    "stadium": "HardRockStadium-MiamiGardens-FL",
    "Virginia": {
      "points": 9,
      "1st downs": 21,
      "rushing 1st downs": 7,
      "passing 1st downs": 12,
      "penalty 1st downs": 2,
      "rushing yards": 74,
      "rushing attempts": 31,
      "passing yards": 244,
      "passing attempts": 41,
      "passing completions": 24,
      "passing interceptions": 0,
      "total yards": 318,
      "total plays": 72,
      "fumbles": 2,
      "fumbles lost": 1,
      "penalties": 3,
      "penalty yards": 20,
      "punts": 3,
      "punt yards": 133,
      "punt returns": 3,
      "punt return yards": 18,
      "kickoff returns": 3,
      "kickoff return yards": 112,
      "interception returns": 0,
      "interception return yards": 0,
      "3rd down conversions": 10,
      "3rd down attempts": 19,
      "4th down conversions": 0,
      "4th down attempts": 1
    },
    "MiamiFL": {
      "points": 17,
      "1st downs": 14,
      "rushing 1st downs": 5,
      "passing 1st downs": 9,
      "penalty 1st downs": 0,
      "rushing yards": 83,
      "rushing attempts": 25,
      "passing yards": 182,
      "passing attempts": 27,
      "passing completions": 16,
      "passing interceptions": 0,
      "total yards": 265,
      "total plays": 52,
      "fumbles": 0,
      "fumbles lost": 0,
      "penalties": 4,
      "penalty yards": 32,
      "punts": 6,
      "punt yards": 275,
      "punt returns": 0,
      "punt return yards": 0,
      "kickoff returns": 1,
      "kickoff return yards": 21,
      "interception returns": 0,
      "interception return yards": 0,
      "3rd down conversions": 2,
      "3rd down attempts": 10,
      "4th down conversions": 1,
      "4th down attempts": 1
    }
  },
  "Colorado vs Oregon": {
    "stadium": "AutzenStadium-Eugene-OR",
    "Colorado": {
      "points": 3,
      "1st downs": 22,
      "rushing 1st downs": 7,
      "passing 1st downs": 9,
      "penalty 1st downs": 6,
      "rushing yards": 168,
      "rushing attempts": 40,
      "passing yards": 131,
      "passing attempts": 34,
      "passing completions": 19,
      "passing interceptions": 4,
      "total yards": 299,
      "total plays": 74,
      "fumbles": 0,
      "fumbles lost": 0,
      "penalties": 14,
      "penalty yards": 114,
      "punts": 4,
      "punt yards": 179,
      "punt returns": 1,
      "punt return yards": 9,
      "kickoff returns": 6,
      "kickoff return yards": 118,
      "interception returns": 0,
      "interception return yards": 0,
      "3rd down conversions": 9,
      "3rd down attempts": 18,
      "4th down conversions": 0,
      "4th down attempts": 2
    },
    "Oregon": {
      "points": 45,
      "1st downs": 25,
      "rushing 1st downs": 9,
      "passing 1st downs": 12,
      "penalty 1st downs": 4,
      "rushing yards": 252,
      "rushing attempts": 36,
      "passing yards": 275,
      "passing attempts": 35,
      "passing completions": 19,
      "passing interceptions": 0,
      "total yards": 527,
      "total plays": 71,
      "fumbles": 0,
      "fumbles lost": 0,
      "penalties": 10,
      "penalty yards": 119,
      "punts": 2,
      "punt yards": 97,
      "punt returns": 2,
      "punt return yards": 24,
      "kickoff returns": 2,
      "kickoff return yards": 39,
      "interception returns": 4,
      "interception return yards": 53,
      "3rd down conversions": 5,
      "3rd down attempts": 11,
      "4th down conversions": 1,
      "4th down attempts": 3
    }
  },
  "SouthCarolina vs Georgia": {
    "stadium": "SanfordStadium-Athens-GA",
    "SouthCarolina": {
      "points": 20,
      "1st downs": 16,
      "rushing 1st downs": 6,
      "passing 1st downs": 7,
      "penalty 1st downs": 3,
      "rushing yards": 142,
      "rushing attempts": 36,
      "passing yards": 155,
      "passing attempts": 32,
      "passing completions": 21,
      "passing interceptions": 0,
      "total yards": 297,
      "total plays": 68,
      "fumbles": 0,
      "fumbles lost": 0,
      "penalties": 11,
      "penalty yards": 68,
      "punts": 7,
      "punt yards": 318,
      "punt returns": 0,
      "punt return yards": 0,
      "kickoff returns": 0,
      "kickoff return yards": 0,
      "interception returns": 3,
      "interception return yards": 53,
      "3rd down conversions": 5,
      "3rd down attempts": 18,
      "4th down conversions": 1,
      "4th down attempts": 1
    },
    "Georgia": {
      "points": 17,
      "1st downs": 30,
      "rushing 1st downs": 7,
      "passing 1st downs": 18,
      "penalty 1st downs": 5,
      "rushing yards": 173,
      "rushing attempts": 43,
      "passing yards": 295,
      "passing attempts": 52,
      "passing completions": 28,
      "passing interceptions": 3,
      "total yards": 468,
      "total plays": 95,
      "fumbles": 1,
      "fumbles lost": 1,
      "penalties": 6,
      "penalty yards": 60,
      "punts": 3,
      "punt yards": 173,
      "punt returns": 0,
      "punt return yards": 0,
      "kickoff returns": 0,
      "kickoff return yards": 0,
      "interception returns": 0,
      "interception return yards": 0,
      "3rd down conversions": 9,
      "3rd down attempts": 18,
      "4th down conversions": 0,
      "4th down attempts": 1
    }
  },
  "Toledo vs BowlingGreen": {
    "stadium": "DoytLPerryStadium-BowlingGreen-OH",
    "Toledo": {
      "points": 7,
      "1st downs": 21,
      "rushing 1st downs": 8,
      "passing 1st downs": 11,
      "penalty 1st downs": 2,
      "rushing yards": 132,
      "rushing attempts": 39,
      "passing yards": 260,
      "passing attempts": 35,
      "passing completions": 23,
      "passing interceptions": 1,
      "total yards": 392,
      "total plays": 74,
      "fumbles": 4,
      "fumbles lost": 1,
      "penalties": 2,
      "penalty yards": 10,
      "punts": 4,
      "punt yards": 173,
      "punt returns": 1,
      "punt return yards": -1,
      "kickoff returns": 4,
      "kickoff return yards": 21,
      "interception returns": 1,
      "interception return yards": 8,
      "3rd down conversions": 5,
      "3rd down attempts": 16,
      "4th down conversions": 2,
      "4th down attempts": 5
    },
    "BowlingGreen": {
      "points": 20,
      "1st downs": 17,
      "rushing 1st downs": 11,
      "passing 1st downs": 6,
      "penalty 1st downs": 0,
      "rushing yards": 240,
      "rushing attempts": 41,
      "passing yards": 185,
      "passing attempts": 21,
      "passing completions": 14,
      "passing interceptions": 1,
      "total yards": 425,
      "total plays": 62,
      "fumbles": 0,
      "fumbles lost": 0,
      "penalties": 9,
      "penalty yards": 74,
      "punts": 4,
      "punt yards": 154,
      "punt returns": 2,
      "punt return yards": 8,
      "kickoff returns": 2,
      "kickoff return yards": 46,
      "interception returns": 1,
      "interception return yards": 0,
      "3rd down conversions": 6,
      "3rd down attempts": 14,
      "4th down conversions": 0,
      "4th down attempts": 2
    }
  },
  "Maryland vs Purdue": {
    "stadium": "RossAdeStadium-WestLafayette-IN",
    "Maryland": {
      "points": 14,
      "1st downs": 15,
      "rushing 1st downs": 7,
      "passing 1st downs": 8,
      "penalty 1st downs": 0,
      "rushing yards": 185,
      "rushing attempts": 26,
      "passing yards": 218,
      "passing attempts": 39,
      "passing completions": 21,
      "passing interceptions": 2,
      "total yards": 403,
      "total plays": 65,
      "fumbles": 2,
      "fumbles lost": 0,
      "penalties": 9,
      "penalty yards": 67,
      "punts": 6,
      "punt yards": 239,
      "punt returns": 0,
      "punt return yards": 0,
      "kickoff returns": 5,
      "kickoff return yards": 84,
      "interception returns": 0,
      "interception return yards": 0,
      "3rd down conversions": 4,
      "3rd down attempts": 14,
      "4th down conversions": 1,
      "4th down attempts": 4
    },
    "Purdue": {
      "points": 40,
      "1st downs": 24,
      "rushing 1st downs": 6,
      "passing 1st downs": 17,
      "penalty 1st downs": 1,
      "rushing yards": 127,
      "rushing attempts": 37,
      "passing yards": 420,
      "passing attempts": 41,
      "passing completions": 33,
      "passing interceptions": 0,
      "total yards": 547,
      "total plays": 78,
      "fumbles": 2,
      "fumbles lost": 1,
      "penalties": 4,
      "penalty yards": 40,
      "punts": 4,
      "punt yards": 157,
      "punt returns": 1,
      "punt return yards": 5,
      "kickoff returns": 2,
      "kickoff return yards": 11,
      "interception returns": 2,
      "interception return yards": 40,
      "3rd down conversions": 11,
      "3rd down attempts": 18,
      "4th down conversions": 0,
      "4th down attempts": 0
    }
  },
  "Rutgers vs Indiana": {
    "stadium": "MemorialStadiumBloomington-IN-Bloomington",
    "Rutgers": {
      "points": 0,
      "1st downs": 6,
      "rushing 1st downs": 5,
      "passing 1st downs": 0,
      "penalty 1st downs": 1,
      "rushing yards": 74,
      "rushing attempts": 33,
      "passing yards": 1,
      "passing attempts": 13,
      "passing completions": 5,
      "passing interceptions": 0,
      "total yards": 75,
      "total plays": 46,
      "fumbles": 1,
      "fumbles lost": 1,
      "penalties": 4,
      "penalty yards": 45,
      "punts": 10,
      "punt yards": 473,
      "punt returns": 0,
      "punt return yards": 0,
      "kickoff returns": 4,
      "kickoff return yards": 75,
      "interception returns": 1,
      "interception return yards": 8,
      "3rd down conversions": 0,
      "3rd down attempts": 11,
      "4th down conversions": 0,
      "4th down attempts": 1
    },
    "Indiana": {
      "points": 35,
      "1st downs": 25,
      "rushing 1st downs": 14,
      "passing 1st downs": 9,
      "penalty 1st downs": 2,
      "rushing yards": 260,
      "rushing attempts": 38,
      "passing yards": 297,
      "passing attempts": 35,
      "passing completions": 24,
      "passing interceptions": 1,
      "total yards": 557,
      "total plays": 73,
      "fumbles": 1,
      "fumbles lost": 1,
      "penalties": 7,
      "penalty yards": 54,
      "punts": 4,
      "punt yards": 172,
      "punt returns": 2,
      "punt return yards": 8,
      "kickoff returns": 1,
      "kickoff return yards": 13,
      "interception returns": 0,
      "interception return yards": 0,
      "3rd down conversions": 6,
      "3rd down attempts": 12,
      "4th down conversions": 0,
      "4th down attempts": 2
    }
  },
  "Memphis vs Temple": {
    "stadium": "LincolnFinancialField-Philadelphia-PA",
    "Memphis": {
      "points": 28,
      "1st downs": 28,
      "rushing 1st downs": 7,
      "passing 1st downs": 17,
      "penalty 1st downs": 4,
      "rushing yards": 129,
      "rushing attempts": 33,
      "passing yards": 363,
      "passing attempts": 44,
      "passing completions": 28,
      "passing interceptions": 1,
      "total yards": 492,
      "total plays": 77,
      "fumbles": 3,
      "fumbles lost": 3,
      "penalties": 4,
      "penalty yards": 44,
      "punts": 2,
      "punt yards": 80,
      "punt returns": 0,
      "punt return yards": 0,
      "kickoff returns": 0,
      "kickoff return yards": 0,
      "interception returns": 0,
      "interception return yards": 0,
      "3rd down conversions": 7,
      "3rd down attempts": 12,
      "4th down conversions": 0,
      "4th down attempts": 3
    },
    "Temple": {
      "points": 30,
      "1st downs": 27,
      "rushing 1st downs": 11,
      "passing 1st downs": 13,
      "penalty 1st downs": 3,
      "rushing yards": 193,
      "rushing attempts": 48,
      "passing yards": 263,
      "passing attempts": 37,
      "passing completions": 24,
      "passing interceptions": 0,
      "total yards": 456,
      "total plays": 85,
      "fumbles": 2,
      "fumbles lost": 2,
      "penalties": 6,
      "penalty yards": 70,
      "punts": 4,
      "punt yards": 162,
      "punt returns": 0,
      "punt return yards": 0,
      "kickoff returns": 3,
      "kickoff return yards": 61,
      "interception returns": 1,
      "interception return yards": 0,
      "3rd down conversions": 6,
      "3rd down attempts": 16,
      "4th down conversions": 1,
      "4th down attempts": 2
    }
  },
  "MississippiState vs Tennessee": {
    "stadium": "NeylandStadium-Knoxville-TN",
    "MississippiState": {
      "points": 10,
      "1st downs": 20,
      "rushing 1st downs": 10,
      "passing 1st downs": 8,
      "penalty 1st downs": 2,
      "rushing yards": 121,
      "rushing attempts": 37,
      "passing yards": 146,
      "passing attempts": 21,
      "passing completions": 11,
      "passing interceptions": 3,
      "total yards": 267,
      "total plays": 58,
      "fumbles": 1,
      "fumbles lost": 0,
      "penalties": 4,
      "penalty yards": 15,
      "punts": 4,
      "punt yards": 173,
      "punt returns": 0,
      "punt return yards": 0,
      "kickoff returns": 1,
      "kickoff return yards": 9,
      "interception returns": 2,
      "interception return yards": 0,
      "3rd down conversions": 5,
      "3rd down attempts": 12,
      "4th down conversions": 1,
      "4th down attempts": 1
    },
    "Tennessee": {
      "points": 20,
      "1st downs": 14,
      "rushing 1st downs": 7,
      "passing 1st downs": 7,
      "penalty 1st downs": 0,
      "rushing yards": 190,
      "rushing attempts": 44,
      "passing yards": 167,
      "passing attempts": 14,
      "passing completions": 10,
      "passing interceptions": 2,
      "total yards": 357,
      "total plays": 58,
      "fumbles": 0,
      "fumbles lost": 0,
      "penalties": 3,
      "penalty yards": 34,
      "punts": 4,
      "punt yards": 185,
      "punt returns": 1,
      "punt return yards": 13,
      "kickoff returns": 1,
      "kickoff return yards": 14,
      "interception returns": 3,
      "interception return yards": 35,
      "3rd down conversions": 7,
      "3rd down attempts": 15,
      "4th down conversions": 0,
      "4th down attempts": 0
    }
  },
  "MiamiOH vs WesternMichigan": {
    "stadium": "WaldoStadium-Kalamazoo-MI",
    "MiamiOH": {
      "points": 16,
      "1st downs": 19,
      "rushing 1st downs": 6,
      "passing 1st downs": 10,
      "penalty 1st downs": 3,
      "rushing yards": 105,
      "rushing attempts": 34,
      "passing yards": 260,
      "passing attempts": 46,
      "passing completions": 26,
      "passing interceptions": 3,
      "total yards": 365,
      "total plays": 80,
      "fumbles": 0,
      "fumbles lost": 0,
      "penalties": 8,
      "penalty yards": 83,
      "punts": 6,
      "punt yards": 280,
      "punt returns": 1,
      "punt return yards": 1,
      "kickoff returns": 1,
      "kickoff return yards": 12,
      "interception returns": 1,
      "interception return yards": 0,
      "3rd down conversions": 4,
      "3rd down attempts": 18,
      "4th down conversions": 0,
      "4th down attempts": 2
    },
    "WesternMichigan": {
      "points": 38,
      "1st downs": 17,
      "rushing 1st downs": 9,
      "passing 1st downs": 5,
      "penalty 1st downs": 3,
      "rushing yards": 173,
      "rushing attempts": 40,
      "passing yards": 137,
      "passing attempts": 25,
      "passing completions": 15,
      "passing interceptions": 1,
      "total yards": 310,
      "total plays": 65,
      "fumbles": 0,
      "fumbles lost": 0,
      "penalties": 7,
      "penalty yards": 67,
      "punts": 7,
      "punt yards": 255,
      "punt returns": 1,
      "punt return yards": 7,
      "kickoff returns": 1,
      "kickoff return yards": 17,
      "interception returns": 3,
      "interception return yards": 103,
      "3rd down conversions": 4,
      "3rd down attempts": 14,
      "4th down conversions": 0,
      "4th down attempts": 1
    }
  },
  "Michigan vs Illinois": {
    "stadium": "MemorialStadiumChampaign-IL-Champaign",
    "Michigan": {
      "points": 42,
      "1st downs": 25,
      "rushing 1st downs": 15,
      "passing 1st downs": 7,
      "penalty 1st downs": 3,
      "rushing yards": 295,
      "rushing attempts": 48,
      "passing yards": 194,
      "passing attempts": 22,
      "passing completions": 11,
      "passing interceptions": 0,
      "total yards": 489,
      "total plays": 70,
      "fumbles": 3,
      "fumbles lost": 2,
      "penalties": 7,
      "penalty yards": 54,
      "punts": 3,
      "punt yards": 133,
      "punt returns": 2,
      "punt return yards": 35,
      "kickoff returns": 1,
      "kickoff return yards": 20,
      "interception returns": 0,
      "interception return yards": 0,
      "3rd down conversions": 4,
      "3rd down attempts": 10,
      "4th down conversions": 1,
      "4th down attempts": 2
    },
    "Illinois": {
      "points": 25,
      "1st downs": 17,
      "rushing 1st downs": 7,
      "passing 1st downs": 8,
      "penalty 1st downs": 2,
      "rushing yards": 64,
      "rushing attempts": 43,
      "passing yards": 192,
      "passing attempts": 29,
      "passing completions": 16,
      "passing interceptions": 0,
      "total yards": 256,
      "total plays": 72,
      "fumbles": 2,
      "fumbles lost": 2,
      "penalties": 10,
      "penalty yards": 95,
      "punts": 7,
      "punt yards": 328,
      "punt returns": 0,
      "punt return yards": 0,
      "kickoff returns": 2,
      "kickoff return yards": 38,
      "interception returns": 0,
      "interception return yards": 0,
      "3rd down conversions": 3,
      "3rd down attempts": 13,
      "4th down conversions": 1,
      "4th down attempts": 1
    }
  },
  "Oklahoma vs Texas": {
    "stadium": "CottonBowl-Dallas-TX",
    "Oklahoma": {
      "points": 34,
      "1st downs": 21,
      "rushing 1st downs": 12,
      "passing 1st downs": 8,
      "penalty 1st downs": 1,
      "rushing yards": 276,
      "rushing attempts": 38,
      "passing yards": 235,
      "passing attempts": 28,
      "passing completions": 16,
      "passing interceptions": 1,
      "total yards": 511,
      "total plays": 66,
      "fumbles": 1,
      "fumbles lost": 1,
      "penalties": 7,
      "penalty yards": 89,
      "punts": 2,
      "punt yards": 76,
      "punt returns": 3,
      "punt return yards": 6,
      "kickoff returns": 1,
      "kickoff return yards": 17,
      "interception returns": 0,
      "interception return yards": 0,
      "3rd down conversions": 3,
      "3rd down attempts": 12,
      "4th down conversions": 1,
      "4th down attempts": 2
    },
    "Texas": {
      "points": 27,
      "1st downs": 25,
      "rushing 1st downs": 4,
      "passing 1st downs": 15,
      "penalty 1st downs": 6,
      "rushing yards": 100,
      "rushing attempts": 36,
      "passing yards": 205,
      "passing attempts": 37,
      "passing completions": 25,
      "passing interceptions": 0,
      "total yards": 305,
      "total plays": 73,
      "fumbles": 1,
      "fumbles lost": 0,
      "penalties": 9,
      "penalty yards": 49,
      "punts": 7,
      "punt yards": 281,
      "punt returns": 0,
      "punt return yards": 0,
      "kickoff returns": 4,
      "kickoff return yards": 79,
      "interception returns": 1,
      "interception return yards": 10,
      "3rd down conversions": 6,
      "3rd down attempts": 15,
      "4th down conversions": 0,
      "4th down attempts": 0
    }
  },
  "GeorgiaTech vs Duke": {
    "stadium": "BrooksFieldatWallaceWadeStadium-Durham-NC",
    "GeorgiaTech": {
      "points": 23,
      "1st downs": 20,
      "rushing 1st downs": 11,
      "passing 1st downs": 9,
      "penalty 1st downs": 0,
      "rushing yards": 173,
      "rushing attempts": 40,
      "passing yards": 206,
      "passing attempts": 35,
      "passing completions": 15,
      "passing interceptions": 0,
      "total yards": 379,
      "total plays": 75,
      "fumbles": 2,
      "fumbles lost": 0,
      "penalties": 6,
      "penalty yards": 55,
      "punts": 5,
      "punt yards": 257,
      "punt returns": 1,
      "punt return yards": 9,
      "kickoff returns": 2,
      "kickoff return yards": 37,
      "interception returns": 0,
      "interception return yards": 0,
      "3rd down conversions": 8,
      "3rd down attempts": 18,
      "4th down conversions": 0,
      "4th down attempts": 2
    },
    "Duke": {
      "points": 41,
      "1st downs": 20,
      "rushing 1st downs": 13,
      "passing 1st downs": 5,
      "penalty 1st downs": 2,
      "rushing yards": 197,
      "rushing attempts": 55,
      "passing yards": 176,
      "passing attempts": 20,
      "passing completions": 11,
      "passing interceptions": 0,
      "total yards": 373,
      "total plays": 75,
      "fumbles": 1,
      "fumbles lost": 0,
      "penalties": 4,
      "penalty yards": 25,
      "punts": 4,
      "punt yards": 201,
      "punt returns": 4,
      "punt return yards": 75,
      "kickoff returns": 3,
      "kickoff return yards": 59,
      "interception returns": 0,
      "interception return yards": 0,
      "3rd down conversions": 6,
      "3rd down attempts": 16,
      "4th down conversions": 3,
      "4th down attempts": 3
    }
  },
  "BallState vs EasternMichigan": {
    "stadium": "RynearsonStadium-Ypsilanti-MI",
    "BallState": {
      "points": 29,
      "1st downs": 25,
      "rushing 1st downs": 12,
      "passing 1st downs": 11,
      "penalty 1st downs": 2,
      "rushing yards": 196,
      "rushing attempts": 47,
      "passing yards": 255,
      "passing attempts": 32,
      "passing completions": 23,
      "passing interceptions": 0,
      "total yards": 451,
      "total plays": 79,
      "fumbles": 2,
      "fumbles lost": 1,
      "penalties": 7,
      "penalty yards": 75,
      "punts": 5,
      "punt yards": 188,
      "punt returns": 0,
      "punt return yards": 0,
      "kickoff returns": 4,
      "kickoff return yards": 85,
      "interception returns": 3,
      "interception return yards": 4,
      "3rd down conversions": 7,
      "3rd down attempts": 14,
      "4th down conversions": 1,
      "4th down attempts": 1
    },
    "EasternMichigan": {
      "points": 23,
      "1st downs": 21,
      "rushing 1st downs": 3,
      "passing 1st downs": 17,
      "penalty 1st downs": 1,
      "rushing yards": 89,
      "rushing attempts": 33,
      "passing yards": 283,
      "passing attempts": 36,
      "passing completions": 20,
      "passing interceptions": 3,
      "total yards": 372,
      "total plays": 69,
      "fumbles": 1,
      "fumbles lost": 1,
      "penalties": 9,
      "penalty yards": 55,
      "punts": 4,
      "punt yards": 188,
      "punt returns": 1,
      "punt return yards": 29,
      "kickoff returns": 3,
      "kickoff return yards": 54,
      "interception returns": 0,
      "interception return yards": 0,
      "3rd down conversions": 3,
      "3rd down attempts": 13,
      "4th down conversions": 1,
      "4th down attempts": 2
    }
  },
  "OldDominion vs Marshall": {
    "stadium": "JoanCEdwardsStadium-Huntington-WV",
    "OldDominion": {
      "points": 17,
      "1st downs": 11,
      "rushing 1st downs": 6,
      "passing 1st downs": 5,
      "penalty 1st downs": 0,
      "rushing yards": 83,
      "rushing attempts": 36,
      "passing yards": 123,
      "passing attempts": 16,
      "passing completions": 9,
      "passing interceptions": 0,
      "total yards": 206,
      "total plays": 52,
      "fumbles": 0,
      "fumbles lost": 0,
      "penalties": 5,
      "penalty yards": 60,
      "punts": 8,
      "punt yards": 346,
      "punt returns": 4,
      "punt return yards": 21,
      "kickoff returns": 3,
      "kickoff return yards": 166,
      "interception returns": 0,
      "interception return yards": 0,
      "3rd down conversions": 4,
      "3rd down attempts": 13,
      "4th down conversions": 0,
      "4th down attempts": 1
    },
    "Marshall": {
      "points": 31,
      "1st downs": 27,
      "rushing 1st downs": 15,
      "passing 1st downs": 10,
      "penalty 1st downs": 2,
      "rushing yards": 236,
      "rushing attempts": 46,
      "passing yards": 208,
      "passing attempts": 32,
      "passing completions": 20,
      "passing interceptions": 0,
      "total yards": 444,
      "total plays": 78,
      "fumbles": 0,
      "fumbles lost": 0,
      "penalties": 3,
      "penalty yards": 30,
      "punts": 6,
      "punt yards": 245,
      "punt returns": 2,
      "punt return yards": 21,
      "kickoff returns": 1,
      "kickoff return yards": 23,
      "interception returns": 0,
      "interception return yards": 0,
      "3rd down conversions": 8,
      "3rd down attempts": 16,
      "4th down conversions": 0,
      "4th down attempts": 0
    }
  },
  "NewMexicoState vs CentralMichigan": {
    "stadium": "KellyShortsStadium-MountPleasant-MI",
    "NewMexicoState": {
      "points": 28,
      "1st downs": 18,
      "rushing 1st downs": 7,
      "passing 1st downs": 11,
      "penalty 1st downs": 0,
      "rushing yards": 121,
      "rushing attempts": 27,
      "passing yards": 263,
      "passing attempts": 40,
      "passing completions": 24,
      "passing interceptions": 1,
      "total yards": 384,
      "total plays": 67,
      "fumbles": 1,
      "fumbles lost": 1,
      "penalties": 4,
      "penalty yards": 49,
      "punts": 7,
      "punt yards": 242,
      "punt returns": 1,
      "punt return yards": 25,
      "kickoff returns": 4,
      "kickoff return yards": 43,
      "interception returns": 0,
      "interception return yards": 0,
      "3rd down conversions": 5,
      "3rd down attempts": 14,
      "4th down conversions": 1,
      "4th down attempts": 2
    },
    "CentralMichigan": {
      "points": 42,
      "1st downs": 22,
      "rushing 1st downs": 16,
      "passing 1st downs": 6,
      "penalty 1st downs": 0,
      "rushing yards": 352,
      "rushing attempts": 56,
      "passing yards": 134,
      "passing attempts": 24,
      "passing completions": 14,
      "passing interceptions": 0,
      "total yards": 486,
      "total plays": 80,
      "fumbles": 2,
      "fumbles lost": 1,
      "penalties": 3,
      "penalty yards": 15,
      "punts": 4,
      "punt yards": 174,
      "punt returns": 4,
      "punt return yards": 68,
      "kickoff returns": 3,
      "kickoff return yards": 73,
      "interception returns": 1,
      "interception return yards": 0,
      "3rd down conversions": 8,
      "3rd down attempts": 18,
      "4th down conversions": 2,
      "4th down attempts": 3
    }
  },
  "BrighamYoung vs SouthFlorida": {
    "stadium": "RaymondJamesStadium-Tampa-FL",
    "BrighamYoung": {
      "points": 23,
      "1st downs": 26,
      "rushing 1st downs": 15,
      "passing 1st downs": 9,
      "penalty 1st downs": 2,
      "rushing yards": 218,
      "rushing attempts": 56,
      "passing yards": 221,
      "passing attempts": 33,
      "passing completions": 21,
      "passing interceptions": 0,
      "total yards": 439,
      "total plays": 89,
      "fumbles": 1,
      "fumbles lost": 1,
      "penalties": 5,
      "penalty yards": 40,
      "punts": 3,
      "punt yards": 140,
      "punt returns": 2,
      "punt return yards": 26,
      "kickoff returns": 3,
      "kickoff return yards": 70,
      "interception returns": 1,
      "interception return yards": 14,
      "3rd down conversions": 12,
      "3rd down attempts": 22,
      "4th down conversions": 0,
      "4th down attempts": 3
    },
    "SouthFlorida": {
      "points": 27,
      "1st downs": 17,
      "rushing 1st downs": 15,
      "passing 1st downs": 2,
      "penalty 1st downs": 0,
      "rushing yards": 243,
      "rushing attempts": 44,
      "passing yards": 72,
      "passing attempts": 14,
      "passing completions": 7,
      "passing interceptions": 1,
      "total yards": 315,
      "total plays": 58,
      "fumbles": 1,
      "fumbles lost": 1,
      "penalties": 11,
      "penalty yards": 105,
      "punts": 5,
      "punt yards": 264,
      "punt returns": 2,
      "punt return yards": 22,
      "kickoff returns": 5,
      "kickoff return yards": 151,
      "interception returns": 0,
      "interception return yards": 0,
      "3rd down conversions": 6,
      "3rd down attempts": 12,
      "4th down conversions": 0,
      "4th down attempts": 0
    }
  },
  "KentState vs Akron": {
    "stadium": "InfoCisionStadiumSummaField-Akron-OH",
    "KentState": {
      "points": 26,
      "1st downs": 24,
      "rushing 1st downs": 16,
      "passing 1st downs": 5,
      "penalty 1st downs": 3,
      "rushing yards": 233,
      "rushing attempts": 48,
      "passing yards": 149,
      "passing attempts": 21,
      "passing completions": 16,
      "passing interceptions": 0,
      "total yards": 382,
      "total plays": 69,
      "fumbles": 1,
      "fumbles lost": 0,
      "penalties": 5,
      "penalty yards": 52,
      "punts": 2,
      "punt yards": 68,
      "punt returns": 0,
      "punt return yards": 0,
      "kickoff returns": 1,
      "kickoff return yards": 0,
      "interception returns": 0,
      "interception return yards": 0,
      "3rd down conversions": 6,
      "3rd down attempts": 13,
      "4th down conversions": 1,
      "4th down attempts": 1
    },
    "Akron": {
      "points": 3,
      "1st downs": 18,
      "rushing 1st downs": 6,
      "passing 1st downs": 9,
      "penalty 1st downs": 3,
      "rushing yards": 95,
      "rushing attempts": 32,
      "passing yards": 202,
      "passing attempts": 29,
      "passing completions": 17,
      "passing interceptions": 0,
      "total yards": 297,
      "total plays": 61,
      "fumbles": 1,
      "fumbles lost": 1,
      "penalties": 11,
      "penalty yards": 89,
      "punts": 3,
      "punt yards": 114,
      "punt returns": 1,
      "punt return yards": 4,
      "kickoff returns": 5,
      "kickoff return yards": 120,
      "interception returns": 0,
      "interception return yards": 0,
      "3rd down conversions": 5,
      "3rd down attempts": 13,
      "4th down conversions": 1,
      "4th down attempts": 3
    }
  },
  "FloridaState vs Clemson": {
    "stadium": "MemorialStadium-Clemson-SC",
    "FloridaState": {
      "points": 14,
      "1st downs": 10,
      "rushing 1st downs": 3,
      "passing 1st downs": 5,
      "penalty 1st downs": 2,
      "rushing yards": 103,
      "rushing attempts": 23,
      "passing yards": 150,
      "passing attempts": 35,
      "passing completions": 17,
      "passing interceptions": 3,
      "total yards": 253,
      "total plays": 58,
      "fumbles": 2,
      "fumbles lost": 1,
      "penalties": 7,
      "penalty yards": 68,
      "punts": 9,
      "punt yards": 342,
      "punt returns": 1,
      "punt return yards": 9,
      "kickoff returns": 2,
      "kickoff return yards": 42,
      "interception returns": 1,
      "interception return yards": 0,
      "3rd down conversions": 2,
      "3rd down attempts": 13,
      "4th down conversions": 0,
      "4th down attempts": 1
    },
    "Clemson": {
      "points": 45,
      "1st downs": 31,
      "rushing 1st downs": 12,
      "passing 1st downs": 15,
      "penalty 1st downs": 4,
      "rushing yards": 320,
      "rushing attempts": 53,
      "passing yards": 232,
      "passing attempts": 38,
      "passing completions": 24,
      "passing interceptions": 1,
      "total yards": 552,
      "total plays": 91,
      "fumbles": 1,
      "fumbles lost": 1,
      "penalties": 6,
      "penalty yards": 65,
      "punts": 4,
      "punt yards": 157,
      "punt returns": 0,
      "punt return yards": 0,
      "kickoff returns": 0,
      "kickoff return yards": 0,
      "interception returns": 3,
      "interception return yards": 48,
      "3rd down conversions": 5,
      "3rd down attempts": 16,
      "4th down conversions": 1,
      "4th down attempts": 3
    }
  },
  "NorthernIllinois vs Ohio": {
    "stadium": "PedenStadium-Athens-OH",
    "NorthernIllinois": {
      "points": 39,
      "1st downs": 22,
      "rushing 1st downs": 6,
      "passing 1st downs": 15,
      "penalty 1st downs": 1,
      "rushing yards": 169,
      "rushing attempts": 31,
      "passing yards": 341,
      "passing attempts": 40,
      "passing completions": 24,
      "passing interceptions": 1,
      "total yards": 510,
      "total plays": 71,
      "fumbles": 0,
      "fumbles lost": 0,
      "penalties": 3,
      "penalty yards": 11,
      "punts": 2,
      "punt yards": 82,
      "punt returns": 1,
      "punt return yards": 23,
      "kickoff returns": 0,
      "kickoff return yards": 0,
      "interception returns": 0,
      "interception return yards": 0,
      "3rd down conversions": 10,
      "3rd down attempts": 16,
      "4th down conversions": 2,
      "4th down attempts": 2
    },
    "Ohio": {
      "points": 36,
      "1st downs": 23,
      "rushing 1st downs": 10,
      "passing 1st downs": 12,
      "penalty 1st downs": 1,
      "rushing yards": 178,
      "rushing attempts": 34,
      "passing yards": 260,
      "passing attempts": 33,
      "passing completions": 20,
      "passing interceptions": 0,
      "total yards": 438,
      "total plays": 67,
      "fumbles": 0,
      "fumbles lost": 0,
      "penalties": 6,
      "penalty yards": 70,
      "punts": 4,
      "punt yards": 174,
      "punt returns": 1,
      "punt return yards": 17,
      "kickoff returns": 6,
      "kickoff return yards": 157,
      "interception returns": 1,
      "interception return yards": 14,
      "3rd down conversions": 6,
      "3rd down attempts": 12,
      "4th down conversions": 0,
      "4th down attempts": 1
    }
  },
  "Cincinnati vs Houston": {
    "stadium": "JohnOQuinnFieldatTDECUStadium-Houston-TX",
    "Cincinnati": {
      "points": 38,
      "1st downs": 17,
      "rushing 1st downs": 5,
      "passing 1st downs": 9,
      "penalty 1st downs": 3,
      "rushing yards": 131,
      "rushing attempts": 34,
      "passing yards": 263,
      "passing attempts": 24,
      "passing completions": 14,
      "passing interceptions": 1,
      "total yards": 394,
      "total plays": 58,
      "fumbles": 0,
      "fumbles lost": 0,
      "penalties": 12,
      "penalty yards": 84,
      "punts": 5,
      "punt yards": 206,
      "punt returns": 2,
      "punt return yards": 11,
      "kickoff returns": 2,
      "kickoff return yards": 71,
      "interception returns": 4,
      "interception return yards": 24,
      "3rd down conversions": 5,
      "3rd down attempts": 13,
      "4th down conversions": 0,
      "4th down attempts": 0
    },
    "Houston": {
      "points": 23,
      "1st downs": 16,
      "rushing 1st downs": 8,
      "passing 1st downs": 7,
      "penalty 1st downs": 1,
      "rushing yards": 190,
      "rushing attempts": 37,
      "passing yards": 234,
      "passing attempts": 30,
      "passing completions": 10,
      "passing interceptions": 4,
      "total yards": 424,
      "total plays": 67,
      "fumbles": 1,
      "fumbles lost": 1,
      "penalties": 7,
      "penalty yards": 69,
      "punts": 4,
      "punt yards": 216,
      "punt returns": 2,
      "punt return yards": 3,
      "kickoff returns": 6,
      "kickoff return yards": 107,
      "interception returns": 1,
      "interception return yards": 11,
      "3rd down conversions": 5,
      "3rd down attempts": 15,
      "4th down conversions": 2,
      "4th down attempts": 3
    }
  },
  "MichiganState vs Wisconsin": {
    "stadium": "CampRandallStadium-Madison-WI",
    "MichiganState": {
      "points": 0,
      "1st downs": 7,
      "rushing 1st downs": 3,
      "passing 1st downs": 4,
      "penalty 1st downs": 0,
      "rushing yards": 30,
      "rushing attempts": 21,
      "passing yards": 119,
      "passing attempts": 30,
      "passing completions": 12,
      "passing interceptions": 2,
      "total yards": 149,
      "total plays": 51,
      "fumbles": 2,
      "fumbles lost": 0,
      "penalties": 5,
      "penalty yards": 40,
      "punts": 9,
      "punt yards": 388,
      "punt returns": 1,
      "punt return yards": -1,
      "kickoff returns": 1,
      "kickoff return yards": 18,
      "interception returns": 0,
      "interception return yards": 0,
      "3rd down conversions": 2,
      "3rd down attempts": 14,
      "4th down conversions": 2,
      "4th down attempts": 2
    },
    "Wisconsin": {
      "points": 38,
      "1st downs": 22,
      "rushing 1st downs": 10,
      "passing 1st downs": 10,
      "penalty 1st downs": 2,
      "rushing yards": 222,
      "rushing attempts": 46,
      "passing yards": 180,
      "passing attempts": 21,
      "passing completions": 18,
      "passing interceptions": 0,
      "total yards": 402,
      "total plays": 67,
      "fumbles": 2,
      "fumbles lost": 0,
      "penalties": 1,
      "penalty yards": 10,
      "punts": 4,
      "punt yards": 138,
      "punt returns": 3,
      "punt return yards": 9,
      "kickoff returns": 1,
      "kickoff return yards": 38,
      "interception returns": 2,
      "interception return yards": 45,
      "3rd down conversions": 6,
      "3rd down attempts": 13,
      "4th down conversions": 2,
      "4th down attempts": 2
    }
  },
  "Alabama vs TexasAM": {
    "stadium": "KyleField-CollegeStation-TX",
    "Alabama": {
      "points": 47,
      "1st downs": 25,
      "rushing 1st downs": 11,
      "passing 1st downs": 13,
      "penalty 1st downs": 1,
      "rushing yards": 155,
      "rushing attempts": 31,
      "passing yards": 293,
      "passing attempts": 34,
      "passing completions": 21,
      "passing interceptions": 1,
      "total yards": 448,
      "total plays": 65,
      "fumbles": 0,
      "fumbles lost": 0,
      "penalties": 11,
      "penalty yards": 91,
      "punts": 2,
      "punt yards": 59,
      "punt returns": 5,
      "punt return yards": 152,
      "kickoff returns": 5,
      "kickoff return yards": 159,
      "interception returns": 0,
      "interception return yards": 0,
      "3rd down conversions": 8,
      "3rd down attempts": 13,
      "4th down conversions": 0,
      "4th down attempts": 0
    },
    "TexasAM": {
      "points": 28,
      "1st downs": 24,
      "rushing 1st downs": 8,
      "passing 1st downs": 13,
      "penalty 1st downs": 3,
      "rushing yards": 125,
      "rushing attempts": 28,
      "passing yards": 264,
      "passing attempts": 42,
      "passing completions": 24,
      "passing interceptions": 0,
      "total yards": 389,
      "total plays": 70,
      "fumbles": 2,
      "fumbles lost": 1,
      "penalties": 5,
      "penalty yards": 55,
      "punts": 4,
      "punt yards": 199,
      "punt returns": 1,
      "punt return yards": 10,
      "kickoff returns": 1,
      "kickoff return yards": 14,
      "interception returns": 1,
      "interception return yards": 16,
      "3rd down conversions": 5,
      "3rd down attempts": 12,
      "4th down conversions": 0,
      "4th down attempts": 1
    }
  },
  "WashingtonState vs ArizonaState": {
    "stadium": "SunDevilStadium-Tempe-AZ",
    "WashingtonState": {
      "points": 34,
      "1st downs": 29,
      "rushing 1st downs": 3,
      "passing 1st downs": 23,
      "penalty 1st downs": 3,
      "rushing yards": 32,
      "rushing attempts": 10,
      "passing yards": 466,
      "passing attempts": 66,
      "passing completions": 44,
      "passing interceptions": 0,
      "total yards": 498,
      "total plays": 76,
      "fumbles": 0,
      "fumbles lost": 0,
      "penalties": 7,
      "penalty yards": 58,
      "punts": 4,
      "punt yards": 221,
      "punt returns": 0,
      "punt return yards": 0,
      "kickoff returns": 5,
      "kickoff return yards": 80,
      "interception returns": 0,
      "interception return yards": 0,
      "3rd down conversions": 5,
      "3rd down attempts": 13,
      "4th down conversions": 2,
      "4th down attempts": 2
    },
    "ArizonaState": {
      "points": 38,
      "1st downs": 25,
      "rushing 1st downs": 9,
      "passing 1st downs": 16,
      "penalty 1st downs": 0,
      "rushing yards": 169,
      "rushing attempts": 32,
      "passing yards": 363,
      "passing attempts": 36,
      "passing completions": 26,
      "passing interceptions": 0,
      "total yards": 532,
      "total plays": 68,
      "fumbles": 1,
      "fumbles lost": 0,
      "penalties": 5,
      "penalty yards": 53,
      "punts": 5,
      "punt yards": 194,
      "punt returns": 1,
      "punt return yards": 7,
      "kickoff returns": 2,
      "kickoff return yards": 44,
      "interception returns": 0,
      "interception return yards": 0,
      "3rd down conversions": 4,
      "3rd down attempts": 11,
      "4th down conversions": 2,
      "4th down attempts": 2
    }
  },
  "Connecticut vs Tulane": {
    "stadium": "YulmanStadium-NewOrleans-LA",
    "Connecticut": {
      "points": 7,
      "1st downs": 14,
      "rushing 1st downs": 7,
      "passing 1st downs": 5,
      "penalty 1st downs": 2,
      "rushing yards": 100,
      "rushing attempts": 29,
      "passing yards": 134,
      "passing attempts": 31,
      "passing completions": 19,
      "passing interceptions": 1,
      "total yards": 234,
      "total plays": 60,
      "fumbles": 1,
      "fumbles lost": 0,
      "penalties": 4,
      "penalty yards": 34,
      "punts": 8,
      "punt yards": 347,
      "punt returns": 0,
      "punt return yards": 0,
      "kickoff returns": 4,
      "kickoff return yards": 68,
      "interception returns": 0,
      "interception return yards": 0,
      "3rd down conversions": 1,
      "3rd down attempts": 12,
      "4th down conversions": 0,
      "4th down attempts": 2
    },
    "Tulane": {
      "points": 49,
      "1st downs": 31,
      "rushing 1st downs": 16,
      "passing 1st downs": 14,
      "penalty 1st downs": 1,
      "rushing yards": 311,
      "rushing attempts": 46,
      "passing yards": 323,
      "passing attempts": 34,
      "passing completions": 26,
      "passing interceptions": 0,
      "total yards": 634,
      "total plays": 80,
      "fumbles": 0,
      "fumbles lost": 0,
      "penalties": 8,
      "penalty yards": 81,
      "punts": 2,
      "punt yards": 61,
      "punt returns": 3,
      "punt return yards": 34,
      "kickoff returns": 0,
      "kickoff return yards": 0,
      "interception returns": 1,
      "interception return yards": 20,
      "3rd down conversions": 7,
      "3rd down attempts": 12,
      "4th down conversions": 1,
      "4th down attempts": 3
    }
  },
  "SanJoseState vs Nevada": {
    "stadium": "MackayStadium-Reno-NV",
    "SanJoseState": {
      "points": 38,
      "1st downs": 16,
      "rushing 1st downs": 2,
      "passing 1st downs": 13,
      "penalty 1st downs": 1,
      "rushing yards": 15,
      "rushing attempts": 16,
      "passing yards": 405,
      "passing attempts": 45,
      "passing completions": 23,
      "passing interceptions": 1,
      "total yards": 420,
      "total plays": 61,
      "fumbles": 3,
      "fumbles lost": 1,
      "penalties": 5,
      "penalty yards": 21,
      "punts": 7,
      "punt yards": 258,
      "punt returns": 3,
      "punt return yards": 17,
      "kickoff returns": 1,
      "kickoff return yards": 18,
      "interception returns": 2,
      "interception return yards": 0,
      "3rd down conversions": 2,
      "3rd down attempts": 12,
      "4th down conversions": 1,
      "4th down attempts": 1
    },
    "Nevada": {
      "points": 41,
      "1st downs": 26,
      "rushing 1st downs": 9,
      "passing 1st downs": 16,
      "penalty 1st downs": 1,
      "rushing yards": 189,
      "rushing attempts": 51,
      "passing yards": 352,
      "passing attempts": 37,
      "passing completions": 22,
      "passing interceptions": 2,
      "total yards": 541,
      "total plays": 88,
      "fumbles": 3,
      "fumbles lost": 1,
      "penalties": 9,
      "penalty yards": 91,
      "punts": 4,
      "punt yards": 168,
      "punt returns": 2,
      "punt return yards": 15,
      "kickoff returns": 4,
      "kickoff return yards": 93,
      "interception returns": 1,
      "interception return yards": 40,
      "3rd down conversions": 8,
      "3rd down attempts": 18,
      "4th down conversions": 1,
      "4th down attempts": 2
    }
  },
  "FCS vs VirginiaTech": {
    "stadium": "LaneStadium-Blacksburg-VA",
    "FCS": {
      "points": 17,
      "1st downs": 18,
      "rushing 1st downs": 1,
      "passing 1st downs": 13,
      "penalty 1st downs": 4,
      "rushing yards": 24,
      "rushing attempts": 15,
      "passing yards": 286,
      "passing attempts": 48,
      "passing completions": 26,
      "passing interceptions": 0,
      "total yards": 310,
      "total plays": 63,
      "fumbles": 0,
      "fumbles lost": 0,
      "penalties": 8,
      "penalty yards": 67,
      "punts": 2,
      "punt yards": 79,
      "punt returns": 0,
      "punt return yards": 0,
      "kickoff returns": 1,
      "kickoff return yards": 11,
      "interception returns": 0,
      "interception return yards": 0,
      "3rd down conversions": 5,
      "3rd down attempts": 15,
      "4th down conversions": 2,
      "4th down attempts": 4
    },
    "VirginiaTech": {
      "points": 34,
      "1st downs": 25,
      "rushing 1st downs": 15,
      "passing 1st downs": 8,
      "penalty 1st downs": 2,
      "rushing yards": 224,
      "rushing attempts": 40,
      "passing yards": 261,
      "passing attempts": 28,
      "passing completions": 16,
      "passing interceptions": 0,
      "total yards": 485,
      "total plays": 68,
      "fumbles": 1,
      "fumbles lost": 0,
      "penalties": 6,
      "penalty yards": 54,
      "punts": 1,
      "punt yards": 39,
      "punt returns": 0,
      "punt return yards": 0,
      "kickoff returns": 3,
      "kickoff return yards": 30,
      "interception returns": 0,
      "interception return yards": 0,
      "3rd down conversions": 6,
      "3rd down attempts": 10,
      "4th down conversions": 0,
      "4th down attempts": 1
    }
  },
  "MiddleTennessee vs FloridaAtlantic": {
    "stadium": "FAUStadium-BocaRaton-FL",
    "MiddleTennessee": {
      "points": 13,
      "1st downs": 24,
      "rushing 1st downs": 9,
      "passing 1st downs": 11,
      "penalty 1st downs": 4,
      "rushing yards": 124,
      "rushing attempts": 29,
      "passing yards": 335,
      "passing attempts": 42,
      "passing completions": 24,
      "passing interceptions": 3,
      "total yards": 459,
      "total plays": 71,
      "fumbles": 1,
      "fumbles lost": 0,
      "penalties": 8,
      "penalty yards": 69,
      "punts": 3,
      "punt yards": 138,
      "punt returns": 1,
      "punt return yards": 1,
      "kickoff returns": 2,
      "kickoff return yards": 18,
      "interception returns": 0,
      "interception return yards": 0,
      "3rd down conversions": 5,
      "3rd down attempts": 12,
      "4th down conversions": 1,
      "4th down attempts": 2
    },
    "FloridaAtlantic": {
      "points": 28,
      "1st downs": 19,
      "rushing 1st downs": 11,
      "passing 1st downs": 8,
      "penalty 1st downs": 0,
      "rushing yards": 203,
      "rushing attempts": 40,
      "passing yards": 161,
      "passing attempts": 31,
      "passing completions": 16,
      "passing interceptions": 0,
      "total yards": 364,
      "total plays": 71,
      "fumbles": 0,
      "fumbles lost": 0,
      "penalties": 9,
      "penalty yards": 74,
      "punts": 6,
      "punt yards": 252,
      "punt returns": 1,
      "punt return yards": 0,
      "kickoff returns": 3,
      "kickoff return yards": 78,
      "interception returns": 3,
      "interception return yards": 0,
      "3rd down conversions": 8,
      "3rd down attempts": 17,
      "4th down conversions": 1,
      "4th down attempts": 1
    }
  },
  "UNLV vs Vanderbilt": {
    "stadium": "VanderbiltStadium-Nashville-TN",
    "UNLV": {
      "points": 34,
      "1st downs": 21,
      "rushing 1st downs": 10,
      "passing 1st downs": 8,
      "penalty 1st downs": 3,
      "rushing yards": 206,
      "rushing attempts": 53,
      "passing yards": 172,
      "passing attempts": 16,
      "passing completions": 11,
      "passing interceptions": 0,
      "total yards": 378,
      "total plays": 69,
      "fumbles": 1,
      "fumbles lost": 1,
      "penalties": 3,
      "penalty yards": 25,
      "punts": 2,
      "punt yards": 75,
      "punt returns": 0,
      "punt return yards": 0,
      "kickoff returns": 1,
      "kickoff return yards": 21,
      "interception returns": 1,
      "interception return yards": 44,
      "3rd down conversions": 5,
      "3rd down attempts": 13,
      "4th down conversions": 2,
      "4th down attempts": 3
    },
    "Vanderbilt": {
      "points": 10,
      "1st downs": 12,
      "rushing 1st downs": 8,
      "passing 1st downs": 4,
      "penalty 1st downs": 0,
      "rushing yards": 166,
      "rushing attempts": 22,
      "passing yards": 140,
      "passing attempts": 41,
      "passing completions": 16,
      "passing interceptions": 1,
      "total yards": 306,
      "total plays": 63,
      "fumbles": 1,
      "fumbles lost": 1,
      "penalties": 3,
      "penalty yards": 38,
      "punts": 2,
      "punt yards": 58,
      "punt returns": 1,
      "punt return yards": 14,
      "kickoff returns": 6,
      "kickoff return yards": 139,
      "interception returns": 0,
      "interception return yards": 0,
      "3rd down conversions": 6,
      "3rd down attempts": 15,
      "4th down conversions": 0,
      "4th down attempts": 4
    }
  },
  "TexasTech vs Baylor": {
    "stadium": "McLaneStadium-Waco-TX",
    "TexasTech": {
      "points": 30,
      "1st downs": 26,
      "rushing 1st downs": 9,
      "passing 1st downs": 15,
      "penalty 1st downs": 2,
      "rushing yards": 148,
      "rushing attempts": 43,
      "passing yards": 362,
      "passing attempts": 42,
      "passing completions": 31,
      "passing interceptions": 2,
      "total yards": 510,
      "total plays": 85,
      "fumbles": 2,
      "fumbles lost": 1,
      "penalties": 8,
      "penalty yards": 67,
      "punts": 4,
      "punt yards": 178,
      "punt returns": 0,
      "punt return yards": 0,
      "kickoff returns": 4,
      "kickoff return yards": 63,
      "interception returns": 3,
      "interception return yards": 23,
      "3rd down conversions": 8,
      "3rd down attempts": 18,
      "4th down conversions": 1,
      "4th down attempts": 2
    },
    "Baylor": {
      "points": 33,
      "1st downs": 27,
      "rushing 1st downs": 9,
      "passing 1st downs": 15,
      "penalty 1st downs": 3,
      "rushing yards": 173,
      "rushing attempts": 38,
      "passing yards": 352,
      "passing attempts": 38,
      "passing completions": 24,
      "passing interceptions": 3,
      "total yards": 525,
      "total plays": 76,
      "fumbles": 1,
      "fumbles lost": 0,
      "penalties": 10,
      "penalty yards": 83,
      "punts": 5,
      "punt yards": 164,
      "punt returns": 1,
      "punt return yards": 12,
      "kickoff returns": 4,
      "kickoff return yards": 111,
      "interception returns": 2,
      "interception return yards": 24,
      "3rd down conversions": 4,
      "3rd down attempts": 11,
      "4th down conversions": 0,
      "4th down attempts": 0
    }
  },
  "IowaState vs WestVirginia": {
    "stadium": "MountaineerFieldatMilanPuskarStadium-Morgantown-WV",
    "IowaState": {
      "points": 38,
      "1st downs": 26,
      "rushing 1st downs": 10,
      "passing 1st downs": 13,
      "penalty 1st downs": 3,
      "rushing yards": 143,
      "rushing attempts": 43,
      "passing yards": 229,
      "passing attempts": 30,
      "passing completions": 19,
      "passing interceptions": 1,
      "total yards": 372,
      "total plays": 73,
      "fumbles": 0,
      "fumbles lost": 0,
      "penalties": 4,
      "penalty yards": 30,
      "punts": 3,
      "punt yards": 137,
      "punt returns": 0,
      "punt return yards": 0,
      "kickoff returns": 1,
      "kickoff return yards": 0,
      "interception returns": 1,
      "interception return yards": 23,
      "3rd down conversions": 6,
      "3rd down attempts": 14,
      "4th down conversions": 3,
      "4th down attempts": 3
    },
    "WestVirginia": {
      "points": 14,
      "1st downs": 12,
      "rushing 1st downs": 6,
      "passing 1st downs": 6,
      "penalty 1st downs": 0,
      "rushing yards": 41,
      "rushing attempts": 28,
      "passing yards": 149,
      "passing attempts": 25,
      "passing completions": 19,
      "passing interceptions": 1,
      "total yards": 190,
      "total plays": 53,
      "fumbles": 3,
      "fumbles lost": 2,
      "penalties": 6,
      "penalty yards": 53,
      "punts": 6,
      "punt yards": 263,
      "punt returns": 0,
      "punt return yards": 0,
      "kickoff returns": 5,
      "kickoff return yards": 110,
      "interception returns": 1,
      "interception return yards": 19,
      "3rd down conversions": 6,
      "3rd down attempts": 13,
      "4th down conversions": 0,
      "4th down attempts": 0
    }
  },
  "GeorgiaState vs CoastalCarolina": {
    "stadium": "BrooksStadium-Conway-SC",
    "GeorgiaState": {
      "points": 31,
      "1st downs": 23,
      "rushing 1st downs": 18,
      "passing 1st downs": 3,
      "penalty 1st downs": 2,
      "rushing yards": 350,
      "rushing attempts": 56,
      "passing yards": 122,
      "passing attempts": 24,
      "passing completions": 16,
      "passing interceptions": 1,
      "total yards": 472,
      "total plays": 80,
      "fumbles": 1,
      "fumbles lost": 0,
      "penalties": 2,
      "penalty yards": 18,
      "punts": 4,
      "punt yards": 93,
      "punt returns": 1,
      "punt return yards": -2,
      "kickoff returns": 0,
      "kickoff return yards": 0,
      "interception returns": 0,
      "interception return yards": 0,
      "3rd down conversions": 10,
      "3rd down attempts": 19,
      "4th down conversions": 2,
      "4th down attempts": 2
    },
    "CoastalCarolina": {
      "points": 21,
      "1st downs": 15,
      "rushing 1st downs": 4,
      "passing 1st downs": 11,
      "penalty 1st downs": 0,
      "rushing yards": 105,
      "rushing attempts": 27,
      "passing yards": 217,
      "passing attempts": 31,
      "passing completions": 19,
      "passing interceptions": 0,
      "total yards": 322,
      "total plays": 58,
      "fumbles": 4,
      "fumbles lost": 3,
      "penalties": 7,
      "penalty yards": 65,
      "punts": 5,
      "punt yards": 211,
      "punt returns": 1,
      "punt return yards": 10,
      "kickoff returns": 1,
      "kickoff return yards": 12,
      "interception returns": 1,
      "interception return yards": 19,
      "3rd down conversions": 5,
      "3rd down attempts": 15,
      "4th down conversions": 2,
      "4th down attempts": 3
    }
  },
  "UAB vs UTSA": {
    "stadium": "Alamodome-SanAntonio-TX",
    "UAB": {
      "points": 33,
      "1st downs": 26,
      "rushing 1st downs": 9,
      "passing 1st downs": 14,
      "penalty 1st downs": 3,
      "rushing yards": 198,
      "rushing attempts": 41,
      "passing yards": 294,
      "passing attempts": 26,
      "passing completions": 17,
      "passing interceptions": 1,
      "total yards": 492,
      "total plays": 67,
      "fumbles": 2,
      "fumbles lost": 1,
      "penalties": 6,
      "penalty yards": 68,
      "punts": 1,
      "punt yards": 53,
      "punt returns": 2,
      "punt return yards": 19,
      "kickoff returns": 2,
      "kickoff return yards": 24,
      "interception returns": 0,
      "interception return yards": 0,
      "3rd down conversions": 2,
      "3rd down attempts": 11,
      "4th down conversions": 1,
      "4th down attempts": 2
    },
    "UTSA": {
      "points": 14,
      "1st downs": 12,
      "rushing 1st downs": 6,
      "passing 1st downs": 3,
      "penalty 1st downs": 3,
      "rushing yards": 126,
      "rushing attempts": 36,
      "passing yards": 94,
      "passing attempts": 20,
      "passing completions": 8,
      "passing interceptions": 0,
      "total yards": 220,
      "total plays": 56,
      "fumbles": 2,
      "fumbles lost": 2,
      "penalties": 9,
      "penalty yards": 78,
      "punts": 5,
      "punt yards": 219,
      "punt returns": 1,
      "punt return yards": 0,
      "kickoff returns": 4,
      "kickoff return yards": 91,
      "interception returns": 1,
      "interception return yards": 2,
      "3rd down conversions": 4,
      "3rd down attempts": 13,
      "4th down conversions": 0,
      "4th down attempts": 2
    }
  },
  "NorthTexas vs SouthernMiss": {
    "stadium": "MMRobertsStadium-Hattiesburg-MS",
    "NorthTexas": {
      "points": 27,
      "1st downs": 18,
      "rushing 1st downs": 8,
      "passing 1st downs": 8,
      "penalty 1st downs": 2,
      "rushing yards": 122,
      "rushing attempts": 32,
      "passing yards": 256,
      "passing attempts": 31,
      "passing completions": 14,
      "passing interceptions": 2,
      "total yards": 378,
      "total plays": 63,
      "fumbles": 0,
      "fumbles lost": 0,
      "penalties": 4,
      "penalty yards": 29,
      "punts": 5,
      "punt yards": 216,
      "punt returns": 0,
      "punt return yards": 0,
      "kickoff returns": 6,
      "kickoff return yards": 112,
      "interception returns": 0,
      "interception return yards": 0,
      "3rd down conversions": 2,
      "3rd down attempts": 12,
      "4th down conversions": 2,
      "4th down attempts": 2
    },
    "SouthernMiss": {
      "points": 45,
      "1st downs": 24,
      "rushing 1st downs": 6,
      "passing 1st downs": 18,
      "penalty 1st downs": 0,
      "rushing yards": 142,
      "rushing attempts": 37,
      "passing yards": 421,
      "passing attempts": 36,
      "passing completions": 29,
      "passing interceptions": 0,
      "total yards": 563,
      "total plays": 73,
      "fumbles": 2,
      "fumbles lost": 0,
      "penalties": 6,
      "penalty yards": 56,
      "punts": 6,
      "punt yards": 181,
      "punt returns": 3,
      "punt return yards": -3,
      "kickoff returns": 1,
      "kickoff return yards": 1,
      "interception returns": 2,
      "interception return yards": 35,
      "3rd down conversions": 6,
      "3rd down attempts": 13,
      "4th down conversions": 0,
      "4th down attempts": 0
    }
  },
  "Massachusetts vs LouisianaTech": {
    "stadium": "JoeAilletStadium-Ruston-LA",
    "Massachusetts": {
      "points": 21,
      "1st downs": 19,
      "rushing 1st downs": 6,
      "passing 1st downs": 12,
      "penalty 1st downs": 1,
      "rushing yards": 126,
      "rushing attempts": 41,
      "passing yards": 221,
      "passing attempts": 43,
      "passing completions": 25,
      "passing interceptions": 2,
      "total yards": 347,
      "total plays": 84,
      "fumbles": 1,
      "fumbles lost": 0,
      "penalties": 5,
      "penalty yards": 46,
      "punts": 9,
      "punt yards": 303,
      "punt returns": 0,
      "punt return yards": 0,
      "kickoff returns": 9,
      "kickoff return yards": 199,
      "interception returns": 1,
      "interception return yards": 0,
      "3rd down conversions": 9,
      "3rd down attempts": 21,
      "4th down conversions": 0,
      "4th down attempts": 2
    },
    "LouisianaTech": {
      "points": 69,
      "1st downs": 28,
      "rushing 1st downs": 14,
      "passing 1st downs": 12,
      "penalty 1st downs": 2,
      "rushing yards": 385,
      "rushing attempts": 38,
      "passing yards": 304,
      "passing attempts": 35,
      "passing completions": 19,
      "passing interceptions": 1,
      "total yards": 689,
      "total plays": 73,
      "fumbles": 2,
      "fumbles lost": 2,
      "penalties": 4,
      "penalty yards": 35,
      "punts": 2,
      "punt yards": 68,
      "punt returns": 1,
      "punt return yards": 0,
      "kickoff returns": 3,
      "kickoff return yards": 102,
      "interception returns": 2,
      "interception return yards": 42,
      "3rd down conversions": 5,
      "3rd down attempts": 10,
      "4th down conversions": 1,
      "4th down attempts": 1
    }
  },
  "Army vs WesternKentucky": {
    "stadium": "HouchensIndustriesLTSmithStadium-BowlingGreen-KY",
    "Army": {
      "points": 8,
      "1st downs": 10,
      "rushing 1st downs": 6,
      "passing 1st downs": 3,
      "penalty 1st downs": 1,
      "rushing yards": 137,
      "rushing attempts": 36,
      "passing yards": 71,
      "passing attempts": 12,
      "passing completions": 5,
      "passing interceptions": 0,
      "total yards": 208,
      "total plays": 48,
      "fumbles": 0,
      "fumbles lost": 0,
      "penalties": 2,
      "penalty yards": 30,
      "punts": 5,
      "punt yards": 222,
      "punt returns": 2,
      "punt return yards": 5,
      "kickoff returns": 0,
      "kickoff return yards": 0,
      "interception returns": 0,
      "interception return yards": 0,
      "3rd down conversions": 3,
      "3rd down attempts": 11,
      "4th down conversions": 2,
      "4th down attempts": 2
    },
    "WesternKentucky": {
      "points": 17,
      "1st downs": 26,
      "rushing 1st downs": 15,
      "passing 1st downs": 10,
      "penalty 1st downs": 1,
      "rushing yards": 225,
      "rushing attempts": 51,
      "passing yards": 140,
      "passing attempts": 30,
      "passing completions": 21,
      "passing interceptions": 0,
      "total yards": 365,
      "total plays": 81,
      "fumbles": 0,
      "fumbles lost": 0,
      "penalties": 2,
      "penalty yards": 28,
      "punts": 2,
      "punt yards": 98,
      "punt returns": 2,
      "punt return yards": 7,
      "kickoff returns": 2,
      "kickoff return yards": 16,
      "interception returns": 0,
      "interception return yards": 0,
      "3rd down conversions": 10,
      "3rd down attempts": 17,
      "4th down conversions": 2,
      "4th down attempts": 3
    }
  },
  "FresnoState vs AirForce": {
    "stadium": "FalconStadium-USAirForceAcademy-CO",
    "FresnoState": {
      "points": 24,
      "1st downs": 12,
      "rushing 1st downs": 2,
      "passing 1st downs": 10,
      "penalty 1st downs": 0,
      "rushing yards": 59,
      "rushing attempts": 15,
      "passing yards": 209,
      "passing attempts": 27,
      "passing completions": 20,
      "passing interceptions": 1,
      "total yards": 268,
      "total plays": 42,
      "fumbles": 1,
      "fumbles lost": 0,
      "penalties": 5,
      "penalty yards": 19,
      "punts": 3,
      "punt yards": 126,
      "punt returns": 0,
      "punt return yards": 0,
      "kickoff returns": 3,
      "kickoff return yards": 51,
      "interception returns": 0,
      "interception return yards": 0,
      "3rd down conversions": 4,
      "3rd down attempts": 8,
      "4th down conversions": 0,
      "4th down attempts": 0
    },
    "AirForce": {
      "points": 43,
      "1st downs": 28,
      "rushing 1st downs": 25,
      "passing 1st downs": 2,
      "penalty 1st downs": 1,
      "rushing yards": 340,
      "rushing attempts": 69,
      "passing yards": 81,
      "passing attempts": 3,
      "passing completions": 2,
      "passing interceptions": 0,
      "total yards": 421,
      "total plays": 72,
      "fumbles": 0,
      "fumbles lost": 0,
      "penalties": 1,
      "penalty yards": 5,
      "punts": 1,
      "punt yards": 51,
      "punt returns": 0,
      "punt return yards": 0,
      "kickoff returns": 0,
      "kickoff return yards": 0,
      "interception returns": 1,
      "interception return yards": 24,
      "3rd down conversions": 5,
      "3rd down attempts": 10,
      "4th down conversions": 4,
      "4th down attempts": 4
    }
  },
  "Charlotte vs FloridaInternational": {
    "stadium": "RiccardoSilvaStadium-Miami-FL",
    "Charlotte": {
      "points": 23,
      "1st downs": 17,
      "rushing 1st downs": 11,
      "passing 1st downs": 5,
      "penalty 1st downs": 1,
      "rushing yards": 217,
      "rushing attempts": 41,
      "passing yards": 113,
      "passing attempts": 13,
      "passing completions": 7,
      "passing interceptions": 0,
      "total yards": 330,
      "total plays": 54,
      "fumbles": 3,
      "fumbles lost": 1,
      "penalties": 5,
      "penalty yards": 30,
      "punts": 3,
      "punt yards": 110,
      "punt returns": 1,
      "punt return yards": -4,
      "kickoff returns": 3,
      "kickoff return yards": 47,
      "interception returns": 0,
      "interception return yards": 0,
      "3rd down conversions": 3,
      "3rd down attempts": 10,
      "4th down conversions": 2,
      "4th down attempts": 2
    },
    "FloridaInternational": {
      "points": 48,
      "1st downs": 26,
      "rushing 1st downs": 16,
      "passing 1st downs": 10,
      "penalty 1st downs": 0,
      "rushing yards": 350,
      "rushing attempts": 53,
      "passing yards": 160,
      "passing attempts": 16,
      "passing completions": 13,
      "passing interceptions": 0,
      "total yards": 510,
      "total plays": 69,
      "fumbles": 2,
      "fumbles lost": 0,
      "penalties": 4,
      "penalty yards": 40,
      "punts": 1,
      "punt yards": 53,
      "punt returns": 0,
      "punt return yards": 0,
      "kickoff returns": 0,
      "kickoff return yards": 0,
      "interception returns": 0,
      "interception return yards": 0,
      "3rd down conversions": 9,
      "3rd down attempts": 11,
      "4th down conversions": 1,
      "4th down attempts": 1
    }
  },
  "OleMiss vs Missouri": {
    "stadium": "FaurotFieldatMemorialStadium-Columbia-MO",
    "OleMiss": {
      "points": 27,
      "1st downs": 25,
      "rushing 1st downs": 10,
      "passing 1st downs": 13,
      "penalty 1st downs": 2,
      "rushing yards": 204,
      "rushing attempts": 45,
      "passing yards": 236,
      "passing attempts": 33,
      "passing completions": 18,
      "passing interceptions": 0,
      "total yards": 440,
      "total plays": 78,
      "fumbles": 3,
      "fumbles lost": 1,
      "penalties": 7,
      "penalty yards": 75,
      "punts": 5,
      "punt yards": 218,
      "punt returns": 0,
      "punt return yards": 0,
      "kickoff returns": 0,
      "kickoff return yards": 0,
      "interception returns": 1,
      "interception return yards": 4,
      "3rd down conversions": 9,
      "3rd down attempts": 17,
      "4th down conversions": 1,
      "4th down attempts": 3
    },
    "Missouri": {
      "points": 38,
      "1st downs": 30,
      "rushing 1st downs": 13,
      "passing 1st downs": 14,
      "penalty 1st downs": 3,
      "rushing yards": 233,
      "rushing attempts": 43,
      "passing yards": 329,
      "passing attempts": 35,
      "passing completions": 23,
      "passing interceptions": 1,
      "total yards": 562,
      "total plays": 78,
      "fumbles": 1,
      "fumbles lost": 1,
      "penalties": 2,
      "penalty yards": 26,
      "punts": 1,
      "punt yards": 39,
      "punt returns": 2,
      "punt return yards": 10,
      "kickoff returns": 2,
      "kickoff return yards": 21,
      "interception returns": 0,
      "interception return yards": 0,
      "3rd down conversions": 9,
      "3rd down attempts": 15,
      "4th down conversions": 1,
      "4th down attempts": 1
    }
  },
  "Louisville vs WakeForest": {
    "stadium": "BBTField-WinstonSalem-NC",
    "Louisville": {
      "points": 62,
      "1st downs": 22,
      "rushing 1st downs": 9,
      "passing 1st downs": 12,
      "penalty 1st downs": 1,
      "rushing yards": 225,
      "rushing attempts": 44,
      "passing yards": 295,
      "passing attempts": 25,
      "passing completions": 17,
      "passing interceptions": 1,
      "total yards": 520,
      "total plays": 69,
      "fumbles": 2,
      "fumbles lost": 1,
      "penalties": 8,
      "penalty yards": 90,
      "punts": 4,
      "punt yards": 159,
      "punt returns": 1,
      "punt return yards": 50,
      "kickoff returns": 5,
      "kickoff return yards": 230,
      "interception returns": 2,
      "interception return yards": 11,
      "3rd down conversions": 6,
      "3rd down attempts": 14,
      "4th down conversions": 1,
      "4th down attempts": 1
    },
    "WakeForest": {
      "points": 59,
      "1st downs": 40,
      "rushing 1st downs": 16,
      "passing 1st downs": 20,
      "penalty 1st downs": 4,
      "rushing yards": 245,
      "rushing attempts": 46,
      "passing yards": 423,
      "passing attempts": 56,
      "passing completions": 33,
      "passing interceptions": 2,
      "total yards": 668,
      "total plays": 102,
      "fumbles": 3,
      "fumbles lost": 1,
      "penalties": 8,
      "penalty yards": 59,
      "punts": 6,
      "punt yards": 268,
      "punt returns": 0,
      "punt return yards": 0,
      "kickoff returns": 5,
      "kickoff return yards": 120,
      "interception returns": 1,
      "interception return yards": 0,
      "3rd down conversions": 7,
      "3rd down attempts": 15,
      "4th down conversions": 0,
      "4th down attempts": 0
    }
  },
  "PennState vs Iowa": {
    "stadium": "KinnickStadium-IowaCity-IA",
    "PennState": {
      "points": 17,
      "1st downs": 20,
      "rushing 1st downs": 12,
      "passing 1st downs": 8,
      "penalty 1st downs": 0,
      "rushing yards": 177,
      "rushing attempts": 53,
      "passing yards": 117,
      "passing attempts": 24,
      "passing completions": 12,
      "passing interceptions": 0,
      "total yards": 294,
      "total plays": 77,
      "fumbles": 0,
      "fumbles lost": 0,
      "penalties": 8,
      "penalty yards": 80,
      "punts": 7,
      "punt yards": 295,
      "punt returns": 1,
      "punt return yards": 5,
      "kickoff returns": 3,
      "kickoff return yards": 48,
      "interception returns": 1,
      "interception return yards": 4,
      "3rd down conversions": 10,
      "3rd down attempts": 19,
      "4th down conversions": 0,
      "4th down attempts": 0
    },
    "Iowa": {
      "points": 12,
      "1st downs": 21,
      "rushing 1st downs": 5,
      "passing 1st downs": 14,
      "penalty 1st downs": 2,
      "rushing yards": 70,
      "rushing attempts": 30,
      "passing yards": 286,
      "passing attempts": 43,
      "passing completions": 25,
      "passing interceptions": 1,
      "total yards": 356,
      "total plays": 73,
      "fumbles": 3,
      "fumbles lost": 1,
      "penalties": 1,
      "penalty yards": 5,
      "punts": 5,
      "punt yards": 175,
      "punt returns": 0,
      "punt return yards": 0,
      "kickoff returns": 2,
      "kickoff return yards": 42,
      "interception returns": 0,
      "interception return yards": 0,
      "3rd down conversions": 8,
      "3rd down attempts": 18,
      "4th down conversions": 2,
      "4th down attempts": 2
    }
  },
  "Nebraska vs Minnesota": {
    "stadium": "TCFBankStadium-Minneapolis-MN",
    "Nebraska": {
      "points": 7,
      "1st downs": 16,
      "rushing 1st downs": 10,
      "passing 1st downs": 5,
      "penalty 1st downs": 1,
      "rushing yards": 151,
      "rushing attempts": 43,
      "passing yards": 148,
      "passing attempts": 29,
      "passing completions": 15,
      "passing interceptions": 0,
      "total yards": 299,
      "total plays": 72,
      "fumbles": 2,
      "fumbles lost": 0,
      "penalties": 5,
      "penalty yards": 33,
      "punts": 6,
      "punt yards": 231,
      "punt returns": 2,
      "punt return yards": 7,
      "kickoff returns": 2,
      "kickoff return yards": 43,
      "interception returns": 0,
      "interception return yards": 0,
      "3rd down conversions": 6,
      "3rd down attempts": 16,
      "4th down conversions": 0,
      "4th down attempts": 4
    },
    "Minnesota": {
      "points": 34,
      "1st downs": 20,
      "rushing 1st downs": 16,
      "passing 1st downs": 4,
      "penalty 1st downs": 0,
      "rushing yards": 322,
      "rushing attempts": 49,
      "passing yards": 128,
      "passing attempts": 13,
      "passing completions": 8,
      "passing interceptions": 0,
      "total yards": 450,
      "total plays": 62,
      "fumbles": 1,
      "fumbles lost": 0,
      "penalties": 4,
      "penalty yards": 42,
      "punts": 5,
      "punt yards": 174,
      "punt returns": 1,
      "punt return yards": 4,
      "kickoff returns": 1,
      "kickoff return yards": 32,
      "interception returns": 0,
      "interception return yards": 0,
      "3rd down conversions": 8,
      "3rd down attempts": 13,
      "4th down conversions": 0,
      "4th down attempts": 0
    }
  },
  "Navy vs Tulsa": {
    "stadium": "SkellyFieldatHAChapmanStadium-Tulsa-OK",
    "Navy": {
      "points": 45,
      "1st downs": 19,
      "rushing 1st downs": 18,
      "passing 1st downs": 1,
      "penalty 1st downs": 0,
      "rushing yards": 388,
      "rushing attempts": 58,
      "passing yards": 35,
      "passing attempts": 5,
      "passing completions": 3,
      "passing interceptions": 0,
      "total yards": 423,
      "total plays": 63,
      "fumbles": 1,
      "fumbles lost": 1,
      "penalties": 4,
      "penalty yards": 35,
      "punts": 5,
      "punt yards": 219,
      "punt returns": 3,
      "punt return yards": 26,
      "kickoff returns": 2,
      "kickoff return yards": 30,
      "interception returns": 0,
      "interception return yards": 0,
      "3rd down conversions": 5,
      "3rd down attempts": 12,
      "4th down conversions": 1,
      "4th down attempts": 1
    },
    "Tulsa": {
      "points": 17,
      "1st downs": 16,
      "rushing 1st downs": 6,
      "passing 1st downs": 9,
      "penalty 1st downs": 1,
      "rushing yards": 69,
      "rushing attempts": 29,
      "passing yards": 254,
      "passing attempts": 49,
      "passing completions": 23,
      "passing interceptions": 0,
      "total yards": 323,
      "total plays": 78,
      "fumbles": 0,
      "fumbles lost": 0,
      "penalties": 10,
      "penalty yards": 51,
      "punts": 8,
      "punt yards": 324,
      "punt returns": 0,
      "punt return yards": 0,
      "kickoff returns": 4,
      "kickoff return yards": 62,
      "interception returns": 0,
      "interception return yards": 0,
      "3rd down conversions": 8,
      "3rd down attempts": 21,
      "4th down conversions": 1,
      "4th down attempts": 3
    }
  },
  "USC vs NotreDame": {
    "stadium": "NotreDameStadium-SouthBend-IN",
    "USC": {
      "points": 27,
      "1st downs": 25,
      "rushing 1st downs": 11,
      "passing 1st downs": 14,
      "penalty 1st downs": 0,
      "rushing yards": 171,
      "rushing attempts": 35,
      "passing yards": 255,
      "passing attempts": 35,
      "passing completions": 24,
      "passing interceptions": 0,
      "total yards": 426,
      "total plays": 70,
      "fumbles": 1,
      "fumbles lost": 0,
      "penalties": 2,
      "penalty yards": 44,
      "punts": 5,
      "punt yards": 211,
      "punt returns": 2,
      "punt return yards": 16,
      "kickoff returns": 3,
      "kickoff return yards": 68,
      "interception returns": 0,
      "interception return yards": 0,
      "3rd down conversions": 5,
      "3rd down attempts": 12,
      "4th down conversions": 0,
      "4th down attempts": 0
    },
    "NotreDame": {
      "points": 30,
      "1st downs": 25,
      "rushing 1st downs": 17,
      "passing 1st downs": 7,
      "penalty 1st downs": 1,
      "rushing yards": 308,
      "rushing attempts": 48,
      "passing yards": 165,
      "passing attempts": 32,
      "passing completions": 17,
      "passing interceptions": 0,
      "total yards": 473,
      "total plays": 80,
      "fumbles": 1,
      "fumbles lost": 0,
      "penalties": 5,
      "penalty yards": 45,
      "punts": 3,
      "punt yards": 121,
      "punt returns": 0,
      "punt return yards": 0,
      "kickoff returns": 3,
      "kickoff return yards": 48,
      "interception returns": 0,
      "interception return yards": 0,
      "3rd down conversions": 9,
      "3rd down attempts": 17,
      "4th down conversions": 0,
      "4th down attempts": 1
    }
  },
  "Arkansas vs Kentucky": {
    "stadium": "KrogerField-Lexington-KY",
    "Arkansas": {
      "points": 20,
      "1st downs": 16,
      "rushing 1st downs": 6,
      "passing 1st downs": 7,
      "penalty 1st downs": 3,
      "rushing yards": 183,
      "rushing attempts": 30,
      "passing yards": 122,
      "passing attempts": 27,
      "passing completions": 12,
      "passing interceptions": 0,
      "total yards": 305,
      "total plays": 57,
      "fumbles": 1,
      "fumbles lost": 0,
      "penalties": 5,
      "penalty yards": 39,
      "punts": 4,
      "punt yards": 177,
      "punt returns": 1,
      "punt return yards": 26,
      "kickoff returns": 2,
      "kickoff return yards": 38,
      "interception returns": 0,
      "interception return yards": 0,
      "3rd down conversions": 6,
      "3rd down attempts": 13,
      "4th down conversions": 0,
      "4th down attempts": 1
    },
    "Kentucky": {
      "points": 24,
      "1st downs": 21,
      "rushing 1st downs": 15,
      "passing 1st downs": 5,
      "penalty 1st downs": 1,
      "rushing yards": 330,
      "rushing attempts": 54,
      "passing yards": 88,
      "passing attempts": 12,
      "passing completions": 8,
      "passing interceptions": 0,
      "total yards": 418,
      "total plays": 66,
      "fumbles": 2,
      "fumbles lost": 1,
      "penalties": 7,
      "penalty yards": 44,
      "punts": 3,
      "punt yards": 133,
      "punt returns": 3,
      "punt return yards": 18,
      "kickoff returns": 2,
      "kickoff return yards": 48,
      "interception returns": 0,
      "interception return yards": 0,
      "3rd down conversions": 7,
      "3rd down attempts": 14,
      "4th down conversions": 0,
      "4th down attempts": 1
    }
  },
  "Utah vs OregonState": {
    "stadium": "ReserStadium-Corvallis-OR",
    "Utah": {
      "points": 52,
      "1st downs": 24,
      "rushing 1st downs": 12,
      "passing 1st downs": 11,
      "penalty 1st downs": 1,
      "rushing yards": 256,
      "rushing attempts": 42,
      "passing yards": 247,
      "passing attempts": 18,
      "passing completions": 14,
      "passing interceptions": 0,
      "total yards": 503,
      "total plays": 60,
      "fumbles": 1,
      "fumbles lost": 1,
      "penalties": 8,
      "penalty yards": 75,
      "punts": 1,
      "punt yards": 38,
      "punt returns": 2,
      "punt return yards": -1,
      "kickoff returns": 1,
      "kickoff return yards": 27,
      "interception returns": 1,
      "interception return yards": 64,
      "3rd down conversions": 4,
      "3rd down attempts": 9,
      "4th down conversions": 1,
      "4th down attempts": 1
    },
    "OregonState": {
      "points": 7,
      "1st downs": 16,
      "rushing 1st downs": 4,
      "passing 1st downs": 10,
      "penalty 1st downs": 2,
      "rushing yards": 48,
      "rushing attempts": 22,
      "passing yards": 169,
      "passing attempts": 42,
      "passing completions": 22,
      "passing interceptions": 1,
      "total yards": 217,
      "total plays": 64,
      "fumbles": 0,
      "fumbles lost": 0,
      "penalties": 4,
      "penalty yards": 26,
      "punts": 7,
      "punt yards": 286,
      "punt returns": 0,
      "punt return yards": 0,
      "kickoff returns": 5,
      "kickoff return yards": 94,
      "interception returns": 0,
      "interception return yards": 0,
      "3rd down conversions": 2,
      "3rd down attempts": 13,
      "4th down conversions": 2,
      "4th down attempts": 3
    }
  },
  "Florida vs LSU": {
    "stadium": "TigerStadium-BatonRouge-LA",
    "Florida": {
      "points": 28,
      "1st downs": 28,
      "rushing 1st downs": 8,
      "passing 1st downs": 18,
      "penalty 1st downs": 2,
      "rushing yards": 146,
      "rushing attempts": 40,
      "passing yards": 311,
      "passing attempts": 44,
      "passing completions": 24,
      "passing interceptions": 1,
      "total yards": 457,
      "total plays": 84,
      "fumbles": 0,
      "fumbles lost": 0,
      "penalties": 5,
      "penalty yards": 39,
      "punts": 4,
      "punt yards": 171,
      "punt returns": 0,
      "punt return yards": 0,
      "kickoff returns": 0,
      "kickoff return yards": 0,
      "interception returns": 0,
      "interception return yards": 0,
      "3rd down conversions": 9,
      "3rd down attempts": 17,
      "4th down conversions": 1,
      "4th down attempts": 2
    },
    "LSU": {
      "points": 42,
      "1st downs": 22,
      "rushing 1st downs": 8,
      "passing 1st downs": 13,
      "penalty 1st downs": 1,
      "rushing yards": 218,
      "rushing attempts": 24,
      "passing yards": 293,
      "passing attempts": 24,
      "passing completions": 21,
      "passing interceptions": 0,
      "total yards": 511,
      "total plays": 48,
      "fumbles": 0,
      "fumbles lost": 0,
      "penalties": 4,
      "penalty yards": 28,
      "punts": 2,
      "punt yards": 81,
      "punt returns": 0,
      "punt return yards": 0,
      "kickoff returns": 1,
      "kickoff return yards": 20,
      "interception returns": 1,
      "interception return yards": 0,
      "3rd down conversions": 1,
      "3rd down attempts": 4,
      "4th down conversions": 0,
      "4th down attempts": 0
    }
  },
  "Hawaii vs BoiseState": {
    "stadium": "AlbertsonsStadium-Boise-ID",
    "Hawaii": {
      "points": 37,
      "1st downs": 24,
      "rushing 1st downs": 6,
      "passing 1st downs": 14,
      "penalty 1st downs": 4,
      "rushing yards": 113,
      "rushing attempts": 19,
      "passing yards": 325,
      "passing attempts": 50,
      "passing completions": 26,
      "passing interceptions": 1,
      "total yards": 438,
      "total plays": 69,
      "fumbles": 3,
      "fumbles lost": 3,
      "penalties": 10,
      "penalty yards": 88,
      "punts": 4,
      "punt yards": 149,
      "punt returns": 0,
      "punt return yards": 0,
      "kickoff returns": 5,
      "kickoff return yards": 136,
      "interception returns": 0,
      "interception return yards": 0,
      "3rd down conversions": 5,
      "3rd down attempts": 12,
      "4th down conversions": 1,
      "4th down attempts": 3
    },
    "BoiseState": {
      "points": 59,
      "1st downs": 29,
      "rushing 1st downs": 11,
      "passing 1st downs": 14,
      "penalty 1st downs": 4,
      "rushing yards": 203,
      "rushing attempts": 39,
      "passing yards": 315,
      "passing attempts": 37,
      "passing completions": 21,
      "passing interceptions": 0,
      "total yards": 518,
      "total plays": 76,
      "fumbles": 1,
      "fumbles lost": 1,
      "penalties": 11,
      "penalty yards": 95,
      "punts": 3,
      "punt yards": 126,
      "punt returns": 1,
      "punt return yards": 4,
      "kickoff returns": 1,
      "kickoff return yards": 34,
      "interception returns": 1,
      "interception return yards": 0,
      "3rd down conversions": 7,
      "3rd down attempts": 14,
      "4th down conversions": 1,
      "4th down attempts": 2
    }
  },
  "Wyoming vs SanDiegoState": {
    "stadium": "SanDiegoCountyCreditUnionStadium-SanDiego-CA",
    "Wyoming": {
      "points": 22,
      "1st downs": 11,
      "rushing 1st downs": 6,
      "passing 1st downs": 4,
      "penalty 1st downs": 1,
      "rushing yards": 157,
      "rushing attempts": 39,
      "passing yards": 109,
      "passing attempts": 14,
      "passing completions": 5,
      "passing interceptions": 1,
      "total yards": 266,
      "total plays": 53,
      "fumbles": 1,
      "fumbles lost": 1,
      "penalties": 6,
      "penalty yards": 70,
      "punts": 5,
      "punt yards": 240,
      "punt returns": 3,
      "punt return yards": 28,
      "kickoff returns": 0,
      "kickoff return yards": 0,
      "interception returns": 0,
      "interception return yards": 0,
      "3rd down conversions": 6,
      "3rd down attempts": 13,
      "4th down conversions": 2,
      "4th down attempts": 2
    },
    "SanDiegoState": {
      "points": 26,
      "1st downs": 21,
      "rushing 1st downs": 8,
      "passing 1st downs": 10,
      "penalty 1st downs": 3,
      "rushing yards": 120,
      "rushing attempts": 36,
      "passing yards": 209,
      "passing attempts": 32,
      "passing completions": 21,
      "passing interceptions": 0,
      "total yards": 329,
      "total plays": 68,
      "fumbles": 0,
      "fumbles lost": 0,
      "penalties": 5,
      "penalty yards": 40,
      "punts": 4,
      "punt yards": 197,
      "punt returns": 3,
      "punt return yards": 21,
      "kickoff returns": 3,
      "kickoff return yards": 63,
      "interception returns": 1,
      "interception return yards": 0,
      "3rd down conversions": 7,
      "3rd down attempts": 16,
      "4th down conversions": 2,
      "4th down attempts": 2
    }
  },
  "Washington vs Arizona": {
    "stadium": "ArizonaStadium-Tucson-AZ",
    "Washington": {
      "points": 51,
      "1st downs": 18,
      "rushing 1st downs": 9,
      "passing 1st downs": 8,
      "penalty 1st downs": 1,
      "rushing yards": 207,
      "rushing attempts": 45,
      "passing yards": 243,
      "passing attempts": 22,
      "passing completions": 15,
      "passing interceptions": 0,
      "total yards": 450,
      "total plays": 67,
      "fumbles": 1,
      "fumbles lost": 1,
      "penalties": 8,
      "penalty yards": 67,
      "punts": 4,
      "punt yards": 177,
      "punt returns": 5,
      "punt return yards": 30,
      "kickoff returns": 1,
      "kickoff return yards": 2,
      "interception returns": 1,
      "interception return yards": 0,
      "3rd down conversions": 3,
      "3rd down attempts": 13,
      "4th down conversions": 1,
      "4th down attempts": 2
    },
    "Arizona": {
      "points": 27,
      "1st downs": 18,
      "rushing 1st downs": 9,
      "passing 1st downs": 8,
      "penalty 1st downs": 1,
      "rushing yards": 151,
      "rushing attempts": 39,
      "passing yards": 209,
      "passing attempts": 33,
      "passing completions": 16,
      "passing interceptions": 1,
      "total yards": 360,
      "total plays": 72,
      "fumbles": 3,
      "fumbles lost": 3,
      "penalties": 5,
      "penalty yards": 33,
      "punts": 6,
      "punt yards": 240,
      "punt returns": 1,
      "punt return yards": -10,
      "kickoff returns": 1,
      "kickoff return yards": 21,
      "interception returns": 0,
      "interception return yards": 0,
      "3rd down conversions": 5,
      "3rd down attempts": 16,
      "4th down conversions": 1,
      "4th down attempts": 1
    }
  }
}