{
  "Buffalo vs BowlingGreen": {
    "stadium": "DoytLPerryStadium-BowlingGreen-OH",
    "Buffalo": {
      "points": 42,
      "1st downs": 23,
      "rushing 1st downs": 20,
      "passing 1st downs": 3,
      "penalty 1st downs": 0,
      "rushing yards": 396,
      "rushing attempts": 48,
      "passing yards": 74,
      "passing attempts": 12,
      "passing completions": 7,
      "passing interceptions": 0,
      "total yards": 470,
      "total plays": 60,
      "fumbles": 0,
      "fumbles lost": 0,
      "penalties": 4,
      "penalty yards": 35,
      "punts": 2,
      "punt yards": 64,
      "punt returns": 1,
      "punt return yards": 27,
      "kickoff returns": 2,
      "kickoff return yards": 33,
      "interception returns": 1,
      "interception return yards": 0,
      "3rd down conversions": 4,
      "3rd down attempts": 8,
      "4th down conversions": 1,
      "4th down attempts": 2
    },
    "BowlingGreen": {
      "points": 17,
      "1st downs": 22,
      "rushing 1st downs": 11,
      "passing 1st downs": 10,
      "penalty 1st downs": 1,
      "rushing yards": 180,
      "rushing attempts": 44,
      "passing yards": 219,
      "passing attempts": 27,
      "passing completions": 17,
      "passing interceptions": 1,
      "total yards": 399,
      "total plays": 71,
      "fumbles": 0,
      "fumbles lost": 0,
      "penalties": 3,
      "penalty yards": 15,
      "punts": 2,
      "punt yards": 77,
      "punt returns": 1,
      "punt return yards": 0,
      "kickoff returns": 5,
      "kickoff return yards": 107,
      "interception returns": 0,
      "interception return yards": 0,
      "3rd down conversions": 4,
      "3rd down attempts": 12,
      "4th down conversions": 2,
      "4th down attempts": 4
    }
  },
  "Akron vs KentState": {
    "stadium": "DixStadium-Kent-OH",
    "Akron": {
      "points": 35,
      "1st downs": 21,
      "rushing 1st downs": 11,
      "passing 1st downs": 7,
      "penalty 1st downs": 3,
      "rushing yards": 212,
      "rushing attempts": 41,
      "passing yards": 154,
      "passing attempts": 15,
      "passing completions": 9,
      "passing interceptions": 1,
      "total yards": 366,
      "total plays": 56,
      "fumbles": 2,
      "fumbles lost": 1,
      "penalties": 5,
      "penalty yards": 35,
      "punts": 2,
      "punt yards": 82,
      "punt returns": 0,
      "punt return yards": 0,
      "kickoff returns": 8,
      "kickoff return yards": 171,
      "interception returns": 0,
      "interception return yards": 0,
      "3rd down conversions": 5,
      "3rd down attempts": 10,
      "4th down conversions": 0,
      "4th down attempts": 1
    },
    "KentState": {
      "points": 69,
      "1st downs": 37,
      "rushing 1st downs": 19,
      "passing 1st downs": 16,
      "penalty 1st downs": 2,
      "rushing yards": 390,
      "rushing attempts": 51,
      "passing yards": 360,
      "passing attempts": 27,
      "passing completions": 24,
      "passing interceptions": 0,
      "total yards": 750,
      "total plays": 78,
      "fumbles": 3,
      "fumbles lost": 2,
      "penalties": 8,
      "penalty yards": 80,
      "punts": 0,
      "punt yards": 0,
      "punt returns": 1,
      "punt return yards": -6,
      "kickoff returns": 3,
      "kickoff return yards": 42,
      "interception returns": 1,
      "interception return yards": 2,
      "3rd down conversions": 11,
      "3rd down attempts": 11,
      "4th down conversions": 0,
      "4th down attempts": 0
    }
  },
  "NorthernIllinois vs BallState": {
    "stadium": "ScheumannStadium-Muncie-IN",
    "NorthernIllinois": {
      "points": 25,
      "1st downs": 24,
      "rushing 1st downs": 7,
      "passing 1st downs": 15,
      "penalty 1st downs": 2,
      "rushing yards": 112,
      "rushing attempts": 32,
      "passing yards": 300,
      "passing attempts": 41,
      "passing completions": 27,
      "passing interceptions": 1,
      "total yards": 412,
      "total plays": 73,
      "fumbles": 0,
      "fumbles lost": 0,
      "penalties": 7,
      "penalty yards": 67,
      "punts": 5,
      "punt yards": 218,
      "punt returns": 1,
      "punt return yards": 8,
      "kickoff returns": 4,
      "kickoff return yards": 41,
      "interception returns": 1,
      "interception return yards": 0,
      "3rd down conversions": 6,
      "3rd down attempts": 13,
      "4th down conversions": 2,
      "4th down attempts": 2
    },
    "BallState": {
      "points": 31,
      "1st downs": 23,
      "rushing 1st downs": 12,
      "passing 1st downs": 10,
      "penalty 1st downs": 1,
      "rushing yards": 201,
      "rushing attempts": 44,
      "passing yards": 214,
      "passing attempts": 25,
      "passing completions": 17,
      "passing interceptions": 1,
      "total yards": 415,
      "total plays": 69,
      "fumbles": 0,
      "fumbles lost": 0,
      "penalties": 6,
      "penalty yards": 50,
      "punts": 2,
      "punt yards": 95,
      "punt returns": 1,
      "punt return yards": -1,
      "kickoff returns": 1,
      "kickoff return yards": 7,
      "interception returns": 1,
      "interception return yards": 71,
      "3rd down conversions": 7,
      "3rd down attempts": 12,
      "4th down conversions": 0,
      "4th down attempts": 1
    }
  },
  "WesternMichigan vs CentralMichigan": {
    "stadium": "KellyShortsStadium-MountPleasant-MI",
    "WesternMichigan": {
      "points": 52,
      "1st downs": 25,
      "rushing 1st downs": 11,
      "passing 1st downs": 10,
      "penalty 1st downs": 4,
      "rushing yards": 246,
      "rushing attempts": 55,
      "passing yards": 382,
      "passing attempts": 20,
      "passing completions": 12,
      "passing interceptions": 1,
      "total yards": 628,
      "total plays": 75,
      "fumbles": 1,
      "fumbles lost": 0,
      "penalties": 8,
      "penalty yards": 58,
      "punts": 3,
      "punt yards": 114,
      "punt returns": 4,
      "punt return yards": 24,
      "kickoff returns": 4,
      "kickoff return yards": 62,
      "interception returns": 0,
      "interception return yards": 0,
      "3rd down conversions": 7,
      "3rd down attempts": 13,
      "4th down conversions": 0,
      "4th down attempts": 0
    },
    "CentralMichigan": {
      "points": 44,
      "1st downs": 17,
      "rushing 1st downs": 8,
      "passing 1st downs": 8,
      "penalty 1st downs": 1,
      "rushing yards": 219,
      "rushing attempts": 36,
      "passing yards": 187,
      "passing attempts": 21,
      "passing completions": 14,
      "passing interceptions": 0,
      "total yards": 406,
      "total plays": 57,
      "fumbles": 2,
      "fumbles lost": 0,
      "penalties": 8,
      "penalty yards": 56,
      "punts": 7,
      "punt yards": 316,
      "punt returns": 2,
      "punt return yards": 15,
      "kickoff returns": 4,
      "kickoff return yards": 83,
      "interception returns": 1,
      "interception return yards": 1,
      "3rd down conversions": 1,
      "3rd down attempts": 10,
      "4th down conversions": 1,
      "4th down attempts": 1
    }
  },
  "Toledo vs EasternMichigan": {
    "stadium": "RynearsonStadium-Ypsilanti-MI",
    "Toledo": {
      "points": 45,
      "1st downs": 27,
      "rushing 1st downs": 13,
      "passing 1st downs": 10,
      "penalty 1st downs": 4,
      "rushing yards": 191,
      "rushing attempts": 44,
      "passing yards": 298,
      "passing attempts": 24,
      "passing completions": 16,
      "passing interceptions": 0,
      "total yards": 489,
      "total plays": 68,
      "fumbles": 2,
      "fumbles lost": 2,
      "penalties": 8,
      "penalty yards": 87,
      "punts": 2,
      "punt yards": 78,
      "punt returns": 2,
      "punt return yards": -1,
      "kickoff returns": 5,
      "kickoff return yards": 84,
      "interception returns": 1,
      "interception return yards": 20,
      "3rd down conversions": 5,
      "3rd down attempts": 11,
      "4th down conversions": 1,
      "4th down attempts": 1
    },
    "EasternMichigan": {
      "points": 28,
      "1st downs": 18,
      "rushing 1st downs": 4,
      "passing 1st downs": 10,
      "penalty 1st downs": 4,
      "rushing yards": 34,
      "rushing attempts": 31,
      "passing yards": 244,
      "passing attempts": 39,
      "passing completions": 25,
      "passing interceptions": 1,
      "total yards": 278,
      "total plays": 70,
      "fumbles": 2,
      "fumbles lost": 2,
      "penalties": 10,
      "penalty yards": 89,
      "punts": 6,
      "punt yards": 265,
      "punt returns": 1,
      "punt return yards": 7,
      "kickoff returns": 2,
      "kickoff return yards": 27,
      "interception returns": 0,
      "interception return yards": 0,
      "3rd down conversions": 6,
      "3rd down attempts": 17,
      "4th down conversions": 4,
      "4th down attempts": 4
    }
  },
  "Tulane vs Tulsa": {
    "stadium": "SkellyFieldatHAChapmanStadium-Tulsa-OK",
    "Tulane": {
      "points": 24,
      "1st downs": 18,
      "rushing 1st downs": 13,
      "passing 1st downs": 3,
      "penalty 1st downs": 2,
      "rushing yards": 226,
      "rushing attempts": 51,
      "passing yards": 76,
      "passing attempts": 17,
      "passing completions": 8,
      "passing interceptions": 1,
      "total yards": 302,
      "total plays": 68,
      "fumbles": 0,
      "fumbles lost": 0,
      "penalties": 7,
      "penalty yards": 63,
      "punts": 6,
      "punt yards": 253,
      "punt returns": 2,
      "punt return yards": 38,
      "kickoff returns": 2,
      "kickoff return yards": 91,
      "interception returns": 1,
      "interception return yards": 0,
      "3rd down conversions": 5,
      "3rd down attempts": 14,
      "4th down conversions": 0,
      "4th down attempts": 0
    },
    "Tulsa": {
      "points": 30,
      "1st downs": 26,
      "rushing 1st downs": 10,
      "passing 1st downs": 15,
      "penalty 1st downs": 1,
      "rushing yards": 179,
      "rushing attempts": 41,
      "passing yards": 343,
      "passing attempts": 48,
      "passing completions": 27,
      "passing interceptions": 1,
      "total yards": 522,
      "total plays": 89,
      "fumbles": 2,
      "fumbles lost": 2,
      "penalties": 10,
      "penalty yards": 85,
      "punts": 4,
      "punt yards": 173,
      "punt returns": 2,
      "punt return yards": 7,
      "kickoff returns": 1,
      "kickoff return yards": 16,
      "interception returns": 1,
      "interception return yards": 96,
      "3rd down conversions": 10,
      "3rd down attempts": 21,
      "4th down conversions": 3,
      "4th down attempts": 4
    }
  },
  "Syracuse vs Louisville": {
    "stadium": "CardinalStadium-Louisville-KY",
    "Syracuse": {
      "points": 0,
      "1st downs": 7,
      "rushing 1st downs": 5,
      "passing 1st downs": 2,
      "penalty 1st downs": 0,
      "rushing yards": 92,
      "rushing attempts": 25,
      "passing yards": 45,
      "passing attempts": 16,
      "passing completions": 6,
      "passing interceptions": 1,
      "total yards": 137,
      "total plays": 41,
      "fumbles": 3,
      "fumbles lost": 2,
      "penalties": 8,
      "penalty yards": 68,
      "punts": 6,
      "punt yards": 267,
      "punt returns": 0,
      "punt return yards": 0,
      "kickoff returns": 6,
      "kickoff return yards": 107,
      "interception returns": 2,
      "interception return yards": 31,
      "3rd down conversions": 1,
      "3rd down attempts": 10,
      "4th down conversions": 0,
      "4th down attempts": 2
    },
    "Louisville": {
      "points": 30,
      "1st downs": 26,
      "rushing 1st downs": 10,
      "passing 1st downs": 13,
      "penalty 1st downs": 3,
      "rushing yards": 134,
      "rushing attempts": 45,
      "passing yards": 279,
      "passing attempts": 34,
      "passing completions": 24,
      "passing interceptions": 2,
      "total yards": 413,
      "total plays": 79,
      "fumbles": 2,
      "fumbles lost": 1,
      "penalties": 7,
      "penalty yards": 48,
      "punts": 3,
      "punt yards": 128,
      "punt returns": 3,
      "punt return yards": 7,
      "kickoff returns": 1,
      "kickoff return yards": 16,
      "interception returns": 1,
      "interception return yards": -2,
      "3rd down conversions": 8,
      "3rd down attempts": 16,
      "4th down conversions": 2,
      "4th down attempts": 2
    }
  },
  "Purdue vs Minnesota": {
    "stadium": "TCFBankStadium-Minneapolis-MN",
    "Purdue": {
      "points": 31,
      "1st downs": 28,
      "rushing 1st downs": 9,
      "passing 1st downs": 16,
      "penalty 1st downs": 3,
      "rushing yards": 125,
      "rushing attempts": 25,
      "passing yards": 367,
      "passing attempts": 43,
      "passing completions": 35,
      "passing interceptions": 1,
      "total yards": 492,
      "total plays": 68,
      "fumbles": 1,
      "fumbles lost": 0,
      "penalties": 4,
      "penalty yards": 38,
      "punts": 1,
      "punt yards": 51,
      "punt returns": 0,
      "punt return yards": 0,
      "kickoff returns": 3,
      "kickoff return yards": 34,
      "interception returns": 0,
      "interception return yards": 0,
      "3rd down conversions": 8,
      "3rd down attempts": 12,
      "4th down conversions": 1,
      "4th down attempts": 1
    },
    "Minnesota": {
      "points": 34,
      "1st downs": 20,
      "rushing 1st downs": 9,
      "passing 1st downs": 10,
      "penalty 1st downs": 1,
      "rushing yards": 130,
      "rushing attempts": 41,
      "passing yards": 264,
      "passing attempts": 22,
      "passing completions": 15,
      "passing interceptions": 0,
      "total yards": 394,
      "total plays": 63,
      "fumbles": 0,
      "fumbles lost": 0,
      "penalties": 4,
      "penalty yards": 41,
      "punts": 2,
      "punt yards": 88,
      "punt returns": 0,
      "punt return yards": 0,
      "kickoff returns": 2,
      "kickoff return yards": 36,
      "interception returns": 1,
      "interception return yards": 5,
      "3rd down conversions": 7,
      "3rd down attempts": 11,
      "4th down conversions": 1,
      "4th down attempts": 2
    }
  },
  "Massachusetts vs FloridaAtlantic": {
    "stadium": "FAUStadium-BocaRaton-FL",
    "Massachusetts": {
      "points": 2,
      "1st downs": 8,
      "rushing 1st downs": 2,
      "passing 1st downs": 6,
      "penalty 1st downs": 0,
      "rushing yards": 62,
      "rushing attempts": 25,
      "passing yards": 85,
      "passing attempts": 30,
      "passing completions": 15,
      "passing interceptions": 2,
      "total yards": 147,
      "total plays": 55,
      "fumbles": 0,
      "fumbles lost": 0,
      "penalties": 5,
      "penalty yards": 69,
      "punts": 10,
      "punt yards": 414,
      "punt returns": 3,
      "punt return yards": 42,
      "kickoff returns": 1,
      "kickoff return yards": 13,
      "interception returns": 0,
      "interception return yards": 0,
      "3rd down conversions": 3,
      "3rd down attempts": 14,
      "4th down conversions": 0,
      "4th down attempts": 2
    },
    "FloridaAtlantic": {
      "points": 24,
      "1st downs": 16,
      "rushing 1st downs": 7,
      "passing 1st downs": 8,
      "penalty 1st downs": 1,
      "rushing yards": 140,
      "rushing attempts": 44,
      "passing yards": 228,
      "passing attempts": 30,
      "passing completions": 15,
      "passing interceptions": 0,
      "total yards": 368,
      "total plays": 74,
      "fumbles": 2,
      "fumbles lost": 1,
      "penalties": 4,
      "penalty yards": 20,
      "punts": 5,
      "punt yards": 213,
      "punt returns": 0,
      "punt return yards": 0,
      "kickoff returns": 0,
      "kickoff return yards": 0,
      "interception returns": 2,
      "interception return yards": 13,
      "3rd down conversions": 7,
      "3rd down attempts": 19,
      "4th down conversions": 2,
      "4th down attempts": 4
    }
  },
  "NewMexico vs AirForce": {
    "stadium": "FalconStadium-USAirForceAcademy-CO",
    "NewMexico": {
      "points": 0,
      "1st downs": 19,
      "rushing 1st downs": 6,
      "passing 1st downs": 12,
      "penalty 1st downs": 1,
      "rushing yards": 83,
      "rushing attempts": 25,
      "passing yards": 221,
      "passing attempts": 42,
      "passing completions": 23,
      "passing interceptions": 1,
      "total yards": 304,
      "total plays": 67,
      "fumbles": 2,
      "fumbles lost": 1,
      "penalties": 8,
      "penalty yards": 70,
      "punts": 4,
      "punt yards": 162,
      "punt returns": 0,
      "punt return yards": 0,
      "kickoff returns": 1,
      "kickoff return yards": 7,
      "interception returns": 0,
      "interception return yards": 0,
      "3rd down conversions": 4,
      "3rd down attempts": 13,
      "4th down conversions": 0,
      "4th down attempts": 1
    },
    "AirForce": {
      "points": 28,
      "1st downs": 23,
      "rushing 1st downs": 18,
      "passing 1st downs": 4,
      "penalty 1st downs": 1,
      "rushing yards": 356,
      "rushing attempts": 63,
      "passing yards": 66,
      "passing attempts": 5,
      "passing completions": 4,
      "passing interceptions": 0,
      "total yards": 422,
      "total plays": 68,
      "fumbles": 4,
      "fumbles lost": 3,
      "penalties": 5,
      "penalty yards": 42,
      "punts": 2,
      "punt yards": 96,
      "punt returns": 0,
      "punt return yards": 0,
      "kickoff returns": 0,
      "kickoff return yards": 0,
      "interception returns": 1,
      "interception return yards": 20,
      "3rd down conversions": 9,
      "3rd down attempts": 13,
      "4th down conversions": 1,
      "4th down attempts": 2
    }
  },
  "GeorgiaSouthern vs Army": {
    "stadium": "MichieStadium-WestPoint-NY",
    "GeorgiaSouthern": {
      "points": 27,
      "1st downs": 12,
      "rushing 1st downs": 7,
      "passing 1st downs": 4,
      "penalty 1st downs": 1,
      "rushing yards": 175,
      "rushing attempts": 32,
      "passing yards": 136,
      "passing attempts": 13,
      "passing completions": 9,
      "passing interceptions": 1,
      "total yards": 311,
      "total plays": 45,
      "fumbles": 1,
      "fumbles lost": 0,
      "penalties": 3,
      "penalty yards": 15,
      "punts": 2,
      "punt yards": 94,
      "punt returns": 1,
      "punt return yards": 6,
      "kickoff returns": 1,
      "kickoff return yards": 14,
      "interception returns": 0,
      "interception return yards": 0,
      "3rd down conversions": 4,
      "3rd down attempts": 9,
      "4th down conversions": 0,
      "4th down attempts": 1
    },
    "Army": {
      "points": 28,
      "1st downs": 20,
      "rushing 1st downs": 18,
      "passing 1st downs": 1,
      "penalty 1st downs": 1,
      "rushing yards": 243,
      "rushing attempts": 73,
      "passing yards": 25,
      "passing attempts": 1,
      "passing completions": 1,
      "passing interceptions": 0,
      "total yards": 268,
      "total plays": 74,
      "fumbles": 3,
      "fumbles lost": 3,
      "penalties": 5,
      "penalty yards": 54,
      "punts": 4,
      "punt yards": 145,
      "punt returns": 1,
      "punt return yards": 28,
      "kickoff returns": 3,
      "kickoff return yards": 84,
      "interception returns": 1,
      "interception return yards": 3,
      "3rd down conversions": 9,
      "3rd down attempts": 18,
      "4th down conversions": 4,
      "4th down attempts": 4
    }
  },
  "EastCarolina vs Temple": {
    "stadium": "LincolnFinancialField-Philadelphia-PA",
    "EastCarolina": {
      "points": 28,
      "1st downs": 16,
      "rushing 1st downs": 9,
      "passing 1st downs": 7,
      "penalty 1st downs": 0,
      "rushing yards": 265,
      "rushing attempts": 40,
      "passing yards": 182,
      "passing attempts": 22,
      "passing completions": 11,
      "passing interceptions": 1,
      "total yards": 447,
      "total plays": 62,
      "fumbles": 1,
      "fumbles lost": 1,
      "penalties": 1,
      "penalty yards": 12,
      "punts": 8,
      "punt yards": 330,
      "punt returns": 5,
      "punt return yards": 58,
      "kickoff returns": 2,
      "kickoff return yards": 111,
      "interception returns": 2,
      "interception return yards": 0,
      "3rd down conversions": 3,
      "3rd down attempts": 13,
      "4th down conversions": 0,
      "4th down attempts": 0
    },
    "Temple": {
      "points": 3,
      "1st downs": 10,
      "rushing 1st downs": 5,
      "passing 1st downs": 5,
      "penalty 1st downs": 0,
      "rushing yards": 140,
      "rushing attempts": 46,
      "passing yards": 95,
      "passing attempts": 23,
      "passing completions": 10,
      "passing interceptions": 2,
      "total yards": 235,
      "total plays": 69,
      "fumbles": 1,
      "fumbles lost": 1,
      "penalties": 10,
      "penalty yards": 59,
      "punts": 11,
      "punt yards": 492,
      "punt returns": 1,
      "punt return yards": 5,
      "kickoff returns": 0,
      "kickoff return yards": 0,
      "interception returns": 1,
      "interception return yards": 45,
      "3rd down conversions": 4,
      "3rd down attempts": 18,
      "4th down conversions": 0,
      "4th down attempts": 0
    }
  },
  "ArkansasState vs TexasState": {
    "stadium": "JimWackerFieldatBobcatStadium-SanMarcos-TX",
    "ArkansasState": {
      "points": 45,
      "1st downs": 30,
      "rushing 1st downs": 8,
      "passing 1st downs": 21,
      "penalty 1st downs": 1,
      "rushing yards": 192,
      "rushing attempts": 42,
      "passing yards": 462,
      "passing attempts": 48,
      "passing completions": 27,
      "passing interceptions": 0,
      "total yards": 654,
      "total plays": 90,
      "fumbles": 1,
      "fumbles lost": 1,
      "penalties": 9,
      "penalty yards": 82,
      "punts": 2,
      "punt yards": 80,
      "punt returns": 1,
      "punt return yards": -2,
      "kickoff returns": 3,
      "kickoff return yards": 67,
      "interception returns": 0,
      "interception return yards": 0,
      "3rd down conversions": 10,
      "3rd down attempts": 18,
      "4th down conversions": 2,
      "4th down attempts": 3
    },
    "TexasState": {
      "points": 47,
      "1st downs": 27,
      "rushing 1st downs": 5,
      "passing 1st downs": 19,
      "penalty 1st downs": 3,
      "rushing yards": 62,
      "rushing attempts": 18,
      "passing yards": 443,
      "passing attempts": 45,
      "passing completions": 32,
      "passing interceptions": 0,
      "total yards": 505,
      "total plays": 63,
      "fumbles": 0,
      "fumbles lost": 0,
      "penalties": 3,
      "penalty yards": 25,
      "punts": 3,
      "punt yards": 153,
      "punt returns": 2,
      "punt return yards": 28,
      "kickoff returns": 4,
      "kickoff return yards": 89,
      "interception returns": 0,
      "interception return yards": 0,
      "3rd down conversions": 5,
      "3rd down attempts": 10,
      "4th down conversions": 0,
      "4th down attempts": 1
    }
  },
  "Florida vs Vanderbilt": {
    "stadium": "VanderbiltStadium-Nashville-TN",
    "Florida": {
      "points": 38,
      "1st downs": 29,
      "rushing 1st downs": 10,
      "passing 1st downs": 19,
      "penalty 1st downs": 0,
      "rushing yards": 173,
      "rushing attempts": 40,
      "passing yards": 413,
      "passing attempts": 36,
      "passing completions": 27,
      "passing interceptions": 0,
      "total yards": 586,
      "total plays": 76,
      "fumbles": 1,
      "fumbles lost": 1,
      "penalties": 6,
      "penalty yards": 46,
      "punts": 2,
      "punt yards": 89,
      "punt returns": 1,
      "punt return yards": 7,
      "kickoff returns": 3,
      "kickoff return yards": 74,
      "interception returns": 1,
      "interception return yards": 0,
      "3rd down conversions": 8,
      "3rd down attempts": 12,
      "4th down conversions": 1,
      "4th down attempts": 1
    },
    "Vanderbilt": {
      "points": 17,
      "1st downs": 21,
      "rushing 1st downs": 5,
      "passing 1st downs": 14,
      "penalty 1st downs": 2,
      "rushing yards": 87,
      "rushing attempts": 34,
      "passing yards": 319,
      "passing attempts": 34,
      "passing completions": 22,
      "passing interceptions": 1,
      "total yards": 406,
      "total plays": 68,
      "fumbles": 0,
      "fumbles lost": 0,
      "penalties": 4,
      "penalty yards": 30,
      "punts": 6,
      "punt yards": 228,
      "punt returns": 0,
      "punt return yards": 0,
      "kickoff returns": 0,
      "kickoff return yards": 0,
      "interception returns": 0,
      "interception return yards": 0,
      "3rd down conversions": 7,
      "3rd down attempts": 15,
      "4th down conversions": 1,
      "4th down attempts": 1
    }
  },
  "LSU vs Arkansas": {
    "stadium": "DonaldWReynoldsRazorbackStadium-Fayetteville-AR",
    "LSU": {
      "points": 27,
      "1st downs": 24,
      "rushing 1st downs": 7,
      "passing 1st downs": 16,
      "penalty 1st downs": 1,
      "rushing yards": 148,
      "rushing attempts": 49,
      "passing yards": 271,
      "passing attempts": 42,
      "passing completions": 27,
      "passing interceptions": 0,
      "total yards": 419,
      "total plays": 91,
      "fumbles": 5,
      "fumbles lost": 1,
      "penalties": 9,
      "penalty yards": 70,
      "punts": 7,
      "punt yards": 342,
      "punt returns": 4,
      "punt return yards": 8,
      "kickoff returns": 0,
      "kickoff return yards": 0,
      "interception returns": 1,
      "interception return yards": 36,
      "3rd down conversions": 11,
      "3rd down attempts": 22,
      "4th down conversions": 2,
      "4th down attempts": 2
    },
    "Arkansas": {
      "points": 24,
      "1st downs": 14,
      "rushing 1st downs": 2,
      "passing 1st downs": 11,
      "penalty 1st downs": 1,
      "rushing yards": 104,
      "rushing attempts": 27,
      "passing yards": 339,
      "passing attempts": 26,
      "passing completions": 17,
      "passing interceptions": 1,
      "total yards": 443,
      "total plays": 53,
      "fumbles": 0,
      "fumbles lost": 0,
      "penalties": 5,
      "penalty yards": 42,
      "punts": 7,
      "punt yards": 332,
      "punt returns": 0,
      "punt return yards": 0,
      "kickoff returns": 0,
      "kickoff return yards": 0,
      "interception returns": 0,
      "interception return yards": 0,
      "3rd down conversions": 0,
      "3rd down attempts": 10,
      "4th down conversions": 1,
      "4th down attempts": 1
    }
  },
  "AppalachianState vs CoastalCarolina": {
    "stadium": "BrooksStadium-Conway-SC",
    "AppalachianState": {
      "points": 23,
      "1st downs": 22,
      "rushing 1st downs": 16,
      "passing 1st downs": 6,
      "penalty 1st downs": 0,
      "rushing yards": 204,
      "rushing attempts": 46,
      "passing yards": 211,
      "passing attempts": 30,
      "passing completions": 17,
      "passing interceptions": 3,
      "total yards": 415,
      "total plays": 76,
      "fumbles": 1,
      "fumbles lost": 0,
      "penalties": 8,
      "penalty yards": 51,
      "punts": 1,
      "punt yards": 36,
      "punt returns": 0,
      "punt return yards": 0,
      "kickoff returns": 6,
      "kickoff return yards": 88,
      "interception returns": 0,
      "interception return yards": 0,
      "3rd down conversions": 6,
      "3rd down attempts": 14,
      "4th down conversions": 0,
      "4th down attempts": 2
    },
    "CoastalCarolina": {
      "points": 34,
      "1st downs": 16,
      "rushing 1st downs": 8,
      "passing 1st downs": 7,
      "penalty 1st downs": 1,
      "rushing yards": 169,
      "rushing attempts": 34,
      "passing yards": 200,
      "passing attempts": 21,
      "passing completions": 12,
      "passing interceptions": 0,
      "total yards": 369,
      "total plays": 55,
      "fumbles": 2,
      "fumbles lost": 1,
      "penalties": 1,
      "penalty yards": 5,
      "punts": 3,
      "punt yards": 127,
      "punt returns": 0,
      "punt return yards": 0,
      "kickoff returns": 3,
      "kickoff return yards": 26,
      "interception returns": 3,
      "interception return yards": 45,
      "3rd down conversions": 7,
      "3rd down attempts": 12,
      "4th down conversions": 1,
      "4th down attempts": 1
    }
  },
  "Indiana vs OhioState": {
    "stadium": "OhioStadium-Columbus-OH",
    "Indiana": {
      "points": 35,
      "1st downs": 19,
      "rushing 1st downs": 2,
      "passing 1st downs": 17,
      "penalty 1st downs": 0,
      "rushing yards": 0,
      "rushing attempts": 16,
      "passing yards": 491,
      "passing attempts": 51,
      "passing completions": 27,
      "passing interceptions": 1,
      "total yards": 490,
      "total plays": 67,
      "fumbles": 4,
      "fumbles lost": 3,
      "penalties": 2,
      "penalty yards": 30,
      "punts": 6,
      "punt yards": 259,
      "punt returns": 2,
      "punt return yards": 22,
      "kickoff returns": 1,
      "kickoff return yards": 11,
      "interception returns": 3,
      "interception return yards": 57,
      "3rd down conversions": 4,
      "3rd down attempts": 13,
      "4th down conversions": 1,
      "4th down attempts": 3
    },
    "OhioState": {
      "points": 42,
      "1st downs": 27,
      "rushing 1st downs": 13,
      "passing 1st downs": 13,
      "penalty 1st downs": 1,
      "rushing yards": 307,
      "rushing attempts": 50,
      "passing yards": 300,
      "passing attempts": 30,
      "passing completions": 18,
      "passing interceptions": 3,
      "total yards": 607,
      "total plays": 80,
      "fumbles": 0,
      "fumbles lost": 0,
      "penalties": 3,
      "penalty yards": 35,
      "punts": 5,
      "punt yards": 213,
      "punt returns": 0,
      "punt return yards": 0,
      "kickoff returns": 1,
      "kickoff return yards": 18,
      "interception returns": 1,
      "interception return yards": 36,
      "3rd down conversions": 7,
      "3rd down attempts": 14,
      "4th down conversions": 0,
      "4th down attempts": 1
    }
  },
  "Illinois vs Nebraska": {
    "stadium": "MemorialStadiumLincoln-NE-Lincoln",
    "Illinois": {
      "points": 41,
      "1st downs": 25,
      "rushing 1st downs": 14,
      "passing 1st downs": 9,
      "penalty 1st downs": 2,
      "rushing yards": 285,
      "rushing attempts": 52,
      "passing yards": 205,
      "passing attempts": 25,
      "passing completions": 18,
      "passing interceptions": 0,
      "total yards": 490,
      "total plays": 77,
      "fumbles": 4,
      "fumbles lost": 0,
      "penalties": 3,
      "penalty yards": 31,
      "punts": 3,
      "punt yards": 137,
      "punt returns": 0,
      "punt return yards": 0,
      "kickoff returns": 2,
      "kickoff return yards": 40,
      "interception returns": 3,
      "interception return yards": 31,
      "3rd down conversions": 11,
      "3rd down attempts": 17,
      "4th down conversions": 1,
      "4th down attempts": 1
    },
    "Nebraska": {
      "points": 23,
      "1st downs": 25,
      "rushing 1st downs": 14,
      "passing 1st downs": 10,
      "penalty 1st downs": 1,
      "rushing yards": 215,
      "rushing attempts": 44,
      "passing yards": 177,
      "passing attempts": 30,
      "passing completions": 18,
      "passing interceptions": 3,
      "total yards": 392,
      "total plays": 74,
      "fumbles": 4,
      "fumbles lost": 2,
      "penalties": 7,
      "penalty yards": 66,
      "punts": 2,
      "punt yards": 98,
      "punt returns": 3,
      "punt return yards": 29,
      "kickoff returns": 3,
      "kickoff return yards": 63,
      "interception returns": 0,
      "interception return yards": 0,
      "3rd down conversions": 4,
      "3rd down attempts": 12,
      "4th down conversions": 2,
      "4th down attempts": 5
    }
  },
  "FCS vs Memphis": {
    "stadium": "LibertyBowlMemorialStadium-Memphis-TN",
    "FCS": {
      "points": 14,
      "1st downs": 11,
      "rushing 1st downs": 3,
      "passing 1st downs": 7,
      "penalty 1st downs": 1,
      "rushing yards": 55,
      "rushing attempts": 26,
      "passing yards": 169,
      "passing attempts": 41,
      "passing completions": 19,
      "passing interceptions": 2,
      "total yards": 224,
      "total plays": 67,
      "fumbles": 0,
      "fumbles lost": 0,
      "penalties": 7,
      "penalty yards": 45,
      "punts": 10,
      "punt yards": 442,
      "punt returns": 1,
      "punt return yards": 4,
      "kickoff returns": 2,
      "kickoff return yards": 26,
      "interception returns": 1,
      "interception return yards": 30,
      "3rd down conversions": 6,
      "3rd down attempts": 18,
      "4th down conversions": 0,
      "4th down attempts": 1
    },
    "Memphis": {
      "points": 56,
      "1st downs": 25,
      "rushing 1st downs": 14,
      "passing 1st downs": 10,
      "penalty 1st downs": 1,
      "rushing yards": 305,
      "rushing attempts": 44,
      "passing yards": 269,
      "passing attempts": 33,
      "passing completions": 18,
      "passing interceptions": 1,
      "total yards": 574,
      "total plays": 77,
      "fumbles": 0,
      "fumbles lost": 0,
      "penalties": 6,
      "penalty yards": 65,
      "punts": 4,
      "punt yards": 193,
      "punt returns": 8,
      "punt return yards": 117,
      "kickoff returns": 2,
      "kickoff return yards": 43,
      "interception returns": 2,
      "interception return yards": 6,
      "3rd down conversions": 5,
      "3rd down attempts": 14,
      "4th down conversions": 2,
      "4th down attempts": 3
    }
  },
  "Rice vs NorthTexas": {
    "stadium": "ApogeeStadium-Denton-TX",
    "Rice": {
      "points": 17,
      "1st downs": 23,
      "rushing 1st downs": 7,
      "passing 1st downs": 15,
      "penalty 1st downs": 1,
      "rushing yards": 49,
      "rushing attempts": 36,
      "passing yards": 327,
      "passing attempts": 34,
      "passing completions": 23,
      "passing interceptions": 0,
      "total yards": 376,
      "total plays": 70,
      "fumbles": 4,
      "fumbles lost": 2,
      "penalties": 2,
      "penalty yards": 25,
      "punts": 0,
      "punt yards": 0,
      "punt returns": 3,
      "punt return yards": 47,
      "kickoff returns": 5,
      "kickoff return yards": 100,
      "interception returns": 0,
      "interception return yards": 0,
      "3rd down conversions": 3,
      "3rd down attempts": 12,
      "4th down conversions": 0,
      "4th down attempts": 2
    },
    "NorthTexas": {
      "points": 27,
      "1st downs": 17,
      "rushing 1st downs": 11,
      "passing 1st downs": 6,
      "penalty 1st downs": 0,
      "rushing yards": 269,
      "rushing attempts": 42,
      "passing yards": 120,
      "passing attempts": 20,
      "passing completions": 9,
      "passing interceptions": 0,
      "total yards": 389,
      "total plays": 62,
      "fumbles": 0,
      "fumbles lost": 0,
      "penalties": 5,
      "penalty yards": 42,
      "punts": 0,
      "punt yards": 0,
      "punt returns": 2,
      "punt return yards": 17,
      "kickoff returns": 2,
      "kickoff return yards": 30,
      "interception returns": 0,
      "interception return yards": 0,
      "3rd down conversions": 7,
      "3rd down attempts": 15,
      "4th down conversions": 0,
      "4th down attempts": 0
    }
  },
  "FloridaInternational vs WesternKentucky": {
    "stadium": "HouchensIndustriesLTSmithStadium-BowlingGreen-KY",
    "FloridaInternational": {
      "points": 21,
      "1st downs": 17,
      "rushing 1st downs": 8,
      "passing 1st downs": 7,
      "penalty 1st downs": 2,
      "rushing yards": 116,
      "rushing attempts": 44,
      "passing yards": 147,
      "passing attempts": 37,
      "passing completions": 14,
      "passing interceptions": 1,
      "total yards": 263,
      "total plays": 81,
      "fumbles": 2,
      "fumbles lost": 1,
      "penalties": 2,
      "penalty yards": 15,
      "punts": 8,
      "punt yards": 354,
      "punt returns": 3,
      "punt return yards": 35,
      "kickoff returns": 6,
      "kickoff return yards": 163,
      "interception returns": 0,
      "interception return yards": 0,
      "3rd down conversions": 7,
      "3rd down attempts": 21,
      "4th down conversions": 3,
      "4th down attempts": 6
    },
    "WesternKentucky": {
      "points": 38,
      "1st downs": 13,
      "rushing 1st downs": 6,
      "passing 1st downs": 7,
      "penalty 1st downs": 0,
      "rushing yards": 157,
      "rushing attempts": 34,
      "passing yards": 121,
      "passing attempts": 25,
      "passing completions": 14,
      "passing interceptions": 0,
      "total yards": 278,
      "total plays": 59,
      "fumbles": 0,
      "fumbles lost": 0,
      "penalties": 4,
      "penalty yards": 40,
      "punts": 8,
      "punt yards": 426,
      "punt returns": 2,
      "punt return yards": -2,
      "kickoff returns": 1,
      "kickoff return yards": 14,
      "interception returns": 1,
      "interception return yards": 22,
      "3rd down conversions": 1,
      "3rd down attempts": 11,
      "4th down conversions": 0,
      "4th down attempts": 1
    }
  },
  "UTSA vs SouthernMiss": {
    "stadium": "MMRobertsStadium-Hattiesburg-MS",
    "UTSA": {
      "points": 23,
      "1st downs": 16,
      "rushing 1st downs": 12,
      "passing 1st downs": 4,
      "penalty 1st downs": 0,
      "rushing yards": 233,
      "rushing attempts": 47,
      "passing yards": 71,
      "passing attempts": 19,
      "passing completions": 12,
      "passing interceptions": 1,
      "total yards": 304,
      "total plays": 66,
      "fumbles": 0,
      "fumbles lost": 0,
      "penalties": 5,
      "penalty yards": 51,
      "punts": 6,
      "punt yards": 286,
      "punt returns": 1,
      "punt return yards": 10,
      "kickoff returns": 3,
      "kickoff return yards": 48,
      "interception returns": 1,
      "interception return yards": 27,
      "3rd down conversions": 6,
      "3rd down attempts": 14,
      "4th down conversions": 0,
      "4th down attempts": 1
    },
    "SouthernMiss": {
      "points": 20,
      "1st downs": 18,
      "rushing 1st downs": 4,
      "passing 1st downs": 11,
      "penalty 1st downs": 3,
      "rushing yards": 75,
      "rushing attempts": 26,
      "passing yards": 272,
      "passing attempts": 39,
      "passing completions": 22,
      "passing interceptions": 1,
      "total yards": 347,
      "total plays": 65,
      "fumbles": 1,
      "fumbles lost": 0,
      "penalties": 5,
      "penalty yards": 44,
      "punts": 4,
      "punt yards": 151,
      "punt returns": 2,
      "punt return yards": 6,
      "kickoff returns": 1,
      "kickoff return yards": 25,
      "interception returns": 1,
      "interception return yards": 3,
      "3rd down conversions": 6,
      "3rd down attempts": 15,
      "4th down conversions": 0,
      "4th down attempts": 1
    }
  },
  "FCS vs BrighamYoung": {
    "stadium": "LaVellEdwardsStadium-Provo-UT",
    "FCS": {
      "points": 14,
      "1st downs": 21,
      "rushing 1st downs": 3,
      "passing 1st downs": 16,
      "penalty 1st downs": 2,
      "rushing yards": 49,
      "rushing attempts": 28,
      "passing yards": 305,
      "passing attempts": 40,
      "passing completions": 26,
      "passing interceptions": 1,
      "total yards": 354,
      "total plays": 68,
      "fumbles": 3,
      "fumbles lost": 2,
      "penalties": 6,
      "penalty yards": 31,
      "punts": 4,
      "punt yards": 174,
      "punt returns": 0,
      "punt return yards": 0,
      "kickoff returns": 1,
      "kickoff return yards": 17,
      "interception returns": 0,
      "interception return yards": 0,
      "3rd down conversions": 6,
      "3rd down attempts": 13,
      "4th down conversions": 0,
      "4th down attempts": 3
    },
    "BrighamYoung": {
      "points": 66,
      "1st downs": 25,
      "rushing 1st downs": 12,
      "passing 1st downs": 11,
      "penalty 1st downs": 2,
      "rushing yards": 278,
      "rushing attempts": 33,
      "passing yards": 277,
      "passing attempts": 26,
      "passing completions": 18,
      "passing interceptions": 0,
      "total yards": 555,
      "total plays": 59,
      "fumbles": 1,
      "fumbles lost": 0,
      "penalties": 5,
      "penalty yards": 43,
      "punts": 2,
      "punt yards": 107,
      "punt returns": 2,
      "punt return yards": 9,
      "kickoff returns": 1,
      "kickoff return yards": 19,
      "interception returns": 1,
      "interception return yards": 0,
      "3rd down conversions": 3,
      "3rd down attempts": 7,
      "4th down conversions": 1,
      "4th down attempts": 1
    }
  },
  "GeorgiaState vs SouthAlabama": {
    "stadium": "HancockWhitneyStadium-Mobile-AL",
    "GeorgiaState": {
      "points": 31,
      "1st downs": 20,
      "rushing 1st downs": 6,
      "passing 1st downs": 13,
      "penalty 1st downs": 1,
      "rushing yards": 222,
      "rushing attempts": 44,
      "passing yards": 334,
      "passing attempts": 28,
      "passing completions": 19,
      "passing interceptions": 3,
      "total yards": 556,
      "total plays": 72,
      "fumbles": 1,
      "fumbles lost": 1,
      "penalties": 5,
      "penalty yards": 70,
      "punts": 4,
      "punt yards": 177,
      "punt returns": 1,
      "punt return yards": 8,
      "kickoff returns": 0,
      "kickoff return yards": 0,
      "interception returns": 0,
      "interception return yards": 0,
      "3rd down conversions": 9,
      "3rd down attempts": 14,
      "4th down conversions": 0,
      "4th down attempts": 0
    },
    "SouthAlabama": {
      "points": 14,
      "1st downs": 19,
      "rushing 1st downs": 7,
      "passing 1st downs": 11,
      "penalty 1st downs": 1,
      "rushing yards": 113,
      "rushing attempts": 37,
      "passing yards": 211,
      "passing attempts": 43,
      "passing completions": 25,
      "passing interceptions": 0,
      "total yards": 324,
      "total plays": 80,
      "fumbles": 2,
      "fumbles lost": 1,
      "penalties": 3,
      "penalty yards": 30,
      "punts": 7,
      "punt yards": 322,
      "punt returns": 1,
      "punt return yards": 0,
      "kickoff returns": 2,
      "kickoff return yards": 12,
      "interception returns": 3,
      "interception return yards": 19,
      "3rd down conversions": 8,
      "3rd down attempts": 19,
      "4th down conversions": 0,
      "4th down attempts": 3
    }
  },
  "Cincinnati vs UCF": {
    "stadium": "BounceHouse-Orlando-FL",
    "Cincinnati": {
      "points": 36,
      "1st downs": 28,
      "rushing 1st downs": 10,
      "passing 1st downs": 16,
      "penalty 1st downs": 2,
      "rushing yards": 144,
      "rushing attempts": 48,
      "passing yards": 338,
      "passing attempts": 32,
      "passing completions": 21,
      "passing interceptions": 0,
      "total yards": 482,
      "total plays": 80,
      "fumbles": 3,
      "fumbles lost": 1,
      "penalties": 11,
      "penalty yards": 86,
      "punts": 4,
      "punt yards": 164,
      "punt returns": 3,
      "punt return yards": 11,
      "kickoff returns": 1,
      "kickoff return yards": 16,
      "interception returns": 1,
      "interception return yards": 20,
      "3rd down conversions": 5,
      "3rd down attempts": 14,
      "4th down conversions": 1,
      "4th down attempts": 2
    },
    "UCF": {
      "points": 33,
      "1st downs": 23,
      "rushing 1st downs": 8,
      "passing 1st downs": 11,
      "penalty 1st downs": 4,
      "rushing yards": 116,
      "rushing attempts": 35,
      "passing yards": 243,
      "passing attempts": 49,
      "passing completions": 26,
      "passing interceptions": 1,
      "total yards": 359,
      "total plays": 84,
      "fumbles": 0,
      "fumbles lost": 0,
      "penalties": 5,
      "penalty yards": 65,
      "punts": 6,
      "punt yards": 260,
      "punt returns": 1,
      "punt return yards": 0,
      "kickoff returns": 0,
      "kickoff return yards": 0,
      "interception returns": 0,
      "interception return yards": 0,
      "3rd down conversions": 11,
      "3rd down attempts": 19,
      "4th down conversions": 0,
      "4th down attempts": 1
    }
  },
  "MiddleTennessee vs Troy": {
    "stadium": "VeteransMemorialStadium-Troy-AL",
    "MiddleTennessee": {
      "points": 20,
      "1st downs": 23,
      "rushing 1st downs": 13,
      "passing 1st downs": 9,
      "penalty 1st downs": 1,
      "rushing yards": 186,
      "rushing attempts": 51,
      "passing yards": 210,
      "passing attempts": 23,
      "passing completions": 19,
      "passing interceptions": 0,
      "total yards": 396,
      "total plays": 74,
      "fumbles": 0,
      "fumbles lost": 0,
      "penalties": 2,
      "penalty yards": 25,
      "punts": 4,
      "punt yards": 158,
      "punt returns": 0,
      "punt return yards": 0,
      "kickoff returns": 0,
      "kickoff return yards": 0,
      "interception returns": 2,
      "interception return yards": 4,
      "3rd down conversions": 5,
      "3rd down attempts": 13,
      "4th down conversions": 1,
      "4th down attempts": 1
    },
    "Troy": {
      "points": 17,
      "1st downs": 18,
      "rushing 1st downs": 6,
      "passing 1st downs": 12,
      "penalty 1st downs": 0,
      "rushing yards": 92,
      "rushing attempts": 23,
      "passing yards": 300,
      "passing attempts": 39,
      "passing completions": 25,
      "passing interceptions": 2,
      "total yards": 392,
      "total plays": 62,
      "fumbles": 1,
      "fumbles lost": 0,
      "penalties": 5,
      "penalty yards": 39,
      "punts": 4,
      "punt yards": 177,
      "punt returns": 1,
      "punt return yards": 0,
      "kickoff returns": 4,
      "kickoff return yards": 84,
      "interception returns": 0,
      "interception return yards": 0,
      "3rd down conversions": 8,
      "3rd down attempts": 14,
      "4th down conversions": 0,
      "4th down attempts": 0
    }
  },
  "Iowa vs PennState": {
    "stadium": "BeaverStadium-UniversityPark-PA",
    "Iowa": {
      "points": 41,
      "1st downs": 24,
      "rushing 1st downs": 12,
      "passing 1st downs": 11,
      "penalty 1st downs": 1,
      "rushing yards": 175,
      "rushing attempts": 46,
      "passing yards": 186,
      "passing attempts": 28,
      "passing completions": 18,
      "passing interceptions": 0,
      "total yards": 361,
      "total plays": 74,
      "fumbles": 2,
      "fumbles lost": 1,
      "penalties": 6,
      "penalty yards": 45,
      "punts": 5,
      "punt yards": 222,
      "punt returns": 3,
      "punt return yards": 5,
      "kickoff returns": 1,
      "kickoff return yards": 25,
      "interception returns": 2,
      "interception return yards": 70,
      "3rd down conversions": 7,
      "3rd down attempts": 15,
      "4th down conversions": 0,
      "4th down attempts": 0
    },
    "PennState": {
      "points": 21,
      "1st downs": 19,
      "rushing 1st downs": 6,
      "passing 1st downs": 13,
      "penalty 1st downs": 0,
      "rushing yards": 62,
      "rushing attempts": 35,
      "passing yards": 280,
      "passing attempts": 38,
      "passing completions": 26,
      "passing interceptions": 2,
      "total yards": 342,
      "total plays": 73,
      "fumbles": 3,
      "fumbles lost": 2,
      "penalties": 2,
      "penalty yards": 15,
      "punts": 4,
      "punt yards": 181,
      "punt returns": 2,
      "punt return yards": 32,
      "kickoff returns": 1,
      "kickoff return yards": 18,
      "interception returns": 0,
      "interception return yards": 0,
      "3rd down conversions": 7,
      "3rd down attempts": 15,
      "4th down conversions": 1,
      "4th down attempts": 3
    }
  },
  "Wisconsin vs Northwestern": {
    "stadium": "RyanField-Evanston-IL",
    "Wisconsin": {
      "points": 7,
      "1st downs": 21,
      "rushing 1st downs": 11,
      "passing 1st downs": 10,
      "penalty 1st downs": 0,
      "rushing yards": 136,
      "rushing attempts": 40,
      "passing yards": 230,
      "passing attempts": 42,
      "passing completions": 23,
      "passing interceptions": 3,
      "total yards": 366,
      "total plays": 82,
      "fumbles": 4,
      "fumbles lost": 2,
      "penalties": 8,
      "penalty yards": 69,
      "punts": 7,
      "punt yards": 291,
      "punt returns": 3,
      "punt return yards": 7,
      "kickoff returns": 3,
      "kickoff return yards": 53,
      "interception returns": 0,
      "interception return yards": 0,
      "3rd down conversions": 3,
      "3rd down attempts": 16,
      "4th down conversions": 2,
      "4th down attempts": 4
    },
    "Northwestern": {
      "points": 17,
      "1st downs": 16,
      "rushing 1st downs": 1,
      "passing 1st downs": 11,
      "penalty 1st downs": 4,
      "rushing yards": 24,
      "rushing attempts": 23,
      "passing yards": 239,
      "passing attempts": 45,
      "passing completions": 24,
      "passing interceptions": 0,
      "total yards": 263,
      "total plays": 68,
      "fumbles": 1,
      "fumbles lost": 1,
      "penalties": 1,
      "penalty yards": 5,
      "punts": 10,
      "punt yards": 379,
      "punt returns": 1,
      "punt return yards": 17,
      "kickoff returns": 1,
      "kickoff return yards": 29,
      "interception returns": 3,
      "interception return yards": 1,
      "3rd down conversions": 2,
      "3rd down attempts": 15,
      "4th down conversions": 0,
      "4th down attempts": 1
    }
  },
  "SanDiegoState vs Nevada": {
    "stadium": "MackayStadium-Reno-NV",
    "SanDiegoState": {
      "points": 21,
      "1st downs": 16,
      "rushing 1st downs": 8,
      "passing 1st downs": 7,
      "penalty 1st downs": 1,
      "rushing yards": 109,
      "rushing attempts": 35,
      "passing yards": 184,
      "passing attempts": 25,
      "passing completions": 14,
      "passing interceptions": 0,
      "total yards": 293,
      "total plays": 60,
      "fumbles": 1,
      "fumbles lost": 1,
      "penalties": 6,
      "penalty yards": 48,
      "punts": 8,
      "punt yards": 420,
      "punt returns": 2,
      "punt return yards": 15,
      "kickoff returns": 2,
      "kickoff return yards": 50,
      "interception returns": 1,
      "interception return yards": 0,
      "3rd down conversions": 2,
      "3rd down attempts": 11,
      "4th down conversions": 0,
      "4th down attempts": 1
    },
    "Nevada": {
      "points": 26,
      "1st downs": 19,
      "rushing 1st downs": 5,
      "passing 1st downs": 10,
      "penalty 1st downs": 4,
      "rushing yards": 88,
      "rushing attempts": 23,
      "passing yards": 288,
      "passing attempts": 47,
      "passing completions": 31,
      "passing interceptions": 1,
      "total yards": 376,
      "total plays": 70,
      "fumbles": 0,
      "fumbles lost": 0,
      "penalties": 7,
      "penalty yards": 42,
      "punts": 5,
      "punt yards": 276,
      "punt returns": 4,
      "punt return yards": 61,
      "kickoff returns": 0,
      "kickoff return yards": 0,
      "interception returns": 0,
      "interception return yards": 0,
      "3rd down conversions": 5,
      "3rd down attempts": 16,
      "4th down conversions": 1,
      "4th down attempts": 1
    }
  },
  "UCLA vs Oregon": {
    "stadium": "AutzenStadium-Eugene-OR",
    "UCLA": {
      "points": 35,
      "1st downs": 27,
      "rushing 1st downs": 16,
      "passing 1st downs": 10,
      "penalty 1st downs": 1,
      "rushing yards": 267,
      "rushing attempts": 51,
      "passing yards": 195,
      "passing attempts": 31,
      "passing completions": 19,
      "passing interceptions": 2,
      "total yards": 462,
      "total plays": 82,
      "fumbles": 2,
      "fumbles lost": 2,
      "penalties": 8,
      "penalty yards": 60,
      "punts": 4,
      "punt yards": 205,
      "punt returns": 0,
      "punt return yards": 0,
      "kickoff returns": 6,
      "kickoff return yards": 126,
      "interception returns": 0,
      "interception return yards": 0,
      "3rd down conversions": 8,
      "3rd down attempts": 17,
      "4th down conversions": 2,
      "4th down attempts": 4
    },
    "Oregon": {
      "points": 38,
      "1st downs": 21,
      "rushing 1st downs": 6,
      "passing 1st downs": 15,
      "penalty 1st downs": 0,
      "rushing yards": 88,
      "rushing attempts": 34,
      "passing yards": 334,
      "passing attempts": 30,
      "passing completions": 19,
      "passing interceptions": 0,
      "total yards": 422,
      "total plays": 64,
      "fumbles": 1,
      "fumbles lost": 1,
      "penalties": 7,
      "penalty yards": 65,
      "punts": 6,
      "punt yards": 222,
      "punt returns": 2,
      "punt return yards": 34,
      "kickoff returns": 3,
      "kickoff return yards": 62,
      "interception returns": 2,
      "interception return yards": 67,
      "3rd down conversions": 3,
      "3rd down attempts": 11,
      "4th down conversions": 0,
      "4th down attempts": 0
    }
  },
  "California vs OregonState": {
    "stadium": "ReserStadium-Corvallis-OR",
    "California": {
      "points": 27,
      "1st downs": 24,
      "rushing 1st downs": 7,
      "passing 1st downs": 12,
      "penalty 1st downs": 5,
      "rushing yards": 124,
      "rushing attempts": 38,
      "passing yards": 315,
      "passing attempts": 43,
      "passing completions": 28,
      "passing interceptions": 2,
      "total yards": 439,
      "total plays": 81,
      "fumbles": 1,
      "fumbles lost": 0,
      "penalties": 7,
      "penalty yards": 59,
      "punts": 4,
      "punt yards": 139,
      "punt returns": 2,
      "punt return yards": 5,
      "kickoff returns": 2,
      "kickoff return yards": 33,
      "interception returns": 2,
      "interception return yards": 34,
      "3rd down conversions": 9,
      "3rd down attempts": 19,
      "4th down conversions": 1,
      "4th down attempts": 2
    },
    "OregonState": {
      "points": 31,
      "1st downs": 16,
      "rushing 1st downs": 6,
      "passing 1st downs": 9,
      "penalty 1st downs": 1,
      "rushing yards": 205,
      "rushing attempts": 30,
      "passing yards": 155,
      "passing attempts": 21,
      "passing completions": 13,
      "passing interceptions": 2,
      "total yards": 360,
      "total plays": 51,
      "fumbles": 0,
      "fumbles lost": 0,
      "penalties": 6,
      "penalty yards": 47,
      "punts": 4,
      "punt yards": 182,
      "punt returns": 3,
      "punt return yards": 66,
      "kickoff returns": 4,
      "kickoff return yards": 96,
      "interception returns": 2,
      "interception return yards": 1,
      "3rd down conversions": 3,
      "3rd down attempts": 10,
      "4th down conversions": 1,
      "4th down attempts": 1
    }
  },
  "VirginiaTech vs Pittsburgh": {
    "stadium": "HeinzField-Pittsburgh-PA",
    "VirginiaTech": {
      "points": 14,
      "1st downs": 17,
      "rushing 1st downs": 8,
      "passing 1st downs": 9,
      "penalty 1st downs": 0,
      "rushing yards": 156,
      "rushing attempts": 37,
      "passing yards": 278,
      "passing attempts": 26,
      "passing completions": 16,
      "passing interceptions": 1,
      "total yards": 434,
      "total plays": 63,
      "fumbles": 1,
      "fumbles lost": 1,
      "penalties": 6,
      "penalty yards": 55,
      "punts": 4,
      "punt yards": 158,
      "punt returns": 0,
      "punt return yards": 0,
      "kickoff returns": 5,
      "kickoff return yards": 100,
      "interception returns": 1,
      "interception return yards": 3,
      "3rd down conversions": 3,
      "3rd down attempts": 11,
      "4th down conversions": 0,
      "4th down attempts": 3
    },
    "Pittsburgh": {
      "points": 47,
      "1st downs": 30,
      "rushing 1st downs": 6,
      "passing 1st downs": 22,
      "penalty 1st downs": 2,
      "rushing yards": 152,
      "rushing attempts": 32,
      "passing yards": 404,
      "passing attempts": 52,
      "passing completions": 35,
      "passing interceptions": 1,
      "total yards": 556,
      "total plays": 84,
      "fumbles": 1,
      "fumbles lost": 0,
      "penalties": 9,
      "penalty yards": 80,
      "punts": 3,
      "punt yards": 123,
      "punt returns": 1,
      "punt return yards": 0,
      "kickoff returns": 1,
      "kickoff return yards": 19,
      "interception returns": 1,
      "interception return yards": 20,
      "3rd down conversions": 7,
      "3rd down attempts": 16,
      "4th down conversions": 1,
      "4th down attempts": 1
    }
  },
  "Kentucky vs Alabama": {
    "stadium": "BryantDennyStadium-Tuscaloosa-AL",
    "Kentucky": {
      "points": 3,
      "1st downs": 12,
      "rushing 1st downs": 5,
      "passing 1st downs": 6,
      "penalty 1st downs": 1,
      "rushing yards": 59,
      "rushing attempts": 32,
      "passing yards": 120,
      "passing attempts": 25,
      "passing completions": 10,
      "passing interceptions": 1,
      "total yards": 179,
      "total plays": 57,
      "fumbles": 2,
      "fumbles lost": 0,
      "penalties": 7,
      "penalty yards": 69,
      "punts": 7,
      "punt yards": 338,
      "punt returns": 0,
      "punt return yards": 0,
      "kickoff returns": 4,
      "kickoff return yards": 81,
      "interception returns": 1,
      "interception return yards": 21,
      "3rd down conversions": 2,
      "3rd down attempts": 13,
      "4th down conversions": 0,
      "4th down attempts": 1
    },
    "Alabama": {
      "points": 63,
      "1st downs": 29,
      "rushing 1st downs": 13,
      "passing 1st downs": 13,
      "penalty 1st downs": 3,
      "rushing yards": 226,
      "rushing attempts": 40,
      "passing yards": 283,
      "passing attempts": 26,
      "passing completions": 18,
      "passing interceptions": 1,
      "total yards": 509,
      "total plays": 66,
      "fumbles": 0,
      "fumbles lost": 0,
      "penalties": 4,
      "penalty yards": 30,
      "punts": 2,
      "punt yards": 92,
      "punt returns": 4,
      "punt return yards": 69,
      "kickoff returns": 1,
      "kickoff return yards": 25,
      "interception returns": 1,
      "interception return yards": 45,
      "3rd down conversions": 6,
      "3rd down attempts": 9,
      "4th down conversions": 1,
      "4th down attempts": 1
    }
  },
  "KansasState vs IowaState": {
    "stadium": "JackTriceStadium-Ames-IA",
    "KansasState": {
      "points": 0,
      "1st downs": 9,
      "rushing 1st downs": 5,
      "passing 1st downs": 3,
      "penalty 1st downs": 1,
      "rushing yards": 73,
      "rushing attempts": 28,
      "passing yards": 76,
      "passing attempts": 19,
      "passing completions": 9,
      "passing interceptions": 1,
      "total yards": 149,
      "total plays": 47,
      "fumbles": 3,
      "fumbles lost": 2,
      "penalties": 4,
      "penalty yards": 20,
      "punts": 6,
      "punt yards": 242,
      "punt returns": 0,
      "punt return yards": 0,
      "kickoff returns": 7,
      "kickoff return yards": 114,
      "interception returns": 0,
      "interception return yards": 0,
      "3rd down conversions": 4,
      "3rd down attempts": 12,
      "4th down conversions": 0,
      "4th down attempts": 2
    },
    "IowaState": {
      "points": 45,
      "1st downs": 26,
      "rushing 1st downs": 14,
      "passing 1st downs": 11,
      "penalty 1st downs": 1,
      "rushing yards": 240,
      "rushing attempts": 44,
      "passing yards": 299,
      "passing attempts": 25,
      "passing completions": 19,
      "passing interceptions": 0,
      "total yards": 539,
      "total plays": 69,
      "fumbles": 0,
      "fumbles lost": 0,
      "penalties": 4,
      "penalty yards": 30,
      "punts": 2,
      "punt yards": 85,
      "punt returns": 0,
      "punt return yards": 0,
      "kickoff returns": 0,
      "kickoff return yards": 0,
      "interception returns": 1,
      "interception return yards": 2,
      "3rd down conversions": 5,
      "3rd down attempts": 12,
      "4th down conversions": 1,
      "4th down attempts": 2
    }
  },
  "FCS vs Virginia": {
    "stadium": "ScottStadium-Charlottesville-VA",
    "FCS": {
      "points": 15,
      "1st downs": 22,
      "rushing 1st downs": 5,
      "passing 1st downs": 15,
      "penalty 1st downs": 2,
      "rushing yards": 62,
      "rushing attempts": 32,
      "passing yards": 278,
      "passing attempts": 45,
      "passing completions": 28,
      "passing interceptions": 1,
      "total yards": 340,
      "total plays": 77,
      "fumbles": 0,
      "fumbles lost": 0,
      "penalties": 10,
      "penalty yards": 62,
      "punts": 5,
      "punt yards": 222,
      "punt returns": 0,
      "punt return yards": 0,
      "kickoff returns": 2,
      "kickoff return yards": 41,
      "interception returns": 0,
      "interception return yards": 0,
      "3rd down conversions": 6,
      "3rd down attempts": 15,
      "4th down conversions": 1,
      "4th down attempts": 4
    },
    "Virginia": {
      "points": 55,
      "1st downs": 23,
      "rushing 1st downs": 7,
      "passing 1st downs": 14,
      "penalty 1st downs": 2,
      "rushing yards": 115,
      "rushing attempts": 33,
      "passing yards": 403,
      "passing attempts": 29,
      "passing completions": 22,
      "passing interceptions": 0,
      "total yards": 518,
      "total plays": 62,
      "fumbles": 0,
      "fumbles lost": 0,
      "penalties": 6,
      "penalty yards": 53,
      "punts": 2,
      "punt yards": 74,
      "punt returns": 4,
      "punt return yards": 10,
      "kickoff returns": 1,
      "kickoff return yards": 16,
      "interception returns": 1,
      "interception return yards": 84,
      "3rd down conversions": 7,
      "3rd down attempts": 11,
      "4th down conversions": 1,
      "4th down attempts": 2
    }
  },
  "Tennessee vs Auburn": {
    "stadium": "JordanHareStadium-Auburn-AL",
    "Tennessee": {
      "points": 17,
      "1st downs": 28,
      "rushing 1st downs": 13,
      "passing 1st downs": 12,
      "penalty 1st downs": 3,
      "rushing yards": 222,
      "rushing attempts": 41,
      "passing yards": 242,
      "passing attempts": 33,
      "passing completions": 22,
      "passing interceptions": 1,
      "total yards": 464,
      "total plays": 74,
      "fumbles": 0,
      "fumbles lost": 0,
      "penalties": 4,
      "penalty yards": 33,
      "punts": 2,
      "punt yards": 74,
      "punt returns": 0,
      "punt return yards": 0,
      "kickoff returns": 0,
      "kickoff return yards": 0,
      "interception returns": 1,
      "interception return yards": 0,
      "3rd down conversions": 9,
      "3rd down attempts": 15,
      "4th down conversions": 1,
      "4th down attempts": 1
    },
    "Auburn": {
      "points": 30,
      "1st downs": 23,
      "rushing 1st downs": 12,
      "passing 1st downs": 10,
      "penalty 1st downs": 1,
      "rushing yards": 165,
      "rushing attempts": 38,
      "passing yards": 220,
      "passing attempts": 26,
      "passing completions": 17,
      "passing interceptions": 1,
      "total yards": 385,
      "total plays": 64,
      "fumbles": 0,
      "fumbles lost": 0,
      "penalties": 6,
      "penalty yards": 60,
      "punts": 2,
      "punt yards": 73,
      "punt returns": 0,
      "punt return yards": 0,
      "kickoff returns": 0,
      "kickoff return yards": 0,
      "interception returns": 1,
      "interception return yards": 0,
      "3rd down conversions": 9,
      "3rd down attempts": 15,
      "4th down conversions": 0,
      "4th down attempts": 0
    }
  },
  "Missouri vs SouthCarolina": {
    "stadium": "WilliamsBriceStadium-Columbia-SC",
    "Missouri": {
      "points": 17,
      "1st downs": 19,
      "rushing 1st downs": 6,
      "passing 1st downs": 10,
      "penalty 1st downs": 3,
      "rushing yards": 98,
      "rushing attempts": 34,
      "passing yards": 203,
      "passing attempts": 33,
      "passing completions": 21,
      "passing interceptions": 1,
      "total yards": 301,
      "total plays": 67,
      "fumbles": 1,
      "fumbles lost": 0,
      "penalties": 7,
      "penalty yards": 77,
      "punts": 7,
      "punt yards": 305,
      "punt returns": 2,
      "punt return yards": 17,
      "kickoff returns": 0,
      "kickoff return yards": 0,
      "interception returns": 1,
      "interception return yards": 8,
      "3rd down conversions": 8,
      "3rd down attempts": 16,
      "4th down conversions": 0,
      "4th down attempts": 0
    },
    "SouthCarolina": {
      "points": 10,
      "1st downs": 18,
      "rushing 1st downs": 6,
      "passing 1st downs": 8,
      "penalty 1st downs": 4,
      "rushing yards": 114,
      "rushing attempts": 36,
      "passing yards": 169,
      "passing attempts": 33,
      "passing completions": 20,
      "passing interceptions": 1,
      "total yards": 283,
      "total plays": 69,
      "fumbles": 0,
      "fumbles lost": 0,
      "penalties": 11,
      "penalty yards": 85,
      "punts": 7,
      "punt yards": 313,
      "punt returns": 1,
      "punt return yards": 1,
      "kickoff returns": 1,
      "kickoff return yards": 23,
      "interception returns": 1,
      "interception return yards": 0,
      "3rd down conversions": 6,
      "3rd down attempts": 16,
      "4th down conversions": 1,
      "4th down attempts": 2
    }
  },
  "Liberty vs NorthCarolinaState": {
    "stadium": "WayneDayFamilyFieldatCarterFinleyStadium-Raleigh-NC",
    "Liberty": {
      "points": 14,
      "1st downs": 17,
      "rushing 1st downs": 5,
      "passing 1st downs": 8,
      "penalty 1st downs": 4,
      "rushing yards": 107,
      "rushing attempts": 38,
      "passing yards": 172,
      "passing attempts": 32,
      "passing completions": 13,
      "passing interceptions": 3,
      "total yards": 279,
      "total plays": 70,
      "fumbles": 0,
      "fumbles lost": 0,
      "penalties": 7,
      "penalty yards": 45,
      "punts": 5,
      "punt yards": 229,
      "punt returns": 2,
      "punt return yards": 12,
      "kickoff returns": 2,
      "kickoff return yards": 50,
      "interception returns": 1,
      "interception return yards": 14,
      "3rd down conversions": 6,
      "3rd down attempts": 15,
      "4th down conversions": 0,
      "4th down attempts": 1
    },
    "NorthCarolinaState": {
      "points": 15,
      "1st downs": 19,
      "rushing 1st downs": 14,
      "passing 1st downs": 5,
      "penalty 1st downs": 0,
      "rushing yards": 167,
      "rushing attempts": 39,
      "passing yards": 154,
      "passing attempts": 27,
      "passing completions": 14,
      "passing interceptions": 1,
      "total yards": 321,
      "total plays": 66,
      "fumbles": 2,
      "fumbles lost": 0,
      "penalties": 14,
      "penalty yards": 123,
      "punts": 8,
      "punt yards": 343,
      "punt returns": 1,
      "punt return yards": 6,
      "kickoff returns": 2,
      "kickoff return yards": 36,
      "interception returns": 3,
      "interception return yards": 5,
      "3rd down conversions": 4,
      "3rd down attempts": 14,
      "4th down conversions": 0,
      "4th down attempts": 0
    }
  },
  "MississippiState vs Georgia": {
    "stadium": "SanfordStadium-Athens-GA",
    "MississippiState": {
      "points": 24,
      "1st downs": 20,
      "rushing 1st downs": 2,
      "passing 1st downs": 17,
      "penalty 1st downs": 1,
      "rushing yards": 22,
      "rushing attempts": 14,
      "passing yards": 336,
      "passing attempts": 52,
      "passing completions": 41,
      "passing interceptions": 0,
      "total yards": 358,
      "total plays": 66,
      "fumbles": 0,
      "fumbles lost": 0,
      "penalties": 3,
      "penalty yards": 25,
      "punts": 4,
      "punt yards": 169,
      "punt returns": 0,
      "punt return yards": 0,
      "kickoff returns": 0,
      "kickoff return yards": 0,
      "interception returns": 0,
      "interception return yards": 0,
      "3rd down conversions": 7,
      "3rd down attempts": 13,
      "4th down conversions": 0,
      "4th down attempts": 1
    },
    "Georgia": {
      "points": 31,
      "1st downs": 18,
      "rushing 1st downs": 2,
      "passing 1st downs": 15,
      "penalty 1st downs": 1,
      "rushing yards": 8,
      "rushing attempts": 23,
      "passing yards": 401,
      "passing attempts": 38,
      "passing completions": 28,
      "passing interceptions": 0,
      "total yards": 409,
      "total plays": 61,
      "fumbles": 0,
      "fumbles lost": 0,
      "penalties": 5,
      "penalty yards": 60,
      "punts": 4,
      "punt yards": 174,
      "punt returns": 0,
      "punt return yards": 0,
      "kickoff returns": 1,
      "kickoff return yards": 30,
      "interception returns": 0,
      "interception return yards": 0,
      "3rd down conversions": 8,
      "3rd down attempts": 13,
      "4th down conversions": 0,
      "4th down attempts": 0
    }
  },
  "OklahomaState vs Oklahoma": {
    "stadium": "GaylordFamilyOklahomaMemorialStadium-Norman-OK",
    "OklahomaState": {
      "points": 13,
      "1st downs": 19,
      "rushing 1st downs": 4,
      "passing 1st downs": 8,
      "penalty 1st downs": 7,
      "rushing yards": 78,
      "rushing attempts": 28,
      "passing yards": 168,
      "passing attempts": 40,
      "passing completions": 15,
      "passing interceptions": 1,
      "total yards": 246,
      "total plays": 68,
      "fumbles": 0,
      "fumbles lost": 0,
      "penalties": 8,
      "penalty yards": 41,
      "punts": 6,
      "punt yards": 236,
      "punt returns": 3,
      "punt return yards": 0,
      "kickoff returns": 7,
      "kickoff return yards": 146,
      "interception returns": 0,
      "interception return yards": 0,
      "3rd down conversions": 3,
      "3rd down attempts": 14,
      "4th down conversions": 1,
      "4th down attempts": 2
    },
    "Oklahoma": {
      "points": 41,
      "1st downs": 23,
      "rushing 1st downs": 9,
      "passing 1st downs": 12,
      "penalty 1st downs": 2,
      "rushing yards": 191,
      "rushing attempts": 44,
      "passing yards": 301,
      "passing attempts": 24,
      "passing completions": 17,
      "passing interceptions": 0,
      "total yards": 492,
      "total plays": 68,
      "fumbles": 1,
      "fumbles lost": 0,
      "penalties": 7,
      "penalty yards": 87,
      "punts": 3,
      "punt yards": 154,
      "punt returns": 1,
      "punt return yards": -9,
      "kickoff returns": 1,
      "kickoff return yards": 11,
      "interception returns": 1,
      "interception return yards": 0,
      "3rd down conversions": 4,
      "3rd down attempts": 12,
      "4th down conversions": 2,
      "4th down attempts": 2
    }
  },
  "Michigan vs Rutgers": {
    "stadium": "SHIStadium-Piscataway-NJ",
    "Michigan": {
      "points": 48,
      "1st downs": 29,
      "rushing 1st downs": 9,
      "passing 1st downs": 16,
      "penalty 1st downs": 4,
      "rushing yards": 148,
      "rushing attempts": 43,
      "passing yards": 349,
      "passing attempts": 48,
      "passing completions": 32,
      "passing interceptions": 0,
      "total yards": 497,
      "total plays": 91,
      "fumbles": 1,
      "fumbles lost": 1,
      "penalties": 5,
      "penalty yards": 40,
      "punts": 3,
      "punt yards": 137,
      "punt returns": 1,
      "punt return yards": 0,
      "kickoff returns": 6,
      "kickoff return yards": 191,
      "interception returns": 1,
      "interception return yards": 0,
      "3rd down conversions": 5,
      "3rd down attempts": 16,
      "4th down conversions": 3,
      "4th down attempts": 4
    },
    "Rutgers": {
      "points": 42,
      "1st downs": 24,
      "rushing 1st downs": 6,
      "passing 1st downs": 17,
      "penalty 1st downs": 1,
      "rushing yards": 104,
      "rushing attempts": 40,
      "passing yards": 378,
      "passing attempts": 44,
      "passing completions": 29,
      "passing interceptions": 1,
      "total yards": 482,
      "total plays": 84,
      "fumbles": 2,
      "fumbles lost": 0,
      "penalties": 12,
      "penalty yards": 99,
      "punts": 6,
      "punt yards": 246,
      "punt returns": 1,
      "punt return yards": -2,
      "kickoff returns": 2,
      "kickoff return yards": 34,
      "interception returns": 0,
      "interception return yards": 0,
      "3rd down conversions": 7,
      "3rd down attempts": 18,
      "4th down conversions": 1,
      "4th down attempts": 2
    }
  },
  "Arizona vs Washington": {
    "stadium": "AlaskaAirlinesFieldatHuskyStadium-Seattle-WA",
    "Arizona": {
      "points": 27,
      "1st downs": 22,
      "rushing 1st downs": 6,
      "passing 1st downs": 12,
      "penalty 1st downs": 4,
      "rushing yards": 72,
      "rushing attempts": 26,
      "passing yards": 259,
      "passing attempts": 39,
      "passing completions": 27,
      "passing interceptions": 0,
      "total yards": 331,
      "total plays": 65,
      "fumbles": 1,
      "fumbles lost": 1,
      "penalties": 7,
      "penalty yards": 40,
      "punts": 5,
      "punt yards": 193,
      "punt returns": 1,
      "punt return yards": 0,
      "kickoff returns": 4,
      "kickoff return yards": 71,
      "interception returns": 0,
      "interception return yards": 0,
      "3rd down conversions": 2,
      "3rd down attempts": 13,
      "4th down conversions": 0,
      "4th down attempts": 1
    },
    "Washington": {
      "points": 44,
      "1st downs": 24,
      "rushing 1st downs": 13,
      "passing 1st downs": 10,
      "penalty 1st downs": 1,
      "rushing yards": 233,
      "rushing attempts": 45,
      "passing yards": 239,
      "passing attempts": 26,
      "passing completions": 16,
      "passing interceptions": 0,
      "total yards": 472,
      "total plays": 71,
      "fumbles": 0,
      "fumbles lost": 0,
      "penalties": 6,
      "penalty yards": 46,
      "punts": 3,
      "punt yards": 126,
      "punt returns": 0,
      "punt return yards": 0,
      "kickoff returns": 1,
      "kickoff return yards": 10,
      "interception returns": 0,
      "interception return yards": 0,
      "3rd down conversions": 8,
      "3rd down attempts": 15,
      "4th down conversions": 2,
      "4th down attempts": 2
    }
  },
  "USC vs Utah": {
    "stadium": "RiceEcclesStadium-SaltLakeCity-UT",
    "USC": {
      "points": 33,
      "1st downs": 18,
      "rushing 1st downs": 5,
      "passing 1st downs": 12,
      "penalty 1st downs": 1,
      "rushing yards": 93,
      "rushing attempts": 31,
      "passing yards": 264,
      "passing attempts": 35,
      "passing completions": 24,
      "passing interceptions": 1,
      "total yards": 357,
      "total plays": 66,
      "fumbles": 3,
      "fumbles lost": 1,
      "penalties": 5,
      "penalty yards": 49,
      "punts": 4,
      "punt yards": 175,
      "punt returns": 1,
      "punt return yards": -4,
      "kickoff returns": 2,
      "kickoff return yards": 36,
      "interception returns": 3,
      "interception return yards": 13,
      "3rd down conversions": 5,
      "3rd down attempts": 13,
      "4th down conversions": 0,
      "4th down attempts": 0
    },
    "Utah": {
      "points": 17,
      "1st downs": 17,
      "rushing 1st downs": 6,
      "passing 1st downs": 10,
      "penalty 1st downs": 1,
      "rushing yards": 119,
      "rushing attempts": 28,
      "passing yards": 216,
      "passing attempts": 34,
      "passing completions": 19,
      "passing interceptions": 3,
      "total yards": 335,
      "total plays": 62,
      "fumbles": 2,
      "fumbles lost": 2,
      "penalties": 6,
      "penalty yards": 52,
      "punts": 4,
      "punt yards": 144,
      "punt returns": 1,
      "punt return yards": 18,
      "kickoff returns": 0,
      "kickoff return yards": 0,
      "interception returns": 1,
      "interception return yards": 0,
      "3rd down conversions": 3,
      "3rd down attempts": 11,
      "4th down conversions": 1,
      "4th down attempts": 3
    }
  },
  "BoiseState vs Hawaii": {
    "stadium": "AlohaStadium-Honolulu-HI",
    "BoiseState": {
      "points": 40,
      "1st downs": 21,
      "rushing 1st downs": 9,
      "passing 1st downs": 11,
      "penalty 1st downs": 1,
      "rushing yards": 127,
      "rushing attempts": 36,
      "passing yards": 281,
      "passing attempts": 32,
      "passing completions": 22,
      "passing interceptions": 1,
      "total yards": 408,
      "total plays": 68,
      "fumbles": 1,
      "fumbles lost": 0,
      "penalties": 8,
      "penalty yards": 94,
      "punts": 4,
      "punt yards": 168,
      "punt returns": 3,
      "punt return yards": 72,
      "kickoff returns": 2,
      "kickoff return yards": 120,
      "interception returns": 0,
      "interception return yards": 0,
      "3rd down conversions": 9,
      "3rd down attempts": 16,
      "4th down conversions": 0,
      "4th down attempts": 0
    },
    "Hawaii": {
      "points": 32,
      "1st downs": 25,
      "rushing 1st downs": 7,
      "passing 1st downs": 13,
      "penalty 1st downs": 5,
      "rushing yards": 141,
      "rushing attempts": 35,
      "passing yards": 253,
      "passing attempts": 48,
      "passing completions": 25,
      "passing interceptions": 0,
      "total yards": 394,
      "total plays": 83,
      "fumbles": 0,
      "fumbles lost": 0,
      "penalties": 6,
      "penalty yards": 45,
      "punts": 7,
      "punt yards": 310,
      "punt returns": 1,
      "punt return yards": 7,
      "kickoff returns": 3,
      "kickoff return yards": 61,
      "interception returns": 1,
      "interception return yards": 0,
      "3rd down conversions": 7,
      "3rd down attempts": 19,
      "4th down conversions": 2,
      "4th down attempts": 2
    }
  }
}