{
  "games": [
    {
      "game": {
        "away": {
          "names": {
            "short": "KentState",
            "standard": "KentState"
          },
          "score": "23"
        },
        "gameState": "final",
        "home": {
          "names": {
            "short": "Buffalo",
            "standard": "Buffalo"
          },
          "score": "7"
        },
        "startDate": "09-19-2012",
        "startTime": "12:00PM ET",
        "url": "/fbs/2012/09/19/kent-st-buffalo",
        "location": "UBStadiumBuffaloNewYork"
      }
    },
    {
      "game": {
        "away": {
          "names": {
            "short": "BrighamYoung",
            "standard": "BrighamYoung"
          },
          "score": "6"
        },
        "gameState": "final",
        "home": {
          "names": {
            "short": "BoiseState",
            "standard": "BoiseState"
          },
          "score": "7"
        },
        "startDate": "09-20-2012",
        "startTime": "12:00PM ET",
        "url": "/fbs/2012/09/20/byu-boise-st",
        "location": "BroncoStadiumBoiseIdaho"
      }
    },
    {
      "game": {
        "away": {
          "names": {
            "short": "Baylor",
            "standard": "Baylor"
          },
          "score": "47"
        },
        "gameState": "final",
        "home": {
          "names": {
            "short": "LouisianaMonroe",
            "standard": "LouisianaMonroe"
          },
          "score": "42"
        },
        "startDate": "09-21-2012",
        "startTime": "12:00PM ET",
        "url": "/fbs/2012/09/21/baylor-la-monroe",
        "location": "JamesLMaloneStadiumMonroeLouisiana"
      }
    },
    {
      "game": {
        "away": {
          "names": {
            "short": "Virginia",
            "standard": "Virginia"
          },
          "score": "7"
        },
        "gameState": "final",
        "home": {
          "names": {
            "short": "TCU",
            "standard": "TCU"
          },
          "score": "27"
        },
        "startDate": "09-22-2012",
        "startTime": "12:00PM ET",
        "url": "/fbs/2012/09/22/virginia-tcu",
        "location": "AmonGCarterStadiumFortWorthTexas"
      }
    },
    {
      "game": {
        "away": {
          "names": {
            "short": "UTEP",
            "standard": "UTEP"
          },
          "score": "26"
        },
        "gameState": "final",
        "home": {
          "names": {
            "short": "Wisconsin",
            "standard": "Wisconsin"
          },
          "score": "37"
        },
        "startDate": "09-22-2012",
        "startTime": "12:00PM ET",
        "url": "/fbs/2012/09/22/utep-wisconsin",
        "location": "CampRandallStadiumMadisonWisconsin"
      }
    },
    {
      "game": {
        "away": {
          "names": {
            "short": "OleMiss",
            "standard": "OleMiss"
          },
          "score": "39"
        },
        "gameState": "final",
        "home": {
          "names": {
            "short": "Tulane",
            "standard": "Tulane"
          },
          "score": "0"
        },
        "startDate": "09-22-2012",
        "startTime": "12:00PM ET",
        "url": "/fbs/2012/09/22/ole-miss-tulane",
        "location": "MercedesBenzSuperdomeNewOrleansLouisiana"
      }
    },
    {
      "game": {
        "away": {
          "names": {
            "short": "CentralMichigan",
            "standard": "CentralMichigan"
          },
          "score": "32"
        },
        "gameState": "final",
        "home": {
          "names": {
            "short": "Iowa",
            "standard": "Iowa"
          },
          "score": "31"
        },
        "startDate": "09-22-2012",
        "startTime": "12:00PM ET",
        "url": "/fbs/2012/09/22/central-mich-iowa",
        "location": "KinnickStadiumIowaCityIowa"
      }
    },
    {
      "game": {
        "away": {
          "names": {
            "short": "BowlingGreen",
            "standard": "BowlingGreen"
          },
          "score": "0"
        },
        "gameState": "final",
        "home": {
          "names": {
            "short": "VirginiaTech",
            "standard": "VirginiaTech"
          },
          "score": "37"
        },
        "startDate": "09-22-2012",
        "startTime": "12:00PM ET",
        "url": "/fbs/2012/09/22/bowling-green-virginia-tech",
        "location": "LaneStadiumWorshamFieldBlacksburgVirginia"
      }
    },
    {
      "game": {
        "away": {
          "names": {
            "short": "Massachusetts",
            "standard": "Massachusetts"
          },
          "score": "16"
        },
        "gameState": "final",
        "home": {
          "names": {
            "short": "MiamiOH",
            "standard": "MiamiOH"
          },
          "score": "27"
        },
        "startDate": "09-22-2012",
        "startTime": "12:00PM ET",
        "url": "/fbs/2012/09/22/massachusetts-miami-oh",
        "location": "FredCYagerStadiumOxfordOhio"
      }
    },
    {
      "game": {
        "away": {
          "names": {
            "short": "Maryland",
            "standard": "Maryland"
          },
          "score": "21"
        },
        "gameState": "final",
        "home": {
          "names": {
            "short": "WestVirginia",
            "standard": "WestVirginia"
          },
          "score": "31"
        },
        "startDate": "09-22-2012",
        "startTime": "12:00PM ET",
        "url": "/fbs/2012/09/22/maryland-west-virginia",
        "location": "MountaineerFieldMorgantownWestVirginia"
      }
    },
    {
      "game": {
        "away": {
          "names": {
            "short": "UAB",
            "standard": "UAB"
          },
          "score": "15"
        },
        "gameState": "final",
        "home": {
          "names": {
            "short": "OhioState",
            "standard": "OhioState"
          },
          "score": "29"
        },
        "startDate": "09-22-2012",
        "startTime": "12:00PM ET",
        "url": "/fbs/2012/09/22/uab-ohio-st",
        "location": "OhioStadiumColumbusOhio"
      }
    },
    {
      "game": {
        "away": {
          "names": {
            "short": "Kentucky",
            "standard": "Kentucky"
          },
          "score": "0"
        },
        "gameState": "final",
        "home": {
          "names": {
            "short": "Florida",
            "standard": "Florida"
          },
          "score": "38"
        },
        "startDate": "09-22-2012",
        "startTime": "12:00PM ET",
        "url": "/fbs/2012/09/22/kentucky-florida",
        "location": "BenHillGriffinStadiumatFloridaFieldGainesvilleFlorida"
      }
    },
    {
      "game": {
        "away": {
          "names": {
            "short": "Army",
            "standard": "Army"
          },
          "score": "37"
        },
        "gameState": "final",
        "home": {
          "names": {
            "short": "WakeForest",
            "standard": "WakeForest"
          },
          "score": "49"
        },
        "startDate": "09-22-2012",
        "startTime": "12:00PM ET",
        "url": "/fbs/2012/09/22/army-wake-forest",
        "location": "BBTFieldWinstonSalemNorthCarolina"
      }
    },
    {
      "game": {
        "away": {
          "names": {
            "short": "NorfolkState",
            "standard": "NorfolkState"
          },
          "score": "10"
        },
        "gameState": "final",
        "home": {
          "names": {
            "short": "Ohio",
            "standard": "Ohio"
          },
          "score": "44"
        },
        "startDate": "09-22-2012",
        "startTime": "12:00PM ET",
        "url": "/fbs/2012/09/22/norfolk-st-ohio",
        "location": "PedenStadiumAthensOhio"
      }
    },
    {
      "game": {
        "away": {
          "names": {
            "short": "Connecticut",
            "standard": "Connecticut"
          },
          "score": "24"
        },
        "gameState": "final",
        "home": {
          "names": {
            "short": "WesternMichigan",
            "standard": "WesternMichigan"
          },
          "score": "30"
        },
        "startDate": "09-22-2012",
        "startTime": "12:00PM ET",
        "url": "/fbs/2012/09/22/connecticut-western-mich",
        "location": "WaldoStadiumKalamazooMichigan"
      }
    },
    {
      "game": {
        "away": {
          "names": {
            "short": "NorthwesternOkla",
            "standard": "NorthwesternOkla"
          },
          "score": "3"
        },
        "gameState": "final",
        "home": {
          "names": {
            "short": "UTSA",
            "standard": "UTSA"
          },
          "score": "56"
        },
        "startDate": "09-22-2012",
        "startTime": "12:00PM ET",
        "url": "/fbs/2012/09/22/northwestern-okla-utsa",
        "location": "AlamodomeSanAntonioTexas"
      }
    },
    {
      "game": {
        "away": {
          "names": {
            "short": "NorthwesternOkla",
            "standard": "NorthwesternOkla"
          },
          "score": "3"
        },
        "gameState": "final",
        "home": {
          "names": {
            "short": "UTSA",
            "standard": "UTSA"
          },
          "score": "56"
        },
        "startDate": "09-22-2012",
        "startTime": "12:00PM ET",
        "url": "/fbs/2012/09/22/northwestern-okla-utsa",
        "location": "AlamodomeSanAntonioTexas"
      }
    },
    {
      "game": {
        "away": {
          "names": {
            "short": "MiamiFL",
            "standard": "MiamiFL"
          },
          "score": "42"
        },
        "gameState": "final",
        "home": {
          "names": {
            "short": "GeorgiaTech",
            "standard": "GeorgiaTech"
          },
          "score": "36"
        },
        "startDate": "09-22-2012",
        "startTime": "12:00PM ET",
        "url": "/fbs/2012/09/22/miami-fl-georgia-tech",
        "location": "BobbyDoddStadiumAtlantaGeorgia"
      }
    },
    {
      "game": {
        "away": {
          "names": {
            "short": "Marshall",
            "standard": "Marshall"
          },
          "score": "54"
        },
        "gameState": "final",
        "home": {
          "names": {
            "short": "Rice",
            "standard": "Rice"
          },
          "score": "51"
        },
        "startDate": "09-22-2012",
        "startTime": "12:00PM ET",
        "url": "/fbs/2012/09/22/marshall-rice",
        "location": "RiceStadiumHoustonTexas"
      }
    },
    {
      "game": {
        "away": {
          "names": {
            "short": "EastCarolina",
            "standard": "EastCarolina"
          },
          "score": "6"
        },
        "gameState": "final",
        "home": {
          "names": {
            "short": "NorthCarolina",
            "standard": "NorthCarolina"
          },
          "score": "27"
        },
        "startDate": "09-22-2012",
        "startTime": "12:00PM ET",
        "url": "/fbs/2012/09/22/east-carolina-north-carolina",
        "location": "KenanMemorialStadiumChapelHillNorthCarolina"
      }
    },
    {
      "game": {
        "away": {
          "names": {
            "short": "OregonState",
            "standard": "OregonState"
          },
          "score": "27"
        },
        "gameState": "final",
        "home": {
          "names": {
            "short": "UCLA",
            "standard": "UCLA"
          },
          "score": "20"
        },
        "startDate": "09-22-2012",
        "startTime": "12:00PM ET",
        "url": "/fbs/2012/09/22/oregon-st-ucla",
        "location": "RoseBowlPasadenaCalifornia"
      }
    },
    {
      "game": {
        "away": {
          "names": {
            "short": "Missouri",
            "standard": "Missouri"
          },
          "score": "10"
        },
        "gameState": "final",
        "home": {
          "names": {
            "short": "SouthCarolina",
            "standard": "SouthCarolina"
          },
          "score": "31"
        },
        "startDate": "09-22-2012",
        "startTime": "12:00PM ET",
        "url": "/fbs/2012/09/22/missouri-south-carolina",
        "location": "WilliamsBriceStadiumColumbiaSouthCarolina"
      }
    },
    {
      "game": {
        "away": {
          "names": {
            "short": "IdahoState",
            "standard": "IdahoState"
          },
          "score": "7"
        },
        "gameState": "final",
        "home": {
          "names": {
            "short": "Nebraska",
            "standard": "Nebraska"
          },
          "score": "73"
        },
        "startDate": "09-22-2012",
        "startTime": "12:00PM ET",
        "url": "/fbs/2012/09/22/idaho-st-nebraska",
        "location": "MemorialStadiumLincolnNebraska"
      }
    },
    {
      "game": {
        "away": {
          "names": {
            "short": "GardnerWebb",
            "standard": "GardnerWebb"
          },
          "score": "10"
        },
        "gameState": "final",
        "home": {
          "names": {
            "short": "Pittsburgh",
            "standard": "Pittsburgh"
          },
          "score": "55"
        },
        "startDate": "09-22-2012",
        "startTime": "12:00PM ET",
        "url": "/fbs/2012/09/22/gardner-webb-pittsburgh",
        "location": "HeinzFieldPittsburghPennsylvania"
      }
    },
    {
      "game": {
        "away": {
          "names": {
            "short": "SouthDakota",
            "standard": "SouthDakota"
          },
          "score": "7"
        },
        "gameState": "final",
        "home": {
          "names": {
            "short": "Northwestern",
            "standard": "Northwestern"
          },
          "score": "38"
        },
        "startDate": "09-22-2012",
        "startTime": "12:00PM ET",
        "url": "/fbs/2012/09/22/south-dakota-northwestern",
        "location": "RyanFieldEvanstonIllinois"
      }
    },
    {
      "game": {
        "away": {
          "names": {
            "short": "VMI",
            "standard": "VMI"
          },
          "score": "3"
        },
        "gameState": "final",
        "home": {
          "names": {
            "short": "Navy",
            "standard": "Navy"
          },
          "score": "41"
        },
        "startDate": "09-22-2012",
        "startTime": "12:00PM ET",
        "url": "/fbs/2012/09/22/vmi-navy",
        "location": "JackStephensFieldatNavyMarineCorpsMemorialStadiumAnnapolisMaryland"
      }
    },
    {
      "game": {
        "away": {
          "names": {
            "short": "EasternMichigan",
            "standard": "EasternMichigan"
          },
          "score": "7"
        },
        "gameState": "final",
        "home": {
          "names": {
            "short": "MichiganState",
            "standard": "MichiganState"
          },
          "score": "23"
        },
        "startDate": "09-22-2012",
        "startTime": "12:00PM ET",
        "url": "/fbs/2012/09/22/eastern-mich-michigan-st",
        "location": "SpartanStadiumEastLansingMichigan"
      }
    },
    {
      "game": {
        "away": {
          "names": {
            "short": "Kansas",
            "standard": "Kansas"
          },
          "score": "23"
        },
        "gameState": "final",
        "home": {
          "names": {
            "short": "NorthernIllinois",
            "standard": "NorthernIllinois"
          },
          "score": "30"
        },
        "startDate": "09-22-2012",
        "startTime": "12:00PM ET",
        "url": "/fbs/2012/09/22/kansas-northern-ill",
        "location": "BrighamFieldatHuskieStadiumDeKalbIllinois"
      }
    },
    {
      "game": {
        "away": {
          "names": {
            "short": "Temple",
            "standard": "Temple"
          },
          "score": "13"
        },
        "gameState": "final",
        "home": {
          "names": {
            "short": "PennState",
            "standard": "PennState"
          },
          "score": "24"
        },
        "startDate": "09-22-2012",
        "startTime": "12:00PM ET",
        "url": "/fbs/2012/09/22/temple-penn-st",
        "location": "BeaverStadiumUniversityParkPennsylvania"
      }
    },
    {
      "game": {
        "away": {
          "names": {
            "short": "Colorado",
            "standard": "Colorado"
          },
          "score": "35"
        },
        "gameState": "final",
        "home": {
          "names": {
            "short": "WashingtonState",
            "standard": "WashingtonState"
          },
          "score": "34"
        },
        "startDate": "09-22-2012",
        "startTime": "12:00PM ET",
        "url": "/fbs/2012/09/22/colorado-washington-st",
        "location": "ClarenceDMartinStadiumPullmanWashington"
      }
    },
    {
      "game": {
        "away": {
          "names": {
            "short": "SouthFlorida",
            "standard": "SouthFlorida"
          },
          "score": "27"
        },
        "gameState": "final",
        "home": {
          "names": {
            "short": "BallState",
            "standard": "BallState"
          },
          "score": "31"
        },
        "startDate": "09-22-2012",
        "startTime": "12:00PM ET",
        "url": "/fbs/2012/09/22/south-fla-ball-st",
        "location": "ScheumannStadiumMuncieIndiana"
      }
    },
    {
      "game": {
        "away": {
          "names": {
            "short": "FloridaAtlantic",
            "standard": "FloridaAtlantic"
          },
          "score": "7"
        },
        "gameState": "final",
        "home": {
          "names": {
            "short": "Alabama",
            "standard": "Alabama"
          },
          "score": "40"
        },
        "startDate": "09-22-2012",
        "startTime": "12:00PM ET",
        "url": "/fbs/2012/09/22/fla-atlantic-alabama",
        "location": "BryantDennyStadiumTuscaloosaAlabama"
      }
    },
    {
      "game": {
        "away": {
          "names": {
            "short": "Wyoming",
            "standard": "Wyoming"
          },
          "score": "40"
        },
        "gameState": "final",
        "home": {
          "names": {
            "short": "Idaho",
            "standard": "Idaho"
          },
          "score": "37"
        },
        "startDate": "09-22-2012",
        "startTime": "12:00PM ET",
        "url": "/fbs/2012/09/22/wyoming-idaho",
        "location": "ASUIKibbieDomeMoscowIdaho"
      }
    },
    {
      "game": {
        "away": {
          "names": {
            "short": "Citadel",
            "standard": "Citadel"
          },
          "score": "14"
        },
        "gameState": "final",
        "home": {
          "names": {
            "short": "NorthCarolinaState",
            "standard": "NorthCarolinaState"
          },
          "score": "52"
        },
        "startDate": "09-22-2012",
        "startTime": "12:00PM ET",
        "url": "/fbs/2012/09/22/citadel-north-carolina-st",
        "location": "CarterFinleyStadiumRaleighNorthCarolina"
      }
    },
    {
      "game": {
        "away": {
          "names": {
            "short": "California",
            "standard": "California"
          },
          "score": "9"
        },
        "gameState": "final",
        "home": {
          "names": {
            "short": "USC",
            "standard": "USC"
          },
          "score": "27"
        },
        "startDate": "09-22-2012",
        "startTime": "12:00PM ET",
        "url": "/fbs/2012/09/22/california-southern-california",
        "location": "LosAngelesMemorialColiseumLosAngelesCalifornia"
      }
    },
    {
      "game": {
        "away": {
          "names": {
            "short": "Memphis",
            "standard": "Memphis"
          },
          "score": "14"
        },
        "gameState": "final",
        "home": {
          "names": {
            "short": "Duke",
            "standard": "Duke"
          },
          "score": "38"
        },
        "startDate": "09-22-2012",
        "startTime": "12:00PM ET",
        "url": "/fbs/2012/09/22/memphis-duke",
        "location": "WallaceWadeStadiumDurhamNorthCarolina"
      }
    },
    {
      "game": {
        "away": {
          "names": {
            "short": "CoastalCarolina",
            "standard": "CoastalCarolina"
          },
          "score": "28"
        },
        "gameState": "final",
        "home": {
          "names": {
            "short": "Toledo",
            "standard": "Toledo"
          },
          "score": "38"
        },
        "startDate": "09-22-2012",
        "startTime": "12:00PM ET",
        "url": "/fbs/2012/09/22/coastal-caro-toledo",
        "location": "GlassBowlToledoOhio"
      }
    },
    {
      "game": {
        "away": {
          "names": {
            "short": "AlcornState",
            "standard": "AlcornState"
          },
          "score": "0"
        },
        "gameState": "final",
        "home": {
          "names": {
            "short": "ArkansasState",
            "standard": "ArkansasState"
          },
          "score": "56"
        },
        "startDate": "09-22-2012",
        "startTime": "12:00PM ET",
        "url": "/fbs/2012/09/22/alcorn-st-arkansas-st",
        "location": "LibertyBankStadiumJonesboroArkansas"
      }
    },
    {
      "game": {
        "away": {
          "names": {
            "short": "Rutgers",
            "standard": "Rutgers"
          },
          "score": "35"
        },
        "gameState": "final",
        "home": {
          "names": {
            "short": "Arkansas",
            "standard": "Arkansas"
          },
          "score": "26"
        },
        "startDate": "09-22-2012",
        "startTime": "12:00PM ET",
        "url": "/fbs/2012/09/22/rutgers-arkansas",
        "location": "ReynoldsRazorbackStadiumFayettevilleArkansas"
      }
    },
    {
      "game": {
        "away": {
          "names": {
            "short": "UtahState",
            "standard": "UtahState"
          },
          "score": "31"
        },
        "gameState": "final",
        "home": {
          "names": {
            "short": "ColoradoState",
            "standard": "ColoradoState"
          },
          "score": "19"
        },
        "startDate": "09-22-2012",
        "startTime": "12:00PM ET",
        "url": "/fbs/2012/09/22/utah-st-colorado-st",
        "location": "HughesStadiumFortCollinsColorado"
      }
    },
    {
      "game": {
        "away": {
          "names": {
            "short": "SCarolinaSt",
            "standard": "SCarolinaSt"
          },
          "score": "14"
        },
        "gameState": "final",
        "home": {
          "names": {
            "short": "TexasAM",
            "standard": "TexasAM"
          },
          "score": "70"
        },
        "startDate": "09-22-2012",
        "startTime": "12:00PM ET",
        "url": "/fbs/2012/09/22/south-carolina-st-texas-am",
        "location": "KyleFieldCollegeStationTexas"
      }
    },
    {
      "game": {
        "away": {
          "names": {
            "short": "StephFAustin",
            "standard": "StephFAustin"
          },
          "score": "37"
        },
        "gameState": "final",
        "home": {
          "names": {
            "short": "TexasState",
            "standard": "TexasState"
          },
          "score": "41"
        },
        "startDate": "09-22-2012",
        "startTime": "12:00PM ET",
        "url": "/fbs/2012/09/22/stephen-f-austin-texas-st",
        "location": "JimWackerFieldatBobcatStadiumSanMarcosTexas"
      }
    },
    {
      "game": {
        "away": {
          "names": {
            "short": "Louisville",
            "standard": "Louisville"
          },
          "score": "28"
        },
        "gameState": "final",
        "home": {
          "names": {
            "short": "FloridaInternational",
            "standard": "FloridaInternational"
          },
          "score": "21"
        },
        "startDate": "09-22-2012",
        "startTime": "12:00PM ET",
        "url": "/fbs/2012/09/22/louisville-fiu",
        "location": "FIUStadiumMiamiFlorida"
      }
    },
    {
      "game": {
        "away": {
          "names": {
            "short": "SouthernMiss",
            "standard": "SouthernMiss"
          },
          "score": "17"
        },
        "gameState": "final",
        "home": {
          "names": {
            "short": "WesternKentucky",
            "standard": "WesternKentucky"
          },
          "score": "42"
        },
        "startDate": "09-22-2012",
        "startTime": "12:00PM ET",
        "url": "/fbs/2012/09/22/southern-miss-western-ky",
        "location": "HouchenIndustriesLTSmithStadiumBowlingGreenKentucky"
      }
    },
    {
      "game": {
        "away": {
          "names": {
            "short": "SouthAlabama",
            "standard": "SouthAlabama"
          },
          "score": "10"
        },
        "gameState": "final",
        "home": {
          "names": {
            "short": "MississippiState",
            "standard": "MississippiState"
          },
          "score": "30"
        },
        "startDate": "09-22-2012",
        "startTime": "12:00PM ET",
        "url": "/fbs/2012/09/22/south-ala-mississippi-st",
        "location": "DavisWadeStadiumatScottFieldStarkvilleMississippi"
      }
    },
    {
      "game": {
        "away": {
          "names": {
            "short": "LSU",
            "standard": "LSU"
          },
          "score": "12"
        },
        "gameState": "final",
        "home": {
          "names": {
            "short": "Auburn",
            "standard": "Auburn"
          },
          "score": "10"
        },
        "startDate": "09-22-2012",
        "startTime": "12:00PM ET",
        "url": "/fbs/2012/09/22/lsu-auburn",
        "location": "JordanHareStadiumAuburnAlabama"
      }
    },
    {
      "game": {
        "away": {
          "names": {
            "short": "Troy",
            "standard": "Troy"
          },
          "score": "14"
        },
        "gameState": "final",
        "home": {
          "names": {
            "short": "NorthTexas",
            "standard": "NorthTexas"
          },
          "score": "7"
        },
        "startDate": "09-22-2012",
        "startTime": "12:00PM ET",
        "url": "/fbs/2012/09/22/troy-north-texas",
        "location": "ApogeeStadiumDentonTexas"
      }
    },
    {
      "game": {
        "away": {
          "names": {
            "short": "Akron",
            "standard": "Akron"
          },
          "score": "26"
        },
        "gameState": "final",
        "home": {
          "names": {
            "short": "Tennessee",
            "standard": "Tennessee"
          },
          "score": "47"
        },
        "startDate": "09-22-2012",
        "startTime": "12:00PM ET",
        "url": "/fbs/2012/09/22/akron-tennessee",
        "location": "NeylandStadiumKnoxvilleTennessee"
      }
    },
    {
      "game": {
        "away": {
          "names": {
            "short": "Michigan",
            "standard": "Michigan"
          },
          "score": "6"
        },
        "gameState": "final",
        "home": {
          "names": {
            "short": "NotreDame",
            "standard": "NotreDame"
          },
          "score": "13"
        },
        "startDate": "09-22-2012",
        "startTime": "12:00PM ET",
        "url": "/fbs/2012/09/22/michigan-notre-dame",
        "location": "NotreDameStadiumSouthBendIndiana"
      }
    },
    {
      "game": {
        "away": {
          "names": {
            "short": "Vanderbilt",
            "standard": "Vanderbilt"
          },
          "score": "3"
        },
        "gameState": "final",
        "home": {
          "names": {
            "short": "Georgia",
            "standard": "Georgia"
          },
          "score": "48"
        },
        "startDate": "09-22-2012",
        "startTime": "12:00PM ET",
        "url": "/fbs/2012/09/22/vanderbilt-georgia",
        "location": "SanfordStadiumAthensGeorgia"
      }
    },
    {
      "game": {
        "away": {
          "names": {
            "short": "KansasState",
            "standard": "KansasState"
          },
          "score": "24"
        },
        "gameState": "final",
        "home": {
          "names": {
            "short": "Oklahoma",
            "standard": "Oklahoma"
          },
          "score": "19"
        },
        "startDate": "09-22-2012",
        "startTime": "12:00PM ET",
        "url": "/fbs/2012/09/22/kansas-st-oklahoma",
        "location": "GaylordFamilyOklahomaMemorialStadiumNormanOklahoma"
      }
    },
    {
      "game": {
        "away": {
          "names": {
            "short": "FresnoState",
            "standard": "FresnoState"
          },
          "score": "26"
        },
        "gameState": "final",
        "home": {
          "names": {
            "short": "Tulsa",
            "standard": "Tulsa"
          },
          "score": "27"
        },
        "startDate": "09-22-2012",
        "startTime": "12:00PM ET",
        "url": "/fbs/2012/09/22/fresno-st-tulsa",
        "location": "SkellyFieldatHAChapmanStadiumTulsaOklahoma"
      }
    },
    {
      "game": {
        "away": {
          "names": {
            "short": "Syracuse",
            "standard": "Syracuse"
          },
          "score": "10"
        },
        "gameState": "final",
        "home": {
          "names": {
            "short": "Minnesota",
            "standard": "Minnesota"
          },
          "score": "17"
        },
        "startDate": "09-22-2012",
        "startTime": "12:00PM ET",
        "url": "/fbs/2012/09/22/syracuse-minnesota",
        "location": "TCFBankStadiumMinneapolisMinnesota"
      }
    },
    {
      "game": {
        "away": {
          "names": {
            "short": "Clemson",
            "standard": "Clemson"
          },
          "score": "37"
        },
        "gameState": "final",
        "home": {
          "names": {
            "short": "FloridaState",
            "standard": "FloridaState"
          },
          "score": "49"
        },
        "startDate": "09-22-2012",
        "startTime": "12:00PM ET",
        "url": "/fbs/2012/09/22/clemson-florida-st",
        "location": "BobbyBowdenFieldatDoakCampbellStadiumTallahasseeFlorida"
      }
    },
    {
      "game": {
        "away": {
          "names": {
            "short": "SanJoseState",
            "standard": "SanJoseState"
          },
          "score": "38"
        },
        "gameState": "final",
        "home": {
          "names": {
            "short": "SanDiegoState",
            "standard": "SanDiegoState"
          },
          "score": "34"
        },
        "startDate": "09-22-2012",
        "startTime": "12:00PM ET",
        "url": "/fbs/2012/09/22/san-jose-st-san-diego-st",
        "location": "QualcommStadiumSanDiegoCalifornia"
      }
    },
    {
      "game": {
        "away": {
          "names": {
            "short": "LouisianaTech",
            "standard": "LouisianaTech"
          },
          "score": "52"
        },
        "gameState": "final",
        "home": {
          "names": {
            "short": "Illinois",
            "standard": "Illinois"
          },
          "score": "24"
        },
        "startDate": "09-22-2012",
        "startTime": "12:00PM ET",
        "url": "/fbs/2012/09/22/louisiana-tech-illinois",
        "location": "MemorialStadiumChampaignIllinois"
      }
    },
    {
      "game": {
        "away": {
          "names": {
            "short": "NewMexico",
            "standard": "NewMexico"
          },
          "score": "27"
        },
        "gameState": "final",
        "home": {
          "names": {
            "short": "NewMexicoState",
            "standard": "NewMexicoState"
          },
          "score": "14"
        },
        "startDate": "09-22-2012",
        "startTime": "12:00PM ET",
        "url": "/fbs/2012/09/22/new-mexico-new-mexico-st",
        "location": "AggieMemorialStadiumLasCrucesNewMexico"
      }
    },
    {
      "game": {
        "away": {
          "names": {
            "short": "Utah",
            "standard": "Utah"
          },
          "score": "7"
        },
        "gameState": "final",
        "home": {
          "names": {
            "short": "ArizonaState",
            "standard": "ArizonaState"
          },
          "score": "37"
        },
        "startDate": "09-22-2012",
        "startTime": "12:00PM ET",
        "url": "/fbs/2012/09/22/utah-arizona-st",
        "location": "SunDevilStadiumTempeArizona"
      }
    },
    {
      "game": {
        "away": {
          "names": {
            "short": "AirForce",
            "standard": "AirForce"
          },
          "score": "35"
        },
        "gameState": "final",
        "home": {
          "names": {
            "short": "UNLV",
            "standard": "UNLV"
          },
          "score": "38"
        },
        "startDate": "09-22-2012",
        "startTime": "12:00PM ET",
        "url": "/fbs/2012/09/22/air-force-unlv",
        "location": "SamBoydStadiumLasVegasNevada"
      }
    },
    {
      "game": {
        "away": {
          "names": {
            "short": "Nevada",
            "standard": "Nevada"
          },
          "score": "69"
        },
        "gameState": "final",
        "home": {
          "names": {
            "short": "Hawaii",
            "standard": "Hawaii"
          },
          "score": "24"
        },
        "startDate": "09-22-2012",
        "startTime": "12:00PM ET",
        "url": "/fbs/2012/09/22/nevada-hawaii",
        "location": "AlohaStadiumHonoluluHawaii"
      }
    },
    {
      "game": {
        "away": {
          "names": {
            "short": "Arizona",
            "standard": "Arizona"
          },
          "score": "0"
        },
        "gameState": "final",
        "home": {
          "names": {
            "short": "Oregon",
            "standard": "Oregon"
          },
          "score": "49"
        },
        "startDate": "09-22-2012",
        "startTime": "12:00PM ET",
        "url": "/fbs/2012/09/22/arizona-oregon",
        "location": "AutzenStadiumEugeneOregon"
      }
    }
  ]
}