{
  "games": [
    {"game": {
      "away": {
        "conferences": [{
          "conferenceName": "Big 12",
          "conferenceSeo": "big-12"
        }],
        "description": "(3-5)",
        "names": {
          "char6": "WVU",
          "full": "West Virginia University",
          "seo": "west-virginia",
          "short": "West Virginia"
        },
        "rank": "",
        "score": "14",
        "seed": "",
        "winner": false
      },
      "bracketId": "",
      "bracketRegion": "",
      "bracketRound": "",
      "contestClock": "0:00",
      "currentPeriod": "FINAL",
      "finalMessage": "FINAL",
      "gameID": "afcb5bff-4dd7-4ac4-bf43-fa83b1a31073",
      "gameState": "final",
      "home": {
        "conferences": [
          {
            "conferenceName": "Big 12",
            "conferenceSeo": "big-12"
          },
          {
            "conferenceName": "Top 25",
            "conferenceSeo": "top-25"
          }
        ],
        "description": "(8-0)",
        "names": {
          "char6": "BAYLOR",
          "full": "Baylor University",
          "seo": "baylor",
          "short": "Baylor"
        },
        "rank": "12",
        "score": "17",
        "seed": "",
        "winner": true
      },
      "liveVideoEnabled": false,
      "network": "",
      "startDate": "10-31-2019",
      "startTime": "08:00PM ET",
      "startTimeEpoch": "1572566400",
      "title": "Baylor West Virginia",
      "url": "/game/3785356",
      "videoState": ""
    }},
    {"game": {
      "away": {
        "conferences": [{
          "conferenceName": "Sun Belt",
          "conferenceSeo": "sun-belt"
        }],
        "description": "(5-3)",
        "names": {
          "char6": "GA SOU",
          "full": "Georgia Southern University",
          "seo": "ga-southern",
          "short": "Ga. Southern"
        },
        "rank": "",
        "score": "24",
        "seed": "",
        "winner": true
      },
      "bracketId": "",
      "bracketRegion": "",
      "bracketRound": "",
      "contestClock": "0:00",
      "currentPeriod": "FINAL",
      "finalMessage": "FINAL",
      "gameID": "757c55f6-78f4-492b-9ecf-c961337bd9f4",
      "gameState": "final",
      "home": {
        "conferences": [
          {
            "conferenceName": "Sun Belt",
            "conferenceSeo": "sun-belt"
          },
          {
            "conferenceName": "Top 25",
            "conferenceSeo": "top-25"
          }
        ],
        "description": "(7-1)",
        "names": {
          "char6": "APP ST",
          "full": "Appalachian State University",
          "seo": "appalachian-st",
          "short": "Appalachian St."
        },
        "rank": "20",
        "score": "21",
        "seed": "",
        "winner": false
      },
      "liveVideoEnabled": false,
      "network": "",
      "startDate": "10-31-2019",
      "startTime": "08:00PM ET",
      "startTimeEpoch": "1572566400",
      "title": "Appalachian St. Ga. Southern",
      "url": "/game/3785063",
      "videoState": ""
    }},
    {"game": {
      "away": {
        "conferences": [{
          "conferenceName": "AAC",
          "conferenceSeo": "aac"
        }],
        "description": "(7-1)",
        "names": {
          "char6": "NAVY",
          "full": "U.S. Naval Academy",
          "seo": "navy",
          "short": "Navy"
        },
        "rank": "",
        "score": "56",
        "seed": "",
        "winner": true
      },
      "bracketId": "",
      "bracketRegion": "",
      "bracketRound": "",
      "contestClock": "0:00",
      "currentPeriod": "FINAL",
      "finalMessage": "FINAL",
      "gameID": "3d27acfc-1e92-4112-ae72-7d54bca340de",
      "gameState": "final",
      "home": {
        "conferences": [{
          "conferenceName": "AAC",
          "conferenceSeo": "aac"
        }],
        "description": "(2-7)",
        "names": {
          "char6": "UCONN",
          "full": "University of Connecticut",
          "seo": "uconn",
          "short": "UConn"
        },
        "rank": "",
        "score": "10",
        "seed": "",
        "winner": false
      },
      "liveVideoEnabled": false,
      "network": "",
      "startDate": "11-01-2019",
      "startTime": "08:00PM ET",
      "startTimeEpoch": "1572652800",
      "title": "UConn Navy",
      "url": "/game/3785126",
      "videoState": ""
    }},
    {"game": {
      "away": {
        "conferences": [{
          "conferenceName": "MAC",
          "conferenceSeo": "mac"
        }],
        "description": "(5-4)",
        "names": {
          "char6": "BUFF",
          "full": "University at Buffalo, the State University of New York",
          "seo": "buffalo",
          "short": "Buffalo"
        },
        "rank": "",
        "score": "43",
        "seed": "",
        "winner": true
      },
      "bracketId": "",
      "bracketRegion": "",
      "bracketRound": "",
      "contestClock": "0:00",
      "currentPeriod": "FINAL",
      "finalMessage": "FINAL",
      "gameID": "7180bc79-312b-421d-ad2f-fd7e48a4d55f",
      "gameState": "final",
      "home": {
        "conferences": [{
          "conferenceName": "MAC",
          "conferenceSeo": "mac"
        }],
        "description": "(4-5)",
        "names": {
          "char6": "E MICH",
          "full": "Eastern Michigan University",
          "seo": "eastern-mich",
          "short": "Eastern Mich."
        },
        "rank": "",
        "score": "14",
        "seed": "",
        "winner": false
      },
      "liveVideoEnabled": false,
      "network": "",
      "startDate": "11-02-2019",
      "startTime": "12:00PM ET",
      "startTimeEpoch": "1572710400",
      "title": "Eastern Mich. Buffalo",
      "url": "/game/3785467",
      "videoState": ""
    }},
    {"game": {
      "away": {
        "conferences": [{
          "conferenceName": "AAC",
          "conferenceSeo": "aac"
        }],
        "description": "(3-6)",
        "names": {
          "char6": "HOU",
          "full": "University of Houston",
          "seo": "houston",
          "short": "Houston"
        },
        "rank": "",
        "score": "29",
        "seed": "",
        "winner": false
      },
      "bracketId": "",
      "bracketRegion": "",
      "bracketRound": "",
      "contestClock": "0:00",
      "currentPeriod": "FINAL",
      "finalMessage": "FINAL",
      "gameID": "44f795d7-70b9-47f3-85a4-e462ebb834d6",
      "gameState": "final",
      "home": {
        "conferences": [{
          "conferenceName": "AAC",
          "conferenceSeo": "aac"
        }],
        "description": "(7-2)",
        "names": {
          "char6": "UCF",
          "full": "University of Central Florida",
          "seo": "ucf",
          "short": "UCF"
        },
        "rank": "",
        "score": "44",
        "seed": "",
        "winner": true
      },
      "liveVideoEnabled": false,
      "network": "",
      "startDate": "11-02-2019",
      "startTime": "12:00PM ET",
      "startTimeEpoch": "1572710400",
      "title": "UCF Houston",
      "url": "/game/3784710",
      "videoState": ""
    }},
    {"game": {
      "away": {
        "conferences": [{
          "conferenceName": "FBS Independent",
          "conferenceSeo": "fbs-independent"
        }],
        "description": "(6-3)",
        "names": {
          "char6": "LIBRTY",
          "full": "Liberty University",
          "seo": "liberty",
          "short": "Liberty"
        },
        "rank": "",
        "score": "63",
        "seed": "",
        "winner": true
      },
      "bracketId": "",
      "bracketRegion": "",
      "bracketRound": "",
      "contestClock": "0:00",
      "currentPeriod": "FINAL",
      "finalMessage": "FINAL",
      "gameID": "798d4408-1678-4017-884d-61deb6cac4d7",
      "gameState": "final",
      "home": {
        "conferences": [{
          "conferenceName": "FBS Independent",
          "conferenceSeo": "fbs-independent"
        }],
        "description": "(1-8)",
        "names": {
          "char6": "UMASS",
          "full": "University of Massachusetts, Amherst",
          "seo": "massachusetts",
          "short": "Massachusetts"
        },
        "rank": "",
        "score": "21",
        "seed": "",
        "winner": false
      },
      "liveVideoEnabled": false,
      "network": "",
      "startDate": "11-02-2019",
      "startTime": "12:00PM ET",
      "startTimeEpoch": "1572710400",
      "title": "Massachusetts Liberty",
      "url": "/game/3784916",
      "videoState": ""
    }},
    {"game": {
      "away": {
        "conferences": [{
          "conferenceName": "ACC",
          "conferenceSeo": "acc"
        }],
        "description": "(4-4)",
        "names": {
          "char6": "NC ST",
          "full": "North Carolina State University",
          "seo": "north-carolina-st",
          "short": "NC State"
        },
        "rank": "",
        "score": "10",
        "seed": "",
        "winner": false
      },
      "bracketId": "",
      "bracketRegion": "",
      "bracketRound": "",
      "contestClock": "0:00",
      "currentPeriod": "FINAL",
      "finalMessage": "FINAL",
      "gameID": "b9c9892f-3101-4616-a1b3-abb57a5697db",
      "gameState": "final",
      "home": {
        "conferences": [
          {
            "conferenceName": "ACC",
            "conferenceSeo": "acc"
          },
          {
            "conferenceName": "Top 25",
            "conferenceSeo": "top-25"
          }
        ],
        "description": "(7-1)",
        "names": {
          "char6": "WAKE",
          "full": "Wake Forest University",
          "seo": "wake-forest",
          "short": "Wake Forest"
        },
        "rank": "23",
        "score": "44",
        "seed": "",
        "winner": true
      },
      "liveVideoEnabled": false,
      "network": "",
      "startDate": "11-02-2019",
      "startTime": "12:00PM ET",
      "startTimeEpoch": "1572710400",
      "title": "Wake Forest NC State",
      "url": "/game/3785821",
      "videoState": ""
    }},
    {"game": {
      "away": {
        "conferences": [{
          "conferenceName": "Big Ten",
          "conferenceSeo": "big-ten"
        }],
        "description": "(4-5)",
        "names": {
          "char6": "NEB",
          "full": "University of Nebraska, Lincoln",
          "seo": "nebraska",
          "short": "Nebraska"
        },
        "rank": "",
        "score": "27",
        "seed": "",
        "winner": false
      },
      "bracketId": "",
      "bracketRegion": "",
      "bracketRound": "",
      "contestClock": "0:00",
      "currentPeriod": "FINAL",
      "finalMessage": "FINAL",
      "gameID": "0d336e84-2214-4b0b-b71b-f657bd3dd15a",
      "gameState": "final",
      "home": {
        "conferences": [{
          "conferenceName": "Big Ten",
          "conferenceSeo": "big-ten"
        }],
        "description": "(3-6)",
        "names": {
          "char6": "PURDUE",
          "full": "Purdue University",
          "seo": "purdue",
          "short": "Purdue"
        },
        "rank": "",
        "score": "31",
        "seed": "",
        "winner": true
      },
      "liveVideoEnabled": false,
      "network": "",
      "startDate": "11-02-2019",
      "startTime": "12:00PM ET",
      "startTimeEpoch": "1572710400",
      "title": "Purdue Nebraska",
      "url": "/game/3786114",
      "videoState": ""
    }},
    {"game": {
      "away": {
        "conferences": [{
          "conferenceName": "ACC",
          "conferenceSeo": "acc"
        }],
        "description": "(5-4)",
        "names": {
          "char6": "BC",
          "full": "Boston College",
          "seo": "boston-college",
          "short": "Boston College"
        },
        "rank": "",
        "score": "58",
        "seed": "",
        "winner": true
      },
      "bracketId": "",
      "bracketRegion": "",
      "bracketRound": "",
      "contestClock": "0:00",
      "currentPeriod": "FINAL",
      "finalMessage": "FINAL",
      "gameID": "7d91805d-b423-40fe-b350-5cbd61aad5f8",
      "gameState": "final",
      "home": {
        "conferences": [{
          "conferenceName": "ACC",
          "conferenceSeo": "acc"
        }],
        "description": "(3-6)",
        "names": {
          "char6": "SYR",
          "full": "Syracuse University",
          "seo": "syracuse",
          "short": "Syracuse"
        },
        "rank": "",
        "score": "27",
        "seed": "",
        "winner": false
      },
      "liveVideoEnabled": false,
      "network": "",
      "startDate": "11-02-2019",
      "startTime": "12:00PM ET",
      "startTimeEpoch": "1572710400",
      "title": "Syracuse Boston College",
      "url": "/game/3784648",
      "videoState": ""
    }},
    {"game": {
      "away": {
        "conferences": [{
          "conferenceName": "MAC",
          "conferenceSeo": "mac"
        }],
        "description": "(3-6)",
        "names": {
          "char6": "NIU",
          "full": "Northern Illinois University",
          "seo": "northern-ill",
          "short": "Northern Ill."
        },
        "rank": "",
        "score": "10",
        "seed": "",
        "winner": false
      },
      "bracketId": "",
      "bracketRegion": "",
      "bracketRound": "",
      "contestClock": "0:00",
      "currentPeriod": "FINAL",
      "finalMessage": "FINAL",
      "gameID": "34db75ce-1505-4b2c-b895-8281b56c3ef6",
      "gameState": "final",
      "home": {
        "conferences": [{
          "conferenceName": "MAC",
          "conferenceSeo": "mac"
        }],
        "description": "(6-4)",
        "names": {
          "char6": "C MICH",
          "full": "Central Michigan University",
          "seo": "central-mich",
          "short": "Central Mich."
        },
        "rank": "",
        "score": "48",
        "seed": "",
        "winner": true
      },
      "liveVideoEnabled": false,
      "network": "",
      "startDate": "11-02-2019",
      "startTime": "12:00PM ET",
      "startTimeEpoch": "1572710400",
      "title": "Central Mich. Northern Ill.",
      "url": "/game/3785351",
      "videoState": ""
    }},
    {"game": {
      "away": {
        "conferences": [
          {
            "conferenceName": "Big Ten",
            "conferenceSeo": "big-ten"
          },
          {
            "conferenceName": "Top 25",
            "conferenceSeo": "top-25"
          }
        ],
        "description": "(7-2)",
        "names": {
          "char6": "MICH",
          "full": "University of Michigan",
          "seo": "michigan",
          "short": "Michigan"
        },
        "rank": "14",
        "score": "38",
        "seed": "",
        "winner": true
      },
      "bracketId": "",
      "bracketRegion": "",
      "bracketRound": "",
      "contestClock": "0:00",
      "currentPeriod": "FINAL",
      "finalMessage": "FINAL",
      "gameID": "f90f5c34-6a4b-4a5d-b181-7d83ac11305d",
      "gameState": "final",
      "home": {
        "conferences": [{
          "conferenceName": "Big Ten",
          "conferenceSeo": "big-ten"
        }],
        "description": "(3-6)",
        "names": {
          "char6": "MD",
          "full": "University of Maryland, College Park",
          "seo": "maryland",
          "short": "Maryland"
        },
        "rank": "",
        "score": "7",
        "seed": "",
        "winner": false
      },
      "liveVideoEnabled": false,
      "network": "",
      "startDate": "11-02-2019",
      "startTime": "12:00PM ET",
      "startTimeEpoch": "1572710400",
      "title": "Maryland Michigan",
      "url": "/game/3785803",
      "videoState": ""
    }},
    {"game": {
      "away": {
        "conferences": [{
          "conferenceName": "C-USA",
          "conferenceSeo": "c-usa"
        }],
        "description": "(3-5)",
        "names": {
          "char6": "UTSA",
          "full": "University of Texas at San Antonio",
          "seo": "utsa",
          "short": "UTSA"
        },
        "rank": "",
        "score": "14",
        "seed": "",
        "winner": false
      },
      "bracketId": "",
      "bracketRegion": "",
      "bracketRound": "",
      "contestClock": "0:00",
      "currentPeriod": "FINAL",
      "finalMessage": "FINAL",
      "gameID": "3b3fa49a-49b0-4082-9304-1e10f19b869d",
      "gameState": "final",
      "home": {
        "conferences": [{
          "conferenceName": "SEC",
          "conferenceSeo": "sec"
        }],
        "description": "(6-3)",
        "names": {
          "char6": "TX A&M",
          "full": "Texas A&M University, College Station",
          "seo": "texas-am",
          "short": "Texas A&M"
        },
        "rank": "",
        "score": "45",
        "seed": "",
        "winner": true
      },
      "liveVideoEnabled": false,
      "network": "",
      "startDate": "11-02-2019",
      "startTime": "12:00PM ET",
      "startTimeEpoch": "1572710400",
      "title": "Texas A&M UTSA",
      "url": "/game/3786007",
      "videoState": ""
    }},
    {"game": {
      "away": {
        "conferences": [{
          "conferenceName": "C-USA",
          "conferenceSeo": "c-usa"
        }],
        "description": "(1-8)",
        "names": {
          "char6": "ODU",
          "full": "Old Dominion University",
          "seo": "old-dominion",
          "short": "Old Dominion"
        },
        "rank": "",
        "score": "17",
        "seed": "",
        "winner": false
      },
      "bracketId": "",
      "bracketRegion": "",
      "bracketRound": "",
      "contestClock": "0:00",
      "currentPeriod": "FINAL",
      "finalMessage": "FINAL",
      "gameID": "ff920d84-a6ea-4559-beb9-7ad6548e1b2d",
      "gameState": "final",
      "home": {
        "conferences": [{
          "conferenceName": "C-USA",
          "conferenceSeo": "c-usa"
        }],
        "description": "(5-4)",
        "names": {
          "char6": "FIU",
          "full": "Florida International University",
          "seo": "fiu",
          "short": "FIU"
        },
        "rank": "",
        "score": "24",
        "seed": "",
        "winner": true
      },
      "liveVideoEnabled": false,
      "network": "",
      "startDate": "11-02-2019",
      "startTime": "12:00PM ET",
      "startTimeEpoch": "1572710400",
      "title": "FIU Old Dominion",
      "url": "/game/3784620",
      "videoState": ""
    }},
    {"game": {
      "away": {
        "conferences": [{
          "conferenceName": "MAC",
          "conferenceSeo": "mac"
        }],
        "description": "(0-9)",
        "names": {
          "char6": "AKRON",
          "full": "University of Akron",
          "seo": "akron",
          "short": "Akron"
        },
        "rank": "",
        "score": "6",
        "seed": "",
        "winner": false
      },
      "bracketId": "",
      "bracketRegion": "",
      "bracketRound": "",
      "contestClock": "0:00",
      "currentPeriod": "FINAL",
      "finalMessage": "FINAL",
      "gameID": "0f9fd7ab-79e5-46be-8362-f8e1a69073c1",
      "gameState": "final",
      "home": {
        "conferences": [{
          "conferenceName": "MAC",
          "conferenceSeo": "mac"
        }],
        "description": "(3-6)",
        "names": {
          "char6": "BGSU",
          "full": "Bowling Green State University",
          "seo": "bowling-green",
          "short": "Bowling Green"
        },
        "rank": "",
        "score": "35",
        "seed": "",
        "winner": true
      },
      "liveVideoEnabled": false,
      "network": "",
      "startDate": "11-02-2019",
      "startTime": "02:00PM ET",
      "startTimeEpoch": "1572717600",
      "title": "Bowling Green Akron",
      "url": "/game/3785186",
      "videoState": ""
    }},
    {"game": {
      "away": {
        "conferences": [{
          "conferenceName": "ACC",
          "conferenceSeo": "acc"
        }],
        "description": "(5-3)",
        "names": {
          "char6": "VT",
          "full": "Virginia Polytechnic Institute and State University",
          "seo": "virginia-tech",
          "short": "Virginia Tech"
        },
        "rank": "",
        "score": "20",
        "seed": "",
        "winner": false
      },
      "bracketId": "",
      "bracketRegion": "",
      "bracketRound": "",
      "contestClock": "0:00",
      "currentPeriod": "FINAL",
      "finalMessage": "FINAL",
      "gameID": "36a152c4-d2a4-40ed-bdd6-f898b9c52a04",
      "gameState": "final",
      "home": {
        "conferences": [
          {
            "conferenceName": "FBS Independent",
            "conferenceSeo": "fbs-independent"
          },
          {
            "conferenceName": "Top 25",
            "conferenceSeo": "top-25"
          }
        ],
        "description": "(6-2)",
        "names": {
          "char6": "N DAME",
          "full": "University of Notre Dame",
          "seo": "notre-dame",
          "short": "Notre Dame"
        },
        "rank": "16",
        "score": "21",
        "seed": "",
        "winner": true
      },
      "liveVideoEnabled": false,
      "network": "",
      "startDate": "11-02-2019",
      "startTime": "02:30PM ET",
      "startTimeEpoch": "1572719400",
      "title": "Notre Dame Virginia Tech",
      "url": "/game/3785331",
      "videoState": ""
    }},
    {"game": {
      "away": {
        "conferences": [{
          "conferenceName": "Sun Belt",
          "conferenceSeo": "sun-belt"
        }],
        "description": "(3-5)",
        "names": {
          "char6": "TROY",
          "full": "Troy University",
          "seo": "troy",
          "short": "Troy"
        },
        "rank": "",
        "score": "35",
        "seed": "",
        "winner": false
      },
      "bracketId": "",
      "bracketRegion": "",
      "bracketRound": "",
      "contestClock": "0:00",
      "currentPeriod": "FINAL",
      "finalMessage": "FINAL",
      "gameID": "a55c0a93-0dce-452e-a679-54b48da54ca4",
      "gameState": "final",
      "home": {
        "conferences": [{
          "conferenceName": "Sun Belt",
          "conferenceSeo": "sun-belt"
        }],
        "description": "(4-4)",
        "names": {
          "char6": "CO CAR",
          "full": "Coastal Carolina University",
          "seo": "coastal-caro",
          "short": "Coastal Carolina"
        },
        "rank": "",
        "score": "36",
        "seed": "",
        "winner": true
      },
      "liveVideoEnabled": false,
      "network": "",
      "startDate": "11-02-2019",
      "startTime": "03:00PM ET",
      "startTimeEpoch": "1572721200",
      "title": "Coastal Carolina Troy",
      "url": "/game/3785558",
      "videoState": ""
    }},
    {"game": {
      "away": {
        "conferences": [{
          "conferenceName": "FBS Independent",
          "conferenceSeo": "fbs-independent"
        }],
        "description": "(3-6)",
        "names": {
          "char6": "ARMY",
          "full": "U.S. Military Academy",
          "seo": "army",
          "short": "Army West Point"
        },
        "rank": "",
        "score": "13",
        "seed": "",
        "winner": false
      },
      "bracketId": "",
      "bracketRegion": "",
      "bracketRound": "",
      "contestClock": "0:00",
      "currentPeriod": "FINAL",
      "finalMessage": "FINAL",
      "gameID": "d82dbd4a-2837-4c0a-bca3-02f1ec4aea06",
      "gameState": "final",
      "home": {
        "conferences": [{
          "conferenceName": "Mountain West",
          "conferenceSeo": "mountain-west"
        }],
        "description": "(7-2)",
        "names": {
          "char6": "AIRFOR",
          "full": "U.S. Air Force Academy",
          "seo": "air-force",
          "short": "Air Force"
        },
        "rank": "",
        "score": "17",
        "seed": "",
        "winner": true
      },
      "liveVideoEnabled": false,
      "network": "",
      "startDate": "11-02-2019",
      "startTime": "03:30PM ET",
      "startTimeEpoch": "1572723000",
      "title": "Air Force Army West Point",
      "url": "/game/3785719",
      "videoState": ""
    }},
    {"game": {
      "away": {
        "conferences": [{
          "conferenceName": "Big Ten",
          "conferenceSeo": "big-ten"
        }],
        "description": "(2-7)",
        "names": {
          "char6": "RUTGER",
          "full": "Rutgers, The State University of New Jersey, New Brunswick",
          "seo": "rutgers",
          "short": "Rutgers"
        },
        "rank": "",
        "score": "10",
        "seed": "",
        "winner": false
      },
      "bracketId": "",
      "bracketRegion": "",
      "bracketRound": "",
      "contestClock": "0:00",
      "currentPeriod": "FINAL",
      "finalMessage": "FINAL",
      "gameID": "f25e699b-d724-472a-8166-cec55b1ee6f7",
      "gameState": "final",
      "home": {
        "conferences": [{
          "conferenceName": "Big Ten",
          "conferenceSeo": "big-ten"
        }],
        "description": "(5-4)",
        "names": {
          "char6": "ILL",
          "full": "University of Illinois Urbana-Champaign",
          "seo": "illinois",
          "short": "Illinois"
        },
        "rank": "",
        "score": "38",
        "seed": "",
        "winner": true
      },
      "liveVideoEnabled": false,
      "network": "",
      "startDate": "11-02-2019",
      "startTime": "03:30PM ET",
      "startTimeEpoch": "1572723000",
      "title": "Illinois Rutgers",
      "url": "/game/3785287",
      "videoState": ""
    }},
    {"game": {
      "away": {
        "conferences": [{
          "conferenceName": "Big 12",
          "conferenceSeo": "big-12"
        }],
        "description": "(4-4)",
        "names": {
          "char6": "TCU",
          "full": "Texas Christian University",
          "seo": "tcu",
          "short": "TCU"
        },
        "rank": "",
        "score": "27",
        "seed": "",
        "winner": false
      },
      "bracketId": "",
      "bracketRegion": "",
      "bracketRound": "",
      "contestClock": "0:00",
      "currentPeriod": "FINAL",
      "finalMessage": "FINAL",
      "gameID": "1fb3b7b2-3653-4158-b175-27df6d56627c",
      "gameState": "final",
      "home": {
        "conferences": [{
          "conferenceName": "Big 12",
          "conferenceSeo": "big-12"
        }],
        "description": "(6-3)",
        "names": {
          "char6": "OKLAST",
          "full": "Oklahoma State University",
          "seo": "oklahoma-st",
          "short": "Oklahoma State"
        },
        "rank": "",
        "score": "34",
        "seed": "",
        "winner": true
      },
      "liveVideoEnabled": false,
      "network": "",
      "startDate": "11-02-2019",
      "startTime": "03:30PM ET",
      "startTimeEpoch": "1572723000",
      "title": "Oklahoma St. TCU",
      "url": "/game/3785665",
      "videoState": ""
    }},
    {"game": {
      "away": {
        "conferences": [{
          "conferenceName": "C-USA",
          "conferenceSeo": "c-usa"
        }],
        "description": "(6-3)",
        "names": {
          "char6": "MARSH",
          "full": "Marshall University",
          "seo": "marshall",
          "short": "Marshall"
        },
        "rank": "",
        "score": "20",
        "seed": "",
        "winner": true
      },
      "bracketId": "",
      "bracketRegion": "",
      "bracketRound": "",
      "contestClock": "0:00",
      "currentPeriod": "FINAL",
      "finalMessage": "FINAL",
      "gameID": "124c1c70-a496-474a-bb68-e550a356135d",
      "gameState": "final",
      "home": {
        "conferences": [{
          "conferenceName": "C-USA",
          "conferenceSeo": "c-usa"
        }],
        "description": "(0-9)",
        "names": {
          "char6": "RICE",
          "full": "Rice University",
          "seo": "rice",
          "short": "Rice"
        },
        "rank": "",
        "score": "7",
        "seed": "",
        "winner": false
      },
      "liveVideoEnabled": false,
      "network": "",
      "startDate": "11-02-2019",
      "startTime": "03:30PM ET",
      "startTimeEpoch": "1572723000",
      "title": "Rice Marshall",
      "url": "/game/3785602",
      "videoState": ""
    }},
    {"game": {
      "away": {
        "conferences": [
          {
            "conferenceName": "Big 12",
            "conferenceSeo": "big-12"
          },
          {
            "conferenceName": "Top 25",
            "conferenceSeo": "top-25"
          }
        ],
        "description": "(6-2)",
        "names": {
          "char6": "KAN ST",
          "full": "Kansas State University",
          "seo": "kansas-st",
          "short": "Kansas St."
        },
        "rank": "22",
        "score": "38",
        "seed": "",
        "winner": true
      },
      "bracketId": "",
      "bracketRegion": "",
      "bracketRound": "",
      "contestClock": "0:00",
      "currentPeriod": "FINAL",
      "finalMessage": "FINAL",
      "gameID": "5e5f196a-c728-45bf-ad75-c32445e0c99d",
      "gameState": "final",
      "home": {
        "conferences": [{
          "conferenceName": "Big 12",
          "conferenceSeo": "big-12"
        }],
        "description": "(3-6)",
        "names": {
          "char6": "KANSAS",
          "full": "University of Kansas",
          "seo": "kansas",
          "short": "Kansas"
        },
        "rank": "",
        "score": "10",
        "seed": "",
        "winner": false
      },
      "liveVideoEnabled": false,
      "network": "",
      "startDate": "11-02-2019",
      "startTime": "03:30PM ET",
      "startTimeEpoch": "1572723000",
      "title": "Kansas Kansas St.",
      "url": "/game/3784834",
      "videoState": ""
    }},
    {"game": {
      "away": {
        "conferences": [{
          "conferenceName": "ACC",
          "conferenceSeo": "acc"
        }],
        "description": "(5-4)",
        "names": {
          "char6": "MIAMI",
          "full": "University of Miami (Florida)",
          "seo": "miami-fl",
          "short": "Miami (Fla.)"
        },
        "rank": "",
        "score": "27",
        "seed": "",
        "winner": true
      },
      "bracketId": "",
      "bracketRegion": "",
      "bracketRound": "",
      "contestClock": "0:00",
      "currentPeriod": "FINAL",
      "finalMessage": "FINAL",
      "gameID": "e4ca277f-4be9-4740-8318-bf90fe13262d",
      "gameState": "final",
      "home": {
        "conferences": [{
          "conferenceName": "ACC",
          "conferenceSeo": "acc"
        }],
        "description": "(4-5)",
        "names": {
          "char6": "FSU",
          "full": "Florida State University",
          "seo": "florida-st",
          "short": "Florida State"
        },
        "rank": "",
        "score": "10",
        "seed": "",
        "winner": false
      },
      "liveVideoEnabled": false,
      "network": "",
      "startDate": "11-02-2019",
      "startTime": "03:30PM ET",
      "startTimeEpoch": "1572723000",
      "title": "Florida St. Miami (FL)",
      "url": "/game/3786054",
      "videoState": ""
    }},
    {"game": {
      "away": {
        "conferences": [{
          "conferenceName": "C-USA",
          "conferenceSeo": "c-usa"
        }],
        "description": "(3-6)",
        "names": {
          "char6": "MIDTEN",
          "full": "Middle Tennessee State University",
          "seo": "middle-tenn",
          "short": "Middle Tenn."
        },
        "rank": "",
        "score": "20",
        "seed": "",
        "winner": false
      },
      "bracketId": "",
      "bracketRegion": "",
      "bracketRound": "",
      "contestClock": "0:00",
      "currentPeriod": "FINAL",
      "finalMessage": "FINAL",
      "gameID": "b9e24d44-950c-4a3a-8bba-c948ea386423",
      "gameState": "final",
      "home": {
        "conferences": [{
          "conferenceName": "C-USA",
          "conferenceSeo": "c-usa"
        }],
        "description": "(4-5)",
        "names": {
          "char6": "CHAR",
          "full": "The University of North Carolina at Charlotte",
          "seo": "charlotte",
          "short": "Charlotte"
        },
        "rank": "",
        "score": "34",
        "seed": "",
        "winner": true
      },
      "liveVideoEnabled": false,
      "network": "",
      "startDate": "11-02-2019",
      "startTime": "03:30PM ET",
      "startTimeEpoch": "1572723000",
      "title": "Charlotte Middle Tenn.",
      "url": "/game/3784837",
      "videoState": ""
    }},
    {"game": {
      "away": {
        "conferences": [{
          "conferenceName": "Mountain West",
          "conferenceSeo": "mountain-west"
        }],
        "description": "(2-7)",
        "names": {
          "char6": "UNLV",
          "full": "University of Nevada, Las Vegas",
          "seo": "unlv",
          "short": "UNLV"
        },
        "rank": "",
        "score": "17",
        "seed": "",
        "winner": false
      },
      "bracketId": "",
      "bracketRegion": "",
      "bracketRound": "",
      "contestClock": "0:00",
      "currentPeriod": "FINAL",
      "finalMessage": "FINAL",
      "gameID": "643a5faa-8de1-49a3-9822-7aa93ab78038",
      "gameState": "final",
      "home": {
        "conferences": [{
          "conferenceName": "Mountain West",
          "conferenceSeo": "mountain-west"
        }],
        "description": "(4-5)",
        "names": {
          "char6": "CO ST",
          "full": "Colorado State University",
          "seo": "colorado-st",
          "short": "Colorado State"
        },
        "rank": "",
        "score": "37",
        "seed": "",
        "winner": true
      },
      "liveVideoEnabled": false,
      "network": "",
      "startDate": "11-02-2019",
      "startTime": "03:30PM ET",
      "startTimeEpoch": "1572723000",
      "title": "Colorado St. UNLV",
      "url": "/game/3785079",
      "videoState": ""
    }},
    {"game": {
      "away": {
        "conferences": [
          {
            "conferenceName": "SEC",
            "conferenceSeo": "sec"
          },
          {
            "conferenceName": "Top 25",
            "conferenceSeo": "top-25"
          }
        ],
        "description": "(7-1)",
        "names": {
          "char6": "UGA",
          "full": "University of Georgia",
          "seo": "georgia",
          "short": "Georgia"
        },
        "rank": "8",
        "score": "24",
        "seed": "",
        "winner": true
      },
      "bracketId": "",
      "bracketRegion": "",
      "bracketRound": "",
      "contestClock": "0:00",
      "currentPeriod": "FINAL",
      "finalMessage": "FINAL",
      "gameID": "ac28f319-c4f5-49a9-aa15-ed7c342fea32",
      "gameState": "final",
      "home": {
        "conferences": [
          {
            "conferenceName": "SEC",
            "conferenceSeo": "sec"
          },
          {
            "conferenceName": "Top 25",
            "conferenceSeo": "top-25"
          }
        ],
        "description": "(7-2)",
        "names": {
          "char6": "FLA",
          "full": "University of Florida",
          "seo": "florida",
          "short": "Florida"
        },
        "rank": "6",
        "score": "17",
        "seed": "",
        "winner": false
      },
      "liveVideoEnabled": false,
      "network": "",
      "startDate": "11-02-2019",
      "startTime": "03:30PM ET",
      "startTimeEpoch": "1572723000",
      "title": "Florida Georgia",
      "url": "/game/3784675",
      "videoState": ""
    }},
    {"game": {
      "away": {
        "conferences": [{
          "conferenceName": "Sun Belt",
          "conferenceSeo": "sun-belt"
        }],
        "description": "(5-4)",
        "names": {
          "char6": "ARK ST",
          "full": "Arkansas State University",
          "seo": "arkansas-st",
          "short": "Arkansas State"
        },
        "rank": "",
        "score": "48",
        "seed": "",
        "winner": true
      },
      "bracketId": "",
      "bracketRegion": "",
      "bracketRound": "",
      "contestClock": "0:00",
      "currentPeriod": "FINAL",
      "finalMessage": "FINAL",
      "gameID": "8b902e42-e2b2-4456-8f2e-2972a586f5ae",
      "gameState": "final",
      "home": {
        "conferences": [{
          "conferenceName": "Sun Belt",
          "conferenceSeo": "sun-belt"
        }],
        "description": "(3-5)",
        "names": {
          "char6": "LA MON",
          "full": "University of Louisiana Monroe",
          "seo": "la-monroe",
          "short": "La.-Monroe"
        },
        "rank": "",
        "score": "41",
        "seed": "",
        "winner": false
      },
      "liveVideoEnabled": false,
      "network": "",
      "startDate": "11-02-2019",
      "startTime": "03:30PM ET",
      "startTimeEpoch": "1572723000",
      "title": "La.-Monroe Arkansas St.",
      "url": "/game/3784601",
      "videoState": ""
    }},
    {"game": {
      "away": {
        "conferences": [{
          "conferenceName": "C-USA",
          "conferenceSeo": "c-usa"
        }],
        "description": "(1-7)",
        "names": {
          "char6": "UTEP",
          "full": "University of Texas at El Paso",
          "seo": "utep",
          "short": "UTEP"
        },
        "rank": "",
        "score": "26",
        "seed": "",
        "winner": false
      },
      "bracketId": "",
      "bracketRegion": "",
      "bracketRound": "",
      "contestClock": "0:00",
      "currentPeriod": "FINAL",
      "finalMessage": "FINAL",
      "gameID": "36e9927f-d3fc-45bd-8b82-65237d5222d6",
      "gameState": "final",
      "home": {
        "conferences": [{
          "conferenceName": "C-USA",
          "conferenceSeo": "c-usa"
        }],
        "description": "(4-5)",
        "names": {
          "char6": "NO TEX",
          "full": "University of North Texas",
          "seo": "north-texas",
          "short": "North Texas"
        },
        "rank": "",
        "score": "52",
        "seed": "",
        "winner": true
      },
      "liveVideoEnabled": false,
      "network": "",
      "startDate": "11-02-2019",
      "startTime": "03:30PM ET",
      "startTimeEpoch": "1572723000",
      "title": "North Texas UTEP",
      "url": "/game/3785987",
      "videoState": ""
    }},
    {"game": {
      "away": {
        "conferences": [{
          "conferenceName": "AAC",
          "conferenceSeo": "aac"
        }],
        "description": "(2-7)",
        "names": {
          "char6": "TULSA",
          "full": "The University of Tulsa",
          "seo": "tulsa",
          "short": "Tulsa"
        },
        "rank": "",
        "score": "26",
        "seed": "",
        "winner": false
      },
      "bracketId": "",
      "bracketRegion": "",
      "bracketRound": "",
      "contestClock": "0:00",
      "currentPeriod": "FINAL",
      "finalMessage": "FINAL",
      "gameID": "b83b1ec1-a78c-4492-a707-07331822ea53",
      "gameState": "final",
      "home": {
        "conferences": [{
          "conferenceName": "AAC",
          "conferenceSeo": "aac"
        }],
        "description": "(6-3)",
        "names": {
          "char6": "TULANE",
          "full": "Tulane University",
          "seo": "tulane",
          "short": "Tulane"
        },
        "rank": "",
        "score": "38",
        "seed": "",
        "winner": true
      },
      "liveVideoEnabled": false,
      "network": "",
      "startDate": "11-02-2019",
      "startTime": "04:00PM ET",
      "startTimeEpoch": "1572724800",
      "title": "Tulane Tulsa",
      "url": "/game/3785288",
      "videoState": ""
    }},
    {"game": {
      "away": {
        "conferences": [{
          "conferenceName": "SoCon",
          "conferenceSeo": "socon"
        }],
        "description": "(5-3)",
        "names": {
          "char6": "WOFFRD",
          "full": "Wofford College",
          "seo": "wofford",
          "short": "Wofford"
        },
        "rank": "",
        "score": "14",
        "seed": "",
        "winner": false
      },
      "bracketId": "",
      "bracketRegion": "",
      "bracketRound": "",
      "contestClock": "0:00",
      "currentPeriod": "FINAL",
      "finalMessage": "FINAL",
      "gameID": "c885fce2-bc76-4144-be8f-dc4a266913bf",
      "gameState": "final",
      "home": {
        "conferences": [
          {
            "conferenceName": "ACC",
            "conferenceSeo": "acc"
          },
          {
            "conferenceName": "Top 25",
            "conferenceSeo": "top-25"
          }
        ],
        "description": "(9-0)",
        "names": {
          "char6": "CLEM",
          "full": "Clemson University",
          "seo": "clemson",
          "short": "Clemson"
        },
        "rank": "4",
        "score": "59",
        "seed": "",
        "winner": true
      },
      "liveVideoEnabled": false,
      "network": "",
      "startDate": "11-02-2019",
      "startTime": "04:00PM ET",
      "startTimeEpoch": "1572724800",
      "title": "Clemson Wofford",
      "url": "/game/3786077",
      "videoState": ""
    }},
    {"game": {
      "away": {
        "conferences": [
          {
            "conferenceName": "Pac-12",
            "conferenceSeo": "pac-12"
          },
          {
            "conferenceName": "Top 25",
            "conferenceSeo": "top-25"
          }
        ],
        "description": "(8-1)",
        "names": {
          "char6": "UTAH",
          "full": "University of Utah",
          "seo": "utah",
          "short": "Utah"
        },
        "rank": "9",
        "score": "33",
        "seed": "",
        "winner": true
      },
      "bracketId": "",
      "bracketRegion": "",
      "bracketRound": "",
      "contestClock": "0:00",
      "currentPeriod": "FINAL",
      "finalMessage": "FINAL",
      "gameID": "d36bdf13-c366-4d17-a1e4-fb2dc0eb9f00",
      "gameState": "final",
      "home": {
        "conferences": [{
          "conferenceName": "Pac-12",
          "conferenceSeo": "pac-12"
        }],
        "description": "(5-4)",
        "names": {
          "char6": "WASH",
          "full": "University of Washington",
          "seo": "washington",
          "short": "Washington"
        },
        "rank": "",
        "score": "28",
        "seed": "",
        "winner": false
      },
      "liveVideoEnabled": false,
      "network": "",
      "startDate": "11-02-2019",
      "startTime": "04:00PM ET",
      "startTimeEpoch": "1572724800",
      "title": "Washington Utah",
      "url": "/game/3785943",
      "videoState": ""
    }},
    {"game": {
      "away": {
        "conferences": [{
          "conferenceName": "ACC",
          "conferenceSeo": "acc"
        }],
        "description": "(6-3)",
        "names": {
          "char6": "PITT",
          "full": "University of Pittsburgh",
          "seo": "pittsburgh",
          "short": "Pittsburgh"
        },
        "rank": "",
        "score": "20",
        "seed": "",
        "winner": true
      },
      "bracketId": "",
      "bracketRegion": "",
      "bracketRound": "",
      "contestClock": "0:00",
      "currentPeriod": "FINAL",
      "finalMessage": "FINAL",
      "gameID": "ee9f71f5-68f8-484a-8d32-17a532fe25fa",
      "gameState": "final",
      "home": {
        "conferences": [{
          "conferenceName": "ACC",
          "conferenceSeo": "acc"
        }],
        "description": "(2-6)",
        "names": {
          "char6": "GATECH",
          "full": "Georgia Institute of Technology",
          "seo": "georgia-tech",
          "short": "Georgia Tech"
        },
        "rank": "",
        "score": "10",
        "seed": "",
        "winner": false
      },
      "liveVideoEnabled": false,
      "network": "",
      "startDate": "11-02-2019",
      "startTime": "04:00PM ET",
      "startTimeEpoch": "1572724800",
      "title": "Georgia Tech Pittsburgh",
      "url": "/game/3784905",
      "videoState": ""
    }},
    {"game": {
      "away": {
        "conferences": [{
          "conferenceName": "C-USA",
          "conferenceSeo": "c-usa"
        }],
        "description": "(6-3)",
        "names": {
          "char6": "FAU",
          "full": "Florida Atlantic University",
          "seo": "fla-atlantic",
          "short": "Florida Atlantic"
        },
        "rank": "",
        "score": "35",
        "seed": "",
        "winner": true
      },
      "bracketId": "",
      "bracketRegion": "",
      "bracketRound": "",
      "contestClock": "0:00",
      "currentPeriod": "FINAL",
      "finalMessage": "FINAL",
      "gameID": "df3fdaec-58f6-4af8-b4c7-41557f91a51a",
      "gameState": "final",
      "home": {
        "conferences": [{
          "conferenceName": "C-USA",
          "conferenceSeo": "c-usa"
        }],
        "description": "(5-4)",
        "names": {
          "char6": "W KY",
          "full": "Western Kentucky University",
          "seo": "western-ky",
          "short": "Western Ky."
        },
        "rank": "",
        "score": "24",
        "seed": "",
        "winner": false
      },
      "liveVideoEnabled": false,
      "network": "",
      "startDate": "11-02-2019",
      "startTime": "04:00PM ET",
      "startTimeEpoch": "1572724800",
      "title": "Western Ky. Fla. Atlantic",
      "url": "/game/3785328",
      "videoState": ""
    }},
    {"game": {
      "away": {
        "conferences": [{
          "conferenceName": "SEC",
          "conferenceSeo": "sec"
        }],
        "description": "(4-5)",
        "names": {
          "char6": "MISSST",
          "full": "Mississippi State University",
          "seo": "mississippi-st",
          "short": "Mississippi St."
        },
        "rank": "",
        "score": "54",
        "seed": "",
        "winner": true
      },
      "bracketId": "",
      "bracketRegion": "",
      "bracketRound": "",
      "contestClock": "0:00",
      "currentPeriod": "FINAL",
      "finalMessage": "FINAL",
      "gameID": "7acac98a-403c-402e-aca0-c9448469e302",
      "gameState": "final",
      "home": {
        "conferences": [{
          "conferenceName": "SEC",
          "conferenceSeo": "sec"
        }],
        "description": "(2-7)",
        "names": {
          "char6": "ARK",
          "full": "University of Arkansas, Fayetteville",
          "seo": "arkansas",
          "short": "Arkansas"
        },
        "rank": "",
        "score": "24",
        "seed": "",
        "winner": false
      },
      "liveVideoEnabled": false,
      "network": "",
      "startDate": "11-02-2019",
      "startTime": "04:00PM ET",
      "startTimeEpoch": "1572724800",
      "title": "Arkansas Mississippi St.",
      "url": "/game/3785802",
      "videoState": ""
    }},
    {"game": {
      "away": {
        "conferences": [{
          "conferenceName": "Pac-12",
          "conferenceSeo": "pac-12"
        }],
        "description": "(4-4)",
        "names": {
          "char6": "ORE ST",
          "full": "Oregon State University",
          "seo": "oregon-st",
          "short": "Oregon St."
        },
        "rank": "",
        "score": "56",
        "seed": "",
        "winner": true
      },
      "bracketId": "",
      "bracketRegion": "",
      "bracketRound": "",
      "contestClock": "0:00",
      "currentPeriod": "FINAL",
      "finalMessage": "FINAL",
      "gameID": "e1552ead-8b30-4126-b021-2840dec42afa",
      "gameState": "final",
      "home": {
        "conferences": [{
          "conferenceName": "Pac-12",
          "conferenceSeo": "pac-12"
        }],
        "description": "(4-5)",
        "names": {
          "char6": "ARIZ",
          "full": "University of Arizona",
          "seo": "arizona",
          "short": "Arizona"
        },
        "rank": "",
        "score": "38",
        "seed": "",
        "winner": false
      },
      "liveVideoEnabled": false,
      "network": "",
      "startDate": "11-02-2019",
      "startTime": "04:30PM ET",
      "startTimeEpoch": "1572726600",
      "title": "Arizona Oregon St.",
      "url": "/game/3786104",
      "videoState": ""
    }},
    {"game": {
      "away": {
        "conferences": [{
          "conferenceName": "Sun Belt",
          "conferenceSeo": "sun-belt"
        }],
        "description": "(2-6)",
        "names": {
          "char6": "TX ST",
          "full": "Texas State University",
          "seo": "texas-st",
          "short": "Texas State"
        },
        "rank": "",
        "score": "3",
        "seed": "",
        "winner": false
      },
      "bracketId": "",
      "bracketRegion": "",
      "bracketRound": "",
      "contestClock": "0:00",
      "currentPeriod": "FINAL",
      "finalMessage": "FINAL",
      "gameID": "62f103a8-e8a2-4d3b-965b-1ab0bce677cf",
      "gameState": "final",
      "home": {
        "conferences": [{
          "conferenceName": "Sun Belt",
          "conferenceSeo": "sun-belt"
        }],
        "description": "(6-2)",
        "names": {
          "char6": "ULL",
          "full": "University of Louisiana at Lafayette",
          "seo": "la-lafayette",
          "short": "Louisiana"
        },
        "rank": "",
        "score": "31",
        "seed": "",
        "winner": true
      },
      "liveVideoEnabled": false,
      "network": "",
      "startDate": "11-02-2019",
      "startTime": "05:00PM ET",
      "startTimeEpoch": "1572728400",
      "title": "Louisiana Texas St.",
      "url": "/game/3784781",
      "videoState": ""
    }},
    {"game": {
      "away": {
        "conferences": [{
          "conferenceName": "Big Ten",
          "conferenceSeo": "big-ten"
        }],
        "description": "(1-7)",
        "names": {
          "char6": "NWSTRN",
          "full": "Northwestern University",
          "seo": "northwestern",
          "short": "Northwestern"
        },
        "rank": "",
        "score": "3",
        "seed": "",
        "winner": false
      },
      "bracketId": "",
      "bracketRegion": "",
      "bracketRound": "",
      "contestClock": "0:00",
      "currentPeriod": "FINAL",
      "finalMessage": "FINAL",
      "gameID": "84e6bd7c-dd26-4a4b-9491-ccec88bea8e5",
      "gameState": "final",
      "home": {
        "conferences": [{
          "conferenceName": "Big Ten",
          "conferenceSeo": "big-ten"
        }],
        "description": "(7-2)",
        "names": {
          "char6": "IND",
          "full": "Indiana University, Bloomington",
          "seo": "indiana",
          "short": "Indiana"
        },
        "rank": "",
        "score": "34",
        "seed": "",
        "winner": true
      },
      "liveVideoEnabled": false,
      "network": "",
      "startDate": "11-02-2019",
      "startTime": "07:00PM ET",
      "startTimeEpoch": "1572735600",
      "title": "Indiana Northwestern",
      "url": "/game/3785431",
      "videoState": ""
    }},
    {"game": {
      "away": {
        "conferences": [{
          "conferenceName": "C-USA",
          "conferenceSeo": "c-usa"
        }],
        "description": "(6-2)",
        "names": {
          "char6": "UAB",
          "full": "University of Alabama at Birmingham",
          "seo": "uab",
          "short": "UAB"
        },
        "rank": "",
        "score": "7",
        "seed": "",
        "winner": false
      },
      "bracketId": "",
      "bracketRegion": "",
      "bracketRound": "",
      "contestClock": "0:00",
      "currentPeriod": "FINAL",
      "finalMessage": "FINAL",
      "gameID": "b700b415-5e3d-4121-a616-d5c78747acbe",
      "gameState": "final",
      "home": {
        "conferences": [{
          "conferenceName": "SEC",
          "conferenceSeo": "sec"
        }],
        "description": "(4-5)",
        "names": {
          "char6": "TENN",
          "full": "University of Tennessee, Knoxville",
          "seo": "tennessee",
          "short": "Tennessee"
        },
        "rank": "",
        "score": "30",
        "seed": "",
        "winner": true
      },
      "liveVideoEnabled": false,
      "network": "",
      "startDate": "11-02-2019",
      "startTime": "07:00PM ET",
      "startTimeEpoch": "1572735600",
      "title": "Tennessee UAB",
      "url": "/game/3785416",
      "videoState": ""
    }},
    {"game": {
      "away": {
        "conferences": [
          {
            "conferenceName": "AAC",
            "conferenceSeo": "aac"
          },
          {
            "conferenceName": "Top 25",
            "conferenceSeo": "top-25"
          }
        ],
        "description": "(7-1)",
        "names": {
          "char6": "CINCY",
          "full": "University of Cincinnati",
          "seo": "cincinnati",
          "short": "Cincinnati"
        },
        "rank": "17",
        "score": "46",
        "seed": "",
        "winner": true
      },
      "bracketId": "",
      "bracketRegion": "",
      "bracketRound": "",
      "contestClock": "0:00",
      "currentPeriod": "FINAL",
      "finalMessage": "FINAL",
      "gameID": "829703d5-20fc-4904-bc5c-2ae19dd9ed40",
      "gameState": "final",
      "home": {
        "conferences": [{
          "conferenceName": "AAC",
          "conferenceSeo": "aac"
        }],
        "description": "(3-6)",
        "names": {
          "char6": "E CAR",
          "full": "East Carolina University",
          "seo": "east-carolina",
          "short": "East Carolina"
        },
        "rank": "",
        "score": "43",
        "seed": "",
        "winner": false
      },
      "liveVideoEnabled": false,
      "network": "",
      "startDate": "11-02-2019",
      "startTime": "07:00PM ET",
      "startTimeEpoch": "1572735600",
      "title": "East Carolina Cincinnati",
      "url": "/game/3785411",
      "videoState": ""
    }},
    {"game": {
      "away": {
        "conferences": [{
          "conferenceName": "SEC",
          "conferenceSeo": "sec"
        }],
        "description": "(3-6)",
        "names": {
          "char6": "MISS",
          "full": "University of Mississippi",
          "seo": "ole-miss",
          "short": "Ole Miss"
        },
        "rank": "",
        "score": "14",
        "seed": "",
        "winner": false
      },
      "bracketId": "",
      "bracketRegion": "",
      "bracketRound": "",
      "contestClock": "0:00",
      "currentPeriod": "FINAL",
      "finalMessage": "FINAL",
      "gameID": "3789465c-5f0c-4a8a-b992-0823d1bbd646",
      "gameState": "final",
      "home": {
        "conferences": [
          {
            "conferenceName": "SEC",
            "conferenceSeo": "sec"
          },
          {
            "conferenceName": "Top 25",
            "conferenceSeo": "top-25"
          }
        ],
        "description": "(7-2)",
        "names": {
          "char6": "AUBURN",
          "full": "Auburn University",
          "seo": "auburn",
          "short": "Auburn"
        },
        "rank": "11",
        "score": "20",
        "seed": "",
        "winner": true
      },
      "liveVideoEnabled": false,
      "network": "",
      "startDate": "11-02-2019",
      "startTime": "07:00PM ET",
      "startTimeEpoch": "1572735600",
      "title": "Auburn Ole Miss",
      "url": "/game/3785337",
      "videoState": ""
    }},
    {"game": {
      "away": {
        "conferences": [{
          "conferenceName": "ACC",
          "conferenceSeo": "acc"
        }],
        "description": "(6-3)",
        "names": {
          "char6": "UVA",
          "full": "University of Virginia",
          "seo": "virginia",
          "short": "Virginia"
        },
        "rank": "",
        "score": "38",
        "seed": "",
        "winner": true
      },
      "bracketId": "",
      "bracketRegion": "",
      "bracketRound": "",
      "contestClock": "0:00",
      "currentPeriod": "FINAL",
      "finalMessage": "FINAL",
      "gameID": "9536aa8f-b94b-425d-bc1c-0eea80085460",
      "gameState": "final",
      "home": {
        "conferences": [{
          "conferenceName": "ACC",
          "conferenceSeo": "acc"
        }],
        "description": "(4-5)",
        "names": {
          "char6": "UNC",
          "full": "University of North Carolina, Chapel Hill",
          "seo": "north-carolina",
          "short": "North Carolina"
        },
        "rank": "",
        "score": "31",
        "seed": "",
        "winner": false
      },
      "liveVideoEnabled": false,
      "network": "",
      "startDate": "11-02-2019",
      "startTime": "07:30PM ET",
      "startTimeEpoch": "1572737400",
      "title": "North Carolina Virginia",
      "url": "/game/3785353",
      "videoState": ""
    }},
    {"game": {
      "away": {
        "conferences": [{
          "conferenceName": "SEC",
          "conferenceSeo": "sec"
        }],
        "description": "(2-6)",
        "names": {
          "char6": "VANDY",
          "full": "Vanderbilt University",
          "seo": "vanderbilt",
          "short": "Vanderbilt"
        },
        "rank": "",
        "score": "7",
        "seed": "",
        "winner": false
      },
      "bracketId": "",
      "bracketRegion": "",
      "bracketRound": "",
      "contestClock": "0:00",
      "currentPeriod": "FINAL",
      "finalMessage": "FINAL",
      "gameID": "4a06555a-7f93-44d5-be6b-698d73c0e60c",
      "gameState": "final",
      "home": {
        "conferences": [{
          "conferenceName": "SEC",
          "conferenceSeo": "sec"
        }],
        "description": "(4-5)",
        "names": {
          "char6": "S CAR",
          "full": "University of South Carolina, Columbia",
          "seo": "south-carolina",
          "short": "South Carolina"
        },
        "rank": "",
        "score": "24",
        "seed": "",
        "winner": true
      },
      "liveVideoEnabled": false,
      "network": "",
      "startDate": "11-02-2019",
      "startTime": "07:30PM ET",
      "startTimeEpoch": "1572737400",
      "title": "South Carolina Vanderbilt",
      "url": "/game/3785921",
      "videoState": ""
    }},
    {"game": {
      "away": {
        "conferences": [
          {
            "conferenceName": "AAC",
            "conferenceSeo": "aac"
          },
          {
            "conferenceName": "Top 25",
            "conferenceSeo": "top-25"
          }
        ],
        "description": "(8-1)",
        "names": {
          "char6": "SMU",
          "full": "Southern Methodist University",
          "seo": "smu",
          "short": "SMU"
        },
        "rank": "15",
        "score": "48",
        "seed": "",
        "winner": false
      },
      "bracketId": "",
      "bracketRegion": "",
      "bracketRound": "",
      "contestClock": "0:00",
      "currentPeriod": "FINAL",
      "finalMessage": "FINAL",
      "gameID": "13571388-d3d9-45ed-b68b-c5e4acd097e5",
      "gameState": "final",
      "home": {
        "conferences": [
          {
            "conferenceName": "AAC",
            "conferenceSeo": "aac"
          },
          {
            "conferenceName": "Top 25",
            "conferenceSeo": "top-25"
          }
        ],
        "description": "(8-1)",
        "names": {
          "char6": "MEM",
          "full": "University of Memphis",
          "seo": "memphis",
          "short": "Memphis"
        },
        "rank": "24",
        "score": "54",
        "seed": "",
        "winner": true
      },
      "liveVideoEnabled": false,
      "network": "",
      "startDate": "11-02-2019",
      "startTime": "07:30PM ET",
      "startTimeEpoch": "1572737400",
      "title": "Memphis SMU",
      "url": "/game/3785154",
      "videoState": ""
    }},
    {"game": {
      "away": {
        "conferences": [
          {
            "conferenceName": "Pac-12",
            "conferenceSeo": "pac-12"
          },
          {
            "conferenceName": "Top 25",
            "conferenceSeo": "top-25"
          }
        ],
        "description": "(8-1)",
        "names": {
          "char6": "OREGN",
          "full": "University of Oregon",
          "seo": "oregon",
          "short": "Oregon"
        },
        "rank": "7",
        "score": "56",
        "seed": "",
        "winner": true
      },
      "bracketId": "",
      "bracketRegion": "",
      "bracketRound": "",
      "contestClock": "0:00",
      "currentPeriod": "FINAL",
      "finalMessage": "FINAL",
      "gameID": "1b8f9b03-2066-49fa-bd6f-70825dbdf116",
      "gameState": "final",
      "home": {
        "conferences": [{
          "conferenceName": "Pac-12",
          "conferenceSeo": "pac-12"
        }],
        "description": "(5-4)",
        "names": {
          "char6": "USC",
          "full": "University of Southern California",
          "seo": "southern-california",
          "short": "USC"
        },
        "rank": "",
        "score": "24",
        "seed": "",
        "winner": false
      },
      "liveVideoEnabled": false,
      "network": "",
      "startDate": "11-02-2019",
      "startTime": "08:00PM ET",
      "startTimeEpoch": "1572739200",
      "title": "Southern California Oregon",
      "url": "/game/3785102",
      "videoState": ""
    }},
    {"game": {
      "away": {
        "conferences": [{
          "conferenceName": "Pac-12",
          "conferenceSeo": "pac-12"
        }],
        "description": "(3-6)",
        "names": {
          "char6": "COLO",
          "full": "University of Colorado, Boulder",
          "seo": "colorado",
          "short": "Colorado"
        },
        "rank": "",
        "score": "14",
        "seed": "",
        "winner": false
      },
      "bracketId": "",
      "bracketRegion": "",
      "bracketRound": "",
      "contestClock": "0:00",
      "currentPeriod": "FINAL",
      "finalMessage": "FINAL",
      "gameID": "36d20fe8-dc15-48d7-8885-7641e4c269ea",
      "gameState": "final",
      "home": {
        "conferences": [{
          "conferenceName": "Pac-12",
          "conferenceSeo": "pac-12"
        }],
        "description": "(4-5)",
        "names": {
          "char6": "UCLA",
          "full": "University of California, Los Angeles",
          "seo": "ucla",
          "short": "UCLA"
        },
        "rank": "",
        "score": "31",
        "seed": "",
        "winner": true
      },
      "liveVideoEnabled": false,
      "network": "",
      "startDate": "11-02-2019",
      "startTime": "09:00PM ET",
      "startTimeEpoch": "1572742800",
      "title": "UCLA Colorado",
      "url": "/game/3784879",
      "videoState": ""
    }},
    {"game": {
      "away": {
        "conferences": [{
          "conferenceName": "FBS Independent",
          "conferenceSeo": "fbs-independent"
        }],
        "description": "(4-4)",
        "names": {
          "char6": "BYU",
          "full": "Brigham Young University",
          "seo": "byu",
          "short": "BYU"
        },
        "rank": "",
        "score": "42",
        "seed": "",
        "winner": true
      },
      "bracketId": "",
      "bracketRegion": "",
      "bracketRound": "",
      "contestClock": "0:00",
      "currentPeriod": "FINAL",
      "finalMessage": "FINAL",
      "gameID": "b0a86c2c-1cab-4c06-bac4-2ca3ae09a8b5",
      "gameState": "final",
      "home": {
        "conferences": [{
          "conferenceName": "Mountain West",
          "conferenceSeo": "mountain-west"
        }],
        "description": "(4-4)",
        "names": {
          "char6": "UT ST",
          "full": "Utah State University",
          "seo": "utah-st",
          "short": "Utah State"
        },
        "rank": "",
        "score": "14",
        "seed": "",
        "winner": false
      },
      "liveVideoEnabled": false,
      "network": "",
      "startDate": "11-02-2019",
      "startTime": "10:00PM ET",
      "startTimeEpoch": "1572746400",
      "title": "Utah St. BYU",
      "url": "/game/3784673",
      "videoState": ""
    }},
    {"game": {
      "away": {
        "conferences": [
          {
            "conferenceName": "Mountain West",
            "conferenceSeo": "mountain-west"
          },
          {
            "conferenceName": "Top 25",
            "conferenceSeo": "top-25"
          }
        ],
        "description": "(7-1)",
        "names": {
          "char6": "BOISE",
          "full": "Boise State University",
          "seo": "boise-st",
          "short": "Boise State"
        },
        "rank": "21",
        "score": "52",
        "seed": "",
        "winner": true
      },
      "bracketId": "",
      "bracketRegion": "",
      "bracketRound": "",
      "contestClock": "0:00",
      "currentPeriod": "FINAL",
      "finalMessage": "FINAL",
      "gameID": "7d939f47-6adb-4c95-840c-af1daeae6527",
      "gameState": "final",
      "home": {
        "conferences": [{
          "conferenceName": "Mountain West",
          "conferenceSeo": "mountain-west"
        }],
        "description": "(4-5)",
        "names": {
          "char6": "SJSU",
          "full": "San Jose State University",
          "seo": "san-jose-st",
          "short": "San Jose State"
        },
        "rank": "",
        "score": "42",
        "seed": "",
        "winner": false
      },
      "liveVideoEnabled": false,
      "network": "",
      "startDate": "11-02-2019",
      "startTime": "10:30PM ET",
      "startTimeEpoch": "1572748200",
      "title": "San Jose St. Boise St.",
      "url": "/game/3785553",
      "videoState": ""
    }},
    {"game": {
      "away": {
        "conferences": [{
          "conferenceName": "Mountain West",
          "conferenceSeo": "mountain-west"
        }],
        "description": "(2-7)",
        "names": {
          "char6": "N MEX",
          "full": "University of New Mexico",
          "seo": "new-mexico",
          "short": "New Mexico"
        },
        "rank": "",
        "score": "10",
        "seed": "",
        "winner": false
      },
      "bracketId": "",
      "bracketRegion": "",
      "bracketRound": "",
      "contestClock": "0:00",
      "currentPeriod": "FINAL",
      "finalMessage": "FINAL",
      "gameID": "3ad9c743-ae69-4b5d-9864-be4b537a550b",
      "gameState": "final",
      "home": {
        "conferences": [{
          "conferenceName": "Mountain West",
          "conferenceSeo": "mountain-west"
        }],
        "description": "(5-4)",
        "names": {
          "char6": "NEVADA",
          "full": "University of Nevada, Reno",
          "seo": "nevada",
          "short": "Nevada"
        },
        "rank": "",
        "score": "21",
        "seed": "",
        "winner": true
      },
      "liveVideoEnabled": false,
      "network": "",
      "startDate": "11-02-2019",
      "startTime": "10:30PM ET",
      "startTimeEpoch": "1572748200",
      "title": "Nevada New Mexico",
      "url": "/game/3785103",
      "videoState": ""
    }},
    {"game": {
      "away": {
        "conferences": [{
          "conferenceName": "Mountain West",
          "conferenceSeo": "mountain-west"
        }],
        "description": "(4-4)",
        "names": {
          "char6": "FRESNO",
          "full": "California State University, Fresno",
          "seo": "fresno-st",
          "short": "Fresno State"
        },
        "rank": "",
        "score": "41",
        "seed": "",
        "winner": true
      },
      "bracketId": "",
      "bracketRegion": "",
      "bracketRound": "",
      "contestClock": "0:00",
      "currentPeriod": "FINAL",
      "finalMessage": "FINAL",
      "gameID": "e8456c91-c3e5-4703-9c8f-081501b2c774",
      "gameState": "final",
      "home": {
        "conferences": [{
          "conferenceName": "Mountain West",
          "conferenceSeo": "mountain-west"
        }],
        "description": "(5-4)",
        "names": {
          "char6": "HAWAII",
          "full": "University of Hawaii, Manoa",
          "seo": "hawaii",
          "short": "Hawaii"
        },
        "rank": "",
        "score": "38",
        "seed": "",
        "winner": false
      },
      "liveVideoEnabled": false,
      "network": "",
      "startDate": "11-03-2019",
      "startTime": "12:00AM ET",
      "startTimeEpoch": "1572753600",
      "title": "Hawaii Fresno St.",
      "url": "/game/3785138",
      "videoState": ""
    }}
  ],
  "inputMD5Sum": "ab1f2224f235cfc59b2b67adad067d83",
  "updated_at": "11-03-2019 14:33:02"
}