{
  "AppalachianState vs ArkansasState": {
    "stadium": "CentennialBankStadium-Jonesboro-AR",
    "AppalachianState": {
      "points": 35,
      "1st downs": 15,
      "rushing 1st downs": 8,
      "passing 1st downs": 4,
      "penalty 1st downs": 3,
      "rushing yards": 246,
      "rushing attempts": 38,
      "passing yards": 144,
      "passing attempts": 27,
      "passing completions": 12,
      "passing interceptions": 0,
      "total yards": 390,
      "total plays": 65,
      "fumbles": 0,
      "fumbles lost": 0,
      "penalties": 4,
      "penalty yards": 50,
      "punts": 8,
      "punt yards": 350,
      "punt returns": 1,
      "punt return yards": -1,
      "kickoff returns": 2,
      "kickoff return yards": 34,
      "interception returns": 3,
      "interception return yards": 25,
      "3rd down conversions": 6,
      "3rd down attempts": 16,
      "4th down conversions": 0,
      "4th down attempts": 1
    },
    "ArkansasState": {
      "points": 9,
      "1st downs": 18,
      "rushing 1st downs": 6,
      "passing 1st downs": 10,
      "penalty 1st downs": 2,
      "rushing yards": 117,
      "rushing attempts": 37,
      "passing yards": 219,
      "passing attempts": 45,
      "passing completions": 27,
      "passing interceptions": 3,
      "total yards": 336,
      "total plays": 82,
      "fumbles": 0,
      "fumbles lost": 0,
      "penalties": 7,
      "penalty yards": 65,
      "punts": 7,
      "punt yards": 318,
      "punt returns": 4,
      "punt return yards": 7,
      "kickoff returns": 3,
      "kickoff return yards": 52,
      "interception returns": 0,
      "interception return yards": 0,
      "3rd down conversions": 4,
      "3rd down attempts": 18,
      "4th down conversions": 1,
      "4th down attempts": 3
    }
  },
  "TexasTech vs TCU": {
    "stadium": "AmonGCarterStadium-FortWorth-TX",
    "TexasTech": {
      "points": 17,
      "1st downs": 17,
      "rushing 1st downs": 9,
      "passing 1st downs": 7,
      "penalty 1st downs": 1,
      "rushing yards": 151,
      "rushing attempts": 43,
      "passing yards": 202,
      "passing attempts": 27,
      "passing completions": 15,
      "passing interceptions": 1,
      "total yards": 353,
      "total plays": 70,
      "fumbles": 0,
      "fumbles lost": 0,
      "penalties": 12,
      "penalty yards": 89,
      "punts": 7,
      "punt yards": 297,
      "punt returns": 0,
      "punt return yards": 0,
      "kickoff returns": 3,
      "kickoff return yards": 39,
      "interception returns": 2,
      "interception return yards": 5,
      "3rd down conversions": 5,
      "3rd down attempts": 15,
      "4th down conversions": 0,
      "4th down attempts": 1
    },
    "TCU": {
      "points": 14,
      "1st downs": 20,
      "rushing 1st downs": 6,
      "passing 1st downs": 12,
      "penalty 1st downs": 2,
      "rushing yards": 121,
      "rushing attempts": 32,
      "passing yards": 290,
      "passing attempts": 45,
      "passing completions": 26,
      "passing interceptions": 2,
      "total yards": 411,
      "total plays": 77,
      "fumbles": 4,
      "fumbles lost": 1,
      "penalties": 8,
      "penalty yards": 63,
      "punts": 7,
      "punt yards": 245,
      "punt returns": 1,
      "punt return yards": 5,
      "kickoff returns": 4,
      "kickoff return yards": 67,
      "interception returns": 1,
      "interception return yards": 0,
      "3rd down conversions": 5,
      "3rd down attempts": 17,
      "4th down conversions": 1,
      "4th down attempts": 3
    }
  },
  "GeorgiaSouthern vs TexasState": {
    "stadium": "JimWackerFieldatBobcatStadium-SanMarcos-TX",
    "GeorgiaSouthern": {
      "points": 15,
      "1st downs": 12,
      "rushing 1st downs": 8,
      "passing 1st downs": 3,
      "penalty 1st downs": 1,
      "rushing yards": 164,
      "rushing attempts": 52,
      "passing yards": 51,
      "passing attempts": 12,
      "passing completions": 7,
      "passing interceptions": 0,
      "total yards": 215,
      "total plays": 64,
      "fumbles": 1,
      "fumbles lost": 1,
      "penalties": 5,
      "penalty yards": 49,
      "punts": 8,
      "punt yards": 319,
      "punt returns": 1,
      "punt return yards": 6,
      "kickoff returns": 1,
      "kickoff return yards": 16,
      "interception returns": 1,
      "interception return yards": 34,
      "3rd down conversions": 4,
      "3rd down attempts": 16,
      "4th down conversions": 0,
      "4th down attempts": 2
    },
    "TexasState": {
      "points": 13,
      "1st downs": 15,
      "rushing 1st downs": 6,
      "passing 1st downs": 7,
      "penalty 1st downs": 2,
      "rushing yards": 107,
      "rushing attempts": 32,
      "passing yards": 135,
      "passing attempts": 27,
      "passing completions": 14,
      "passing interceptions": 1,
      "total yards": 242,
      "total plays": 59,
      "fumbles": 1,
      "fumbles lost": 1,
      "penalties": 3,
      "penalty yards": 25,
      "punts": 7,
      "punt yards": 235,
      "punt returns": 2,
      "punt return yards": -3,
      "kickoff returns": 1,
      "kickoff return yards": 39,
      "interception returns": 0,
      "interception return yards": 0,
      "3rd down conversions": 2,
      "3rd down attempts": 12,
      "4th down conversions": 1,
      "4th down attempts": 2
    }
  },
  "SouthFlorida vs Tulsa": {
    "stadium": "SkellyFieldatHAChapmanStadium-Tulsa-OK",
    "SouthFlorida": {
      "points": 25,
      "1st downs": 26,
      "rushing 1st downs": 12,
      "passing 1st downs": 11,
      "penalty 1st downs": 3,
      "rushing yards": 250,
      "rushing attempts": 47,
      "passing yards": 237,
      "passing attempts": 40,
      "passing completions": 17,
      "passing interceptions": 1,
      "total yards": 487,
      "total plays": 87,
      "fumbles": 1,
      "fumbles lost": 0,
      "penalties": 8,
      "penalty yards": 70,
      "punts": 7,
      "punt yards": 288,
      "punt returns": 4,
      "punt return yards": 13,
      "kickoff returns": 1,
      "kickoff return yards": 17,
      "interception returns": 0,
      "interception return yards": 0,
      "3rd down conversions": 10,
      "3rd down attempts": 20,
      "4th down conversions": 0,
      "4th down attempts": 1
    },
    "Tulsa": {
      "points": 24,
      "1st downs": 16,
      "rushing 1st downs": 10,
      "passing 1st downs": 5,
      "penalty 1st downs": 1,
      "rushing yards": 220,
      "rushing attempts": 49,
      "passing yards": 79,
      "passing attempts": 21,
      "passing completions": 6,
      "passing interceptions": 0,
      "total yards": 299,
      "total plays": 70,
      "fumbles": 0,
      "fumbles lost": 0,
      "penalties": 10,
      "penalty yards": 81,
      "punts": 9,
      "punt yards": 456,
      "punt returns": 2,
      "punt return yards": 3,
      "kickoff returns": 3,
      "kickoff return yards": 42,
      "interception returns": 1,
      "interception return yards": 0,
      "3rd down conversions": 7,
      "3rd down attempts": 17,
      "4th down conversions": 0,
      "4th down attempts": 0
    }
  },
  "AirForce vs SanDiegoState": {
    "stadium": "SanDiegoCountyCreditUnionStadium-SanDiego-CA",
    "AirForce": {
      "points": 17,
      "1st downs": 14,
      "rushing 1st downs": 9,
      "passing 1st downs": 4,
      "penalty 1st downs": 1,
      "rushing yards": 214,
      "rushing attempts": 51,
      "passing yards": 62,
      "passing attempts": 17,
      "passing completions": 8,
      "passing interceptions": 1,
      "total yards": 276,
      "total plays": 68,
      "fumbles": 0,
      "fumbles lost": 0,
      "penalties": 5,
      "penalty yards": 56,
      "punts": 8,
      "punt yards": 282,
      "punt returns": 1,
      "punt return yards": 4,
      "kickoff returns": 2,
      "kickoff return yards": 80,
      "interception returns": 1,
      "interception return yards": 0,
      "3rd down conversions": 6,
      "3rd down attempts": 16,
      "4th down conversions": 0,
      "4th down attempts": 0
    },
    "SanDiegoState": {
      "points": 21,
      "1st downs": 13,
      "rushing 1st downs": 5,
      "passing 1st downs": 8,
      "penalty 1st downs": 0,
      "rushing yards": 84,
      "rushing attempts": 34,
      "passing yards": 213,
      "passing attempts": 25,
      "passing completions": 9,
      "passing interceptions": 1,
      "total yards": 297,
      "total plays": 59,
      "fumbles": 1,
      "fumbles lost": 0,
      "penalties": 8,
      "penalty yards": 55,
      "punts": 7,
      "punt yards": 276,
      "punt returns": 4,
      "punt return yards": 41,
      "kickoff returns": 2,
      "kickoff return yards": 32,
      "interception returns": 1,
      "interception return yards": 0,
      "3rd down conversions": 2,
      "3rd down attempts": 12,
      "4th down conversions": 0,
      "4th down attempts": 0
    }
  },
  "Arizona vs Utah": {
    "stadium": "RiceEcclesStadium-SaltLakeCity-UT",
    "Arizona": {
      "points": 10,
      "1st downs": 19,
      "rushing 1st downs": 4,
      "passing 1st downs": 10,
      "penalty 1st downs": 5,
      "rushing yards": 72,
      "rushing attempts": 31,
      "passing yards": 246,
      "passing attempts": 46,
      "passing completions": 24,
      "passing interceptions": 0,
      "total yards": 318,
      "total plays": 77,
      "fumbles": 1,
      "fumbles lost": 0,
      "penalties": 5,
      "penalty yards": 56,
      "punts": 5,
      "punt yards": 209,
      "punt returns": 1,
      "punt return yards": 0,
      "kickoff returns": 3,
      "kickoff return yards": 67,
      "interception returns": 1,
      "interception return yards": 33,
      "3rd down conversions": 6,
      "3rd down attempts": 18,
      "4th down conversions": 1,
      "4th down attempts": 5
    },
    "Utah": {
      "points": 42,
      "1st downs": 23,
      "rushing 1st downs": 12,
      "passing 1st downs": 8,
      "penalty 1st downs": 3,
      "rushing yards": 230,
      "rushing attempts": 46,
      "passing yards": 265,
      "passing attempts": 22,
      "passing completions": 16,
      "passing interceptions": 1,
      "total yards": 495,
      "total plays": 68,
      "fumbles": 0,
      "fumbles lost": 0,
      "penalties": 9,
      "penalty yards": 94,
      "punts": 4,
      "punt yards": 193,
      "punt returns": 1,
      "punt return yards": 2,
      "kickoff returns": 0,
      "kickoff return yards": 0,
      "interception returns": 0,
      "interception return yards": 0,
      "3rd down conversions": 5,
      "3rd down attempts": 13,
      "4th down conversions": 3,
      "4th down attempts": 3
    }
  },
  "Tennessee vs Auburn": {
    "stadium": "JordanHareStadium-Auburn-AL",
    "Tennessee": {
      "points": 30,
      "1st downs": 16,
      "rushing 1st downs": 4,
      "passing 1st downs": 12,
      "penalty 1st downs": 0,
      "rushing yards": 68,
      "rushing attempts": 36,
      "passing yards": 328,
      "passing attempts": 32,
      "passing completions": 21,
      "passing interceptions": 0,
      "total yards": 396,
      "total plays": 68,
      "fumbles": 0,
      "fumbles lost": 0,
      "penalties": 5,
      "penalty yards": 40,
      "punts": 4,
      "punt yards": 171,
      "punt returns": 1,
      "punt return yards": 0,
      "kickoff returns": 0,
      "kickoff return yards": 0,
      "interception returns": 2,
      "interception return yards": 16,
      "3rd down conversions": 10,
      "3rd down attempts": 19,
      "4th down conversions": 0,
      "4th down attempts": 1
    },
    "Auburn": {
      "points": 24,
      "1st downs": 22,
      "rushing 1st downs": 8,
      "passing 1st downs": 13,
      "penalty 1st downs": 1,
      "rushing yards": 126,
      "rushing attempts": 34,
      "passing yards": 322,
      "passing attempts": 46,
      "passing completions": 28,
      "passing interceptions": 2,
      "total yards": 448,
      "total plays": 80,
      "fumbles": 3,
      "fumbles lost": 1,
      "penalties": 5,
      "penalty yards": 38,
      "punts": 3,
      "punt yards": 133,
      "punt returns": 0,
      "punt return yards": 0,
      "kickoff returns": 2,
      "kickoff return yards": 30,
      "interception returns": 0,
      "interception return yards": 0,
      "3rd down conversions": 9,
      "3rd down attempts": 16,
      "4th down conversions": 1,
      "4th down attempts": 2
    }
  },
  "Nebraska vs Northwestern": {
    "stadium": "RyanField-Evanston-IL",
    "Nebraska": {
      "points": 31,
      "1st downs": 24,
      "rushing 1st downs": 15,
      "passing 1st downs": 9,
      "penalty 1st downs": 0,
      "rushing yards": 231,
      "rushing attempts": 47,
      "passing yards": 251,
      "passing attempts": 35,
      "passing completions": 25,
      "passing interceptions": 2,
      "total yards": 482,
      "total plays": 82,
      "fumbles": 3,
      "fumbles lost": 1,
      "penalties": 9,
      "penalty yards": 89,
      "punts": 5,
      "punt yards": 229,
      "punt returns": 1,
      "punt return yards": 19,
      "kickoff returns": 4,
      "kickoff return yards": 57,
      "interception returns": 2,
      "interception return yards": 14,
      "3rd down conversions": 7,
      "3rd down attempts": 16,
      "4th down conversions": 0,
      "4th down attempts": 1
    },
    "Northwestern": {
      "points": 34,
      "1st downs": 30,
      "rushing 1st downs": 4,
      "passing 1st downs": 21,
      "penalty 1st downs": 5,
      "rushing yards": 32,
      "rushing attempts": 23,
      "passing yards": 455,
      "passing attempts": 65,
      "passing completions": 41,
      "passing interceptions": 2,
      "total yards": 487,
      "total plays": 88,
      "fumbles": 0,
      "fumbles lost": 0,
      "penalties": 1,
      "penalty yards": 5,
      "punts": 5,
      "punt yards": 197,
      "punt returns": 0,
      "punt return yards": 0,
      "kickoff returns": 1,
      "kickoff return yards": 20,
      "interception returns": 2,
      "interception return yards": 0,
      "3rd down conversions": 8,
      "3rd down attempts": 18,
      "4th down conversions": 2,
      "4th down attempts": 2
    }
  },
  "Minnesota vs OhioState": {
    "stadium": "OhioStadium-Columbus-OH",
    "Minnesota": {
      "points": 14,
      "1st downs": 19,
      "rushing 1st downs": 7,
      "passing 1st downs": 10,
      "penalty 1st downs": 2,
      "rushing yards": 178,
      "rushing attempts": 33,
      "passing yards": 218,
      "passing attempts": 23,
      "passing completions": 13,
      "passing interceptions": 2,
      "total yards": 396,
      "total plays": 56,
      "fumbles": 1,
      "fumbles lost": 1,
      "penalties": 4,
      "penalty yards": 60,
      "punts": 2,
      "punt yards": 87,
      "punt returns": 1,
      "punt return yards": 12,
      "kickoff returns": 1,
      "kickoff return yards": 14,
      "interception returns": 0,
      "interception return yards": 0,
      "3rd down conversions": 4,
      "3rd down attempts": 9,
      "4th down conversions": 0,
      "4th down attempts": 0
    },
    "OhioState": {
      "points": 30,
      "1st downs": 29,
      "rushing 1st downs": 6,
      "passing 1st downs": 20,
      "penalty 1st downs": 3,
      "rushing yards": 92,
      "rushing attempts": 32,
      "passing yards": 412,
      "passing attempts": 44,
      "passing completions": 33,
      "passing interceptions": 0,
      "total yards": 504,
      "total plays": 76,
      "fumbles": 1,
      "fumbles lost": 0,
      "penalties": 5,
      "penalty yards": 36,
      "punts": 2,
      "punt yards": 92,
      "punt returns": 2,
      "punt return yards": -1,
      "kickoff returns": 0,
      "kickoff return yards": 0,
      "interception returns": 2,
      "interception return yards": 0,
      "3rd down conversions": 6,
      "3rd down attempts": 14,
      "4th down conversions": 2,
      "4th down attempts": 3
    }
  },
  "Akron vs Buffalo": {
    "stadium": "UBStadium-Buffalo-NY",
    "Akron": {
      "points": 6,
      "1st downs": 13,
      "rushing 1st downs": 7,
      "passing 1st downs": 5,
      "penalty 1st downs": 1,
      "rushing yards": 120,
      "rushing attempts": 32,
      "passing yards": 115,
      "passing attempts": 29,
      "passing completions": 12,
      "passing interceptions": 1,
      "total yards": 235,
      "total plays": 61,
      "fumbles": 4,
      "fumbles lost": 0,
      "penalties": 5,
      "penalty yards": 46,
      "punts": 9,
      "punt yards": 330,
      "punt returns": 3,
      "punt return yards": 7,
      "kickoff returns": 3,
      "kickoff return yards": 44,
      "interception returns": 1,
      "interception return yards": 0,
      "3rd down conversions": 3,
      "3rd down attempts": 14,
      "4th down conversions": 1,
      "4th down attempts": 1
    },
    "Buffalo": {
      "points": 24,
      "1st downs": 20,
      "rushing 1st downs": 10,
      "passing 1st downs": 9,
      "penalty 1st downs": 1,
      "rushing yards": 223,
      "rushing attempts": 46,
      "passing yards": 212,
      "passing attempts": 30,
      "passing completions": 16,
      "passing interceptions": 1,
      "total yards": 435,
      "total plays": 76,
      "fumbles": 0,
      "fumbles lost": 0,
      "penalties": 5,
      "penalty yards": 45,
      "punts": 5,
      "punt yards": 205,
      "punt returns": 2,
      "punt return yards": 10,
      "kickoff returns": 0,
      "kickoff return yards": 0,
      "interception returns": 1,
      "interception return yards": 0,
      "3rd down conversions": 8,
      "3rd down attempts": 17,
      "4th down conversions": 1,
      "4th down attempts": 1
    }
  },
  "OklahomaState vs KansasState": {
    "stadium": "BillSnyderFamilyFootballStadium-Manhattan-KS",
    "OklahomaState": {
      "points": 12,
      "1st downs": 15,
      "rushing 1st downs": 6,
      "passing 1st downs": 8,
      "penalty 1st downs": 1,
      "rushing yards": 127,
      "rushing attempts": 28,
      "passing yards": 184,
      "passing attempts": 35,
      "passing completions": 17,
      "passing interceptions": 2,
      "total yards": 311,
      "total plays": 63,
      "fumbles": 0,
      "fumbles lost": 0,
      "penalties": 7,
      "penalty yards": 70,
      "punts": 4,
      "punt yards": 132,
      "punt returns": 2,
      "punt return yards": 14,
      "kickoff returns": 5,
      "kickoff return yards": 89,
      "interception returns": 0,
      "interception return yards": 0,
      "3rd down conversions": 5,
      "3rd down attempts": 15,
      "4th down conversions": 2,
      "4th down attempts": 2
    },
    "KansasState": {
      "points": 31,
      "1st downs": 23,
      "rushing 1st downs": 13,
      "passing 1st downs": 7,
      "penalty 1st downs": 3,
      "rushing yards": 291,
      "rushing attempts": 55,
      "passing yards": 130,
      "passing attempts": 22,
      "passing completions": 11,
      "passing interceptions": 0,
      "total yards": 421,
      "total plays": 77,
      "fumbles": 0,
      "fumbles lost": 0,
      "penalties": 4,
      "penalty yards": 40,
      "punts": 3,
      "punt yards": 129,
      "punt returns": 2,
      "punt return yards": 5,
      "kickoff returns": 2,
      "kickoff return yards": 53,
      "interception returns": 2,
      "interception return yards": 30,
      "3rd down conversions": 8,
      "3rd down attempts": 15,
      "4th down conversions": 1,
      "4th down attempts": 1
    }
  },
  "Florida vs Vanderbilt": {
    "stadium": "VanderbiltStadium-Nashville-TN",
    "Florida": {
      "points": 37,
      "1st downs": 31,
      "rushing 1st downs": 18,
      "passing 1st downs": 13,
      "penalty 1st downs": 0,
      "rushing yards": 292,
      "rushing attempts": 63,
      "passing yards": 284,
      "passing attempts": 29,
      "passing completions": 19,
      "passing interceptions": 1,
      "total yards": 576,
      "total plays": 92,
      "fumbles": 2,
      "fumbles lost": 2,
      "penalties": 7,
      "penalty yards": 63,
      "punts": 2,
      "punt yards": 91,
      "punt returns": 4,
      "punt return yards": 36,
      "kickoff returns": 1,
      "kickoff return yards": 11,
      "interception returns": 1,
      "interception return yards": 1,
      "3rd down conversions": 12,
      "3rd down attempts": 19,
      "4th down conversions": 3,
      "4th down attempts": 3
    },
    "Vanderbilt": {
      "points": 27,
      "1st downs": 17,
      "rushing 1st downs": 3,
      "passing 1st downs": 9,
      "penalty 1st downs": 5,
      "rushing yards": 107,
      "rushing attempts": 22,
      "passing yards": 229,
      "passing attempts": 36,
      "passing completions": 18,
      "passing interceptions": 1,
      "total yards": 336,
      "total plays": 58,
      "fumbles": 0,
      "fumbles lost": 0,
      "penalties": 5,
      "penalty yards": 28,
      "punts": 5,
      "punt yards": 228,
      "punt returns": 1,
      "punt return yards": 7,
      "kickoff returns": 3,
      "kickoff return yards": 51,
      "interception returns": 1,
      "interception return yards": 0,
      "3rd down conversions": 3,
      "3rd down attempts": 12,
      "4th down conversions": 1,
      "4th down attempts": 1
    }
  },
  "Iowa vs Indiana": {
    "stadium": "MemorialStadiumBloomington-IN-Bloomington",
    "Iowa": {
      "points": 42,
      "1st downs": 26,
      "rushing 1st downs": 7,
      "passing 1st downs": 12,
      "penalty 1st downs": 7,
      "rushing yards": 159,
      "rushing attempts": 32,
      "passing yards": 320,
      "passing attempts": 33,
      "passing completions": 21,
      "passing interceptions": 1,
      "total yards": 479,
      "total plays": 65,
      "fumbles": 0,
      "fumbles lost": 0,
      "penalties": 11,
      "penalty yards": 110,
      "punts": 2,
      "punt yards": 89,
      "punt returns": 1,
      "punt return yards": 5,
      "kickoff returns": 4,
      "kickoff return yards": 136,
      "interception returns": 2,
      "interception return yards": 19,
      "3rd down conversions": 8,
      "3rd down attempts": 12,
      "4th down conversions": 1,
      "4th down attempts": 2
    },
    "Indiana": {
      "points": 16,
      "1st downs": 22,
      "rushing 1st downs": 8,
      "passing 1st downs": 10,
      "penalty 1st downs": 4,
      "rushing yards": 67,
      "rushing attempts": 25,
      "passing yards": 263,
      "passing attempts": 42,
      "passing completions": 31,
      "passing interceptions": 2,
      "total yards": 330,
      "total plays": 67,
      "fumbles": 1,
      "fumbles lost": 0,
      "penalties": 10,
      "penalty yards": 99,
      "punts": 4,
      "punt yards": 177,
      "punt returns": 1,
      "punt return yards": 0,
      "kickoff returns": 1,
      "kickoff return yards": 18,
      "interception returns": 1,
      "interception return yards": 30,
      "3rd down conversions": 5,
      "3rd down attempts": 12,
      "4th down conversions": 0,
      "4th down attempts": 2
    }
  },
  "Toledo vs EasternMichigan": {
    "stadium": "RynearsonStadium-Ypsilanti-MI",
    "Toledo": {
      "points": 26,
      "1st downs": 25,
      "rushing 1st downs": 14,
      "passing 1st downs": 6,
      "penalty 1st downs": 5,
      "rushing yards": 229,
      "rushing attempts": 52,
      "passing yards": 147,
      "passing attempts": 27,
      "passing completions": 12,
      "passing interceptions": 1,
      "total yards": 376,
      "total plays": 79,
      "fumbles": 3,
      "fumbles lost": 0,
      "penalties": 16,
      "penalty yards": 130,
      "punts": 3,
      "punt yards": 115,
      "punt returns": 3,
      "punt return yards": 86,
      "kickoff returns": 2,
      "kickoff return yards": 31,
      "interception returns": 0,
      "interception return yards": 0,
      "3rd down conversions": 6,
      "3rd down attempts": 16,
      "4th down conversions": 1,
      "4th down attempts": 4
    },
    "EasternMichigan": {
      "points": 28,
      "1st downs": 19,
      "rushing 1st downs": 10,
      "passing 1st downs": 8,
      "penalty 1st downs": 1,
      "rushing yards": 229,
      "rushing attempts": 38,
      "passing yards": 183,
      "passing attempts": 23,
      "passing completions": 17,
      "passing interceptions": 0,
      "total yards": 412,
      "total plays": 61,
      "fumbles": 2,
      "fumbles lost": 0,
      "penalties": 11,
      "penalty yards": 138,
      "punts": 5,
      "punt yards": 207,
      "punt returns": 1,
      "punt return yards": 5,
      "kickoff returns": 1,
      "kickoff return yards": 23,
      "interception returns": 1,
      "interception return yards": -2,
      "3rd down conversions": 1,
      "3rd down attempts": 9,
      "4th down conversions": 1,
      "4th down attempts": 2
    }
  },
  "Rutgers vs Maryland": {
    "stadium": "CapitalOneFieldatMarylandStadium-CollegePark-MD",
    "Rutgers": {
      "points": 7,
      "1st downs": 14,
      "rushing 1st downs": 11,
      "passing 1st downs": 0,
      "penalty 1st downs": 3,
      "rushing yards": 171,
      "rushing attempts": 45,
      "passing yards": 8,
      "passing attempts": 17,
      "passing completions": 2,
      "passing interceptions": 5,
      "total yards": 179,
      "total plays": 62,
      "fumbles": 2,
      "fumbles lost": 0,
      "penalties": 4,
      "penalty yards": 23,
      "punts": 6,
      "punt yards": 263,
      "punt returns": 1,
      "punt return yards": 2,
      "kickoff returns": 2,
      "kickoff return yards": 52,
      "interception returns": 0,
      "interception return yards": 0,
      "3rd down conversions": 4,
      "3rd down attempts": 13,
      "4th down conversions": 1,
      "4th down attempts": 1
    },
    "Maryland": {
      "points": 34,
      "1st downs": 16,
      "rushing 1st downs": 12,
      "passing 1st downs": 4,
      "penalty 1st downs": 0,
      "rushing yards": 290,
      "rushing attempts": 40,
      "passing yards": 85,
      "passing attempts": 20,
      "passing completions": 9,
      "passing interceptions": 0,
      "total yards": 375,
      "total plays": 60,
      "fumbles": 1,
      "fumbles lost": 1,
      "penalties": 9,
      "penalty yards": 85,
      "punts": 6,
      "punt yards": 250,
      "punt returns": 4,
      "punt return yards": 9,
      "kickoff returns": 2,
      "kickoff return yards": 34,
      "interception returns": 5,
      "interception return yards": 46,
      "3rd down conversions": 7,
      "3rd down attempts": 15,
      "4th down conversions": 0,
      "4th down attempts": 0
    }
  },
  "Duke vs GeorgiaTech": {
    "stadium": "BobbyDoddStadiumatHistoricGrantField-Atlanta-GA",
    "Duke": {
      "points": 28,
      "1st downs": 19,
      "rushing 1st downs": 10,
      "passing 1st downs": 9,
      "penalty 1st downs": 0,
      "rushing yards": 98,
      "rushing attempts": 33,
      "passing yards": 206,
      "passing attempts": 27,
      "passing completions": 17,
      "passing interceptions": 1,
      "total yards": 304,
      "total plays": 60,
      "fumbles": 4,
      "fumbles lost": 2,
      "penalties": 3,
      "penalty yards": 15,
      "punts": 3,
      "punt yards": 150,
      "punt returns": 1,
      "punt return yards": 3,
      "kickoff returns": 2,
      "kickoff return yards": 74,
      "interception returns": 0,
      "interception return yards": 0,
      "3rd down conversions": 5,
      "3rd down attempts": 10,
      "4th down conversions": 0,
      "4th down attempts": 2
    },
    "GeorgiaTech": {
      "points": 14,
      "1st downs": 20,
      "rushing 1st downs": 14,
      "passing 1st downs": 5,
      "penalty 1st downs": 1,
      "rushing yards": 229,
      "rushing attempts": 61,
      "passing yards": 125,
      "passing attempts": 17,
      "passing completions": 7,
      "passing interceptions": 0,
      "total yards": 354,
      "total plays": 78,
      "fumbles": 6,
      "fumbles lost": 3,
      "penalties": 3,
      "penalty yards": 18,
      "punts": 4,
      "punt yards": 185,
      "punt returns": 2,
      "punt return yards": 10,
      "kickoff returns": 3,
      "kickoff return yards": 38,
      "interception returns": 1,
      "interception return yards": 0,
      "3rd down conversions": 8,
      "3rd down attempts": 17,
      "4th down conversions": 1,
      "4th down attempts": 4
    }
  },
  "Louisville vs BostonCollege": {
    "stadium": "AlumniStadium-ChestnutHill-MA",
    "Louisville": {
      "points": 20,
      "1st downs": 15,
      "rushing 1st downs": 4,
      "passing 1st downs": 10,
      "penalty 1st downs": 1,
      "rushing yards": 47,
      "rushing attempts": 32,
      "passing yards": 170,
      "passing attempts": 35,
      "passing completions": 17,
      "passing interceptions": 1,
      "total yards": 217,
      "total plays": 67,
      "fumbles": 0,
      "fumbles lost": 0,
      "penalties": 4,
      "penalty yards": 33,
      "punts": 9,
      "punt yards": 334,
      "punt returns": 2,
      "punt return yards": 4,
      "kickoff returns": 4,
      "kickoff return yards": 90,
      "interception returns": 0,
      "interception return yards": 0,
      "3rd down conversions": 4,
      "3rd down attempts": 16,
      "4th down conversions": 1,
      "4th down attempts": 1
    },
    "BostonCollege": {
      "points": 38,
      "1st downs": 20,
      "rushing 1st downs": 14,
      "passing 1st downs": 6,
      "penalty 1st downs": 0,
      "rushing yards": 251,
      "rushing attempts": 61,
      "passing yards": 179,
      "passing attempts": 22,
      "passing completions": 16,
      "passing interceptions": 0,
      "total yards": 430,
      "total plays": 83,
      "fumbles": 2,
      "fumbles lost": 2,
      "penalties": 7,
      "penalty yards": 60,
      "punts": 4,
      "punt yards": 166,
      "punt returns": 5,
      "punt return yards": 62,
      "kickoff returns": 4,
      "kickoff return yards": 87,
      "interception returns": 1,
      "interception return yards": 1,
      "3rd down conversions": 8,
      "3rd down attempts": 18,
      "4th down conversions": 2,
      "4th down attempts": 4
    }
  },
  "UAB vs Rice": {
    "stadium": "RiceStadium-Houston-TX",
    "UAB": {
      "points": 42,
      "1st downs": 18,
      "rushing 1st downs": 8,
      "passing 1st downs": 8,
      "penalty 1st downs": 2,
      "rushing yards": 208,
      "rushing attempts": 45,
      "passing yards": 274,
      "passing attempts": 19,
      "passing completions": 11,
      "passing interceptions": 1,
      "total yards": 482,
      "total plays": 64,
      "fumbles": 1,
      "fumbles lost": 1,
      "penalties": 2,
      "penalty yards": 30,
      "punts": 6,
      "punt yards": 206,
      "punt returns": 3,
      "punt return yards": 55,
      "kickoff returns": 0,
      "kickoff return yards": 0,
      "interception returns": 0,
      "interception return yards": 0,
      "3rd down conversions": 4,
      "3rd down attempts": 13,
      "4th down conversions": 0,
      "4th down attempts": 1
    },
    "Rice": {
      "points": 0,
      "1st downs": 9,
      "rushing 1st downs": 1,
      "passing 1st downs": 7,
      "penalty 1st downs": 1,
      "rushing yards": 50,
      "rushing attempts": 37,
      "passing yards": 136,
      "passing attempts": 28,
      "passing completions": 13,
      "passing interceptions": 0,
      "total yards": 186,
      "total plays": 65,
      "fumbles": 2,
      "fumbles lost": 1,
      "penalties": 5,
      "penalty yards": 42,
      "punts": 12,
      "punt yards": 588,
      "punt returns": 0,
      "punt return yards": 0,
      "kickoff returns": 0,
      "kickoff return yards": 0,
      "interception returns": 1,
      "interception return yards": 0,
      "3rd down conversions": 1,
      "3rd down attempts": 17,
      "4th down conversions": 0,
      "4th down attempts": 2
    }
  },
  "SouthernMiss vs NorthTexas": {
    "stadium": "ApogeeStadium-Denton-TX",
    "SouthernMiss": {
      "points": 7,
      "1st downs": 20,
      "rushing 1st downs": 4,
      "passing 1st downs": 14,
      "penalty 1st downs": 2,
      "rushing yards": 50,
      "rushing attempts": 28,
      "passing yards": 317,
      "passing attempts": 44,
      "passing completions": 30,
      "passing interceptions": 1,
      "total yards": 367,
      "total plays": 72,
      "fumbles": 2,
      "fumbles lost": 1,
      "penalties": 3,
      "penalty yards": 32,
      "punts": 6,
      "punt yards": 209,
      "punt returns": 1,
      "punt return yards": 7,
      "kickoff returns": 4,
      "kickoff return yards": 79,
      "interception returns": 0,
      "interception return yards": 0,
      "3rd down conversions": 6,
      "3rd down attempts": 15,
      "4th down conversions": 0,
      "4th down attempts": 2
    },
    "NorthTexas": {
      "points": 30,
      "1st downs": 24,
      "rushing 1st downs": 10,
      "passing 1st downs": 13,
      "penalty 1st downs": 1,
      "rushing yards": 165,
      "rushing attempts": 33,
      "passing yards": 292,
      "passing attempts": 38,
      "passing completions": 24,
      "passing interceptions": 0,
      "total yards": 457,
      "total plays": 71,
      "fumbles": 1,
      "fumbles lost": 1,
      "penalties": 5,
      "penalty yards": 55,
      "punts": 6,
      "punt yards": 226,
      "punt returns": 0,
      "punt return yards": 0,
      "kickoff returns": 1,
      "kickoff return yards": 14,
      "interception returns": 1,
      "interception return yards": 23,
      "3rd down conversions": 5,
      "3rd down attempts": 12,
      "4th down conversions": 0,
      "4th down attempts": 0
    }
  },
  "Troy vs Liberty": {
    "stadium": "WilliamsStadium-Lynchburg-VA",
    "Troy": {
      "points": 16,
      "1st downs": 17,
      "rushing 1st downs": 10,
      "passing 1st downs": 5,
      "penalty 1st downs": 2,
      "rushing yards": 133,
      "rushing attempts": 39,
      "passing yards": 160,
      "passing attempts": 30,
      "passing completions": 16,
      "passing interceptions": 1,
      "total yards": 293,
      "total plays": 69,
      "fumbles": 2,
      "fumbles lost": 2,
      "penalties": 10,
      "penalty yards": 65,
      "punts": 5,
      "punt yards": 237,
      "punt returns": 2,
      "punt return yards": 28,
      "kickoff returns": 3,
      "kickoff return yards": 96,
      "interception returns": 1,
      "interception return yards": 1,
      "3rd down conversions": 4,
      "3rd down attempts": 15,
      "4th down conversions": 2,
      "4th down attempts": 3
    },
    "Liberty": {
      "points": 22,
      "1st downs": 17,
      "rushing 1st downs": 4,
      "passing 1st downs": 13,
      "penalty 1st downs": 0,
      "rushing yards": 103,
      "rushing attempts": 45,
      "passing yards": 238,
      "passing attempts": 32,
      "passing completions": 17,
      "passing interceptions": 1,
      "total yards": 341,
      "total plays": 77,
      "fumbles": 0,
      "fumbles lost": 0,
      "penalties": 3,
      "penalty yards": 45,
      "punts": 9,
      "punt yards": 252,
      "punt returns": 1,
      "punt return yards": 0,
      "kickoff returns": 2,
      "kickoff return yards": 39,
      "interception returns": 1,
      "interception return yards": 42,
      "3rd down conversions": 7,
      "3rd down attempts": 19,
      "4th down conversions": 1,
      "4th down attempts": 2
    }
  },
  "KentState vs MiamiOH": {
    "stadium": "FredCYagerStadium-Oxford-OH",
    "KentState": {
      "points": 6,
      "1st downs": 15,
      "rushing 1st downs": 6,
      "passing 1st downs": 7,
      "penalty 1st downs": 2,
      "rushing yards": 125,
      "rushing attempts": 31,
      "passing yards": 149,
      "passing attempts": 29,
      "passing completions": 15,
      "passing interceptions": 1,
      "total yards": 274,
      "total plays": 60,
      "fumbles": 0,
      "fumbles lost": 0,
      "penalties": 10,
      "penalty yards": 70,
      "punts": 9,
      "punt yards": 344,
      "punt returns": 0,
      "punt return yards": 0,
      "kickoff returns": 1,
      "kickoff return yards": 9,
      "interception returns": 0,
      "interception return yards": 0,
      "3rd down conversions": 5,
      "3rd down attempts": 15,
      "4th down conversions": 0,
      "4th down attempts": 0
    },
    "MiamiOH": {
      "points": 31,
      "1st downs": 26,
      "rushing 1st downs": 13,
      "passing 1st downs": 9,
      "penalty 1st downs": 4,
      "rushing yards": 295,
      "rushing attempts": 51,
      "passing yards": 209,
      "passing attempts": 25,
      "passing completions": 16,
      "passing interceptions": 0,
      "total yards": 504,
      "total plays": 76,
      "fumbles": 2,
      "fumbles lost": 1,
      "penalties": 6,
      "penalty yards": 40,
      "punts": 3,
      "punt yards": 97,
      "punt returns": 1,
      "punt return yards": 1,
      "kickoff returns": 0,
      "kickoff return yards": 0,
      "interception returns": 1,
      "interception return yards": 0,
      "3rd down conversions": 5,
      "3rd down attempts": 14,
      "4th down conversions": 2,
      "4th down attempts": 3
    }
  },
  "Pittsburgh vs NotreDame": {
    "stadium": "NotreDameStadium-SouthBend-IN",
    "Pittsburgh": {
      "points": 14,
      "1st downs": 14,
      "rushing 1st downs": 6,
      "passing 1st downs": 6,
      "penalty 1st downs": 2,
      "rushing yards": 116,
      "rushing attempts": 30,
      "passing yards": 126,
      "passing attempts": 30,
      "passing completions": 19,
      "passing interceptions": 0,
      "total yards": 242,
      "total plays": 60,
      "fumbles": 0,
      "fumbles lost": 0,
      "penalties": 8,
      "penalty yards": 80,
      "punts": 4,
      "punt yards": 167,
      "punt returns": 1,
      "punt return yards": -2,
      "kickoff returns": 2,
      "kickoff return yards": 122,
      "interception returns": 2,
      "interception return yards": 24,
      "3rd down conversions": 4,
      "3rd down attempts": 12,
      "4th down conversions": 0,
      "4th down attempts": 2
    },
    "NotreDame": {
      "points": 19,
      "1st downs": 23,
      "rushing 1st downs": 8,
      "passing 1st downs": 12,
      "penalty 1st downs": 3,
      "rushing yards": 80,
      "rushing attempts": 38,
      "passing yards": 264,
      "passing attempts": 32,
      "passing completions": 26,
      "passing interceptions": 2,
      "total yards": 344,
      "total plays": 70,
      "fumbles": 1,
      "fumbles lost": 0,
      "penalties": 4,
      "penalty yards": 35,
      "punts": 3,
      "punt yards": 140,
      "punt returns": 2,
      "punt return yards": 12,
      "kickoff returns": 0,
      "kickoff return yards": 0,
      "interception returns": 0,
      "interception return yards": 0,
      "3rd down conversions": 7,
      "3rd down attempts": 15,
      "4th down conversions": 1,
      "4th down attempts": 2
    }
  },
  "WesternMichigan vs BowlingGreen": {
    "stadium": "DoytLPerryStadium-BowlingGreen-OH",
    "WesternMichigan": {
      "points": 42,
      "1st downs": 33,
      "rushing 1st downs": 18,
      "passing 1st downs": 11,
      "penalty 1st downs": 4,
      "rushing yards": 282,
      "rushing attempts": 54,
      "passing yards": 266,
      "passing attempts": 37,
      "passing completions": 22,
      "passing interceptions": 2,
      "total yards": 548,
      "total plays": 91,
      "fumbles": 1,
      "fumbles lost": 0,
      "penalties": 5,
      "penalty yards": 47,
      "punts": 3,
      "punt yards": 127,
      "punt returns": 2,
      "punt return yards": 7,
      "kickoff returns": 3,
      "kickoff return yards": 67,
      "interception returns": 2,
      "interception return yards": 8,
      "3rd down conversions": 7,
      "3rd down attempts": 16,
      "4th down conversions": 3,
      "4th down attempts": 5
    },
    "BowlingGreen": {
      "points": 35,
      "1st downs": 19,
      "rushing 1st downs": 3,
      "passing 1st downs": 13,
      "penalty 1st downs": 3,
      "rushing yards": 132,
      "rushing attempts": 21,
      "passing yards": 379,
      "passing attempts": 35,
      "passing completions": 21,
      "passing interceptions": 2,
      "total yards": 511,
      "total plays": 56,
      "fumbles": 2,
      "fumbles lost": 2,
      "penalties": 9,
      "penalty yards": 85,
      "punts": 5,
      "punt yards": 199,
      "punt returns": 2,
      "punt return yards": 20,
      "kickoff returns": 5,
      "kickoff return yards": 60,
      "interception returns": 2,
      "interception return yards": 5,
      "3rd down conversions": 4,
      "3rd down attempts": 10,
      "4th down conversions": 0,
      "4th down attempts": 1
    }
  },
  "BallState vs CentralMichigan": {
    "stadium": "KellyShortsStadium-MountPleasant-MI",
    "BallState": {
      "points": 24,
      "1st downs": 27,
      "rushing 1st downs": 11,
      "passing 1st downs": 10,
      "penalty 1st downs": 6,
      "rushing yards": 157,
      "rushing attempts": 51,
      "passing yards": 202,
      "passing attempts": 27,
      "passing completions": 20,
      "passing interceptions": 0,
      "total yards": 359,
      "total plays": 78,
      "fumbles": 1,
      "fumbles lost": 1,
      "penalties": 8,
      "penalty yards": 80,
      "punts": 3,
      "punt yards": 111,
      "punt returns": 2,
      "punt return yards": 20,
      "kickoff returns": 3,
      "kickoff return yards": 36,
      "interception returns": 0,
      "interception return yards": 0,
      "3rd down conversions": 10,
      "3rd down attempts": 17,
      "4th down conversions": 2,
      "4th down attempts": 2
    },
    "CentralMichigan": {
      "points": 23,
      "1st downs": 24,
      "rushing 1st downs": 15,
      "passing 1st downs": 5,
      "penalty 1st downs": 4,
      "rushing yards": 261,
      "rushing attempts": 50,
      "passing yards": 127,
      "passing attempts": 23,
      "passing completions": 11,
      "passing interceptions": 0,
      "total yards": 388,
      "total plays": 73,
      "fumbles": 1,
      "fumbles lost": 0,
      "penalties": 11,
      "penalty yards": 115,
      "punts": 3,
      "punt yards": 122,
      "punt returns": 0,
      "punt return yards": 0,
      "kickoff returns": 3,
      "kickoff return yards": 58,
      "interception returns": 0,
      "interception return yards": 0,
      "3rd down conversions": 7,
      "3rd down attempts": 15,
      "4th down conversions": 0,
      "4th down attempts": 1
    }
  },
  "MichiganState vs PennState": {
    "stadium": "BeaverStadium-UniversityPark-PA",
    "MichiganState": {
      "points": 21,
      "1st downs": 25,
      "rushing 1st downs": 5,
      "passing 1st downs": 17,
      "penalty 1st downs": 3,
      "rushing yards": 123,
      "rushing attempts": 36,
      "passing yards": 295,
      "passing attempts": 53,
      "passing completions": 25,
      "passing interceptions": 1,
      "total yards": 418,
      "total plays": 89,
      "fumbles": 4,
      "fumbles lost": 0,
      "penalties": 3,
      "penalty yards": 20,
      "punts": 10,
      "punt yards": 404,
      "punt returns": 5,
      "punt return yards": 26,
      "kickoff returns": 1,
      "kickoff return yards": 15,
      "interception returns": 0,
      "interception return yards": 0,
      "3rd down conversions": 6,
      "3rd down attempts": 20,
      "4th down conversions": 1,
      "4th down attempts": 2
    },
    "PennState": {
      "points": 17,
      "1st downs": 14,
      "rushing 1st downs": 5,
      "passing 1st downs": 9,
      "penalty 1st downs": 0,
      "rushing yards": 205,
      "rushing attempts": 32,
      "passing yards": 192,
      "passing attempts": 32,
      "passing completions": 19,
      "passing interceptions": 0,
      "total yards": 397,
      "total plays": 64,
      "fumbles": 1,
      "fumbles lost": 1,
      "penalties": 6,
      "penalty yards": 41,
      "punts": 8,
      "punt yards": 364,
      "punt returns": 4,
      "punt return yards": 17,
      "kickoff returns": 3,
      "kickoff return yards": 57,
      "interception returns": 1,
      "interception return yards": 37,
      "3rd down conversions": 3,
      "3rd down attempts": 14,
      "4th down conversions": 0,
      "4th down attempts": 1
    }
  },
  "WesternKentucky vs Charlotte": {
    "stadium": "JerryRichardsonStadium-Charlotte-NC",
    "WesternKentucky": {
      "points": 14,
      "1st downs": 17,
      "rushing 1st downs": 4,
      "passing 1st downs": 11,
      "penalty 1st downs": 2,
      "rushing yards": 42,
      "rushing attempts": 17,
      "passing yards": 214,
      "passing attempts": 39,
      "passing completions": 27,
      "passing interceptions": 2,
      "total yards": 256,
      "total plays": 56,
      "fumbles": 1,
      "fumbles lost": 1,
      "penalties": 7,
      "penalty yards": 55,
      "punts": 4,
      "punt yards": 142,
      "punt returns": 0,
      "punt return yards": 0,
      "kickoff returns": 2,
      "kickoff return yards": 38,
      "interception returns": 0,
      "interception return yards": 0,
      "3rd down conversions": 3,
      "3rd down attempts": 9,
      "4th down conversions": 0,
      "4th down attempts": 1
    },
    "Charlotte": {
      "points": 40,
      "1st downs": 27,
      "rushing 1st downs": 12,
      "passing 1st downs": 12,
      "penalty 1st downs": 3,
      "rushing yards": 211,
      "rushing attempts": 50,
      "passing yards": 237,
      "passing attempts": 26,
      "passing completions": 17,
      "passing interceptions": 0,
      "total yards": 448,
      "total plays": 76,
      "fumbles": 1,
      "fumbles lost": 1,
      "penalties": 4,
      "penalty yards": 30,
      "punts": 1,
      "punt yards": 41,
      "punt returns": 1,
      "punt return yards": 3,
      "kickoff returns": 2,
      "kickoff return yards": 37,
      "interception returns": 2,
      "interception return yards": 27,
      "3rd down conversions": 9,
      "3rd down attempts": 14,
      "4th down conversions": 0,
      "4th down attempts": 0
    }
  },
  "Washington vs Oregon": {
    "stadium": "AutzenStadium-Eugene-OR",
    "Washington": {
      "points": 27,
      "1st downs": 22,
      "rushing 1st downs": 7,
      "passing 1st downs": 13,
      "penalty 1st downs": 2,
      "rushing yards": 194,
      "rushing attempts": 45,
      "passing yards": 243,
      "passing attempts": 25,
      "passing completions": 15,
      "passing interceptions": 1,
      "total yards": 437,
      "total plays": 70,
      "fumbles": 1,
      "fumbles lost": 0,
      "penalties": 5,
      "penalty yards": 38,
      "punts": 3,
      "punt yards": 123,
      "punt returns": 1,
      "punt return yards": 0,
      "kickoff returns": 3,
      "kickoff return yards": 57,
      "interception returns": 0,
      "interception return yards": 0,
      "3rd down conversions": 6,
      "3rd down attempts": 13,
      "4th down conversions": 1,
      "4th down attempts": 2
    },
    "Oregon": {
      "points": 30,
      "1st downs": 24,
      "rushing 1st downs": 11,
      "passing 1st downs": 11,
      "penalty 1st downs": 2,
      "rushing yards": 177,
      "rushing attempts": 49,
      "passing yards": 202,
      "passing attempts": 32,
      "passing completions": 18,
      "passing interceptions": 0,
      "total yards": 379,
      "total plays": 81,
      "fumbles": 2,
      "fumbles lost": 1,
      "penalties": 7,
      "penalty yards": 70,
      "punts": 4,
      "punt yards": 154,
      "punt returns": 1,
      "punt return yards": 0,
      "kickoff returns": 4,
      "kickoff return yards": 108,
      "interception returns": 1,
      "interception return yards": 11,
      "3rd down conversions": 9,
      "3rd down attempts": 18,
      "4th down conversions": 3,
      "4th down attempts": 3
    }
  },
  "Georgia vs LSU": {
    "stadium": "TigerStadium-BatonRouge-LA",
    "Georgia": {
      "points": 16,
      "1st downs": 18,
      "rushing 1st downs": 7,
      "passing 1st downs": 10,
      "penalty 1st downs": 1,
      "rushing yards": 113,
      "rushing attempts": 30,
      "passing yards": 209,
      "passing attempts": 34,
      "passing completions": 16,
      "passing interceptions": 2,
      "total yards": 322,
      "total plays": 64,
      "fumbles": 2,
      "fumbles lost": 2,
      "penalties": 3,
      "penalty yards": 20,
      "punts": 6,
      "punt yards": 213,
      "punt returns": 1,
      "punt return yards": 27,
      "kickoff returns": 1,
      "kickoff return yards": 14,
      "interception returns": 0,
      "interception return yards": 0,
      "3rd down conversions": 5,
      "3rd down attempts": 14,
      "4th down conversions": 0,
      "4th down attempts": 1
    },
    "LSU": {
      "points": 36,
      "1st downs": 20,
      "rushing 1st downs": 10,
      "passing 1st downs": 9,
      "penalty 1st downs": 1,
      "rushing yards": 275,
      "rushing attempts": 51,
      "passing yards": 200,
      "passing attempts": 30,
      "passing completions": 15,
      "passing interceptions": 0,
      "total yards": 475,
      "total plays": 81,
      "fumbles": 0,
      "fumbles lost": 0,
      "penalties": 2,
      "penalty yards": 19,
      "punts": 4,
      "punt yards": 164,
      "punt returns": 0,
      "punt return yards": 0,
      "kickoff returns": 1,
      "kickoff return yards": 7,
      "interception returns": 2,
      "interception return yards": 0,
      "3rd down conversions": 6,
      "3rd down attempts": 19,
      "4th down conversions": 4,
      "4th down attempts": 4
    }
  },
  "Temple vs Navy": {
    "stadium": "NavyMarineCorpsMemorialStadium-Annapolis-MD",
    "Temple": {
      "points": 24,
      "1st downs": 22,
      "rushing 1st downs": 8,
      "passing 1st downs": 11,
      "penalty 1st downs": 3,
      "rushing yards": 109,
      "rushing attempts": 34,
      "passing yards": 300,
      "passing attempts": 32,
      "passing completions": 23,
      "passing interceptions": 1,
      "total yards": 409,
      "total plays": 66,
      "fumbles": 2,
      "fumbles lost": 1,
      "penalties": 7,
      "penalty yards": 63,
      "punts": 2,
      "punt yards": 75,
      "punt returns": 1,
      "punt return yards": 10,
      "kickoff returns": 4,
      "kickoff return yards": 95,
      "interception returns": 0,
      "interception return yards": 0,
      "3rd down conversions": 4,
      "3rd down attempts": 11,
      "4th down conversions": 1,
      "4th down attempts": 1
    },
    "Navy": {
      "points": 17,
      "1st downs": 18,
      "rushing 1st downs": 14,
      "passing 1st downs": 1,
      "penalty 1st downs": 3,
      "rushing yards": 270,
      "rushing attempts": 53,
      "passing yards": 14,
      "passing attempts": 11,
      "passing completions": 3,
      "passing interceptions": 0,
      "total yards": 284,
      "total plays": 64,
      "fumbles": 2,
      "fumbles lost": 1,
      "penalties": 6,
      "penalty yards": 40,
      "punts": 3,
      "punt yards": 117,
      "punt returns": 1,
      "punt return yards": 3,
      "kickoff returns": 1,
      "kickoff return yards": 19,
      "interception returns": 1,
      "interception return yards": 0,
      "3rd down conversions": 5,
      "3rd down attempts": 13,
      "4th down conversions": 1,
      "4th down attempts": 3
    }
  },
  "Purdue vs Illinois": {
    "stadium": "MemorialStadiumChampaign-IL-Champaign",
    "Purdue": {
      "points": 46,
      "1st downs": 29,
      "rushing 1st downs": 11,
      "passing 1st downs": 14,
      "penalty 1st downs": 4,
      "rushing yards": 227,
      "rushing attempts": 44,
      "passing yards": 384,
      "passing attempts": 37,
      "passing completions": 26,
      "passing interceptions": 1,
      "total yards": 611,
      "total plays": 81,
      "fumbles": 1,
      "fumbles lost": 0,
      "penalties": 5,
      "penalty yards": 45,
      "punts": 2,
      "punt yards": 94,
      "punt returns": 2,
      "punt return yards": 6,
      "kickoff returns": 0,
      "kickoff return yards": 0,
      "interception returns": 1,
      "interception return yards": 10,
      "3rd down conversions": 7,
      "3rd down attempts": 15,
      "4th down conversions": 0,
      "4th down attempts": 1
    },
    "Illinois": {
      "points": 7,
      "1st downs": 14,
      "rushing 1st downs": 7,
      "passing 1st downs": 7,
      "penalty 1st downs": 0,
      "rushing yards": 69,
      "rushing attempts": 31,
      "passing yards": 181,
      "passing attempts": 29,
      "passing completions": 15,
      "passing interceptions": 1,
      "total yards": 250,
      "total plays": 60,
      "fumbles": 0,
      "fumbles lost": 0,
      "penalties": 7,
      "penalty yards": 57,
      "punts": 9,
      "punt yards": 391,
      "punt returns": 2,
      "punt return yards": 1,
      "kickoff returns": 3,
      "kickoff return yards": 50,
      "interception returns": 1,
      "interception return yards": 2,
      "3rd down conversions": 3,
      "3rd down attempts": 13,
      "4th down conversions": 0,
      "4th down attempts": 0
    }
  },
  "UCF vs Memphis": {
    "stadium": "LibertyBowlMemorialStadium-Memphis-TN",
    "UCF": {
      "points": 31,
      "1st downs": 18,
      "rushing 1st downs": 6,
      "passing 1st downs": 11,
      "penalty 1st downs": 1,
      "rushing yards": 165,
      "rushing attempts": 37,
      "passing yards": 296,
      "passing attempts": 29,
      "passing completions": 17,
      "passing interceptions": 0,
      "total yards": 461,
      "total plays": 66,
      "fumbles": 3,
      "fumbles lost": 1,
      "penalties": 12,
      "penalty yards": 103,
      "punts": 7,
      "punt yards": 295,
      "punt returns": 1,
      "punt return yards": 1,
      "kickoff returns": 3,
      "kickoff return yards": 73,
      "interception returns": 0,
      "interception return yards": 0,
      "3rd down conversions": 2,
      "3rd down attempts": 12,
      "4th down conversions": 2,
      "4th down attempts": 3
    },
    "Memphis": {
      "points": 30,
      "1st downs": 27,
      "rushing 1st downs": 14,
      "passing 1st downs": 10,
      "penalty 1st downs": 3,
      "rushing yards": 281,
      "rushing attempts": 52,
      "passing yards": 209,
      "passing attempts": 29,
      "passing completions": 17,
      "passing interceptions": 0,
      "total yards": 490,
      "total plays": 81,
      "fumbles": 3,
      "fumbles lost": 2,
      "penalties": 7,
      "penalty yards": 43,
      "punts": 5,
      "punt yards": 216,
      "punt returns": 2,
      "punt return yards": 26,
      "kickoff returns": 4,
      "kickoff return yards": 52,
      "interception returns": 0,
      "interception return yards": 0,
      "3rd down conversions": 7,
      "3rd down attempts": 16,
      "4th down conversions": 1,
      "4th down attempts": 1
    }
  },
  "Ohio vs NorthernIllinois": {
    "stadium": "BrighamFieldatHuskieStadium-DeKalb-IL",
    "Ohio": {
      "points": 21,
      "1st downs": 19,
      "rushing 1st downs": 3,
      "passing 1st downs": 9,
      "penalty 1st downs": 7,
      "rushing yards": 46,
      "rushing attempts": 32,
      "passing yards": 275,
      "passing attempts": 23,
      "passing completions": 15,
      "passing interceptions": 1,
      "total yards": 321,
      "total plays": 55,
      "fumbles": 3,
      "fumbles lost": 2,
      "penalties": 6,
      "penalty yards": 59,
      "punts": 5,
      "punt yards": 199,
      "punt returns": 0,
      "punt return yards": 0,
      "kickoff returns": 1,
      "kickoff return yards": 23,
      "interception returns": 0,
      "interception return yards": 0,
      "3rd down conversions": 3,
      "3rd down attempts": 9,
      "4th down conversions": 0,
      "4th down attempts": 0
    },
    "NorthernIllinois": {
      "points": 24,
      "1st downs": 25,
      "rushing 1st downs": 13,
      "passing 1st downs": 10,
      "penalty 1st downs": 2,
      "rushing yards": 255,
      "rushing attempts": 46,
      "passing yards": 145,
      "passing attempts": 33,
      "passing completions": 17,
      "passing interceptions": 0,
      "total yards": 400,
      "total plays": 79,
      "fumbles": 0,
      "fumbles lost": 0,
      "penalties": 12,
      "penalty yards": 109,
      "punts": 7,
      "punt yards": 271,
      "punt returns": 2,
      "punt return yards": 1,
      "kickoff returns": 2,
      "kickoff return yards": 11,
      "interception returns": 1,
      "interception return yards": 17,
      "3rd down conversions": 7,
      "3rd down attempts": 16,
      "4th down conversions": 1,
      "4th down attempts": 1
    }
  },
  "Marshall vs OldDominion": {
    "stadium": "ForemanFieldatSBBallardStadium-Norfolk-VA",
    "Marshall": {
      "points": 42,
      "1st downs": 24,
      "rushing 1st downs": 13,
      "passing 1st downs": 9,
      "penalty 1st downs": 2,
      "rushing yards": 319,
      "rushing attempts": 45,
      "passing yards": 182,
      "passing attempts": 29,
      "passing completions": 18,
      "passing interceptions": 1,
      "total yards": 501,
      "total plays": 74,
      "fumbles": 0,
      "fumbles lost": 0,
      "penalties": 8,
      "penalty yards": 101,
      "punts": 5,
      "punt yards": 232,
      "punt returns": 2,
      "punt return yards": 39,
      "kickoff returns": 2,
      "kickoff return yards": 34,
      "interception returns": 1,
      "interception return yards": 0,
      "3rd down conversions": 6,
      "3rd down attempts": 13,
      "4th down conversions": 1,
      "4th down attempts": 2
    },
    "OldDominion": {
      "points": 20,
      "1st downs": 25,
      "rushing 1st downs": 6,
      "passing 1st downs": 15,
      "penalty 1st downs": 4,
      "rushing yards": 106,
      "rushing attempts": 31,
      "passing yards": 296,
      "passing attempts": 54,
      "passing completions": 31,
      "passing interceptions": 1,
      "total yards": 402,
      "total plays": 85,
      "fumbles": 2,
      "fumbles lost": 1,
      "penalties": 7,
      "penalty yards": 70,
      "punts": 6,
      "punt yards": 261,
      "punt returns": 1,
      "punt return yards": 4,
      "kickoff returns": 6,
      "kickoff return yards": 114,
      "interception returns": 1,
      "interception return yards": 14,
      "3rd down conversions": 9,
      "3rd down attempts": 20,
      "4th down conversions": 1,
      "4th down attempts": 2
    }
  },
  "Baylor vs Texas": {
    "stadium": "DarrellKRoyalTexasMemorialStadium-Austin-TX",
    "Baylor": {
      "points": 17,
      "1st downs": 19,
      "rushing 1st downs": 8,
      "passing 1st downs": 10,
      "penalty 1st downs": 1,
      "rushing yards": 88,
      "rushing attempts": 34,
      "passing yards": 240,
      "passing attempts": 40,
      "passing completions": 20,
      "passing interceptions": 1,
      "total yards": 328,
      "total plays": 74,
      "fumbles": 1,
      "fumbles lost": 0,
      "penalties": 10,
      "penalty yards": 92,
      "punts": 7,
      "punt yards": 303,
      "punt returns": 0,
      "punt return yards": 0,
      "kickoff returns": 0,
      "kickoff return yards": 0,
      "interception returns": 1,
      "interception return yards": 0,
      "3rd down conversions": 8,
      "3rd down attempts": 17,
      "4th down conversions": 0,
      "4th down attempts": 0
    },
    "Texas": {
      "points": 23,
      "1st downs": 25,
      "rushing 1st downs": 9,
      "passing 1st downs": 13,
      "penalty 1st downs": 3,
      "rushing yards": 170,
      "rushing attempts": 41,
      "passing yards": 219,
      "passing attempts": 39,
      "passing completions": 24,
      "passing interceptions": 1,
      "total yards": 389,
      "total plays": 80,
      "fumbles": 0,
      "fumbles lost": 0,
      "penalties": 8,
      "penalty yards": 56,
      "punts": 4,
      "punt yards": 191,
      "punt returns": 3,
      "punt return yards": -5,
      "kickoff returns": 0,
      "kickoff return yards": 0,
      "interception returns": 1,
      "interception return yards": 0,
      "3rd down conversions": 9,
      "3rd down attempts": 18,
      "4th down conversions": 1,
      "4th down attempts": 1
    }
  },
  "TexasAM vs SouthCarolina": {
    "stadium": "WilliamsBriceStadium-Columbia-SC",
    "TexasAM": {
      "points": 26,
      "1st downs": 25,
      "rushing 1st downs": 9,
      "passing 1st downs": 15,
      "penalty 1st downs": 1,
      "rushing yards": 105,
      "rushing attempts": 40,
      "passing yards": 353,
      "passing attempts": 37,
      "passing completions": 25,
      "passing interceptions": 0,
      "total yards": 458,
      "total plays": 77,
      "fumbles": 0,
      "fumbles lost": 0,
      "penalties": 12,
      "penalty yards": 117,
      "punts": 4,
      "punt yards": 209,
      "punt returns": 2,
      "punt return yards": 15,
      "kickoff returns": 2,
      "kickoff return yards": 48,
      "interception returns": 1,
      "interception return yards": 0,
      "3rd down conversions": 3,
      "3rd down attempts": 13,
      "4th down conversions": 0,
      "4th down attempts": 0
    },
    "SouthCarolina": {
      "points": 23,
      "1st downs": 19,
      "rushing 1st downs": 6,
      "passing 1st downs": 8,
      "penalty 1st downs": 5,
      "rushing yards": 76,
      "rushing attempts": 18,
      "passing yards": 223,
      "passing attempts": 35,
      "passing completions": 17,
      "passing interceptions": 1,
      "total yards": 299,
      "total plays": 53,
      "fumbles": 1,
      "fumbles lost": 1,
      "penalties": 4,
      "penalty yards": 39,
      "punts": 6,
      "punt yards": 304,
      "punt returns": 2,
      "punt return yards": 34,
      "kickoff returns": 2,
      "kickoff return yards": 32,
      "interception returns": 0,
      "interception return yards": 0,
      "3rd down conversions": 2,
      "3rd down attempts": 9,
      "4th down conversions": 1,
      "4th down attempts": 1
    }
  },
  "Army vs SanJoseState": {
    "stadium": "LevisStadium-SantaClara-CA",
    "Army": {
      "points": 52,
      "1st downs": 24,
      "rushing 1st downs": 19,
      "passing 1st downs": 2,
      "penalty 1st downs": 3,
      "rushing yards": 341,
      "rushing attempts": 65,
      "passing yards": 54,
      "passing attempts": 5,
      "passing completions": 2,
      "passing interceptions": 0,
      "total yards": 395,
      "total plays": 70,
      "fumbles": 0,
      "fumbles lost": 0,
      "penalties": 3,
      "penalty yards": 15,
      "punts": 2,
      "punt yards": 69,
      "punt returns": 2,
      "punt return yards": 34,
      "kickoff returns": 0,
      "kickoff return yards": 0,
      "interception returns": 0,
      "interception return yards": 0,
      "3rd down conversions": 10,
      "3rd down attempts": 16,
      "4th down conversions": 3,
      "4th down attempts": 3
    },
    "SanJoseState": {
      "points": 3,
      "1st downs": 10,
      "rushing 1st downs": 3,
      "passing 1st downs": 7,
      "penalty 1st downs": 0,
      "rushing yards": 36,
      "rushing attempts": 30,
      "passing yards": 135,
      "passing attempts": 18,
      "passing completions": 13,
      "passing interceptions": 0,
      "total yards": 171,
      "total plays": 48,
      "fumbles": 4,
      "fumbles lost": 4,
      "penalties": 7,
      "penalty yards": 55,
      "punts": 5,
      "punt yards": 207,
      "punt returns": 0,
      "punt return yards": 0,
      "kickoff returns": 6,
      "kickoff return yards": 108,
      "interception returns": 0,
      "interception return yards": 0,
      "3rd down conversions": 4,
      "3rd down attempts": 11,
      "4th down conversions": 0,
      "4th down attempts": 0
    }
  },
  "UNLV vs UtahState": {
    "stadium": "MerlinOlsenFieldatMaverikStadium-Logan-UT",
    "UNLV": {
      "points": 28,
      "1st downs": 21,
      "rushing 1st downs": 8,
      "passing 1st downs": 10,
      "penalty 1st downs": 3,
      "rushing yards": 154,
      "rushing attempts": 48,
      "passing yards": 250,
      "passing attempts": 36,
      "passing completions": 18,
      "passing interceptions": 1,
      "total yards": 404,
      "total plays": 84,
      "fumbles": 1,
      "fumbles lost": 0,
      "penalties": 9,
      "penalty yards": 70,
      "punts": 8,
      "punt yards": 315,
      "punt returns": 0,
      "punt return yards": 0,
      "kickoff returns": 3,
      "kickoff return yards": 52,
      "interception returns": 0,
      "interception return yards": 0,
      "3rd down conversions": 8,
      "3rd down attempts": 21,
      "4th down conversions": 1,
      "4th down attempts": 2
    },
    "UtahState": {
      "points": 59,
      "1st downs": 24,
      "rushing 1st downs": 9,
      "passing 1st downs": 14,
      "penalty 1st downs": 1,
      "rushing yards": 221,
      "rushing attempts": 38,
      "passing yards": 377,
      "passing attempts": 31,
      "passing completions": 22,
      "passing interceptions": 0,
      "total yards": 598,
      "total plays": 69,
      "fumbles": 1,
      "fumbles lost": 1,
      "penalties": 5,
      "penalty yards": 55,
      "punts": 4,
      "punt yards": 176,
      "punt returns": 7,
      "punt return yards": 55,
      "kickoff returns": 1,
      "kickoff return yards": 5,
      "interception returns": 1,
      "interception return yards": 0,
      "3rd down conversions": 7,
      "3rd down attempts": 14,
      "4th down conversions": 0,
      "4th down attempts": 0
    }
  },
  "NewMexico vs ColoradoState": {
    "stadium": "SonnyLubickFieldatColoradoStateStadium-FortCollins-CO",
    "NewMexico": {
      "points": 18,
      "1st downs": 16,
      "rushing 1st downs": 7,
      "passing 1st downs": 7,
      "penalty 1st downs": 2,
      "rushing yards": 134,
      "rushing attempts": 35,
      "passing yards": 165,
      "passing attempts": 20,
      "passing completions": 12,
      "passing interceptions": 0,
      "total yards": 299,
      "total plays": 55,
      "fumbles": 2,
      "fumbles lost": 1,
      "penalties": 6,
      "penalty yards": 45,
      "punts": 6,
      "punt yards": 267,
      "punt returns": 2,
      "punt return yards": 56,
      "kickoff returns": 3,
      "kickoff return yards": 60,
      "interception returns": 0,
      "interception return yards": 0,
      "3rd down conversions": 3,
      "3rd down attempts": 11,
      "4th down conversions": 0,
      "4th down attempts": 1
    },
    "ColoradoState": {
      "points": 20,
      "1st downs": 24,
      "rushing 1st downs": 10,
      "passing 1st downs": 12,
      "penalty 1st downs": 2,
      "rushing yards": 112,
      "rushing attempts": 41,
      "passing yards": 311,
      "passing attempts": 42,
      "passing completions": 24,
      "passing interceptions": 0,
      "total yards": 423,
      "total plays": 83,
      "fumbles": 0,
      "fumbles lost": 0,
      "penalties": 10,
      "penalty yards": 75,
      "punts": 6,
      "punt yards": 329,
      "punt returns": 1,
      "punt return yards": 15,
      "kickoff returns": 1,
      "kickoff return yards": 23,
      "interception returns": 0,
      "interception return yards": 0,
      "3rd down conversions": 7,
      "3rd down attempts": 18,
      "4th down conversions": 1,
      "4th down attempts": 1
    }
  },
  "FCS vs SouthAlabama": {
    "stadium": "LaddPeeblesStadium-Mobile-AL",
    "FCS": {
      "points": 7,
      "1st downs": 11,
      "rushing 1st downs": 5,
      "passing 1st downs": 4,
      "penalty 1st downs": 2,
      "rushing yards": 85,
      "rushing attempts": 32,
      "passing yards": 134,
      "passing attempts": 19,
      "passing completions": 10,
      "passing interceptions": 0,
      "total yards": 219,
      "total plays": 51,
      "fumbles": 2,
      "fumbles lost": 0,
      "penalties": 13,
      "penalty yards": 83,
      "punts": 7,
      "punt yards": 321,
      "punt returns": 0,
      "punt return yards": 0,
      "kickoff returns": 5,
      "kickoff return yards": 97,
      "interception returns": 0,
      "interception return yards": 0,
      "3rd down conversions": 4,
      "3rd down attempts": 13,
      "4th down conversions": 0,
      "4th down attempts": 1
    },
    "SouthAlabama": {
      "points": 45,
      "1st downs": 21,
      "rushing 1st downs": 13,
      "passing 1st downs": 7,
      "penalty 1st downs": 1,
      "rushing yards": 185,
      "rushing attempts": 44,
      "passing yards": 211,
      "passing attempts": 17,
      "passing completions": 13,
      "passing interceptions": 0,
      "total yards": 396,
      "total plays": 61,
      "fumbles": 0,
      "fumbles lost": 0,
      "penalties": 7,
      "penalty yards": 75,
      "punts": 3,
      "punt yards": 139,
      "punt returns": 3,
      "punt return yards": 88,
      "kickoff returns": 2,
      "kickoff return yards": 73,
      "interception returns": 0,
      "interception return yards": 0,
      "3rd down conversions": 8,
      "3rd down attempts": 12,
      "4th down conversions": 0,
      "4th down attempts": 0
    }
  },
  "NewMexicoState vs LouisianaLafayette": {
    "stadium": "CajunField-Lafayette-LA",
    "NewMexicoState": {
      "points": 38,
      "1st downs": 26,
      "rushing 1st downs": 7,
      "passing 1st downs": 15,
      "penalty 1st downs": 4,
      "rushing yards": 122,
      "rushing attempts": 25,
      "passing yards": 284,
      "passing attempts": 44,
      "passing completions": 25,
      "passing interceptions": 1,
      "total yards": 406,
      "total plays": 69,
      "fumbles": 1,
      "fumbles lost": 1,
      "penalties": 2,
      "penalty yards": 30,
      "punts": 2,
      "punt yards": 71,
      "punt returns": 0,
      "punt return yards": 0,
      "kickoff returns": 5,
      "kickoff return yards": 176,
      "interception returns": 0,
      "interception return yards": 0,
      "3rd down conversions": 7,
      "3rd down attempts": 13,
      "4th down conversions": 0,
      "4th down attempts": 2
    },
    "LouisianaLafayette": {
      "points": 66,
      "1st downs": 37,
      "rushing 1st downs": 17,
      "passing 1st downs": 18,
      "penalty 1st downs": 2,
      "rushing yards": 344,
      "rushing attempts": 56,
      "passing yards": 415,
      "passing attempts": 29,
      "passing completions": 22,
      "passing interceptions": 0,
      "total yards": 759,
      "total plays": 85,
      "fumbles": 0,
      "fumbles lost": 0,
      "penalties": 7,
      "penalty yards": 72,
      "punts": 1,
      "punt yards": 35,
      "punt returns": 1,
      "punt return yards": 1,
      "kickoff returns": 4,
      "kickoff return yards": 101,
      "interception returns": 1,
      "interception return yards": 0,
      "3rd down conversions": 12,
      "3rd down attempts": 14,
      "4th down conversions": 0,
      "4th down attempts": 0
    }
  },
  "LouisianaMonroe vs CoastalCarolina": {
    "stadium": "BrooksStadium-Conway-SC",
    "LouisianaMonroe": {
      "points": 45,
      "1st downs": 20,
      "rushing 1st downs": 11,
      "passing 1st downs": 8,
      "penalty 1st downs": 1,
      "rushing yards": 242,
      "rushing attempts": 34,
      "passing yards": 224,
      "passing attempts": 22,
      "passing completions": 16,
      "passing interceptions": 0,
      "total yards": 466,
      "total plays": 56,
      "fumbles": 1,
      "fumbles lost": 1,
      "penalties": 2,
      "penalty yards": 25,
      "punts": 3,
      "punt yards": 114,
      "punt returns": 1,
      "punt return yards": 17,
      "kickoff returns": 3,
      "kickoff return yards": 67,
      "interception returns": 1,
      "interception return yards": 0,
      "3rd down conversions": 8,
      "3rd down attempts": 12,
      "4th down conversions": 0,
      "4th down attempts": 0
    },
    "CoastalCarolina": {
      "points": 20,
      "1st downs": 20,
      "rushing 1st downs": 13,
      "passing 1st downs": 6,
      "penalty 1st downs": 1,
      "rushing yards": 272,
      "rushing attempts": 53,
      "passing yards": 163,
      "passing attempts": 23,
      "passing completions": 12,
      "passing interceptions": 1,
      "total yards": 435,
      "total plays": 76,
      "fumbles": 4,
      "fumbles lost": 2,
      "penalties": 8,
      "penalty yards": 72,
      "punts": 3,
      "punt yards": 130,
      "punt returns": 1,
      "punt return yards": 2,
      "kickoff returns": 4,
      "kickoff return yards": 56,
      "interception returns": 0,
      "interception return yards": 0,
      "3rd down conversions": 9,
      "3rd down attempts": 17,
      "4th down conversions": 2,
      "4th down attempts": 3
    }
  },
  "UCLA vs California": {
    "stadium": "CaliforniaMemorialStadium-Berkeley-CA",
    "UCLA": {
      "points": 37,
      "1st downs": 20,
      "rushing 1st downs": 12,
      "passing 1st downs": 6,
      "penalty 1st downs": 2,
      "rushing yards": 207,
      "rushing attempts": 55,
      "passing yards": 141,
      "passing attempts": 15,
      "passing completions": 13,
      "passing interceptions": 0,
      "total yards": 348,
      "total plays": 70,
      "fumbles": 1,
      "fumbles lost": 0,
      "penalties": 4,
      "penalty yards": 30,
      "punts": 4,
      "punt yards": 165,
      "punt returns": 1,
      "punt return yards": 40,
      "kickoff returns": 1,
      "kickoff return yards": 16,
      "interception returns": 2,
      "interception return yards": 0,
      "3rd down conversions": 5,
      "3rd down attempts": 14,
      "4th down conversions": 1,
      "4th down attempts": 2
    },
    "California": {
      "points": 7,
      "1st downs": 20,
      "rushing 1st downs": 10,
      "passing 1st downs": 9,
      "penalty 1st downs": 1,
      "rushing yards": 131,
      "rushing attempts": 33,
      "passing yards": 179,
      "passing attempts": 42,
      "passing completions": 23,
      "passing interceptions": 2,
      "total yards": 310,
      "total plays": 75,
      "fumbles": 4,
      "fumbles lost": 3,
      "penalties": 3,
      "penalty yards": 36,
      "punts": 4,
      "punt yards": 176,
      "punt returns": 2,
      "punt return yards": 26,
      "kickoff returns": 4,
      "kickoff return yards": 61,
      "interception returns": 0,
      "interception return yards": 0,
      "3rd down conversions": 3,
      "3rd down attempts": 14,
      "4th down conversions": 1,
      "4th down attempts": 5
    }
  },
  "WestVirginia vs IowaState": {
    "stadium": "JackTriceStadium-Ames-IA",
    "WestVirginia": {
      "points": 14,
      "1st downs": 9,
      "rushing 1st downs": 7,
      "passing 1st downs": 2,
      "penalty 1st downs": 0,
      "rushing yards": 52,
      "rushing attempts": 27,
      "passing yards": 100,
      "passing attempts": 15,
      "passing completions": 11,
      "passing interceptions": 1,
      "total yards": 152,
      "total plays": 42,
      "fumbles": 0,
      "fumbles lost": 0,
      "penalties": 9,
      "penalty yards": 103,
      "punts": 8,
      "punt yards": 332,
      "punt returns": 1,
      "punt return yards": 14,
      "kickoff returns": 2,
      "kickoff return yards": 31,
      "interception returns": 1,
      "interception return yards": 3,
      "3rd down conversions": 1,
      "3rd down attempts": 10,
      "4th down conversions": 0,
      "4th down attempts": 0
    },
    "IowaState": {
      "points": 30,
      "1st downs": 25,
      "rushing 1st downs": 10,
      "passing 1st downs": 11,
      "penalty 1st downs": 4,
      "rushing yards": 244,
      "rushing attempts": 47,
      "passing yards": 254,
      "passing attempts": 25,
      "passing completions": 18,
      "passing interceptions": 1,
      "total yards": 498,
      "total plays": 72,
      "fumbles": 1,
      "fumbles lost": 0,
      "penalties": 10,
      "penalty yards": 95,
      "punts": 4,
      "punt yards": 174,
      "punt returns": 1,
      "punt return yards": 21,
      "kickoff returns": 3,
      "kickoff return yards": 28,
      "interception returns": 1,
      "interception return yards": 0,
      "3rd down conversions": 5,
      "3rd down attempts": 13,
      "4th down conversions": 2,
      "4th down attempts": 2
    }
  },
  "Houston vs EastCarolina": {
    "stadium": "BagwellFieldatDowdyFicklenStadium-Greenville-NC",
    "Houston": {
      "points": 42,
      "1st downs": 18,
      "rushing 1st downs": 8,
      "passing 1st downs": 8,
      "penalty 1st downs": 2,
      "rushing yards": 157,
      "rushing attempts": 43,
      "passing yards": 249,
      "passing attempts": 28,
      "passing completions": 16,
      "passing interceptions": 0,
      "total yards": 406,
      "total plays": 71,
      "fumbles": 1,
      "fumbles lost": 0,
      "penalties": 12,
      "penalty yards": 115,
      "punts": 10,
      "punt yards": 430,
      "punt returns": 1,
      "punt return yards": 22,
      "kickoff returns": 1,
      "kickoff return yards": 5,
      "interception returns": 3,
      "interception return yards": 13,
      "3rd down conversions": 4,
      "3rd down attempts": 14,
      "4th down conversions": 0,
      "4th down attempts": 0
    },
    "EastCarolina": {
      "points": 20,
      "1st downs": 27,
      "rushing 1st downs": 4,
      "passing 1st downs": 20,
      "penalty 1st downs": 3,
      "rushing yards": 41,
      "rushing attempts": 31,
      "passing yards": 374,
      "passing attempts": 63,
      "passing completions": 38,
      "passing interceptions": 3,
      "total yards": 415,
      "total plays": 94,
      "fumbles": 1,
      "fumbles lost": 1,
      "penalties": 8,
      "penalty yards": 69,
      "punts": 7,
      "punt yards": 282,
      "punt returns": 1,
      "punt return yards": 0,
      "kickoff returns": 3,
      "kickoff return yards": 65,
      "interception returns": 0,
      "interception return yards": 0,
      "3rd down conversions": 9,
      "3rd down attempts": 21,
      "4th down conversions": 1,
      "4th down attempts": 1
    }
  },
  "LouisianaTech vs UTSA": {
    "stadium": "Alamodome-SanAntonio-TX",
    "LouisianaTech": {
      "points": 31,
      "1st downs": 21,
      "rushing 1st downs": 6,
      "passing 1st downs": 14,
      "penalty 1st downs": 1,
      "rushing yards": 75,
      "rushing attempts": 38,
      "passing yards": 309,
      "passing attempts": 37,
      "passing completions": 25,
      "passing interceptions": 1,
      "total yards": 384,
      "total plays": 75,
      "fumbles": 1,
      "fumbles lost": 1,
      "penalties": 4,
      "penalty yards": 40,
      "punts": 4,
      "punt yards": 177,
      "punt returns": 1,
      "punt return yards": -4,
      "kickoff returns": 2,
      "kickoff return yards": 63,
      "interception returns": 1,
      "interception return yards": 19,
      "3rd down conversions": 8,
      "3rd down attempts": 15,
      "4th down conversions": 1,
      "4th down attempts": 1
    },
    "UTSA": {
      "points": 3,
      "1st downs": 16,
      "rushing 1st downs": 6,
      "passing 1st downs": 9,
      "penalty 1st downs": 1,
      "rushing yards": 85,
      "rushing attempts": 23,
      "passing yards": 201,
      "passing attempts": 40,
      "passing completions": 19,
      "passing interceptions": 1,
      "total yards": 286,
      "total plays": 63,
      "fumbles": 1,
      "fumbles lost": 1,
      "penalties": 4,
      "penalty yards": 47,
      "punts": 6,
      "punt yards": 242,
      "punt returns": 2,
      "punt return yards": 6,
      "kickoff returns": 4,
      "kickoff return yards": 86,
      "interception returns": 1,
      "interception return yards": -2,
      "3rd down conversions": 3,
      "3rd down attempts": 12,
      "4th down conversions": 0,
      "4th down attempts": 1
    }
  },
  "VirginiaTech vs NorthCarolina": {
    "stadium": "KenanMemorialStadium-ChapelHill-NC",
    "VirginiaTech": {
      "points": 22,
      "1st downs": 20,
      "rushing 1st downs": 8,
      "passing 1st downs": 12,
      "penalty 1st downs": 0,
      "rushing yards": 154,
      "rushing attempts": 41,
      "passing yards": 221,
      "passing attempts": 36,
      "passing completions": 20,
      "passing interceptions": 2,
      "total yards": 375,
      "total plays": 77,
      "fumbles": 1,
      "fumbles lost": 0,
      "penalties": 8,
      "penalty yards": 59,
      "punts": 7,
      "punt yards": 301,
      "punt returns": 1,
      "punt return yards": 0,
      "kickoff returns": 3,
      "kickoff return yards": 68,
      "interception returns": 0,
      "interception return yards": 0,
      "3rd down conversions": 8,
      "3rd down attempts": 17,
      "4th down conversions": 1,
      "4th down attempts": 1
    },
    "NorthCarolina": {
      "points": 19,
      "1st downs": 21,
      "rushing 1st downs": 6,
      "passing 1st downs": 12,
      "penalty 1st downs": 3,
      "rushing yards": 235,
      "rushing attempts": 38,
      "passing yards": 287,
      "passing attempts": 35,
      "passing completions": 22,
      "passing interceptions": 0,
      "total yards": 522,
      "total plays": 73,
      "fumbles": 4,
      "fumbles lost": 2,
      "penalties": 7,
      "penalty yards": 35,
      "punts": 2,
      "punt yards": 73,
      "punt returns": 3,
      "punt return yards": 51,
      "kickoff returns": 0,
      "kickoff return yards": 0,
      "interception returns": 2,
      "interception return yards": 17,
      "3rd down conversions": 6,
      "3rd down attempts": 15,
      "4th down conversions": 0,
      "4th down attempts": 1
    }
  },
  "MiamiFL vs Virginia": {
    "stadium": "ScottStadium-Charlottesville-VA",
    "MiamiFL": {
      "points": 13,
      "1st downs": 17,
      "rushing 1st downs": 6,
      "passing 1st downs": 9,
      "penalty 1st downs": 2,
      "rushing yards": 149,
      "rushing attempts": 29,
      "passing yards": 190,
      "passing attempts": 29,
      "passing completions": 15,
      "passing interceptions": 3,
      "total yards": 339,
      "total plays": 58,
      "fumbles": 0,
      "fumbles lost": 0,
      "penalties": 8,
      "penalty yards": 71,
      "punts": 3,
      "punt yards": 131,
      "punt returns": 0,
      "punt return yards": 0,
      "kickoff returns": 2,
      "kickoff return yards": 46,
      "interception returns": 3,
      "interception return yards": 27,
      "3rd down conversions": 5,
      "3rd down attempts": 12,
      "4th down conversions": 0,
      "4th down attempts": 2
    },
    "Virginia": {
      "points": 16,
      "1st downs": 18,
      "rushing 1st downs": 12,
      "passing 1st downs": 3,
      "penalty 1st downs": 3,
      "rushing yards": 139,
      "rushing attempts": 41,
      "passing yards": 92,
      "passing attempts": 21,
      "passing completions": 12,
      "passing interceptions": 3,
      "total yards": 231,
      "total plays": 62,
      "fumbles": 0,
      "fumbles lost": 0,
      "penalties": 6,
      "penalty yards": 60,
      "punts": 4,
      "punt yards": 150,
      "punt returns": 3,
      "punt return yards": 9,
      "kickoff returns": 2,
      "kickoff return yards": 61,
      "interception returns": 3,
      "interception return yards": 117,
      "3rd down conversions": 4,
      "3rd down attempts": 11,
      "4th down conversions": 0,
      "4th down attempts": 0
    }
  },
  "Missouri vs Alabama": {
    "stadium": "BryantDennyStadium-Tuscaloosa-AL",
    "Missouri": {
      "points": 10,
      "1st downs": 13,
      "rushing 1st downs": 5,
      "passing 1st downs": 6,
      "penalty 1st downs": 2,
      "rushing yards": 70,
      "rushing attempts": 35,
      "passing yards": 142,
      "passing attempts": 26,
      "passing completions": 13,
      "passing interceptions": 2,
      "total yards": 212,
      "total plays": 61,
      "fumbles": 1,
      "fumbles lost": 1,
      "penalties": 5,
      "penalty yards": 53,
      "punts": 6,
      "punt yards": 262,
      "punt returns": 0,
      "punt return yards": 0,
      "kickoff returns": 2,
      "kickoff return yards": 29,
      "interception returns": 0,
      "interception return yards": 0,
      "3rd down conversions": 6,
      "3rd down attempts": 16,
      "4th down conversions": 1,
      "4th down attempts": 2
    },
    "Alabama": {
      "points": 39,
      "1st downs": 25,
      "rushing 1st downs": 11,
      "passing 1st downs": 12,
      "penalty 1st downs": 2,
      "rushing yards": 184,
      "rushing attempts": 45,
      "passing yards": 380,
      "passing attempts": 30,
      "passing completions": 19,
      "passing interceptions": 0,
      "total yards": 564,
      "total plays": 75,
      "fumbles": 2,
      "fumbles lost": 1,
      "penalties": 5,
      "penalty yards": 60,
      "punts": 1,
      "punt yards": 12,
      "punt returns": 1,
      "punt return yards": 1,
      "kickoff returns": 3,
      "kickoff return yards": 88,
      "interception returns": 2,
      "interception return yards": 33,
      "3rd down conversions": 6,
      "3rd down attempts": 13,
      "4th down conversions": 0,
      "4th down attempts": 2
    }
  },
  "OleMiss vs Arkansas": {
    "stadium": "WarMemorialStadiumAR-LittleRock-AR",
    "OleMiss": {
      "points": 37,
      "1st downs": 32,
      "rushing 1st downs": 15,
      "passing 1st downs": 15,
      "penalty 1st downs": 2,
      "rushing yards": 224,
      "rushing attempts": 38,
      "passing yards": 387,
      "passing attempts": 35,
      "passing completions": 26,
      "passing interceptions": 1,
      "total yards": 611,
      "total plays": 73,
      "fumbles": 1,
      "fumbles lost": 0,
      "penalties": 4,
      "penalty yards": 50,
      "punts": 1,
      "punt yards": 35,
      "punt returns": 0,
      "punt return yards": 0,
      "kickoff returns": 3,
      "kickoff return yards": 62,
      "interception returns": 1,
      "interception return yards": 0,
      "3rd down conversions": 6,
      "3rd down attempts": 10,
      "4th down conversions": 0,
      "4th down attempts": 0
    },
    "Arkansas": {
      "points": 33,
      "1st downs": 27,
      "rushing 1st downs": 17,
      "passing 1st downs": 7,
      "penalty 1st downs": 3,
      "rushing yards": 299,
      "rushing attempts": 48,
      "passing yards": 177,
      "passing attempts": 22,
      "passing completions": 15,
      "passing interceptions": 1,
      "total yards": 476,
      "total plays": 70,
      "fumbles": 1,
      "fumbles lost": 0,
      "penalties": 5,
      "penalty yards": 65,
      "punts": 2,
      "punt yards": 95,
      "punt returns": 0,
      "punt return yards": 0,
      "kickoff returns": 3,
      "kickoff return yards": 35,
      "interception returns": 1,
      "interception return yards": 0,
      "3rd down conversions": 2,
      "3rd down attempts": 9,
      "4th down conversions": 1,
      "4th down attempts": 1
    }
  },
  "Wisconsin vs Michigan": {
    "stadium": "MichiganStadium-AnnArbor-MI",
    "Wisconsin": {
      "points": 13,
      "1st downs": 11,
      "rushing 1st downs": 7,
      "passing 1st downs": 4,
      "penalty 1st downs": 0,
      "rushing yards": 183,
      "rushing attempts": 29,
      "passing yards": 100,
      "passing attempts": 20,
      "passing completions": 7,
      "passing interceptions": 2,
      "total yards": 283,
      "total plays": 49,
      "fumbles": 1,
      "fumbles lost": 0,
      "penalties": 3,
      "penalty yards": 30,
      "punts": 7,
      "punt yards": 281,
      "punt returns": 1,
      "punt return yards": 15,
      "kickoff returns": 3,
      "kickoff return yards": 47,
      "interception returns": 0,
      "interception return yards": 0,
      "3rd down conversions": 2,
      "3rd down attempts": 11,
      "4th down conversions": 1,
      "4th down attempts": 1
    },
    "Michigan": {
      "points": 38,
      "1st downs": 21,
      "rushing 1st downs": 14,
      "passing 1st downs": 5,
      "penalty 1st downs": 2,
      "rushing yards": 320,
      "rushing attempts": 48,
      "passing yards": 124,
      "passing attempts": 21,
      "passing completions": 14,
      "passing interceptions": 0,
      "total yards": 444,
      "total plays": 69,
      "fumbles": 2,
      "fumbles lost": 0,
      "penalties": 1,
      "penalty yards": 15,
      "punts": 2,
      "punt yards": 91,
      "punt returns": 2,
      "punt return yards": 32,
      "kickoff returns": 0,
      "kickoff return yards": 0,
      "interception returns": 2,
      "interception return yards": 52,
      "3rd down conversions": 7,
      "3rd down attempts": 16,
      "4th down conversions": 0,
      "4th down attempts": 0
    }
  },
  "MiddleTennessee vs FloridaInternational": {
    "stadium": "RiccardoSilvaStadium-Miami-FL",
    "MiddleTennessee": {
      "points": 21,
      "1st downs": 21,
      "rushing 1st downs": 11,
      "passing 1st downs": 8,
      "penalty 1st downs": 2,
      "rushing yards": 187,
      "rushing attempts": 40,
      "passing yards": 142,
      "passing attempts": 27,
      "passing completions": 15,
      "passing interceptions": 1,
      "total yards": 329,
      "total plays": 67,
      "fumbles": 0,
      "fumbles lost": 0,
      "penalties": 5,
      "penalty yards": 52,
      "punts": 4,
      "punt yards": 154,
      "punt returns": 1,
      "punt return yards": 25,
      "kickoff returns": 0,
      "kickoff return yards": 0,
      "interception returns": 0,
      "interception return yards": 0,
      "3rd down conversions": 9,
      "3rd down attempts": 16,
      "4th down conversions": 2,
      "4th down attempts": 2
    },
    "FloridaInternational": {
      "points": 24,
      "1st downs": 21,
      "rushing 1st downs": 6,
      "passing 1st downs": 11,
      "penalty 1st downs": 4,
      "rushing yards": 70,
      "rushing attempts": 34,
      "passing yards": 311,
      "passing attempts": 36,
      "passing completions": 27,
      "passing interceptions": 0,
      "total yards": 381,
      "total plays": 70,
      "fumbles": 0,
      "fumbles lost": 0,
      "penalties": 7,
      "penalty yards": 49,
      "punts": 1,
      "punt yards": 54,
      "punt returns": 0,
      "punt return yards": 0,
      "kickoff returns": 3,
      "kickoff return yards": 62,
      "interception returns": 1,
      "interception return yards": 20,
      "3rd down conversions": 11,
      "3rd down attempts": 18,
      "4th down conversions": 1,
      "4th down attempts": 2
    }
  },
  "Hawaii vs BrighamYoung": {
    "stadium": "LaVellEdwardsStadium-Provo-UT",
    "Hawaii": {
      "points": 23,
      "1st downs": 18,
      "rushing 1st downs": 4,
      "passing 1st downs": 13,
      "penalty 1st downs": 1,
      "rushing yards": 63,
      "rushing attempts": 28,
      "passing yards": 248,
      "passing attempts": 38,
      "passing completions": 22,
      "passing interceptions": 1,
      "total yards": 311,
      "total plays": 66,
      "fumbles": 3,
      "fumbles lost": 1,
      "penalties": 4,
      "penalty yards": 25,
      "punts": 4,
      "punt yards": 177,
      "punt returns": 1,
      "punt return yards": 1,
      "kickoff returns": 5,
      "kickoff return yards": 89,
      "interception returns": 1,
      "interception return yards": 4,
      "3rd down conversions": 3,
      "3rd down attempts": 13,
      "4th down conversions": 2,
      "4th down attempts": 4
    },
    "BrighamYoung": {
      "points": 49,
      "1st downs": 26,
      "rushing 1st downs": 14,
      "passing 1st downs": 11,
      "penalty 1st downs": 1,
      "rushing yards": 280,
      "rushing attempts": 47,
      "passing yards": 194,
      "passing attempts": 24,
      "passing completions": 16,
      "passing interceptions": 1,
      "total yards": 474,
      "total plays": 71,
      "fumbles": 0,
      "fumbles lost": 0,
      "penalties": 6,
      "penalty yards": 55,
      "punts": 3,
      "punt yards": 114,
      "punt returns": 3,
      "punt return yards": 23,
      "kickoff returns": 3,
      "kickoff return yards": 55,
      "interception returns": 1,
      "interception return yards": 36,
      "3rd down conversions": 5,
      "3rd down attempts": 11,
      "4th down conversions": 2,
      "4th down attempts": 2
    }
  },
  "BoiseState vs Nevada": {
    "stadium": "MackayStadium-Reno-NV",
    "BoiseState": {
      "points": 31,
      "1st downs": 24,
      "rushing 1st downs": 9,
      "passing 1st downs": 14,
      "penalty 1st downs": 1,
      "rushing yards": 207,
      "rushing attempts": 40,
      "passing yards": 299,
      "passing attempts": 38,
      "passing completions": 28,
      "passing interceptions": 3,
      "total yards": 506,
      "total plays": 78,
      "fumbles": 1,
      "fumbles lost": 1,
      "penalties": 9,
      "penalty yards": 108,
      "punts": 2,
      "punt yards": 67,
      "punt returns": 0,
      "punt return yards": 0,
      "kickoff returns": 3,
      "kickoff return yards": 72,
      "interception returns": 1,
      "interception return yards": 99,
      "3rd down conversions": 11,
      "3rd down attempts": 18,
      "4th down conversions": 2,
      "4th down attempts": 3
    },
    "Nevada": {
      "points": 27,
      "1st downs": 23,
      "rushing 1st downs": 7,
      "passing 1st downs": 11,
      "penalty 1st downs": 5,
      "rushing yards": 82,
      "rushing attempts": 24,
      "passing yards": 304,
      "passing attempts": 42,
      "passing completions": 24,
      "passing interceptions": 1,
      "total yards": 386,
      "total plays": 66,
      "fumbles": 3,
      "fumbles lost": 2,
      "penalties": 4,
      "penalty yards": 20,
      "punts": 3,
      "punt yards": 121,
      "punt returns": 0,
      "punt return yards": 0,
      "kickoff returns": 3,
      "kickoff return yards": 75,
      "interception returns": 3,
      "interception return yards": 64,
      "3rd down conversions": 5,
      "3rd down attempts": 13,
      "4th down conversions": 2,
      "4th down attempts": 2
    }
  },
  "Wyoming vs FresnoState": {
    "stadium": "BulldogStadiumatJimSweeneyField-Fresno-CA",
    "Wyoming": {
      "points": 3,
      "1st downs": 14,
      "rushing 1st downs": 6,
      "passing 1st downs": 6,
      "penalty 1st downs": 2,
      "rushing yards": 104,
      "rushing attempts": 30,
      "passing yards": 117,
      "passing attempts": 32,
      "passing completions": 12,
      "passing interceptions": 1,
      "total yards": 221,
      "total plays": 62,
      "fumbles": 0,
      "fumbles lost": 0,
      "penalties": 5,
      "penalty yards": 22,
      "punts": 7,
      "punt yards": 259,
      "punt returns": 0,
      "punt return yards": 0,
      "kickoff returns": 3,
      "kickoff return yards": 56,
      "interception returns": 0,
      "interception return yards": 0,
      "3rd down conversions": 5,
      "3rd down attempts": 17,
      "4th down conversions": 0,
      "4th down attempts": 1
    },
    "FresnoState": {
      "points": 27,
      "1st downs": 17,
      "rushing 1st downs": 6,
      "passing 1st downs": 11,
      "penalty 1st downs": 0,
      "rushing yards": 104,
      "rushing attempts": 33,
      "passing yards": 287,
      "passing attempts": 32,
      "passing completions": 22,
      "passing interceptions": 0,
      "total yards": 391,
      "total plays": 65,
      "fumbles": 3,
      "fumbles lost": 0,
      "penalties": 5,
      "penalty yards": 45,
      "punts": 5,
      "punt yards": 206,
      "punt returns": 2,
      "punt return yards": 15,
      "kickoff returns": 1,
      "kickoff return yards": 18,
      "interception returns": 1,
      "interception return yards": 1,
      "3rd down conversions": 6,
      "3rd down attempts": 14,
      "4th down conversions": 2,
      "4th down attempts": 3
    }
  },
  "Colorado vs USC": {
    "stadium": "LosAngelesMemorialColiseum-LosAngeles-CA",
    "Colorado": {
      "points": 20,
      "1st downs": 17,
      "rushing 1st downs": 6,
      "passing 1st downs": 7,
      "penalty 1st downs": 4,
      "rushing yards": 95,
      "rushing attempts": 37,
      "passing yards": 170,
      "passing attempts": 47,
      "passing completions": 26,
      "passing interceptions": 1,
      "total yards": 265,
      "total plays": 84,
      "fumbles": 0,
      "fumbles lost": 0,
      "penalties": 8,
      "penalty yards": 81,
      "punts": 9,
      "punt yards": 377,
      "punt returns": 3,
      "punt return yards": 30,
      "kickoff returns": 1,
      "kickoff return yards": 21,
      "interception returns": 2,
      "interception return yards": 0,
      "3rd down conversions": 7,
      "3rd down attempts": 23,
      "4th down conversions": 2,
      "4th down attempts": 4
    },
    "USC": {
      "points": 31,
      "1st downs": 16,
      "rushing 1st downs": 6,
      "passing 1st downs": 8,
      "penalty 1st downs": 2,
      "rushing yards": 62,
      "rushing attempts": 27,
      "passing yards": 272,
      "passing attempts": 34,
      "passing completions": 17,
      "passing interceptions": 2,
      "total yards": 334,
      "total plays": 61,
      "fumbles": 1,
      "fumbles lost": 1,
      "penalties": 13,
      "penalty yards": 123,
      "punts": 7,
      "punt yards": 297,
      "punt returns": 4,
      "punt return yards": 20,
      "kickoff returns": 1,
      "kickoff return yards": 31,
      "interception returns": 1,
      "interception return yards": 6,
      "3rd down conversions": 2,
      "3rd down attempts": 10,
      "4th down conversions": 0,
      "4th down attempts": 0
    }
  }
}