{
  "BowlingGreen vs NorthernIllinois": {
    "stadium": "FordField-Detroit-MI",
    "BowlingGreen": {
      "points": 34,
      "1st downs": 25,
      "rushing 1st downs": 13,
      "passing 1st downs": 10,
      "penalty 1st downs": 2,
      "rushing yards": 266,
      "rushing attempts": 53,
      "passing yards": 235,
      "passing attempts": 37,
      "passing completions": 25,
      "passing interceptions": 2,
      "total yards": 501,
      "total plays": 90,
      "fumbles": 0,
      "fumbles lost": 0,
      "penalties": 13,
      "penalty yards": 110,
      "punts": 5,
      "punt yards": 230,
      "punt returns": 1,
      "punt return yards": -1,
      "kickoff returns": 2,
      "kickoff return yards": 36,
      "interception returns": 3,
      "interception return yards": -2,
      "3rd down conversions": 6,
      "3rd down attempts": 15,
      "4th down conversions": 1,
      "4th down attempts": 4
    },
    "NorthernIllinois": {
      "points": 14,
      "1st downs": 17,
      "rushing 1st downs": 9,
      "passing 1st downs": 6,
      "penalty 1st downs": 2,
      "rushing yards": 107,
      "rushing attempts": 38,
      "passing yards": 152,
      "passing attempts": 28,
      "passing completions": 12,
      "passing interceptions": 3,
      "total yards": 259,
      "total plays": 66,
      "fumbles": 2,
      "fumbles lost": 2,
      "penalties": 6,
      "penalty yards": 49,
      "punts": 6,
      "punt yards": 257,
      "punt returns": 2,
      "punt return yards": 23,
      "kickoff returns": 3,
      "kickoff return yards": 61,
      "interception returns": 2,
      "interception return yards": 72,
      "3rd down conversions": 2,
      "3rd down attempts": 13,
      "4th down conversions": 1,
      "4th down attempts": 5
    }
  },
  "SouthernMiss vs WesternKentucky": {
    "stadium": "HouchensIndustriesLTSmithStadium-BowlingGreen-KY",
    "SouthernMiss": {
      "points": 28,
      "1st downs": 14,
      "rushing 1st downs": 6,
      "passing 1st downs": 8,
      "penalty 1st downs": 0,
      "rushing yards": 159,
      "rushing attempts": 32,
      "passing yards": 181,
      "passing attempts": 30,
      "passing completions": 15,
      "passing interceptions": 3,
      "total yards": 340,
      "total plays": 62,
      "fumbles": 2,
      "fumbles lost": 1,
      "penalties": 5,
      "penalty yards": 52,
      "punts": 4,
      "punt yards": 151,
      "punt returns": 1,
      "punt return yards": 0,
      "kickoff returns": 8,
      "kickoff return yards": 159,
      "interception returns": 1,
      "interception return yards": 40,
      "3rd down conversions": 5,
      "3rd down attempts": 13,
      "4th down conversions": 1,
      "4th down attempts": 2
    },
    "WesternKentucky": {
      "points": 45,
      "1st downs": 24,
      "rushing 1st downs": 7,
      "passing 1st downs": 16,
      "penalty 1st downs": 1,
      "rushing yards": 111,
      "rushing attempts": 36,
      "passing yards": 410,
      "passing attempts": 52,
      "passing completions": 34,
      "passing interceptions": 1,
      "total yards": 521,
      "total plays": 88,
      "fumbles": 0,
      "fumbles lost": 0,
      "penalties": 2,
      "penalty yards": 15,
      "punts": 3,
      "punt yards": 109,
      "punt returns": 1,
      "punt return yards": -2,
      "kickoff returns": 3,
      "kickoff return yards": 85,
      "interception returns": 3,
      "interception return yards": 16,
      "3rd down conversions": 11,
      "3rd down attempts": 20,
      "4th down conversions": 1,
      "4th down attempts": 3
    }
  },
  "Texas vs Baylor": {
    "stadium": "McLaneStadium-Waco-TX",
    "Texas": {
      "points": 23,
      "1st downs": 15,
      "rushing 1st downs": 7,
      "passing 1st downs": 7,
      "penalty 1st downs": 1,
      "rushing yards": 156,
      "rushing attempts": 42,
      "passing yards": 151,
      "passing attempts": 21,
      "passing completions": 12,
      "passing interceptions": 0,
      "total yards": 307,
      "total plays": 63,
      "fumbles": 1,
      "fumbles lost": 0,
      "penalties": 7,
      "penalty yards": 60,
      "punts": 6,
      "punt yards": 243,
      "punt returns": 1,
      "punt return yards": 2,
      "kickoff returns": 3,
      "kickoff return yards": 92,
      "interception returns": 2,
      "interception return yards": 46,
      "3rd down conversions": 3,
      "3rd down attempts": 14,
      "4th down conversions": 0,
      "4th down attempts": 1
    },
    "Baylor": {
      "points": 17,
      "1st downs": 29,
      "rushing 1st downs": 22,
      "passing 1st downs": 5,
      "penalty 1st downs": 2,
      "rushing yards": 395,
      "rushing attempts": 66,
      "passing yards": 84,
      "passing attempts": 28,
      "passing completions": 13,
      "passing interceptions": 2,
      "total yards": 479,
      "total plays": 94,
      "fumbles": 2,
      "fumbles lost": 2,
      "penalties": 10,
      "penalty yards": 60,
      "punts": 3,
      "punt yards": 113,
      "punt returns": 0,
      "punt return yards": 0,
      "kickoff returns": 0,
      "kickoff return yards": 0,
      "interception returns": 0,
      "interception return yards": 0,
      "3rd down conversions": 4,
      "3rd down attempts": 16,
      "4th down conversions": 2,
      "4th down attempts": 5
    }
  },
  "Temple vs Houston": {
    "stadium": "JohnOQuinnFieldatTDECUStadium-Houston-TX",
    "Temple": {
      "points": 13,
      "1st downs": 19,
      "rushing 1st downs": 5,
      "passing 1st downs": 13,
      "penalty 1st downs": 1,
      "rushing yards": 98,
      "rushing attempts": 27,
      "passing yards": 287,
      "passing attempts": 44,
      "passing completions": 26,
      "passing interceptions": 1,
      "total yards": 385,
      "total plays": 71,
      "fumbles": 1,
      "fumbles lost": 1,
      "penalties": 2,
      "penalty yards": 15,
      "punts": 3,
      "punt yards": 99,
      "punt returns": 2,
      "punt return yards": 4,
      "kickoff returns": 4,
      "kickoff return yards": 80,
      "interception returns": 0,
      "interception return yards": 0,
      "3rd down conversions": 5,
      "3rd down attempts": 14,
      "4th down conversions": 1,
      "4th down attempts": 4
    },
    "Houston": {
      "points": 24,
      "1st downs": 16,
      "rushing 1st downs": 11,
      "passing 1st downs": 5,
      "penalty 1st downs": 0,
      "rushing yards": 233,
      "rushing attempts": 40,
      "passing yards": 106,
      "passing attempts": 22,
      "passing completions": 12,
      "passing interceptions": 0,
      "total yards": 339,
      "total plays": 62,
      "fumbles": 0,
      "fumbles lost": 0,
      "penalties": 5,
      "penalty yards": 40,
      "punts": 6,
      "punt yards": 219,
      "punt returns": 2,
      "punt return yards": 5,
      "kickoff returns": 4,
      "kickoff return yards": 59,
      "interception returns": 1,
      "interception return yards": 8,
      "3rd down conversions": 5,
      "3rd down attempts": 14,
      "4th down conversions": 2,
      "4th down attempts": 2
    }
  },
  "GeorgiaState vs GeorgiaSouthern": {
    "stadium": "AllenEPaulsonStadium-Statesboro-GA",
    "GeorgiaState": {
      "points": 34,
      "1st downs": 23,
      "rushing 1st downs": 8,
      "passing 1st downs": 14,
      "penalty 1st downs": 1,
      "rushing yards": 143,
      "rushing attempts": 37,
      "passing yards": 346,
      "passing attempts": 32,
      "passing completions": 20,
      "passing interceptions": 1,
      "total yards": 489,
      "total plays": 69,
      "fumbles": 1,
      "fumbles lost": 0,
      "penalties": 8,
      "penalty yards": 103,
      "punts": 5,
      "punt yards": 203,
      "punt returns": 0,
      "punt return yards": 0,
      "kickoff returns": 1,
      "kickoff return yards": 10,
      "interception returns": 2,
      "interception return yards": 34,
      "3rd down conversions": 8,
      "3rd down attempts": 14,
      "4th down conversions": 0,
      "4th down attempts": 0
    },
    "GeorgiaSouthern": {
      "points": 7,
      "1st downs": 15,
      "rushing 1st downs": 6,
      "passing 1st downs": 4,
      "penalty 1st downs": 5,
      "rushing yards": 135,
      "rushing attempts": 44,
      "passing yards": 68,
      "passing attempts": 19,
      "passing completions": 6,
      "passing interceptions": 2,
      "total yards": 203,
      "total plays": 63,
      "fumbles": 1,
      "fumbles lost": 0,
      "penalties": 6,
      "penalty yards": 38,
      "punts": 7,
      "punt yards": 270,
      "punt returns": 2,
      "punt return yards": 6,
      "kickoff returns": 6,
      "kickoff return yards": 195,
      "interception returns": 1,
      "interception return yards": 34,
      "3rd down conversions": 4,
      "3rd down attempts": 14,
      "4th down conversions": 1,
      "4th down attempts": 2
    }
  },
  "NewMexicoState vs LouisianaMonroe": {
    "stadium": "JPSFieldatMaloneStadium-Monroe-LA",
    "NewMexicoState": {
      "points": 35,
      "1st downs": 18,
      "rushing 1st downs": 7,
      "passing 1st downs": 10,
      "penalty 1st downs": 1,
      "rushing yards": 89,
      "rushing attempts": 52,
      "passing yards": 308,
      "passing attempts": 36,
      "passing completions": 23,
      "passing interceptions": 2,
      "total yards": 397,
      "total plays": 88,
      "fumbles": 4,
      "fumbles lost": 2,
      "penalties": 10,
      "penalty yards": 100,
      "punts": 7,
      "punt yards": 265,
      "punt returns": 1,
      "punt return yards": 27,
      "kickoff returns": 6,
      "kickoff return yards": 117,
      "interception returns": 2,
      "interception return yards": 27,
      "3rd down conversions": 7,
      "3rd down attempts": 22,
      "4th down conversions": 1,
      "4th down attempts": 5
    },
    "LouisianaMonroe": {
      "points": 42,
      "1st downs": 14,
      "rushing 1st downs": 5,
      "passing 1st downs": 7,
      "penalty 1st downs": 2,
      "rushing yards": 64,
      "rushing attempts": 43,
      "passing yards": 239,
      "passing attempts": 26,
      "passing completions": 9,
      "passing interceptions": 2,
      "total yards": 303,
      "total plays": 69,
      "fumbles": 2,
      "fumbles lost": 1,
      "penalties": 2,
      "penalty yards": 20,
      "punts": 8,
      "punt yards": 288,
      "punt returns": 1,
      "punt return yards": -2,
      "kickoff returns": 3,
      "kickoff return yards": 82,
      "interception returns": 2,
      "interception return yards": 44,
      "3rd down conversions": 5,
      "3rd down attempts": 18,
      "4th down conversions": 0,
      "4th down attempts": 1
    }
  },
  "TexasState vs ArkansasState": {
    "stadium": "CentennialBankStadium-Jonesboro-AR",
    "TexasState": {
      "points": 17,
      "1st downs": 22,
      "rushing 1st downs": 9,
      "passing 1st downs": 11,
      "penalty 1st downs": 2,
      "rushing yards": 154,
      "rushing attempts": 43,
      "passing yards": 227,
      "passing attempts": 32,
      "passing completions": 19,
      "passing interceptions": 2,
      "total yards": 381,
      "total plays": 75,
      "fumbles": 1,
      "fumbles lost": 1,
      "penalties": 6,
      "penalty yards": 45,
      "punts": 5,
      "punt yards": 216,
      "punt returns": 0,
      "punt return yards": 0,
      "kickoff returns": 4,
      "kickoff return yards": 56,
      "interception returns": 0,
      "interception return yards": 0,
      "3rd down conversions": 5,
      "3rd down attempts": 15,
      "4th down conversions": 1,
      "4th down attempts": 1
    },
    "ArkansasState": {
      "points": 55,
      "1st downs": 23,
      "rushing 1st downs": 13,
      "passing 1st downs": 9,
      "penalty 1st downs": 1,
      "rushing yards": 343,
      "rushing attempts": 46,
      "passing yards": 192,
      "passing attempts": 16,
      "passing completions": 12,
      "passing interceptions": 0,
      "total yards": 535,
      "total plays": 62,
      "fumbles": 1,
      "fumbles lost": 1,
      "penalties": 9,
      "penalty yards": 67,
      "punts": 2,
      "punt yards": 92,
      "punt returns": 1,
      "punt return yards": 0,
      "kickoff returns": 1,
      "kickoff return yards": 31,
      "interception returns": 2,
      "interception return yards": 99,
      "3rd down conversions": 8,
      "3rd down attempts": 12,
      "4th down conversions": 1,
      "4th down attempts": 1
    }
  },
  "Florida vs Alabama": {
    "stadium": "GeorgiaDome-Atlanta-GA",
    "Florida": {
      "points": 15,
      "1st downs": 7,
      "rushing 1st downs": 1,
      "passing 1st downs": 6,
      "penalty 1st downs": 0,
      "rushing yards": 15,
      "rushing attempts": 21,
      "passing yards": 165,
      "passing attempts": 24,
      "passing completions": 9,
      "passing interceptions": 1,
      "total yards": 180,
      "total plays": 45,
      "fumbles": 1,
      "fumbles lost": 0,
      "penalties": 5,
      "penalty yards": 51,
      "punts": 8,
      "punt yards": 414,
      "punt returns": 3,
      "punt return yards": 84,
      "kickoff returns": 2,
      "kickoff return yards": 44,
      "interception returns": 0,
      "interception return yards": 0,
      "3rd down conversions": 0,
      "3rd down attempts": 11,
      "4th down conversions": 0,
      "4th down attempts": 1
    },
    "Alabama": {
      "points": 29,
      "1st downs": 25,
      "rushing 1st downs": 14,
      "passing 1st downs": 9,
      "penalty 1st downs": 2,
      "rushing yards": 233,
      "rushing attempts": 58,
      "passing yards": 204,
      "passing attempts": 26,
      "passing completions": 18,
      "passing interceptions": 0,
      "total yards": 437,
      "total plays": 84,
      "fumbles": 2,
      "fumbles lost": 1,
      "penalties": 5,
      "penalty yards": 35,
      "punts": 6,
      "punt yards": 307,
      "punt returns": 8,
      "punt return yards": 45,
      "kickoff returns": 2,
      "kickoff return yards": 46,
      "interception returns": 1,
      "interception return yards": -1,
      "3rd down conversions": 7,
      "3rd down attempts": 17,
      "4th down conversions": 1,
      "4th down attempts": 1
    }
  },
  "WestVirginia vs KansasState": {
    "stadium": "BillSnyderFamilyFootballStadium-Manhattan-KS",
    "WestVirginia": {
      "points": 23,
      "1st downs": 22,
      "rushing 1st downs": 8,
      "passing 1st downs": 14,
      "penalty 1st downs": 0,
      "rushing yards": 166,
      "rushing attempts": 42,
      "passing yards": 281,
      "passing attempts": 42,
      "passing completions": 19,
      "passing interceptions": 0,
      "total yards": 447,
      "total plays": 84,
      "fumbles": 1,
      "fumbles lost": 1,
      "penalties": 3,
      "penalty yards": 40,
      "punts": 9,
      "punt yards": 426,
      "punt returns": 4,
      "punt return yards": 24,
      "kickoff returns": 3,
      "kickoff return yards": 77,
      "interception returns": 2,
      "interception return yards": 0,
      "3rd down conversions": 6,
      "3rd down attempts": 20,
      "4th down conversions": 0,
      "4th down attempts": 1
    },
    "KansasState": {
      "points": 24,
      "1st downs": 15,
      "rushing 1st downs": 6,
      "passing 1st downs": 7,
      "penalty 1st downs": 2,
      "rushing yards": 98,
      "rushing attempts": 49,
      "passing yards": 206,
      "passing attempts": 31,
      "passing completions": 10,
      "passing interceptions": 2,
      "total yards": 304,
      "total plays": 80,
      "fumbles": 0,
      "fumbles lost": 0,
      "penalties": 3,
      "penalty yards": 35,
      "punts": 11,
      "punt yards": 466,
      "punt returns": 4,
      "punt return yards": -7,
      "kickoff returns": 4,
      "kickoff return yards": 209,
      "interception returns": 0,
      "interception return yards": 0,
      "3rd down conversions": 7,
      "3rd down attempts": 20,
      "4th down conversions": 0,
      "4th down attempts": 1
    }
  },
  "Troy vs LouisianaLafayette": {
    "stadium": "CajunField-Lafayette-LA",
    "Troy": {
      "points": 41,
      "1st downs": 18,
      "rushing 1st downs": 6,
      "passing 1st downs": 12,
      "penalty 1st downs": 0,
      "rushing yards": 128,
      "rushing attempts": 33,
      "passing yards": 320,
      "passing attempts": 28,
      "passing completions": 22,
      "passing interceptions": 0,
      "total yards": 448,
      "total plays": 61,
      "fumbles": 0,
      "fumbles lost": 0,
      "penalties": 10,
      "penalty yards": 95,
      "punts": 2,
      "punt yards": 86,
      "punt returns": 2,
      "punt return yards": 11,
      "kickoff returns": 4,
      "kickoff return yards": 65,
      "interception returns": 1,
      "interception return yards": 0,
      "3rd down conversions": 4,
      "3rd down attempts": 12,
      "4th down conversions": 0,
      "4th down attempts": 2
    },
    "LouisianaLafayette": {
      "points": 17,
      "1st downs": 21,
      "rushing 1st downs": 8,
      "passing 1st downs": 11,
      "penalty 1st downs": 2,
      "rushing yards": 103,
      "rushing attempts": 39,
      "passing yards": 207,
      "passing attempts": 39,
      "passing completions": 22,
      "passing interceptions": 1,
      "total yards": 310,
      "total plays": 78,
      "fumbles": 3,
      "fumbles lost": 3,
      "penalties": 9,
      "penalty yards": 85,
      "punts": 4,
      "punt yards": 175,
      "punt returns": 2,
      "punt return yards": 10,
      "kickoff returns": 4,
      "kickoff return yards": 67,
      "interception returns": 0,
      "interception return yards": 0,
      "3rd down conversions": 7,
      "3rd down attempts": 19,
      "4th down conversions": 3,
      "4th down attempts": 5
    }
  },
  "AirForce vs SanDiegoState": {
    "stadium": "QualcommStadium-SanDiego-CA",
    "AirForce": {
      "points": 24,
      "1st downs": 14,
      "rushing 1st downs": 11,
      "passing 1st downs": 3,
      "penalty 1st downs": 0,
      "rushing yards": 305,
      "rushing attempts": 46,
      "passing yards": 35,
      "passing attempts": 11,
      "passing completions": 5,
      "passing interceptions": 0,
      "total yards": 340,
      "total plays": 57,
      "fumbles": 1,
      "fumbles lost": 0,
      "penalties": 2,
      "penalty yards": 9,
      "punts": 6,
      "punt yards": 237,
      "punt returns": 2,
      "punt return yards": 1,
      "kickoff returns": 4,
      "kickoff return yards": 94,
      "interception returns": 0,
      "interception return yards": 0,
      "3rd down conversions": 2,
      "3rd down attempts": 11,
      "4th down conversions": 1,
      "4th down attempts": 2
    },
    "SanDiegoState": {
      "points": 27,
      "1st downs": 17,
      "rushing 1st downs": 11,
      "passing 1st downs": 6,
      "penalty 1st downs": 0,
      "rushing yards": 233,
      "rushing attempts": 46,
      "passing yards": 203,
      "passing attempts": 14,
      "passing completions": 9,
      "passing interceptions": 0,
      "total yards": 436,
      "total plays": 60,
      "fumbles": 1,
      "fumbles lost": 1,
      "penalties": 5,
      "penalty yards": 39,
      "punts": 5,
      "punt yards": 209,
      "punt returns": 2,
      "punt return yards": -4,
      "kickoff returns": 5,
      "kickoff return yards": 107,
      "interception returns": 0,
      "interception return yards": 0,
      "3rd down conversions": 5,
      "3rd down attempts": 13,
      "4th down conversions": 1,
      "4th down attempts": 1
    }
  },
  "AppalachianState vs SouthAlabama": {
    "stadium": "LaddPeeblesStadium-Mobile-AL",
    "AppalachianState": {
      "points": 34,
      "1st downs": 20,
      "rushing 1st downs": 9,
      "passing 1st downs": 9,
      "penalty 1st downs": 2,
      "rushing yards": 301,
      "rushing attempts": 36,
      "passing yards": 163,
      "passing attempts": 22,
      "passing completions": 15,
      "passing interceptions": 1,
      "total yards": 464,
      "total plays": 58,
      "fumbles": 3,
      "fumbles lost": 3,
      "penalties": 3,
      "penalty yards": 19,
      "punts": 3,
      "punt yards": 126,
      "punt returns": 1,
      "punt return yards": 5,
      "kickoff returns": 6,
      "kickoff return yards": 134,
      "interception returns": 3,
      "interception return yards": 48,
      "3rd down conversions": 4,
      "3rd down attempts": 10,
      "4th down conversions": 1,
      "4th down attempts": 1
    },
    "SouthAlabama": {
      "points": 27,
      "1st downs": 21,
      "rushing 1st downs": 11,
      "passing 1st downs": 10,
      "penalty 1st downs": 0,
      "rushing yards": 214,
      "rushing attempts": 56,
      "passing yards": 151,
      "passing attempts": 27,
      "passing completions": 15,
      "passing interceptions": 3,
      "total yards": 365,
      "total plays": 83,
      "fumbles": 0,
      "fumbles lost": 0,
      "penalties": 7,
      "penalty yards": 65,
      "punts": 5,
      "punt yards": 210,
      "punt returns": 0,
      "punt return yards": 0,
      "kickoff returns": 5,
      "kickoff return yards": 140,
      "interception returns": 1,
      "interception return yards": 0,
      "3rd down conversions": 8,
      "3rd down attempts": 19,
      "4th down conversions": 2,
      "4th down attempts": 3
    }
  },
  "Stanford vs USC": {
    "stadium": "LevisStadium-SantaClara-CA",
    "Stanford": {
      "points": 41,
      "1st downs": 20,
      "rushing 1st downs": 13,
      "passing 1st downs": 6,
      "penalty 1st downs": 1,
      "rushing yards": 262,
      "rushing attempts": 51,
      "passing yards": 155,
      "passing attempts": 13,
      "passing completions": 10,
      "passing interceptions": 0,
      "total yards": 417,
      "total plays": 64,
      "fumbles": 0,
      "fumbles lost": 0,
      "penalties": 7,
      "penalty yards": 58,
      "punts": 1,
      "punt yards": 33,
      "punt returns": 2,
      "punt return yards": 29,
      "kickoff returns": 5,
      "kickoff return yards": 120,
      "interception returns": 0,
      "interception return yards": 0,
      "3rd down conversions": 7,
      "3rd down attempts": 13,
      "4th down conversions": 2,
      "4th down attempts": 3
    },
    "USC": {
      "points": 22,
      "1st downs": 25,
      "rushing 1st downs": 13,
      "passing 1st downs": 10,
      "penalty 1st downs": 2,
      "rushing yards": 170,
      "rushing attempts": 32,
      "passing yards": 187,
      "passing attempts": 37,
      "passing completions": 22,
      "passing interceptions": 0,
      "total yards": 357,
      "total plays": 69,
      "fumbles": 1,
      "fumbles lost": 1,
      "penalties": 7,
      "penalty yards": 62,
      "punts": 3,
      "punt yards": 130,
      "punt returns": 0,
      "punt return yards": 0,
      "kickoff returns": 6,
      "kickoff return yards": 96,
      "interception returns": 0,
      "interception return yards": 0,
      "3rd down conversions": 4,
      "3rd down attempts": 11,
      "4th down conversions": 1,
      "4th down attempts": 2
    }
  },
  "NorthCarolina vs Clemson": {
    "stadium": "BankofAmericaStadium-Charlotte-NC",
    "NorthCarolina": {
      "points": 37,
      "1st downs": 22,
      "rushing 1st downs": 7,
      "passing 1st downs": 10,
      "penalty 1st downs": 5,
      "rushing yards": 142,
      "rushing attempts": 32,
      "passing yards": 240,
      "passing attempts": 35,
      "passing completions": 12,
      "passing interceptions": 1,
      "total yards": 382,
      "total plays": 67,
      "fumbles": 2,
      "fumbles lost": 1,
      "penalties": 6,
      "penalty yards": 44,
      "punts": 6,
      "punt yards": 249,
      "punt returns": 2,
      "punt return yards": 29,
      "kickoff returns": 6,
      "kickoff return yards": 110,
      "interception returns": 1,
      "interception return yards": 0,
      "3rd down conversions": 5,
      "3rd down attempts": 14,
      "4th down conversions": 1,
      "4th down attempts": 2
    },
    "Clemson": {
      "points": 45,
      "1st downs": 33,
      "rushing 1st downs": 18,
      "passing 1st downs": 13,
      "penalty 1st downs": 2,
      "rushing yards": 319,
      "rushing attempts": 56,
      "passing yards": 289,
      "passing attempts": 42,
      "passing completions": 26,
      "passing interceptions": 1,
      "total yards": 608,
      "total plays": 98,
      "fumbles": 1,
      "fumbles lost": 0,
      "penalties": 11,
      "penalty yards": 80,
      "punts": 5,
      "punt yards": 199,
      "punt returns": 1,
      "punt return yards": -1,
      "kickoff returns": 4,
      "kickoff return yards": 66,
      "interception returns": 1,
      "interception return yards": -1,
      "3rd down conversions": 9,
      "3rd down attempts": 18,
      "4th down conversions": 1,
      "4th down attempts": 2
    }
  },
  "MichiganState vs Iowa": {
    "stadium": "LucasOilStadium-Indianapolis-IN",
    "MichiganState": {
      "points": 16,
      "1st downs": 20,
      "rushing 1st downs": 9,
      "passing 1st downs": 10,
      "penalty 1st downs": 1,
      "rushing yards": 174,
      "rushing attempts": 46,
      "passing yards": 191,
      "passing attempts": 33,
      "passing completions": 16,
      "passing interceptions": 1,
      "total yards": 365,
      "total plays": 79,
      "fumbles": 0,
      "fumbles lost": 0,
      "penalties": 8,
      "penalty yards": 80,
      "punts": 4,
      "punt yards": 163,
      "punt returns": 0,
      "punt return yards": 0,
      "kickoff returns": 0,
      "kickoff return yards": 0,
      "interception returns": 1,
      "interception return yards": 0,
      "3rd down conversions": 10,
      "3rd down attempts": 20,
      "4th down conversions": 1,
      "4th down attempts": 1
    },
    "Iowa": {
      "points": 13,
      "1st downs": 13,
      "rushing 1st downs": 5,
      "passing 1st downs": 6,
      "penalty 1st downs": 2,
      "rushing yards": 52,
      "rushing attempts": 24,
      "passing yards": 216,
      "passing attempts": 27,
      "passing completions": 18,
      "passing interceptions": 1,
      "total yards": 268,
      "total plays": 51,
      "fumbles": 4,
      "fumbles lost": 2,
      "penalties": 5,
      "penalty yards": 45,
      "punts": 5,
      "punt yards": 178,
      "punt returns": 1,
      "punt return yards": 4,
      "kickoff returns": 2,
      "kickoff return yards": 52,
      "interception returns": 1,
      "interception return yards": 4,
      "3rd down conversions": 3,
      "3rd down attempts": 12,
      "4th down conversions": 0,
      "4th down attempts": 0
    }
  }
}