{
  "Buffalo vs Charlotte": {
    "stadium": "ThomasRobinsonStadium-Nassau-USA",
    "Buffalo": {
      "points": 31,
      "1st downs": 19,
      "rushing 1st downs": 13,
      "passing 1st downs": 5,
      "penalty 1st downs": 1,
      "rushing yards": 205,
      "rushing attempts": 46,
      "passing yards": 77,
      "passing attempts": 17,
      "passing completions": 8,
      "passing interceptions": 1,
      "total yards": 282,
      "total plays": 63,
      "fumbles": 0,
      "fumbles lost": 0,
      "penalties": 2,
      "penalty yards": 30,
      "punts": 3,
      "punt yards": 128,
      "punt returns": 1,
      "punt return yards": 4,
      "kickoff returns": 0,
      "kickoff return yards": 0,
      "interception returns": 1,
      "interception return yards": 20,
      "3rd down conversions": 7,
      "3rd down attempts": 14,
      "4th down conversions": 2,
      "4th down attempts": 2
    },
    "Charlotte": {
      "points": 9,
      "1st downs": 15,
      "rushing 1st downs": 4,
      "passing 1st downs": 10,
      "penalty 1st downs": 1,
      "rushing yards": 80,
      "rushing attempts": 31,
      "passing yards": 198,
      "passing attempts": 24,
      "passing completions": 15,
      "passing interceptions": 1,
      "total yards": 278,
      "total plays": 55,
      "fumbles": 1,
      "fumbles lost": 1,
      "penalties": 3,
      "penalty yards": 20,
      "punts": 1,
      "punt yards": 39,
      "punt returns": 2,
      "punt return yards": 31,
      "kickoff returns": 0,
      "kickoff return yards": 0,
      "interception returns": 1,
      "interception return yards": 34,
      "3rd down conversions": 5,
      "3rd down attempts": 12,
      "4th down conversions": 2,
      "4th down attempts": 4
    }
  },
  "UtahState vs KentState": {
    "stadium": "ToyotaStadium-Frisco-TX",
    "UtahState": {
      "points": 41,
      "1st downs": 29,
      "rushing 1st downs": 11,
      "passing 1st downs": 16,
      "penalty 1st downs": 2,
      "rushing yards": 189,
      "rushing attempts": 40,
      "passing yards": 317,
      "passing attempts": 39,
      "passing completions": 30,
      "passing interceptions": 1,
      "total yards": 506,
      "total plays": 79,
      "fumbles": 3,
      "fumbles lost": 2,
      "penalties": 4,
      "penalty yards": 36,
      "punts": 3,
      "punt yards": 78,
      "punt returns": 1,
      "punt return yards": 0,
      "kickoff returns": 5,
      "kickoff return yards": 64,
      "interception returns": 0,
      "interception return yards": 0,
      "3rd down conversions": 6,
      "3rd down attempts": 13,
      "4th down conversions": 0,
      "4th down attempts": 1
    },
    "KentState": {
      "points": 51,
      "1st downs": 26,
      "rushing 1st downs": 15,
      "passing 1st downs": 10,
      "penalty 1st downs": 1,
      "rushing yards": 252,
      "rushing attempts": 56,
      "passing yards": 298,
      "passing attempts": 27,
      "passing completions": 22,
      "passing interceptions": 0,
      "total yards": 550,
      "total plays": 83,
      "fumbles": 2,
      "fumbles lost": 1,
      "penalties": 6,
      "penalty yards": 60,
      "punts": 2,
      "punt yards": 77,
      "punt returns": 0,
      "punt return yards": 0,
      "kickoff returns": 7,
      "kickoff return yards": 191,
      "interception returns": 1,
      "interception return yards": 1,
      "3rd down conversions": 7,
      "3rd down attempts": 15,
      "4th down conversions": 1,
      "4th down attempts": 2
    }
  },
  "CentralMichigan vs SanDiegoState": {
    "stadium": "DreamstyleStadium-Albuquerque-NM",
    "CentralMichigan": {
      "points": 11,
      "1st downs": 8,
      "rushing 1st downs": 2,
      "passing 1st downs": 4,
      "penalty 1st downs": 2,
      "rushing yards": 112,
      "rushing attempts": 27,
      "passing yards": 165,
      "passing attempts": 30,
      "passing completions": 12,
      "passing interceptions": 3,
      "total yards": 277,
      "total plays": 57,
      "fumbles": 3,
      "fumbles lost": 2,
      "penalties": 10,
      "penalty yards": 86,
      "punts": 8,
      "punt yards": 320,
      "punt returns": 2,
      "punt return yards": -5,
      "kickoff returns": 0,
      "kickoff return yards": 0,
      "interception returns": 1,
      "interception return yards": 0,
      "3rd down conversions": 4,
      "3rd down attempts": 17,
      "4th down conversions": 0,
      "4th down attempts": 1
    },
    "SanDiegoState": {
      "points": 48,
      "1st downs": 24,
      "rushing 1st downs": 9,
      "passing 1st downs": 12,
      "penalty 1st downs": 3,
      "rushing yards": 223,
      "rushing attempts": 45,
      "passing yards": 287,
      "passing attempts": 31,
      "passing completions": 18,
      "passing interceptions": 1,
      "total yards": 510,
      "total plays": 76,
      "fumbles": 0,
      "fumbles lost": 0,
      "penalties": 6,
      "penalty yards": 65,
      "punts": 7,
      "punt yards": 304,
      "punt returns": 1,
      "punt return yards": 0,
      "kickoff returns": 2,
      "kickoff return yards": 53,
      "interception returns": 3,
      "interception return yards": 0,
      "3rd down conversions": 6,
      "3rd down attempts": 16,
      "4th down conversions": 0,
      "4th down attempts": 0
    }
  },
  "Liberty vs GeorgiaSouthern": {
    "stadium": "ExploriaStadium-Orlando-FL",
    "Liberty": {
      "points": 23,
      "1st downs": 19,
      "rushing 1st downs": 3,
      "passing 1st downs": 12,
      "penalty 1st downs": 4,
      "rushing yards": 142,
      "rushing attempts": 37,
      "passing yards": 270,
      "passing attempts": 35,
      "passing completions": 16,
      "passing interceptions": 2,
      "total yards": 412,
      "total plays": 72,
      "fumbles": 1,
      "fumbles lost": 0,
      "penalties": 4,
      "penalty yards": 45,
      "punts": 6,
      "punt yards": 219,
      "punt returns": 3,
      "punt return yards": -10,
      "kickoff returns": 0,
      "kickoff return yards": 0,
      "interception returns": 1,
      "interception return yards": 0,
      "3rd down conversions": 5,
      "3rd down attempts": 15,
      "4th down conversions": 0,
      "4th down attempts": 2
    },
    "GeorgiaSouthern": {
      "points": 16,
      "1st downs": 13,
      "rushing 1st downs": 6,
      "passing 1st downs": 4,
      "penalty 1st downs": 3,
      "rushing yards": 154,
      "rushing attempts": 46,
      "passing yards": 95,
      "passing attempts": 19,
      "passing completions": 10,
      "passing interceptions": 1,
      "total yards": 249,
      "total plays": 65,
      "fumbles": 0,
      "fumbles lost": 0,
      "penalties": 10,
      "penalty yards": 101,
      "punts": 9,
      "punt yards": 439,
      "punt returns": 0,
      "punt return yards": 0,
      "kickoff returns": 1,
      "kickoff return yards": 19,
      "interception returns": 2,
      "interception return yards": -1,
      "3rd down conversions": 4,
      "3rd down attempts": 17,
      "4th down conversions": 0,
      "4th down attempts": 0
    }
  },
  "SouthernMethodist vs FloridaAtlantic": {
    "stadium": "FAUStadium-BocaRaton-FL",
    "SouthernMethodist": {
      "points": 28,
      "1st downs": 24,
      "rushing 1st downs": 5,
      "passing 1st downs": 16,
      "penalty 1st downs": 3,
      "rushing yards": 120,
      "rushing attempts": 34,
      "passing yards": 305,
      "passing attempts": 50,
      "passing completions": 28,
      "passing interceptions": 1,
      "total yards": 425,
      "total plays": 84,
      "fumbles": 2,
      "fumbles lost": 1,
      "penalties": 9,
      "penalty yards": 55,
      "punts": 8,
      "punt yards": 304,
      "punt returns": 0,
      "punt return yards": 0,
      "kickoff returns": 6,
      "kickoff return yards": 143,
      "interception returns": 0,
      "interception return yards": 0,
      "3rd down conversions": 6,
      "3rd down attempts": 16,
      "4th down conversions": 1,
      "4th down attempts": 1
    },
    "FloridaAtlantic": {
      "points": 52,
      "1st downs": 30,
      "rushing 1st downs": 10,
      "passing 1st downs": 17,
      "penalty 1st downs": 3,
      "rushing yards": 188,
      "rushing attempts": 44,
      "passing yards": 333,
      "passing attempts": 39,
      "passing completions": 29,
      "passing interceptions": 0,
      "total yards": 521,
      "total plays": 83,
      "fumbles": 1,
      "fumbles lost": 1,
      "penalties": 5,
      "penalty yards": 39,
      "punts": 5,
      "punt yards": 240,
      "punt returns": 2,
      "punt return yards": 5,
      "kickoff returns": 1,
      "kickoff return yards": 24,
      "interception returns": 1,
      "interception return yards": 22,
      "3rd down conversions": 5,
      "3rd down attempts": 15,
      "4th down conversions": 2,
      "4th down attempts": 2
    }
  },
  "FloridaInternational vs ArkansasState": {
    "stadium": "CramtonBowl-Montgomery-AL",
    "FloridaInternational": {
      "points": 26,
      "1st downs": 23,
      "rushing 1st downs": 5,
      "passing 1st downs": 13,
      "penalty 1st downs": 5,
      "rushing yards": 132,
      "rushing attempts": 35,
      "passing yards": 312,
      "passing attempts": 39,
      "passing completions": 22,
      "passing interceptions": 2,
      "total yards": 444,
      "total plays": 74,
      "fumbles": 0,
      "fumbles lost": 0,
      "penalties": 7,
      "penalty yards": 62,
      "punts": 3,
      "punt yards": 148,
      "punt returns": 0,
      "punt return yards": 0,
      "kickoff returns": 3,
      "kickoff return yards": 29,
      "interception returns": 1,
      "interception return yards": 0,
      "3rd down conversions": 6,
      "3rd down attempts": 16,
      "4th down conversions": 1,
      "4th down attempts": 2
    },
    "ArkansasState": {
      "points": 34,
      "1st downs": 31,
      "rushing 1st downs": 8,
      "passing 1st downs": 20,
      "penalty 1st downs": 3,
      "rushing yards": 132,
      "rushing attempts": 37,
      "passing yards": 393,
      "passing attempts": 52,
      "passing completions": 27,
      "passing interceptions": 1,
      "total yards": 525,
      "total plays": 89,
      "fumbles": 1,
      "fumbles lost": 1,
      "penalties": 10,
      "penalty yards": 142,
      "punts": 3,
      "punt yards": 119,
      "punt returns": 0,
      "punt return yards": 0,
      "kickoff returns": 3,
      "kickoff return yards": 61,
      "interception returns": 2,
      "interception return yards": 33,
      "3rd down conversions": 12,
      "3rd down attempts": 19,
      "4th down conversions": 1,
      "4th down attempts": 2
    }
  },
  "BoiseState vs Washington": {
    "stadium": "SamBoydStadium-LasVegas-NV",
    "BoiseState": {
      "points": 7,
      "1st downs": 16,
      "rushing 1st downs": 7,
      "passing 1st downs": 9,
      "penalty 1st downs": 0,
      "rushing yards": 78,
      "rushing attempts": 22,
      "passing yards": 188,
      "passing attempts": 37,
      "passing completions": 21,
      "passing interceptions": 2,
      "total yards": 266,
      "total plays": 59,
      "fumbles": 1,
      "fumbles lost": 1,
      "penalties": 3,
      "penalty yards": 25,
      "punts": 5,
      "punt yards": 183,
      "punt returns": 1,
      "punt return yards": 29,
      "kickoff returns": 6,
      "kickoff return yards": 122,
      "interception returns": 0,
      "interception return yards": 0,
      "3rd down conversions": 3,
      "3rd down attempts": 11,
      "4th down conversions": 1,
      "4th down attempts": 2
    },
    "Washington": {
      "points": 38,
      "1st downs": 22,
      "rushing 1st downs": 9,
      "passing 1st downs": 12,
      "penalty 1st downs": 1,
      "rushing yards": 118,
      "rushing attempts": 35,
      "passing yards": 223,
      "passing attempts": 33,
      "passing completions": 23,
      "passing interceptions": 0,
      "total yards": 341,
      "total plays": 68,
      "fumbles": 0,
      "fumbles lost": 0,
      "penalties": 1,
      "penalty yards": 10,
      "punts": 4,
      "punt yards": 188,
      "punt returns": 2,
      "punt return yards": 2,
      "kickoff returns": 1,
      "kickoff return yards": 19,
      "interception returns": 2,
      "interception return yards": 57,
      "3rd down conversions": 7,
      "3rd down attempts": 14,
      "4th down conversions": 3,
      "4th down attempts": 3
    }
  },
  "AppalachianState vs UAB": {
    "stadium": "MercedesBenzSuperdome-NewOrleans-LA",
    "AppalachianState": {
      "points": 31,
      "1st downs": 20,
      "rushing 1st downs": 9,
      "passing 1st downs": 6,
      "penalty 1st downs": 5,
      "rushing yards": 261,
      "rushing attempts": 40,
      "passing yards": 142,
      "passing attempts": 25,
      "passing completions": 13,
      "passing interceptions": 0,
      "total yards": 403,
      "total plays": 65,
      "fumbles": 1,
      "fumbles lost": 0,
      "penalties": 11,
      "penalty yards": 130,
      "punts": 7,
      "punt yards": 313,
      "punt returns": 1,
      "punt return yards": 4,
      "kickoff returns": 0,
      "kickoff return yards": 0,
      "interception returns": 1,
      "interception return yards": 11,
      "3rd down conversions": 3,
      "3rd down attempts": 14,
      "4th down conversions": 2,
      "4th down attempts": 2
    },
    "UAB": {
      "points": 17,
      "1st downs": 20,
      "rushing 1st downs": 5,
      "passing 1st downs": 13,
      "penalty 1st downs": 2,
      "rushing yards": 40,
      "rushing attempts": 33,
      "passing yards": 298,
      "passing attempts": 34,
      "passing completions": 22,
      "passing interceptions": 1,
      "total yards": 338,
      "total plays": 67,
      "fumbles": 2,
      "fumbles lost": 2,
      "penalties": 8,
      "penalty yards": 76,
      "punts": 5,
      "punt yards": 212,
      "punt returns": 0,
      "punt return yards": 0,
      "kickoff returns": 1,
      "kickoff return yards": 21,
      "interception returns": 0,
      "interception return yards": 0,
      "3rd down conversions": 3,
      "3rd down attempts": 14,
      "4th down conversions": 2,
      "4th down attempts": 3
    }
  },
  "UCF vs Marshall": {
    "stadium": "RaymondJamesStadium-Tampa-FL",
    "UCF": {
      "points": 48,
      "1st downs": 25,
      "rushing 1st downs": 14,
      "passing 1st downs": 8,
      "penalty 1st downs": 3,
      "rushing yards": 310,
      "rushing attempts": 47,
      "passing yards": 277,
      "passing attempts": 31,
      "passing completions": 17,
      "passing interceptions": 1,
      "total yards": 587,
      "total plays": 78,
      "fumbles": 2,
      "fumbles lost": 0,
      "penalties": 10,
      "penalty yards": 93,
      "punts": 4,
      "punt yards": 158,
      "punt returns": 3,
      "punt return yards": 24,
      "kickoff returns": 0,
      "kickoff return yards": 0,
      "interception returns": 2,
      "interception return yards": 73,
      "3rd down conversions": 7,
      "3rd down attempts": 16,
      "4th down conversions": 1,
      "4th down attempts": 2
    },
    "Marshall": {
      "points": 25,
      "1st downs": 19,
      "rushing 1st downs": 8,
      "passing 1st downs": 7,
      "penalty 1st downs": 4,
      "rushing yards": 167,
      "rushing attempts": 44,
      "passing yards": 194,
      "passing attempts": 25,
      "passing completions": 11,
      "passing interceptions": 2,
      "total yards": 361,
      "total plays": 69,
      "fumbles": 4,
      "fumbles lost": 3,
      "penalties": 8,
      "penalty yards": 67,
      "punts": 4,
      "punt yards": 191,
      "punt returns": 1,
      "punt return yards": 22,
      "kickoff returns": 6,
      "kickoff return yards": 138,
      "interception returns": 1,
      "interception return yards": -75,
      "3rd down conversions": 7,
      "3rd down attempts": 16,
      "4th down conversions": 0,
      "4th down attempts": 1
    }
  },
  "Hawaii vs BrighamYoung": {
    "stadium": "AlohaStadium-Honolulu-HI",
    "Hawaii": {
      "points": 38,
      "1st downs": 20,
      "rushing 1st downs": 2,
      "passing 1st downs": 17,
      "penalty 1st downs": 1,
      "rushing yards": 2,
      "rushing attempts": 27,
      "passing yards": 493,
      "passing attempts": 47,
      "passing completions": 28,
      "passing interceptions": 0,
      "total yards": 495,
      "total plays": 74,
      "fumbles": 0,
      "fumbles lost": 0,
      "penalties": 6,
      "penalty yards": 59,
      "punts": 6,
      "punt yards": 253,
      "punt returns": 1,
      "punt return yards": -9,
      "kickoff returns": 7,
      "kickoff return yards": 129,
      "interception returns": 2,
      "interception return yards": 29,
      "3rd down conversions": 9,
      "3rd down attempts": 18,
      "4th down conversions": 1,
      "4th down attempts": 1
    },
    "BrighamYoung": {
      "points": 34,
      "1st downs": 29,
      "rushing 1st downs": 11,
      "passing 1st downs": 16,
      "penalty 1st downs": 2,
      "rushing yards": 231,
      "rushing attempts": 40,
      "passing yards": 274,
      "passing attempts": 41,
      "passing completions": 24,
      "passing interceptions": 2,
      "total yards": 505,
      "total plays": 81,
      "fumbles": 2,
      "fumbles lost": 1,
      "penalties": 2,
      "penalty yards": 20,
      "punts": 4,
      "punt yards": 165,
      "punt returns": 3,
      "punt return yards": 97,
      "kickoff returns": 2,
      "kickoff return yards": 27,
      "interception returns": 0,
      "interception return yards": 0,
      "3rd down conversions": 6,
      "3rd down attempts": 14,
      "4th down conversions": 0,
      "4th down attempts": 0
    }
  },
  "LouisianaTech vs MiamiFL": {
    "stadium": "IndependenceStadium-Shreveport-LA",
    "LouisianaTech": {
      "points": 14,
      "1st downs": 18,
      "rushing 1st downs": 10,
      "passing 1st downs": 7,
      "penalty 1st downs": 1,
      "rushing yards": 174,
      "rushing attempts": 40,
      "passing yards": 163,
      "passing attempts": 28,
      "passing completions": 13,
      "passing interceptions": 1,
      "total yards": 337,
      "total plays": 68,
      "fumbles": 2,
      "fumbles lost": 0,
      "penalties": 5,
      "penalty yards": 49,
      "punts": 9,
      "punt yards": 380,
      "punt returns": 4,
      "punt return yards": 38,
      "kickoff returns": 0,
      "kickoff return yards": 0,
      "interception returns": 2,
      "interception return yards": 7,
      "3rd down conversions": 6,
      "3rd down attempts": 16,
      "4th down conversions": 0,
      "4th down attempts": 0
    },
    "MiamiFL": {
      "points": 0,
      "1st downs": 15,
      "rushing 1st downs": 4,
      "passing 1st downs": 10,
      "penalty 1st downs": 1,
      "rushing yards": 74,
      "rushing attempts": 28,
      "passing yards": 153,
      "passing attempts": 34,
      "passing completions": 15,
      "passing interceptions": 2,
      "total yards": 227,
      "total plays": 62,
      "fumbles": 1,
      "fumbles lost": 1,
      "penalties": 7,
      "penalty yards": 65,
      "punts": 9,
      "punt yards": 371,
      "punt returns": 3,
      "punt return yards": 47,
      "kickoff returns": 1,
      "kickoff return yards": 16,
      "interception returns": 1,
      "interception return yards": 34,
      "3rd down conversions": 5,
      "3rd down attempts": 14,
      "4th down conversions": 0,
      "4th down attempts": 0
    }
  },
  "Pittsburgh vs EasternMichigan": {
    "stadium": "FordField-Detroit-MI",
    "Pittsburgh": {
      "points": 34,
      "1st downs": 22,
      "rushing 1st downs": 5,
      "passing 1st downs": 16,
      "penalty 1st downs": 1,
      "rushing yards": 96,
      "rushing attempts": 29,
      "passing yards": 361,
      "passing attempts": 39,
      "passing completions": 27,
      "passing interceptions": 0,
      "total yards": 457,
      "total plays": 68,
      "fumbles": 3,
      "fumbles lost": 1,
      "penalties": 4,
      "penalty yards": 36,
      "punts": 4,
      "punt yards": 176,
      "punt returns": 1,
      "punt return yards": 9,
      "kickoff returns": 1,
      "kickoff return yards": 25,
      "interception returns": 1,
      "interception return yards": 14,
      "3rd down conversions": 6,
      "3rd down attempts": 14,
      "4th down conversions": 0,
      "4th down attempts": 0
    },
    "EasternMichigan": {
      "points": 30,
      "1st downs": 27,
      "rushing 1st downs": 9,
      "passing 1st downs": 16,
      "penalty 1st downs": 2,
      "rushing yards": 127,
      "rushing attempts": 36,
      "passing yards": 311,
      "passing attempts": 51,
      "passing completions": 28,
      "passing interceptions": 1,
      "total yards": 438,
      "total plays": 87,
      "fumbles": 0,
      "fumbles lost": 0,
      "penalties": 3,
      "penalty yards": 40,
      "punts": 5,
      "punt yards": 246,
      "punt returns": 2,
      "punt return yards": 14,
      "kickoff returns": 0,
      "kickoff return yards": 0,
      "interception returns": 0,
      "interception return yards": 0,
      "3rd down conversions": 9,
      "3rd down attempts": 18,
      "4th down conversions": 0,
      "4th down attempts": 1
    }
  },
  "NorthCarolina vs Temple": {
    "stadium": "NavyMarineCorpsMemorialStadium-Annapolis-MD",
    "NorthCarolina": {
      "points": 55,
      "1st downs": 33,
      "rushing 1st downs": 15,
      "passing 1st downs": 15,
      "penalty 1st downs": 3,
      "rushing yards": 238,
      "rushing attempts": 40,
      "passing yards": 296,
      "passing attempts": 35,
      "passing completions": 26,
      "passing interceptions": 0,
      "total yards": 534,
      "total plays": 75,
      "fumbles": 1,
      "fumbles lost": 1,
      "penalties": 6,
      "penalty yards": 63,
      "punts": 0,
      "punt yards": 0,
      "punt returns": 1,
      "punt return yards": 16,
      "kickoff returns": 2,
      "kickoff return yards": 38,
      "interception returns": 2,
      "interception return yards": 20,
      "3rd down conversions": 11,
      "3rd down attempts": 14,
      "4th down conversions": 1,
      "4th down attempts": 1
    },
    "Temple": {
      "points": 13,
      "1st downs": 16,
      "rushing 1st downs": 7,
      "passing 1st downs": 6,
      "penalty 1st downs": 3,
      "rushing yards": 78,
      "rushing attempts": 34,
      "passing yards": 194,
      "passing attempts": 32,
      "passing completions": 18,
      "passing interceptions": 2,
      "total yards": 272,
      "total plays": 66,
      "fumbles": 0,
      "fumbles lost": 0,
      "penalties": 8,
      "penalty yards": 65,
      "punts": 3,
      "punt yards": 103,
      "punt returns": 0,
      "punt return yards": 0,
      "kickoff returns": 4,
      "kickoff return yards": 92,
      "interception returns": 0,
      "interception return yards": 0,
      "3rd down conversions": 6,
      "3rd down attempts": 16,
      "4th down conversions": 2,
      "4th down attempts": 3
    }
  },
  "MichiganState vs WakeForest": {
    "stadium": "YankeeStadium-Bronx-NY",
    "MichiganState": {
      "points": 27,
      "1st downs": 26,
      "rushing 1st downs": 10,
      "passing 1st downs": 15,
      "penalty 1st downs": 1,
      "rushing yards": 177,
      "rushing attempts": 41,
      "passing yards": 320,
      "passing attempts": 38,
      "passing completions": 26,
      "passing interceptions": 1,
      "total yards": 497,
      "total plays": 79,
      "fumbles": 1,
      "fumbles lost": 1,
      "penalties": 7,
      "penalty yards": 55,
      "punts": 4,
      "punt yards": 180,
      "punt returns": 3,
      "punt return yards": 26,
      "kickoff returns": 4,
      "kickoff return yards": 79,
      "interception returns": 1,
      "interception return yards": 14,
      "3rd down conversions": 5,
      "3rd down attempts": 14,
      "4th down conversions": 1,
      "4th down attempts": 1
    },
    "WakeForest": {
      "points": 21,
      "1st downs": 17,
      "rushing 1st downs": 11,
      "passing 1st downs": 6,
      "penalty 1st downs": 0,
      "rushing yards": 176,
      "rushing attempts": 41,
      "passing yards": 175,
      "passing attempts": 29,
      "passing completions": 12,
      "passing interceptions": 1,
      "total yards": 351,
      "total plays": 70,
      "fumbles": 2,
      "fumbles lost": 0,
      "penalties": 7,
      "penalty yards": 65,
      "punts": 6,
      "punt yards": 281,
      "punt returns": 1,
      "punt return yards": 36,
      "kickoff returns": 5,
      "kickoff return yards": 94,
      "interception returns": 1,
      "interception return yards": 3,
      "3rd down conversions": 8,
      "3rd down attempts": 17,
      "4th down conversions": 0,
      "4th down attempts": 2
    }
  },
  "OklahomaState vs TexasAM": {
    "stadium": "NRGStadium-Houston-TX",
    "OklahomaState": {
      "points": 21,
      "1st downs": 17,
      "rushing 1st downs": 8,
      "passing 1st downs": 7,
      "penalty 1st downs": 2,
      "rushing yards": 150,
      "rushing attempts": 31,
      "passing yards": 184,
      "passing attempts": 28,
      "passing completions": 15,
      "passing interceptions": 0,
      "total yards": 334,
      "total plays": 59,
      "fumbles": 0,
      "fumbles lost": 0,
      "penalties": 5,
      "penalty yards": 42,
      "punts": 5,
      "punt yards": 182,
      "punt returns": 0,
      "punt return yards": 0,
      "kickoff returns": 2,
      "kickoff return yards": 43,
      "interception returns": 0,
      "interception return yards": 0,
      "3rd down conversions": 4,
      "3rd down attempts": 12,
      "4th down conversions": 0,
      "4th down attempts": 1
    },
    "TexasAM": {
      "points": 24,
      "1st downs": 19,
      "rushing 1st downs": 12,
      "passing 1st downs": 5,
      "penalty 1st downs": 2,
      "rushing yards": 248,
      "rushing attempts": 41,
      "passing yards": 95,
      "passing attempts": 19,
      "passing completions": 13,
      "passing interceptions": 0,
      "total yards": 343,
      "total plays": 60,
      "fumbles": 2,
      "fumbles lost": 2,
      "penalties": 8,
      "penalty yards": 56,
      "punts": 4,
      "punt yards": 155,
      "punt returns": 1,
      "punt return yards": 3,
      "kickoff returns": 2,
      "kickoff return yards": 36,
      "interception returns": 0,
      "interception return yards": 0,
      "3rd down conversions": 5,
      "3rd down attempts": 10,
      "4th down conversions": 0,
      "4th down attempts": 0
    }
  },
  "USC vs Iowa": {
    "stadium": "SanDiegoCountyCreditUnionStadium-SanDiego-CA",
    "USC": {
      "points": 24,
      "1st downs": 20,
      "rushing 1st downs": 4,
      "passing 1st downs": 14,
      "penalty 1st downs": 2,
      "rushing yards": 22,
      "rushing attempts": 18,
      "passing yards": 334,
      "passing attempts": 48,
      "passing completions": 34,
      "passing interceptions": 1,
      "total yards": 356,
      "total plays": 66,
      "fumbles": 3,
      "fumbles lost": 2,
      "penalties": 3,
      "penalty yards": 21,
      "punts": 4,
      "punt yards": 153,
      "punt returns": 0,
      "punt return yards": 0,
      "kickoff returns": 1,
      "kickoff return yards": 19,
      "interception returns": 0,
      "interception return yards": 0,
      "3rd down conversions": 7,
      "3rd down attempts": 14,
      "4th down conversions": 0,
      "4th down attempts": 0
    },
    "Iowa": {
      "points": 49,
      "1st downs": 20,
      "rushing 1st downs": 8,
      "passing 1st downs": 12,
      "penalty 1st downs": 0,
      "rushing yards": 115,
      "rushing attempts": 35,
      "passing yards": 213,
      "passing attempts": 28,
      "passing completions": 18,
      "passing interceptions": 0,
      "total yards": 328,
      "total plays": 63,
      "fumbles": 2,
      "fumbles lost": 0,
      "penalties": 4,
      "penalty yards": 23,
      "punts": 4,
      "punt yards": 148,
      "punt returns": 2,
      "punt return yards": -1,
      "kickoff returns": 3,
      "kickoff return yards": 142,
      "interception returns": 1,
      "interception return yards": 25,
      "3rd down conversions": 8,
      "3rd down attempts": 13,
      "4th down conversions": 1,
      "4th down attempts": 1
    }
  },
  "AirForce vs WashingtonState": {
    "stadium": "ChaseField-Phoenix-AZ",
    "AirForce": {
      "points": 31,
      "1st downs": 28,
      "rushing 1st downs": 27,
      "passing 1st downs": 0,
      "penalty 1st downs": 1,
      "rushing yards": 371,
      "rushing attempts": 69,
      "passing yards": 30,
      "passing attempts": 12,
      "passing completions": 4,
      "passing interceptions": 1,
      "total yards": 401,
      "total plays": 81,
      "fumbles": 2,
      "fumbles lost": 0,
      "penalties": 2,
      "penalty yards": 20,
      "punts": 2,
      "punt yards": 76,
      "punt returns": 0,
      "punt return yards": 0,
      "kickoff returns": 2,
      "kickoff return yards": 19,
      "interception returns": 0,
      "interception return yards": 0,
      "3rd down conversions": 4,
      "3rd down attempts": 11,
      "4th down conversions": 3,
      "4th down attempts": 3
    },
    "WashingtonState": {
      "points": 21,
      "1st downs": 15,
      "rushing 1st downs": 1,
      "passing 1st downs": 14,
      "penalty 1st downs": 0,
      "rushing yards": 15,
      "rushing attempts": 8,
      "passing yards": 351,
      "passing attempts": 42,
      "passing completions": 28,
      "passing interceptions": 0,
      "total yards": 366,
      "total plays": 50,
      "fumbles": 1,
      "fumbles lost": 1,
      "penalties": 3,
      "penalty yards": 45,
      "punts": 1,
      "punt yards": 46,
      "punt returns": 1,
      "punt return yards": 29,
      "kickoff returns": 5,
      "kickoff return yards": 99,
      "interception returns": 1,
      "interception return yards": 31,
      "3rd down conversions": 3,
      "3rd down attempts": 9,
      "4th down conversions": 2,
      "4th down attempts": 5
    }
  },
  "NotreDame vs IowaState": {
    "stadium": "CampingWorldStadium-Orlando-FL",
    "NotreDame": {
      "points": 33,
      "1st downs": 17,
      "rushing 1st downs": 7,
      "passing 1st downs": 10,
      "penalty 1st downs": 0,
      "rushing yards": 208,
      "rushing attempts": 37,
      "passing yards": 247,
      "passing attempts": 28,
      "passing completions": 20,
      "passing interceptions": 0,
      "total yards": 455,
      "total plays": 65,
      "fumbles": 0,
      "fumbles lost": 0,
      "penalties": 3,
      "penalty yards": 30,
      "punts": 4,
      "punt yards": 151,
      "punt returns": 2,
      "punt return yards": -1,
      "kickoff returns": 3,
      "kickoff return yards": 71,
      "interception returns": 0,
      "interception return yards": 0,
      "3rd down conversions": 3,
      "3rd down attempts": 13,
      "4th down conversions": 2,
      "4th down attempts": 2
    },
    "IowaState": {
      "points": 9,
      "1st downs": 14,
      "rushing 1st downs": 4,
      "passing 1st downs": 9,
      "penalty 1st downs": 1,
      "rushing yards": 45,
      "rushing attempts": 27,
      "passing yards": 227,
      "passing attempts": 32,
      "passing completions": 18,
      "passing interceptions": 0,
      "total yards": 272,
      "total plays": 59,
      "fumbles": 2,
      "fumbles lost": 2,
      "penalties": 1,
      "penalty yards": 5,
      "punts": 5,
      "punt yards": 236,
      "punt returns": 2,
      "punt return yards": 6,
      "kickoff returns": 2,
      "kickoff return yards": 42,
      "interception returns": 0,
      "interception return yards": 0,
      "3rd down conversions": 5,
      "3rd down attempts": 15,
      "4th down conversions": 0,
      "4th down attempts": 2
    }
  },
  "Memphis vs PennState": {
    "stadium": "ATTStadium-Arlington-TX",
    "Memphis": {
      "points": 39,
      "1st downs": 27,
      "rushing 1st downs": 8,
      "passing 1st downs": 19,
      "penalty 1st downs": 0,
      "rushing yards": 63,
      "rushing attempts": 33,
      "passing yards": 479,
      "passing attempts": 53,
      "passing completions": 33,
      "passing interceptions": 2,
      "total yards": 542,
      "total plays": 86,
      "fumbles": 2,
      "fumbles lost": 0,
      "penalties": 8,
      "penalty yards": 45,
      "punts": 3,
      "punt yards": 99,
      "punt returns": 1,
      "punt return yards": -1,
      "kickoff returns": 1,
      "kickoff return yards": 12,
      "interception returns": 1,
      "interception return yards": 0,
      "3rd down conversions": 7,
      "3rd down attempts": 16,
      "4th down conversions": 0,
      "4th down attempts": 0
    },
    "PennState": {
      "points": 53,
      "1st downs": 25,
      "rushing 1st downs": 18,
      "passing 1st downs": 7,
      "penalty 1st downs": 0,
      "rushing yards": 396,
      "rushing attempts": 53,
      "passing yards": 133,
      "passing attempts": 20,
      "passing completions": 11,
      "passing interceptions": 1,
      "total yards": 529,
      "total plays": 73,
      "fumbles": 0,
      "fumbles lost": 0,
      "penalties": 2,
      "penalty yards": 15,
      "punts": 3,
      "punt yards": 136,
      "punt returns": 0,
      "punt return yards": 0,
      "kickoff returns": 2,
      "kickoff return yards": 31,
      "interception returns": 2,
      "interception return yards": 28,
      "3rd down conversions": 7,
      "3rd down attempts": 13,
      "4th down conversions": 0,
      "4th down attempts": 2
    }
  },
  "Oklahoma vs LSU": {
    "stadium": "MercedesBenzStadium-Atlanta-GA",
    "Oklahoma": {
      "points": 28,
      "1st downs": 16,
      "rushing 1st downs": 5,
      "passing 1st downs": 9,
      "penalty 1st downs": 2,
      "rushing yards": 97,
      "rushing attempts": 28,
      "passing yards": 225,
      "passing attempts": 34,
      "passing completions": 16,
      "passing interceptions": 1,
      "total yards": 322,
      "total plays": 62,
      "fumbles": 0,
      "fumbles lost": 0,
      "penalties": 8,
      "penalty yards": 62,
      "punts": 5,
      "punt yards": 219,
      "punt returns": 0,
      "punt return yards": 0,
      "kickoff returns": 1,
      "kickoff return yards": 33,
      "interception returns": 0,
      "interception return yards": 0,
      "3rd down conversions": 5,
      "3rd down attempts": 13,
      "4th down conversions": 2,
      "4th down attempts": 3
    },
    "LSU": {
      "points": 63,
      "1st downs": 31,
      "rushing 1st downs": 10,
      "passing 1st downs": 20,
      "penalty 1st downs": 1,
      "rushing yards": 160,
      "rushing attempts": 32,
      "passing yards": 532,
      "passing attempts": 42,
      "passing completions": 32,
      "passing interceptions": 0,
      "total yards": 692,
      "total plays": 74,
      "fumbles": 2,
      "fumbles lost": 0,
      "penalties": 4,
      "penalty yards": 49,
      "punts": 1,
      "punt yards": 34,
      "punt returns": 0,
      "punt return yards": 0,
      "kickoff returns": 1,
      "kickoff return yards": 20,
      "interception returns": 1,
      "interception return yards": 0,
      "3rd down conversions": 7,
      "3rd down attempts": 11,
      "4th down conversions": 1,
      "4th down attempts": 1
    }
  },
  "Clemson vs OhioState": {
    "stadium": "StateFarmStadium-Glendale-AZ",
    "Clemson": {
      "points": 29,
      "1st downs": 21,
      "rushing 1st downs": 7,
      "passing 1st downs": 10,
      "penalty 1st downs": 4,
      "rushing yards": 158,
      "rushing attempts": 29,
      "passing yards": 259,
      "passing attempts": 33,
      "passing completions": 18,
      "passing interceptions": 0,
      "total yards": 417,
      "total plays": 62,
      "fumbles": 0,
      "fumbles lost": 0,
      "penalties": 6,
      "penalty yards": 47,
      "punts": 7,
      "punt yards": 314,
      "punt returns": 3,
      "punt return yards": 4,
      "kickoff returns": 1,
      "kickoff return yards": 16,
      "interception returns": 2,
      "interception return yards": 3,
      "3rd down conversions": 5,
      "3rd down attempts": 14,
      "4th down conversions": 0,
      "4th down attempts": 0
    },
    "OhioState": {
      "points": 23,
      "1st downs": 28,
      "rushing 1st downs": 9,
      "passing 1st downs": 16,
      "penalty 1st downs": 3,
      "rushing yards": 196,
      "rushing attempts": 39,
      "passing yards": 320,
      "passing attempts": 46,
      "passing completions": 30,
      "passing interceptions": 2,
      "total yards": 516,
      "total plays": 85,
      "fumbles": 0,
      "fumbles lost": 0,
      "penalties": 8,
      "penalty yards": 77,
      "punts": 6,
      "punt yards": 272,
      "punt returns": 2,
      "punt return yards": 3,
      "kickoff returns": 0,
      "kickoff return yards": 0,
      "interception returns": 0,
      "interception return yards": 0,
      "3rd down conversions": 7,
      "3rd down attempts": 18,
      "4th down conversions": 1,
      "4th down attempts": 1
    }
  },
  "WesternKentucky vs WesternMichigan": {
    "stadium": "GeraldJFordStadium-Dallas-TX",
    "WesternKentucky": {
      "points": 23,
      "1st downs": 28,
      "rushing 1st downs": 5,
      "passing 1st downs": 20,
      "penalty 1st downs": 3,
      "rushing yards": 123,
      "rushing attempts": 28,
      "passing yards": 358,
      "passing attempts": 52,
      "passing completions": 35,
      "passing interceptions": 2,
      "total yards": 481,
      "total plays": 80,
      "fumbles": 0,
      "fumbles lost": 0,
      "penalties": 4,
      "penalty yards": 56,
      "punts": 3,
      "punt yards": 123,
      "punt returns": 2,
      "punt return yards": 8,
      "kickoff returns": 3,
      "kickoff return yards": 61,
      "interception returns": 1,
      "interception return yards": 0,
      "3rd down conversions": 7,
      "3rd down attempts": 15,
      "4th down conversions": 1,
      "4th down attempts": 2
    },
    "WesternMichigan": {
      "points": 20,
      "1st downs": 19,
      "rushing 1st downs": 7,
      "passing 1st downs": 10,
      "penalty 1st downs": 2,
      "rushing yards": 114,
      "rushing attempts": 31,
      "passing yards": 193,
      "passing attempts": 36,
      "passing completions": 19,
      "passing interceptions": 1,
      "total yards": 307,
      "total plays": 67,
      "fumbles": 1,
      "fumbles lost": 0,
      "penalties": 6,
      "penalty yards": 64,
      "punts": 5,
      "punt yards": 232,
      "punt returns": 2,
      "punt return yards": 5,
      "kickoff returns": 4,
      "kickoff return yards": 107,
      "interception returns": 2,
      "interception return yards": 88,
      "3rd down conversions": 5,
      "3rd down attempts": 15,
      "4th down conversions": 1,
      "4th down attempts": 2
    }
  },
  "California vs Illinois": {
    "stadium": "LevisStadium-SantaClara-CA",
    "California": {
      "points": 35,
      "1st downs": 24,
      "rushing 1st downs": 6,
      "passing 1st downs": 13,
      "penalty 1st downs": 5,
      "rushing yards": 123,
      "rushing attempts": 37,
      "passing yards": 272,
      "passing attempts": 31,
      "passing completions": 22,
      "passing interceptions": 0,
      "total yards": 395,
      "total plays": 68,
      "fumbles": 0,
      "fumbles lost": 0,
      "penalties": 5,
      "penalty yards": 45,
      "punts": 6,
      "punt yards": 271,
      "punt returns": 2,
      "punt return yards": 19,
      "kickoff returns": 3,
      "kickoff return yards": 50,
      "interception returns": 1,
      "interception return yards": 12,
      "3rd down conversions": 6,
      "3rd down attempts": 14,
      "4th down conversions": 1,
      "4th down attempts": 1
    },
    "Illinois": {
      "points": 20,
      "1st downs": 24,
      "rushing 1st downs": 8,
      "passing 1st downs": 14,
      "penalty 1st downs": 2,
      "rushing yards": 165,
      "rushing attempts": 38,
      "passing yards": 285,
      "passing attempts": 39,
      "passing completions": 23,
      "passing interceptions": 1,
      "total yards": 450,
      "total plays": 77,
      "fumbles": 2,
      "fumbles lost": 0,
      "penalties": 10,
      "penalty yards": 89,
      "punts": 5,
      "punt yards": 208,
      "punt returns": 2,
      "punt return yards": 6,
      "kickoff returns": 3,
      "kickoff return yards": 55,
      "interception returns": 0,
      "interception return yards": 0,
      "3rd down conversions": 8,
      "3rd down attempts": 15,
      "4th down conversions": 0,
      "4th down attempts": 1
    }
  },
  "MississippiState vs Louisville": {
    "stadium": "NissanStadium-Nashville-TN",
    "MississippiState": {
      "points": 28,
      "1st downs": 24,
      "rushing 1st downs": 9,
      "passing 1st downs": 12,
      "penalty 1st downs": 3,
      "rushing yards": 145,
      "rushing attempts": 36,
      "passing yards": 221,
      "passing attempts": 26,
      "passing completions": 17,
      "passing interceptions": 0,
      "total yards": 366,
      "total plays": 62,
      "fumbles": 4,
      "fumbles lost": 2,
      "penalties": 2,
      "penalty yards": 20,
      "punts": 5,
      "punt yards": 215,
      "punt returns": 0,
      "punt return yards": 0,
      "kickoff returns": 4,
      "kickoff return yards": 44,
      "interception returns": 0,
      "interception return yards": 0,
      "3rd down conversions": 4,
      "3rd down attempts": 11,
      "4th down conversions": 0,
      "4th down attempts": 1
    },
    "Louisville": {
      "points": 38,
      "1st downs": 23,
      "rushing 1st downs": 9,
      "passing 1st downs": 13,
      "penalty 1st downs": 1,
      "rushing yards": 198,
      "rushing attempts": 44,
      "passing yards": 312,
      "passing attempts": 25,
      "passing completions": 17,
      "passing interceptions": 0,
      "total yards": 510,
      "total plays": 69,
      "fumbles": 1,
      "fumbles lost": 1,
      "penalties": 6,
      "penalty yards": 50,
      "punts": 3,
      "punt yards": 133,
      "punt returns": 1,
      "punt return yards": 0,
      "kickoff returns": 3,
      "kickoff return yards": 65,
      "interception returns": 0,
      "interception return yards": 0,
      "3rd down conversions": 6,
      "3rd down attempts": 11,
      "4th down conversions": 0,
      "4th down attempts": 1
    }
  },
  "Florida vs Virginia": {
    "stadium": "HardRockStadium-MiamiGardens-FL",
    "Florida": {
      "points": 36,
      "1st downs": 25,
      "rushing 1st downs": 12,
      "passing 1st downs": 13,
      "penalty 1st downs": 0,
      "rushing yards": 244,
      "rushing attempts": 34,
      "passing yards": 305,
      "passing attempts": 39,
      "passing completions": 24,
      "passing interceptions": 1,
      "total yards": 549,
      "total plays": 73,
      "fumbles": 0,
      "fumbles lost": 0,
      "penalties": 4,
      "penalty yards": 40,
      "punts": 2,
      "punt yards": 66,
      "punt returns": 1,
      "punt return yards": 2,
      "kickoff returns": 1,
      "kickoff return yards": 21,
      "interception returns": 1,
      "interception return yards": 0,
      "3rd down conversions": 6,
      "3rd down attempts": 13,
      "4th down conversions": 2,
      "4th down attempts": 2
    },
    "Virginia": {
      "points": 28,
      "1st downs": 20,
      "rushing 1st downs": 0,
      "passing 1st downs": 19,
      "penalty 1st downs": 1,
      "rushing yards": 52,
      "rushing attempts": 21,
      "passing yards": 323,
      "passing attempts": 41,
      "passing completions": 28,
      "passing interceptions": 1,
      "total yards": 375,
      "total plays": 62,
      "fumbles": 1,
      "fumbles lost": 0,
      "penalties": 3,
      "penalty yards": 14,
      "punts": 6,
      "punt yards": 289,
      "punt returns": 0,
      "punt return yards": 0,
      "kickoff returns": 2,
      "kickoff return yards": 32,
      "interception returns": 1,
      "interception return yards": 0,
      "3rd down conversions": 5,
      "3rd down attempts": 13,
      "4th down conversions": 1,
      "4th down attempts": 1
    }
  },
  "VirginiaTech vs Kentucky": {
    "stadium": "BankofAmericaStadium-Charlotte-NC",
    "VirginiaTech": {
      "points": 30,
      "1st downs": 20,
      "rushing 1st downs": 10,
      "passing 1st downs": 7,
      "penalty 1st downs": 3,
      "rushing yards": 219,
      "rushing attempts": 33,
      "passing yards": 110,
      "passing attempts": 22,
      "passing completions": 12,
      "passing interceptions": 0,
      "total yards": 329,
      "total plays": 55,
      "fumbles": 1,
      "fumbles lost": 1,
      "penalties": 2,
      "penalty yards": 30,
      "punts": 2,
      "punt yards": 83,
      "punt returns": 2,
      "punt return yards": 11,
      "kickoff returns": 1,
      "kickoff return yards": 21,
      "interception returns": 1,
      "interception return yards": 23,
      "3rd down conversions": 4,
      "3rd down attempts": 11,
      "4th down conversions": 1,
      "4th down attempts": 1
    },
    "Kentucky": {
      "points": 37,
      "1st downs": 22,
      "rushing 1st downs": 16,
      "passing 1st downs": 4,
      "penalty 1st downs": 2,
      "rushing yards": 331,
      "rushing attempts": 55,
      "passing yards": 73,
      "passing attempts": 13,
      "passing completions": 6,
      "passing interceptions": 1,
      "total yards": 404,
      "total plays": 68,
      "fumbles": 3,
      "fumbles lost": 1,
      "penalties": 6,
      "penalty yards": 65,
      "punts": 2,
      "punt yards": 73,
      "punt returns": 1,
      "punt return yards": 10,
      "kickoff returns": 3,
      "kickoff return yards": 59,
      "interception returns": 0,
      "interception return yards": 0,
      "3rd down conversions": 6,
      "3rd down attempts": 13,
      "4th down conversions": 3,
      "4th down attempts": 3
    }
  },
  "FloridaState vs ArizonaState": {
    "stadium": "SunBowlStadium-ElPaso-TX",
    "FloridaState": {
      "points": 14,
      "1st downs": 21,
      "rushing 1st downs": 11,
      "passing 1st downs": 9,
      "penalty 1st downs": 1,
      "rushing yards": 224,
      "rushing attempts": 51,
      "passing yards": 246,
      "passing attempts": 29,
      "passing completions": 16,
      "passing interceptions": 4,
      "total yards": 470,
      "total plays": 80,
      "fumbles": 4,
      "fumbles lost": 2,
      "penalties": 8,
      "penalty yards": 72,
      "punts": 6,
      "punt yards": 249,
      "punt returns": 3,
      "punt return yards": 18,
      "kickoff returns": 0,
      "kickoff return yards": 0,
      "interception returns": 0,
      "interception return yards": 0,
      "3rd down conversions": 2,
      "3rd down attempts": 16,
      "4th down conversions": 2,
      "4th down attempts": 3
    },
    "ArizonaState": {
      "points": 20,
      "1st downs": 13,
      "rushing 1st downs": 4,
      "passing 1st downs": 6,
      "penalty 1st downs": 3,
      "rushing yards": 87,
      "rushing attempts": 37,
      "passing yards": 195,
      "passing attempts": 28,
      "passing completions": 12,
      "passing interceptions": 0,
      "total yards": 282,
      "total plays": 65,
      "fumbles": 3,
      "fumbles lost": 2,
      "penalties": 5,
      "penalty yards": 40,
      "punts": 8,
      "punt yards": 366,
      "punt returns": 1,
      "punt return yards": 3,
      "kickoff returns": 1,
      "kickoff return yards": 20,
      "interception returns": 4,
      "interception return yards": 54,
      "3rd down conversions": 4,
      "3rd down attempts": 17,
      "4th down conversions": 0,
      "4th down attempts": 0
    }
  },
  "Navy vs KansasState": {
    "stadium": "LibertyBowlMemorialStadium-Memphis-TN",
    "Navy": {
      "points": 20,
      "1st downs": 19,
      "rushing 1st downs": 13,
      "passing 1st downs": 4,
      "penalty 1st downs": 2,
      "rushing yards": 323,
      "rushing attempts": 54,
      "passing yards": 98,
      "passing attempts": 9,
      "passing completions": 6,
      "passing interceptions": 0,
      "total yards": 421,
      "total plays": 63,
      "fumbles": 1,
      "fumbles lost": 0,
      "penalties": 7,
      "penalty yards": 55,
      "punts": 3,
      "punt yards": 118,
      "punt returns": 0,
      "punt return yards": 0,
      "kickoff returns": 0,
      "kickoff return yards": 0,
      "interception returns": 0,
      "interception return yards": 0,
      "3rd down conversions": 7,
      "3rd down attempts": 15,
      "4th down conversions": 2,
      "4th down attempts": 2
    },
    "KansasState": {
      "points": 17,
      "1st downs": 10,
      "rushing 1st downs": 5,
      "passing 1st downs": 5,
      "penalty 1st downs": 0,
      "rushing yards": 46,
      "rushing attempts": 27,
      "passing yards": 124,
      "passing attempts": 14,
      "passing completions": 10,
      "passing interceptions": 0,
      "total yards": 170,
      "total plays": 41,
      "fumbles": 4,
      "fumbles lost": 1,
      "penalties": 5,
      "penalty yards": 40,
      "punts": 3,
      "punt yards": 154,
      "punt returns": 1,
      "punt return yards": 66,
      "kickoff returns": 3,
      "kickoff return yards": 79,
      "interception returns": 0,
      "interception return yards": 0,
      "3rd down conversions": 1,
      "3rd down attempts": 8,
      "4th down conversions": 2,
      "4th down attempts": 3
    }
  },
  "GeorgiaState vs Wyoming": {
    "stadium": "ArizonaStadium-Tucson-AZ",
    "GeorgiaState": {
      "points": 17,
      "1st downs": 16,
      "rushing 1st downs": 10,
      "passing 1st downs": 6,
      "penalty 1st downs": 0,
      "rushing yards": 199,
      "rushing attempts": 38,
      "passing yards": 156,
      "passing attempts": 27,
      "passing completions": 13,
      "passing interceptions": 1,
      "total yards": 355,
      "total plays": 65,
      "fumbles": 1,
      "fumbles lost": 0,
      "penalties": 5,
      "penalty yards": 56,
      "punts": 5,
      "punt yards": 186,
      "punt returns": 1,
      "punt return yards": 4,
      "kickoff returns": 0,
      "kickoff return yards": 0,
      "interception returns": 1,
      "interception return yards": 25,
      "3rd down conversions": 3,
      "3rd down attempts": 13,
      "4th down conversions": 1,
      "4th down attempts": 4
    },
    "Wyoming": {
      "points": 38,
      "1st downs": 24,
      "rushing 1st downs": 12,
      "passing 1st downs": 9,
      "penalty 1st downs": 3,
      "rushing yards": 290,
      "rushing attempts": 47,
      "passing yards": 234,
      "passing attempts": 26,
      "passing completions": 11,
      "passing interceptions": 1,
      "total yards": 524,
      "total plays": 73,
      "fumbles": 2,
      "fumbles lost": 2,
      "penalties": 1,
      "penalty yards": 10,
      "punts": 2,
      "punt yards": 76,
      "punt returns": 2,
      "punt return yards": 11,
      "kickoff returns": 2,
      "kickoff return yards": 42,
      "interception returns": 1,
      "interception return yards": 23,
      "3rd down conversions": 11,
      "3rd down attempts": 17,
      "4th down conversions": 0,
      "4th down attempts": 0
    }
  },
  "Utah vs Texas": {
    "stadium": "Alamodome-SanAntonio-TX",
    "Utah": {
      "points": 10,
      "1st downs": 15,
      "rushing 1st downs": 8,
      "passing 1st downs": 5,
      "penalty 1st downs": 2,
      "rushing yards": 128,
      "rushing attempts": 37,
      "passing yards": 126,
      "passing attempts": 23,
      "passing completions": 15,
      "passing interceptions": 0,
      "total yards": 254,
      "total plays": 60,
      "fumbles": 0,
      "fumbles lost": 0,
      "penalties": 8,
      "penalty yards": 53,
      "punts": 7,
      "punt yards": 330,
      "punt returns": 1,
      "punt return yards": 1,
      "kickoff returns": 0,
      "kickoff return yards": 0,
      "interception returns": 1,
      "interception return yards": 0,
      "3rd down conversions": 4,
      "3rd down attempts": 14,
      "4th down conversions": 1,
      "4th down attempts": 2
    },
    "Texas": {
      "points": 38,
      "1st downs": 22,
      "rushing 1st downs": 12,
      "passing 1st downs": 6,
      "penalty 1st downs": 4,
      "rushing yards": 231,
      "rushing attempts": 37,
      "passing yards": 207,
      "passing attempts": 19,
      "passing completions": 13,
      "passing interceptions": 1,
      "total yards": 438,
      "total plays": 56,
      "fumbles": 1,
      "fumbles lost": 0,
      "penalties": 4,
      "penalty yards": 38,
      "punts": 2,
      "punt yards": 94,
      "punt returns": 4,
      "punt return yards": 102,
      "kickoff returns": 1,
      "kickoff return yards": 22,
      "interception returns": 0,
      "interception return yards": 0,
      "3rd down conversions": 4,
      "3rd down attempts": 9,
      "4th down conversions": 0,
      "4th down attempts": 1
    }
  },
  "Minnesota vs Auburn": {
    "stadium": "RaymondJamesStadium-Tampa-FL",
    "Minnesota": {
      "points": 31,
      "1st downs": 23,
      "rushing 1st downs": 12,
      "passing 1st downs": 11,
      "penalty 1st downs": 0,
      "rushing yards": 215,
      "rushing attempts": 45,
      "passing yards": 279,
      "passing attempts": 30,
      "passing completions": 20,
      "passing interceptions": 1,
      "total yards": 494,
      "total plays": 75,
      "fumbles": 1,
      "fumbles lost": 0,
      "penalties": 5,
      "penalty yards": 41,
      "punts": 4,
      "punt yards": 163,
      "punt returns": 1,
      "punt return yards": 1,
      "kickoff returns": 0,
      "kickoff return yards": 0,
      "interception returns": 0,
      "interception return yards": 0,
      "3rd down conversions": 4,
      "3rd down attempts": 14,
      "4th down conversions": 2,
      "4th down attempts": 3
    },
    "Auburn": {
      "points": 24,
      "1st downs": 13,
      "rushing 1st downs": 3,
      "passing 1st downs": 9,
      "penalty 1st downs": 1,
      "rushing yards": 56,
      "rushing attempts": 26,
      "passing yards": 176,
      "passing attempts": 27,
      "passing completions": 17,
      "passing interceptions": 0,
      "total yards": 232,
      "total plays": 53,
      "fumbles": 2,
      "fumbles lost": 1,
      "penalties": 3,
      "penalty yards": 20,
      "punts": 5,
      "punt yards": 215,
      "punt returns": 2,
      "punt return yards": 4,
      "kickoff returns": 5,
      "kickoff return yards": 118,
      "interception returns": 1,
      "interception return yards": 24,
      "3rd down conversions": 3,
      "3rd down attempts": 11,
      "4th down conversions": 1,
      "4th down attempts": 2
    }
  },
  "Michigan vs Alabama": {
    "stadium": "CampingWorldStadium-Orlando-FL",
    "Michigan": {
      "points": 16,
      "1st downs": 23,
      "rushing 1st downs": 13,
      "passing 1st downs": 10,
      "penalty 1st downs": 0,
      "rushing yards": 162,
      "rushing attempts": 43,
      "passing yards": 233,
      "passing attempts": 37,
      "passing completions": 17,
      "passing interceptions": 2,
      "total yards": 395,
      "total plays": 80,
      "fumbles": 1,
      "fumbles lost": 0,
      "penalties": 7,
      "penalty yards": 61,
      "punts": 5,
      "punt yards": 182,
      "punt returns": 1,
      "punt return yards": -2,
      "kickoff returns": 4,
      "kickoff return yards": 122,
      "interception returns": 0,
      "interception return yards": 0,
      "3rd down conversions": 8,
      "3rd down attempts": 18,
      "4th down conversions": 1,
      "4th down attempts": 1
    },
    "Alabama": {
      "points": 35,
      "1st downs": 20,
      "rushing 1st downs": 8,
      "passing 1st downs": 10,
      "penalty 1st downs": 2,
      "rushing yards": 153,
      "rushing attempts": 30,
      "passing yards": 327,
      "passing attempts": 25,
      "passing completions": 16,
      "passing interceptions": 0,
      "total yards": 480,
      "total plays": 55,
      "fumbles": 0,
      "fumbles lost": 0,
      "penalties": 5,
      "penalty yards": 25,
      "punts": 6,
      "punt yards": 254,
      "punt returns": 1,
      "punt return yards": 13,
      "kickoff returns": 1,
      "kickoff return yards": 23,
      "interception returns": 2,
      "interception return yards": 0,
      "3rd down conversions": 4,
      "3rd down attempts": 10,
      "4th down conversions": 0,
      "4th down attempts": 0
    }
  },
  "Oregon vs Wisconsin": {
    "stadium": "RoseBowl-Pasadena-CA",
    "Oregon": {
      "points": 28,
      "1st downs": 13,
      "rushing 1st downs": 5,
      "passing 1st downs": 7,
      "penalty 1st downs": 1,
      "rushing yards": 66,
      "rushing attempts": 30,
      "passing yards": 138,
      "passing attempts": 21,
      "passing completions": 14,
      "passing interceptions": 1,
      "total yards": 204,
      "total plays": 51,
      "fumbles": 1,
      "fumbles lost": 0,
      "penalties": 2,
      "penalty yards": 20,
      "punts": 6,
      "punt yards": 269,
      "punt returns": 1,
      "punt return yards": 4,
      "kickoff returns": 1,
      "kickoff return yards": 32,
      "interception returns": 1,
      "interception return yards": 24,
      "3rd down conversions": 3,
      "3rd down attempts": 10,
      "4th down conversions": 0,
      "4th down attempts": 1
    },
    "Wisconsin": {
      "points": 27,
      "1st downs": 18,
      "rushing 1st downs": 9,
      "passing 1st downs": 8,
      "penalty 1st downs": 1,
      "rushing yards": 136,
      "rushing attempts": 37,
      "passing yards": 186,
      "passing attempts": 35,
      "passing completions": 23,
      "passing interceptions": 1,
      "total yards": 322,
      "total plays": 72,
      "fumbles": 3,
      "fumbles lost": 3,
      "penalties": 9,
      "penalty yards": 79,
      "punts": 3,
      "punt yards": 120,
      "punt returns": 4,
      "punt return yards": 20,
      "kickoff returns": 4,
      "kickoff return yards": 194,
      "interception returns": 1,
      "interception return yards": 0,
      "3rd down conversions": 5,
      "3rd down attempts": 17,
      "4th down conversions": 4,
      "4th down attempts": 5
    }
  },
  "Georgia vs Baylor": {
    "stadium": "MercedesBenzSuperdome-NewOrleans-LA",
    "Georgia": {
      "points": 26,
      "1st downs": 19,
      "rushing 1st downs": 9,
      "passing 1st downs": 9,
      "penalty 1st downs": 1,
      "rushing yards": 130,
      "rushing attempts": 40,
      "passing yards": 250,
      "passing attempts": 30,
      "passing completions": 20,
      "passing interceptions": 0,
      "total yards": 380,
      "total plays": 70,
      "fumbles": 0,
      "fumbles lost": 0,
      "penalties": 6,
      "penalty yards": 82,
      "punts": 7,
      "punt yards": 295,
      "punt returns": 1,
      "punt return yards": 9,
      "kickoff returns": 1,
      "kickoff return yards": 24,
      "interception returns": 2,
      "interception return yards": 5,
      "3rd down conversions": 5,
      "3rd down attempts": 16,
      "4th down conversions": 1,
      "4th down attempts": 1
    },
    "Baylor": {
      "points": 14,
      "1st downs": 21,
      "rushing 1st downs": 4,
      "passing 1st downs": 12,
      "penalty 1st downs": 5,
      "rushing yards": 61,
      "rushing attempts": 28,
      "passing yards": 234,
      "passing attempts": 50,
      "passing completions": 28,
      "passing interceptions": 2,
      "total yards": 295,
      "total plays": 78,
      "fumbles": 2,
      "fumbles lost": 1,
      "penalties": 10,
      "penalty yards": 90,
      "punts": 7,
      "punt yards": 344,
      "punt returns": 2,
      "punt return yards": 26,
      "kickoff returns": 1,
      "kickoff return yards": 13,
      "interception returns": 0,
      "interception return yards": 0,
      "3rd down conversions": 8,
      "3rd down attempts": 19,
      "4th down conversions": 0,
      "4th down attempts": 3
    }
  },
  "BostonCollege vs Cincinnati": {
    "stadium": "LegionField-Birmingham-AL",
    "BostonCollege": {
      "points": 6,
      "1st downs": 8,
      "rushing 1st downs": 5,
      "passing 1st downs": 3,
      "penalty 1st downs": 0,
      "rushing yards": 77,
      "rushing attempts": 28,
      "passing yards": 87,
      "passing attempts": 19,
      "passing completions": 8,
      "passing interceptions": 0,
      "total yards": 164,
      "total plays": 47,
      "fumbles": 2,
      "fumbles lost": 1,
      "penalties": 4,
      "penalty yards": 30,
      "punts": 7,
      "punt yards": 291,
      "punt returns": 0,
      "punt return yards": 0,
      "kickoff returns": 4,
      "kickoff return yards": 72,
      "interception returns": 0,
      "interception return yards": 0,
      "3rd down conversions": 0,
      "3rd down attempts": 11,
      "4th down conversions": 0,
      "4th down attempts": 1
    },
    "Cincinnati": {
      "points": 38,
      "1st downs": 33,
      "rushing 1st downs": 26,
      "passing 1st downs": 7,
      "penalty 1st downs": 0,
      "rushing yards": 343,
      "rushing attempts": 60,
      "passing yards": 116,
      "passing attempts": 31,
      "passing completions": 17,
      "passing interceptions": 0,
      "total yards": 459,
      "total plays": 91,
      "fumbles": 0,
      "fumbles lost": 0,
      "penalties": 2,
      "penalty yards": 5,
      "punts": 4,
      "punt yards": 147,
      "punt returns": 2,
      "punt return yards": 15,
      "kickoff returns": 1,
      "kickoff return yards": 18,
      "interception returns": 0,
      "interception return yards": 0,
      "3rd down conversions": 11,
      "3rd down attempts": 19,
      "4th down conversions": 2,
      "4th down attempts": 2
    }
  },
  "Indiana vs Tennessee": {
    "stadium": "TIAABankField-Jacksonville-FL",
    "Indiana": {
      "points": 22,
      "1st downs": 17,
      "rushing 1st downs": 7,
      "passing 1st downs": 8,
      "penalty 1st downs": 2,
      "rushing yards": 76,
      "rushing attempts": 31,
      "passing yards": 227,
      "passing attempts": 34,
      "passing completions": 20,
      "passing interceptions": 1,
      "total yards": 303,
      "total plays": 65,
      "fumbles": 0,
      "fumbles lost": 0,
      "penalties": 6,
      "penalty yards": 46,
      "punts": 4,
      "punt yards": 185,
      "punt returns": 2,
      "punt return yards": -4,
      "kickoff returns": 2,
      "kickoff return yards": 51,
      "interception returns": 2,
      "interception return yards": 66,
      "3rd down conversions": 4,
      "3rd down attempts": 13,
      "4th down conversions": 1,
      "4th down attempts": 2
    },
    "Tennessee": {
      "points": 23,
      "1st downs": 19,
      "rushing 1st downs": 6,
      "passing 1st downs": 11,
      "penalty 1st downs": 2,
      "rushing yards": 136,
      "rushing attempts": 35,
      "passing yards": 238,
      "passing attempts": 34,
      "passing completions": 19,
      "passing interceptions": 2,
      "total yards": 374,
      "total plays": 69,
      "fumbles": 0,
      "fumbles lost": 0,
      "penalties": 7,
      "penalty yards": 55,
      "punts": 4,
      "punt yards": 151,
      "punt returns": 1,
      "punt return yards": 4,
      "kickoff returns": 1,
      "kickoff return yards": 47,
      "interception returns": 1,
      "interception return yards": 0,
      "3rd down conversions": 6,
      "3rd down attempts": 15,
      "4th down conversions": 0,
      "4th down attempts": 1
    }
  },
  "Ohio vs Nevada": {
    "stadium": "AlbertsonsStadium-Boise-ID",
    "Ohio": {
      "points": 30,
      "1st downs": 25,
      "rushing 1st downs": 16,
      "passing 1st downs": 7,
      "penalty 1st downs": 2,
      "rushing yards": 285,
      "rushing attempts": 50,
      "passing yards": 144,
      "passing attempts": 17,
      "passing completions": 9,
      "passing interceptions": 0,
      "total yards": 429,
      "total plays": 67,
      "fumbles": 2,
      "fumbles lost": 2,
      "penalties": 2,
      "penalty yards": 20,
      "punts": 2,
      "punt yards": 84,
      "punt returns": 3,
      "punt return yards": 22,
      "kickoff returns": 4,
      "kickoff return yards": 78,
      "interception returns": 0,
      "interception return yards": 0,
      "3rd down conversions": 2,
      "3rd down attempts": 11,
      "4th down conversions": 2,
      "4th down attempts": 2
    },
    "Nevada": {
      "points": 21,
      "1st downs": 24,
      "rushing 1st downs": 6,
      "passing 1st downs": 17,
      "penalty 1st downs": 1,
      "rushing yards": 29,
      "rushing attempts": 19,
      "passing yards": 401,
      "passing attempts": 50,
      "passing completions": 32,
      "passing interceptions": 0,
      "total yards": 430,
      "total plays": 69,
      "fumbles": 2,
      "fumbles lost": 2,
      "penalties": 4,
      "penalty yards": 58,
      "punts": 3,
      "punt yards": 139,
      "punt returns": 1,
      "punt return yards": 8,
      "kickoff returns": 4,
      "kickoff return yards": 65,
      "interception returns": 0,
      "interception return yards": 0,
      "3rd down conversions": 3,
      "3rd down attempts": 12,
      "4th down conversions": 2,
      "4th down attempts": 3
    }
  },
  "SouthernMiss vs Tulane": {
    "stadium": "AmonGCarterStadium-FortWorth-TX",
    "SouthernMiss": {
      "points": 13,
      "1st downs": 15,
      "rushing 1st downs": 3,
      "passing 1st downs": 11,
      "penalty 1st downs": 1,
      "rushing yards": 58,
      "rushing attempts": 23,
      "passing yards": 301,
      "passing attempts": 45,
      "passing completions": 26,
      "passing interceptions": 2,
      "total yards": 359,
      "total plays": 68,
      "fumbles": 0,
      "fumbles lost": 0,
      "penalties": 10,
      "penalty yards": 82,
      "punts": 8,
      "punt yards": 318,
      "punt returns": 2,
      "punt return yards": 22,
      "kickoff returns": 3,
      "kickoff return yards": 75,
      "interception returns": 0,
      "interception return yards": 0,
      "3rd down conversions": 6,
      "3rd down attempts": 17,
      "4th down conversions": 0,
      "4th down attempts": 2
    },
    "Tulane": {
      "points": 30,
      "1st downs": 19,
      "rushing 1st downs": 8,
      "passing 1st downs": 8,
      "penalty 1st downs": 3,
      "rushing yards": 164,
      "rushing attempts": 48,
      "passing yards": 215,
      "passing attempts": 18,
      "passing completions": 13,
      "passing interceptions": 0,
      "total yards": 379,
      "total plays": 66,
      "fumbles": 1,
      "fumbles lost": 0,
      "penalties": 6,
      "penalty yards": 50,
      "punts": 6,
      "punt yards": 289,
      "punt returns": 1,
      "punt return yards": 17,
      "kickoff returns": 3,
      "kickoff return yards": 62,
      "interception returns": 2,
      "interception return yards": 29,
      "3rd down conversions": 3,
      "3rd down attempts": 14,
      "4th down conversions": 0,
      "4th down attempts": 1
    }
  },
  "LouisianaLafayette vs MiamiOH": {
    "stadium": "LaddPeeblesStadium-Mobile-AL",
    "LouisianaLafayette": {
      "points": 27,
      "1st downs": 19,
      "rushing 1st downs": 8,
      "passing 1st downs": 9,
      "penalty 1st downs": 2,
      "rushing yards": 155,
      "rushing attempts": 34,
      "passing yards": 246,
      "passing attempts": 26,
      "passing completions": 19,
      "passing interceptions": 0,
      "total yards": 401,
      "total plays": 60,
      "fumbles": 1,
      "fumbles lost": 0,
      "penalties": 9,
      "penalty yards": 53,
      "punts": 4,
      "punt yards": 181,
      "punt returns": 1,
      "punt return yards": 12,
      "kickoff returns": 2,
      "kickoff return yards": 41,
      "interception returns": 0,
      "interception return yards": 0,
      "3rd down conversions": 5,
      "3rd down attempts": 12,
      "4th down conversions": 0,
      "4th down attempts": 0
    },
    "MiamiOH": {
      "points": 17,
      "1st downs": 22,
      "rushing 1st downs": 8,
      "passing 1st downs": 12,
      "penalty 1st downs": 2,
      "rushing yards": 103,
      "rushing attempts": 37,
      "passing yards": 248,
      "passing attempts": 31,
      "passing completions": 22,
      "passing interceptions": 0,
      "total yards": 351,
      "total plays": 68,
      "fumbles": 2,
      "fumbles lost": 1,
      "penalties": 3,
      "penalty yards": 23,
      "punts": 3,
      "punt yards": 140,
      "punt returns": 1,
      "punt return yards": 14,
      "kickoff returns": 5,
      "kickoff return yards": 96,
      "interception returns": 0,
      "interception return yards": 0,
      "3rd down conversions": 6,
      "3rd down attempts": 13,
      "4th down conversions": 0,
      "4th down attempts": 2
    }
  },
  "Clemson vs LSU": {
    "stadium": "MercedesBenzSuperdome-NewOrleans-LA",
    "Clemson": {
      "points": 25,
      "1st downs": 23,
      "rushing 1st downs": 6,
      "passing 1st downs": 11,
      "penalty 1st downs": 6,
      "rushing yards": 160,
      "rushing attempts": 28,
      "passing yards": 234,
      "passing attempts": 37,
      "passing completions": 18,
      "passing interceptions": 0,
      "total yards": 394,
      "total plays": 65,
      "fumbles": 1,
      "fumbles lost": 1,
      "penalties": 7,
      "penalty yards": 65,
      "punts": 9,
      "punt yards": 355,
      "punt returns": 2,
      "punt return yards": 0,
      "kickoff returns": 1,
      "kickoff return yards": 30,
      "interception returns": 0,
      "interception return yards": 0,
      "3rd down conversions": 1,
      "3rd down attempts": 11,
      "4th down conversions": 0,
      "4th down attempts": 0
    },
    "LSU": {
      "points": 42,
      "1st downs": 29,
      "rushing 1st downs": 10,
      "passing 1st downs": 17,
      "penalty 1st downs": 2,
      "rushing yards": 165,
      "rushing attempts": 32,
      "passing yards": 463,
      "passing attempts": 49,
      "passing completions": 31,
      "passing interceptions": 0,
      "total yards": 628,
      "total plays": 81,
      "fumbles": 0,
      "fumbles lost": 0,
      "penalties": 11,
      "penalty yards": 118,
      "punts": 7,
      "punt yards": 312,
      "punt returns": 2,
      "punt return yards": 17,
      "kickoff returns": 0,
      "kickoff return yards": 0,
      "interception returns": 0,
      "interception return yards": 0,
      "3rd down conversions": 4,
      "3rd down attempts": 14,
      "4th down conversions": 1,
      "4th down attempts": 1
    }
  }
}