{
  "Army vs Navy": {
    "stadium": "LincolnFinancialField-Philadelphia-PA",
    "Army": {
      "points": 7,
      "1st downs": 9,
      "rushing 1st downs": 8,
      "passing 1st downs": 1,
      "penalty 1st downs": 0,
      "rushing yards": 123,
      "rushing attempts": 47,
      "passing yards": 25,
      "passing attempts": 6,
      "passing completions": 3,
      "passing interceptions": 1,
      "total yards": 148,
      "total plays": 53,
      "fumbles": 4,
      "fumbles lost": 1,
      "penalties": 3,
      "penalty yards": 18,
      "punts": 5,
      "punt yards": 230,
      "punt returns": 2,
      "punt return yards": 9,
      "kickoff returns": 4,
      "kickoff return yards": 42,
      "interception returns": 0,
      "interception return yards": 0,
      "3rd down conversions": 4,
      "3rd down attempts": 14,
      "4th down conversions": 2,
      "4th down attempts": 3
    },
    "Navy": {
      "points": 31,
      "1st downs": 17,
      "rushing 1st downs": 17,
      "passing 1st downs": 0,
      "penalty 1st downs": 0,
      "rushing yards": 395,
      "rushing attempts": 55,
      "passing yards": 1,
      "passing attempts": 1,
      "passing completions": 1,
      "passing interceptions": 0,
      "total yards": 396,
      "total plays": 56,
      "fumbles": 0,
      "fumbles lost": 0,
      "penalties": 1,
      "penalty yards": 15,
      "punts": 3,
      "punt yards": 106,
      "punt returns": 1,
      "punt return yards": 7,
      "kickoff returns": 0,
      "kickoff return yards": 0,
      "interception returns": 1,
      "interception return yards": 6,
      "3rd down conversions": 7,
      "3rd down attempts": 12,
      "4th down conversions": 0,
      "4th down attempts": 0
    }
  }
}