{
  "games": [
    {"game": {
      "away": {
        "conferenceNames": {
          "conferenceDisplay": "Conference USA",
          "conferenceDivision": "fbs",
          "conferenceName": "C-USA",
          "conferenceSeo": "conference-usa"
        },
        "description": "(-)",
        "names": {
          "char6": "LATECH",
          "full": "Louisiana Tech University",
          "seo": "louisiana-tech",
          "short": "Louisiana Tech"
        },
        "rank": "",
        "score": "0",
        "seed": "",
        "winner": true
      },
      "bracketId": "",
      "bracketRegion": "",
      "bracketRound": "",
      "contestClock": "",
      "currentPeriod": "Final",
      "finalMessage": "Final",
      "gameID": "6c98a0c5-ee3c-4d74-8bd5-3cbadf99b88d",
      "gameState": "final",
      "home": {
        "conferenceNames": {
          "conferenceDisplay": "Conference USA",
          "conferenceDivision": "fbs",
          "conferenceName": "C-USA",
          "conferenceSeo": "conference-usa"
        },
        "description": "(-)",
        "names": {
          "char6": "NO TEX",
          "full": "University of North Texas",
          "seo": "north-texas",
          "short": "North Texas"
        },
        "rank": "",
        "score": "0",
        "seed": "",
        "winner": true
      },
      "liveVideoEnabled": false,
      "network": "",
      "startDate": "09-11-2014",
      "startTime": "08:00PM ET",
      "startTimeEpoch": "1410480000",
      "title": "North Texas Louisiana Tech",
      "url": "/game/football/fbs/2014/09/11/louisiana-tech-north-texas",
      "videoState": ""
    }},
    {"game": {
      "away": {
        "conferenceNames": {
          "conferenceDisplay": "American Athletic Conference",
          "conferenceDivision": "fbs",
          "conferenceName": "AAC",
          "conferenceSeo": "american-athletic"
        },
        "description": "(1-2)",
        "names": {
          "char6": "HOU",
          "full": "University of Houston",
          "seo": "houston",
          "short": "Houston"
        },
        "rank": "",
        "score": "25",
        "seed": "",
        "winner": false
      },
      "bracketId": "",
      "bracketRegion": "",
      "bracketRound": "",
      "contestClock": "0:00",
      "currentPeriod": "Final",
      "finalMessage": "Final",
      "gameID": "207930af-c11f-4015-b7b9-7e2b68f2148a",
      "gameState": "final",
      "home": {
        "conferenceNames": {
          "conferenceDisplay": "FBS Independent",
          "conferenceDivision": "fbs",
          "conferenceName": "IND",
          "conferenceSeo": "fbs-independent"
        },
        "description": "(3-0)",
        "names": {
          "char6": "BYU",
          "full": "Brigham Young University",
          "seo": "byu",
          "short": "BYU"
        },
        "rank": "25",
        "score": "33",
        "seed": "",
        "winner": true
      },
      "liveVideoEnabled": false,
      "network": "",
      "startDate": "09-11-2014",
      "startTime": "09:00PM ET",
      "startTimeEpoch": "1410483600",
      "title": "BYU Houston",
      "url": "/game/football/fbs/2014/09/11/houston-byu",
      "videoState": ""
    }},
    {"game": {
      "away": {
        "conferenceNames": {
          "conferenceDisplay": "Mid-American Conference",
          "conferenceDivision": "fbs",
          "conferenceName": "MAC",
          "conferenceSeo": "mid-american"
        },
        "description": "(1-2)",
        "names": {
          "char6": "TOLEDO",
          "full": "University of Toledo",
          "seo": "toledo",
          "short": "Toledo"
        },
        "rank": "",
        "score": "34",
        "seed": "",
        "winner": false
      },
      "bracketId": "",
      "bracketRegion": "",
      "bracketRound": "",
      "contestClock": "0:00",
      "currentPeriod": "Final",
      "finalMessage": "Final",
      "gameID": "ee51f42f-b99e-4cb0-93c9-ddf974fbbd52",
      "gameState": "final",
      "home": {
        "conferenceNames": {
          "conferenceDisplay": "American Athletic Conference",
          "conferenceDivision": "fbs",
          "conferenceName": "AAC",
          "conferenceSeo": "american-athletic"
        },
        "description": "(1-0)",
        "names": {
          "char6": "CINCY",
          "full": "University of Cincinnati",
          "seo": "cincinnati",
          "short": "Cincinnati"
        },
        "rank": "",
        "score": "58",
        "seed": "",
        "winner": true
      },
      "liveVideoEnabled": false,
      "network": "",
      "startDate": "09-12-2014",
      "startTime": "07:00PM ET",
      "startTimeEpoch": "1410562800",
      "title": "Cincinnati Toledo",
      "url": "/game/football/fbs/2014/09/12/toledo-cincinnati",
      "videoState": ""
    }},
    {"game": {
      "away": {
        "conferenceNames": {
          "conferenceDisplay": "Big 12 Conference",
          "conferenceDivision": "fbs",
          "conferenceName": "Big 12",
          "conferenceSeo": "big-12"
        },
        "description": "(3-0)",
        "names": {
          "char6": "BAYLOR",
          "full": "Baylor University",
          "seo": "baylor",
          "short": "Baylor"
        },
        "rank": "8",
        "score": "63",
        "seed": "",
        "winner": true
      },
      "bracketId": "",
      "bracketRegion": "",
      "bracketRound": "",
      "contestClock": "0:00",
      "currentPeriod": "Final",
      "finalMessage": "Final",
      "gameID": "a1391165-8511-4400-8610-296592c6d43f",
      "gameState": "final",
      "home": {
        "conferenceNames": {
          "conferenceDisplay": "Mid-American Conference",
          "conferenceDivision": "fbs",
          "conferenceName": "MAC",
          "conferenceSeo": "mid-american"
        },
        "description": "(1-2)",
        "names": {
          "char6": "BUFF",
          "full": "University at Buffalo, the State University of New York",
          "seo": "buffalo",
          "short": "Buffalo"
        },
        "rank": "",
        "score": "21",
        "seed": "",
        "winner": false
      },
      "liveVideoEnabled": false,
      "network": "",
      "startDate": "09-12-2014",
      "startTime": "08:00PM ET",
      "startTimeEpoch": "1410566400",
      "title": "Buffalo Baylor",
      "url": "/game/football/fbs/2014/09/12/baylor-buffalo",
      "videoState": ""
    }},
    {"game": {
      "away": {
        "conferenceNames": {
          "conferenceDisplay": "American Athletic Conference",
          "conferenceDivision": "fbs",
          "conferenceName": "AAC",
          "conferenceSeo": "american-athletic"
        },
        "description": "(2-1)",
        "names": {
          "char6": "E CAR",
          "full": "East Carolina University",
          "seo": "east-carolina",
          "short": "East Carolina"
        },
        "rank": "",
        "score": "28",
        "seed": "",
        "winner": true
      },
      "bracketId": "",
      "bracketRegion": "",
      "bracketRound": "",
      "contestClock": "0:00",
      "currentPeriod": "Final",
      "finalMessage": "Final",
      "gameID": "54f7250c-408a-4fc2-acba-cc0584463c11",
      "gameState": "final",
      "home": {
        "conferenceNames": {
          "conferenceDisplay": "Atlantic Coast Conference",
          "conferenceDivision": "fbs",
          "conferenceName": "ACC",
          "conferenceSeo": "atlantic-coast"
        },
        "description": "(2-1)",
        "names": {
          "char6": "VATECH",
          "full": "Virginia Polytechnic Institute & State University",
          "seo": "virginia-tech",
          "short": "Virginia Tech"
        },
        "rank": "17",
        "score": "21",
        "seed": "",
        "winner": false
      },
      "liveVideoEnabled": false,
      "network": "",
      "startDate": "09-13-2014",
      "startTime": "12:00PM ET",
      "startTimeEpoch": "1410624000",
      "title": "Virginia Tech East Carolina",
      "url": "/game/football/fbs/2014/09/13/east-carolina-virginia-tech",
      "videoState": ""
    }},
    {"game": {
      "away": {
        "conferenceNames": {
          "conferenceDisplay": "Big 12 Conference",
          "conferenceDivision": "fbs",
          "conferenceName": "Big 12",
          "conferenceSeo": "big-12"
        },
        "description": "(2-1)",
        "names": {
          "char6": "WVU",
          "full": "West Virginia University",
          "seo": "west-virginia",
          "short": "West Virginia"
        },
        "rank": "",
        "score": "40",
        "seed": "",
        "winner": true
      },
      "bracketId": "",
      "bracketRegion": "",
      "bracketRound": "",
      "contestClock": "0:00",
      "currentPeriod": "Final",
      "finalMessage": "Final",
      "gameID": "b4515374-69da-45cc-b04f-3e96768d8c8d",
      "gameState": "final",
      "home": {
        "conferenceNames": {
          "conferenceDisplay": "Big Ten Conference",
          "conferenceDivision": "fbs",
          "conferenceName": "Big Ten",
          "conferenceSeo": "big-ten"
        },
        "description": "(2-1)",
        "names": {
          "char6": "MD",
          "full": "University of Maryland, College Park",
          "seo": "maryland",
          "short": "Maryland"
        },
        "rank": "",
        "score": "37",
        "seed": "",
        "winner": false
      },
      "liveVideoEnabled": false,
      "network": "",
      "startDate": "09-13-2014",
      "startTime": "12:00PM ET",
      "startTimeEpoch": "1410624000",
      "title": "Maryland West Virginia",
      "url": "/game/football/fbs/2014/09/13/west-virginia-maryland",
      "videoState": ""
    }},
    {"game": {
      "away": {
        "conferenceNames": {
          "conferenceDisplay": "American Athletic Conference",
          "conferenceDivision": "fbs",
          "conferenceName": "AAC",
          "conferenceSeo": "american-athletic"
        },
        "description": "(0-2)",
        "names": {
          "char6": "UCF",
          "full": "University of Central Florida",
          "seo": "ucf",
          "short": "UCF"
        },
        "rank": "",
        "score": "10",
        "seed": "",
        "winner": false
      },
      "bracketId": "",
      "bracketRegion": "",
      "bracketRound": "",
      "contestClock": "0:00",
      "currentPeriod": "Final",
      "finalMessage": "Final",
      "gameID": "11cf9aac-1ed7-4962-a296-5fcfc5febefe",
      "gameState": "final",
      "home": {
        "conferenceNames": {
          "conferenceDisplay": "Southeastern Conference",
          "conferenceDivision": "fbs",
          "conferenceName": "SEC",
          "conferenceSeo": "southeastern"
        },
        "description": "(3-0)",
        "names": {
          "char6": "MIZZOU",
          "full": "University of Missouri, Columbia",
          "seo": "missouri",
          "short": "Missouri"
        },
        "rank": "20",
        "score": "38",
        "seed": "",
        "winner": true
      },
      "liveVideoEnabled": false,
      "network": "",
      "startDate": "09-13-2014",
      "startTime": "12:00PM ET",
      "startTimeEpoch": "1410624000",
      "title": "Missouri UCF",
      "url": "/game/football/fbs/2014/09/13/ucf-missouri",
      "videoState": ""
    }},
    {"game": {
      "away": {
        "conferenceNames": {
          "conferenceDisplay": "Mountain West Conference",
          "conferenceDivision": "fbs",
          "conferenceName": "MWC",
          "conferenceSeo": "mountain-west"
        },
        "description": "(2-1)",
        "names": {
          "char6": "BOISE",
          "full": "Boise State University",
          "seo": "boise-st",
          "short": "Boise St."
        },
        "rank": "",
        "score": "38",
        "seed": "",
        "winner": true
      },
      "bracketId": "",
      "bracketRegion": "",
      "bracketRound": "",
      "contestClock": "0:00",
      "currentPeriod": "Final",
      "finalMessage": "Final",
      "gameID": "97b474c7-4772-44e3-968c-bf4f27975639",
      "gameState": "final",
      "home": {
        "conferenceNames": {
          "conferenceDisplay": "American Athletic Conference",
          "conferenceDivision": "fbs",
          "conferenceName": "AAC",
          "conferenceSeo": "american-athletic"
        },
        "description": "(1-2)",
        "names": {
          "char6": "UCONN",
          "full": "University of Connecticut",
          "seo": "uconn",
          "short": "UConn"
        },
        "rank": "",
        "score": "21",
        "seed": "",
        "winner": false
      },
      "liveVideoEnabled": false,
      "network": "",
      "startDate": "09-13-2014",
      "startTime": "12:00PM ET",
      "startTimeEpoch": "1410624000",
      "title": "UConn Boise St.",
      "url": "/game/football/fbs/2014/09/13/boise-st-uconn",
      "videoState": ""
    }},
    {"game": {
      "away": {
        "conferenceNames": {
          "conferenceDisplay": "Mid-American Conference",
          "conferenceDivision": "fbs",
          "conferenceName": "MAC",
          "conferenceSeo": "mid-american"
        },
        "description": "(1-2)",
        "names": {
          "char6": "OHIO",
          "full": "Ohio University",
          "seo": "ohio",
          "short": "Ohio"
        },
        "rank": "",
        "score": "14",
        "seed": "",
        "winner": false
      },
      "bracketId": "",
      "bracketRegion": "",
      "bracketRound": "",
      "contestClock": "0:00",
      "currentPeriod": "Final",
      "finalMessage": "Final",
      "gameID": "aec2d5c9-ad26-419c-9085-36c7a899a395",
      "gameState": "final",
      "home": {
        "conferenceNames": {
          "conferenceDisplay": "Conference USA",
          "conferenceDivision": "fbs",
          "conferenceName": "C-USA",
          "conferenceSeo": "conference-usa"
        },
        "description": "(3-0)",
        "names": {
          "char6": "MARSH",
          "full": "Marshall University",
          "seo": "marshall",
          "short": "Marshall"
        },
        "rank": "",
        "score": "44",
        "seed": "",
        "winner": true
      },
      "liveVideoEnabled": false,
      "network": "",
      "startDate": "09-13-2014",
      "startTime": "12:00PM ET",
      "startTimeEpoch": "1410624000",
      "title": "Marshall Ohio",
      "url": "/game/football/fbs/2014/09/13/ohio-marshall",
      "videoState": ""
    }},
    {"game": {
      "away": {
        "conferenceNames": {
          "conferenceDisplay": "Atlantic Coast Conference",
          "conferenceDivision": "fbs",
          "conferenceName": "ACC",
          "conferenceSeo": "atlantic-coast"
        },
        "description": "(2-0)",
        "names": {
          "char6": "SYR",
          "full": "Syracuse University",
          "seo": "syracuse",
          "short": "Syracuse"
        },
        "rank": "",
        "score": "40",
        "seed": "",
        "winner": true
      },
      "bracketId": "",
      "bracketRegion": "",
      "bracketRound": "",
      "contestClock": "0:00",
      "currentPeriod": "Final",
      "finalMessage": "Final",
      "gameID": "fbbd8a20-a82e-481e-b1dd-74618a86726a",
      "gameState": "final",
      "home": {
        "conferenceNames": {
          "conferenceDisplay": "Mid-American Conference",
          "conferenceDivision": "fbs",
          "conferenceName": "MAC",
          "conferenceSeo": "mid-american"
        },
        "description": "(2-1)",
        "names": {
          "char6": "C MICH",
          "full": "Central Michigan University",
          "seo": "central-mich",
          "short": "Central Mich."
        },
        "rank": "",
        "score": "3",
        "seed": "",
        "winner": false
      },
      "liveVideoEnabled": false,
      "network": "",
      "startDate": "09-13-2014",
      "startTime": "12:00PM ET",
      "startTimeEpoch": "1410624000",
      "title": "Central Mich. Syracuse",
      "url": "/game/football/fbs/2014/09/13/syracuse-central-mich",
      "videoState": ""
    }},
    {"game": {
      "away": {
        "conferenceNames": {
          "conferenceDisplay": "Atlantic Coast Conference",
          "conferenceDivision": "fbs",
          "conferenceName": "ACC",
          "conferenceSeo": "atlantic-coast"
        },
        "description": "(3-0)",
        "names": {
          "char6": "PITT",
          "full": "University of Pittsburgh",
          "seo": "pittsburgh",
          "short": "Pittsburgh"
        },
        "rank": "",
        "score": "42",
        "seed": "",
        "winner": true
      },
      "bracketId": "",
      "bracketRegion": "",
      "bracketRound": "",
      "contestClock": "0:00",
      "currentPeriod": "Final",
      "finalMessage": "Final",
      "gameID": "4e314c51-8741-4891-bd14-ee452571ad78",
      "gameState": "final",
      "home": {
        "conferenceNames": {
          "conferenceDisplay": "Conference USA",
          "conferenceDivision": "fbs",
          "conferenceName": "C-USA",
          "conferenceSeo": "conference-usa"
        },
        "description": "(1-2)",
        "names": {
          "char6": "FIU",
          "full": "Florida International University",
          "seo": "fiu",
          "short": "FIU"
        },
        "rank": "",
        "score": "25",
        "seed": "",
        "winner": false
      },
      "liveVideoEnabled": false,
      "network": "",
      "startDate": "09-13-2014",
      "startTime": "12:00PM ET",
      "startTimeEpoch": "1410624000",
      "title": "FIU Pittsburgh",
      "url": "/game/football/fbs/2014/09/13/pittsburgh-fiu",
      "videoState": ""
    }},
    {"game": {
      "away": {
        "conferenceNames": {
          "conferenceDisplay": "Mid-American Conference",
          "conferenceDivision": "fbs",
          "conferenceName": "MAC",
          "conferenceSeo": "mid-american"
        },
        "description": "(0-3)",
        "names": {
          "char6": "KENT",
          "full": "Kent State University",
          "seo": "kent-st",
          "short": "Kent St."
        },
        "rank": "",
        "score": "0",
        "seed": "",
        "winner": false
      },
      "bracketId": "",
      "bracketRegion": "",
      "bracketRound": "",
      "contestClock": "0:00",
      "currentPeriod": "Final",
      "finalMessage": "Final",
      "gameID": "44cfd09a-038e-4f59-bf03-af88e795c84d",
      "gameState": "final",
      "home": {
        "conferenceNames": {
          "conferenceDisplay": "Big Ten Conference",
          "conferenceDivision": "fbs",
          "conferenceName": "Big Ten",
          "conferenceSeo": "big-ten"
        },
        "description": "(2-1)",
        "names": {
          "char6": "OHIOST",
          "full": "The Ohio State University",
          "seo": "ohio-st",
          "short": "Ohio St."
        },
        "rank": "22",
        "score": "66",
        "seed": "",
        "winner": true
      },
      "liveVideoEnabled": false,
      "network": "",
      "startDate": "09-13-2014",
      "startTime": "12:00PM ET",
      "startTimeEpoch": "1410624000",
      "title": "Ohio St. Kent St.",
      "url": "/game/football/fbs/2014/09/13/kent-st-ohio-st",
      "videoState": ""
    }},
    {"game": {
      "away": {
        "conferenceNames": {
          "conferenceDisplay": "FBS Independent",
          "conferenceDivision": "fbs",
          "conferenceName": "IND",
          "conferenceSeo": "fbs-independent"
        },
        "description": "(0-3)",
        "names": {
          "char6": "UMASS",
          "full": "University of Massachusetts, Amherst",
          "seo": "massachusetts",
          "short": "Massachusetts"
        },
        "rank": "",
        "score": "31",
        "seed": "",
        "winner": false
      },
      "bracketId": "",
      "bracketRegion": "",
      "bracketRound": "",
      "contestClock": "0:00",
      "currentPeriod": "Final",
      "finalMessage": "Final",
      "gameID": "dd64110f-fbb5-4bdb-995c-0b75a5904010",
      "gameState": "final",
      "home": {
        "conferenceNames": {
          "conferenceDisplay": "Southeastern Conference",
          "conferenceDivision": "fbs",
          "conferenceName": "SEC",
          "conferenceSeo": "southeastern"
        },
        "description": "(1-2)",
        "names": {
          "char6": "VANDY",
          "full": "Vanderbilt University",
          "seo": "vanderbilt",
          "short": "Vanderbilt"
        },
        "rank": "",
        "score": "34",
        "seed": "",
        "winner": true
      },
      "liveVideoEnabled": false,
      "network": "",
      "startDate": "09-13-2014",
      "startTime": "12:00PM ET",
      "startTimeEpoch": "1410624000",
      "title": "Vanderbilt Massachusetts",
      "url": "/game/football/fbs/2014/09/13/massachusetts-vanderbilt",
      "videoState": ""
    }},
    {"game": {
      "away": {
        "conferenceNames": {
          "conferenceDisplay": "Big Ten Conference",
          "conferenceDivision": "fbs",
          "conferenceName": "Big Ten",
          "conferenceSeo": "big-ten"
        },
        "description": "(1-1)",
        "names": {
          "char6": "IND",
          "full": "Indiana University, Bloomington",
          "seo": "indiana",
          "short": "Indiana"
        },
        "rank": "",
        "score": "42",
        "seed": "",
        "winner": false
      },
      "bracketId": "",
      "bracketRegion": "",
      "bracketRound": "",
      "contestClock": "0:00",
      "currentPeriod": "Final",
      "finalMessage": "Final",
      "gameID": "cd90b613-7fa6-4353-8285-432497368c7c",
      "gameState": "final",
      "home": {
        "conferenceNames": {
          "conferenceDisplay": "Mid-American Conference",
          "conferenceDivision": "fbs",
          "conferenceName": "MAC",
          "conferenceSeo": "mid-american"
        },
        "description": "(2-1)",
        "names": {
          "char6": "BGSU",
          "full": "Bowling Green State University",
          "seo": "bowling-green",
          "short": "Bowling Green"
        },
        "rank": "",
        "score": "45",
        "seed": "",
        "winner": true
      },
      "liveVideoEnabled": false,
      "network": "",
      "startDate": "09-13-2014",
      "startTime": "12:00PM ET",
      "startTimeEpoch": "1410624000",
      "title": "Bowling Green Indiana",
      "url": "/game/football/fbs/2014/09/13/indiana-bowling-green",
      "videoState": ""
    }},
    {"game": {
      "away": {
        "conferenceNames": {
          "conferenceDisplay": "Sun Belt Conference",
          "conferenceDivision": "fbs",
          "conferenceName": "Sun Belt",
          "conferenceSeo": "sun-belt"
        },
        "description": "(1-2)",
        "names": {
          "char6": "GA SOU",
          "full": "Georgia Southern University",
          "seo": "ga-southern",
          "short": "Ga. Southern"
        },
        "rank": "",
        "score": "38",
        "seed": "",
        "winner": false
      },
      "bracketId": "",
      "bracketRegion": "",
      "bracketRound": "",
      "contestClock": "0:00",
      "currentPeriod": "Final",
      "finalMessage": "Final",
      "gameID": "6a2fc626-d58c-4b5d-9751-570dba775edb",
      "gameState": "final",
      "home": {
        "conferenceNames": {
          "conferenceDisplay": "Atlantic Coast Conference",
          "conferenceDivision": "fbs",
          "conferenceName": "ACC",
          "conferenceSeo": "atlantic-coast"
        },
        "description": "(3-0)",
        "names": {
          "char6": "GATECH",
          "full": "Georgia Institute of Technology",
          "seo": "georgia-tech",
          "short": "Georgia Tech"
        },
        "rank": "",
        "score": "42",
        "seed": "",
        "winner": true
      },
      "liveVideoEnabled": false,
      "network": "",
      "startDate": "09-13-2014",
      "startTime": "12:00PM ET",
      "startTimeEpoch": "1410624000",
      "title": "Georgia Tech Ga. Southern",
      "url": "/game/football/fbs/2014/09/13/ga-southern-georgia-tech",
      "videoState": ""
    }},
    {"game": {
      "away": {
        "conferenceNames": {
          "conferenceDisplay": "Atlantic Coast Conference",
          "conferenceDivision": "fbs",
          "conferenceName": "ACC",
          "conferenceSeo": "atlantic-coast"
        },
        "description": "(2-1)",
        "names": {
          "char6": "LOUIS",
          "full": "University of Louisville",
          "seo": "louisville",
          "short": "Louisville"
        },
        "rank": "21",
        "score": "21",
        "seed": "",
        "winner": false
      },
      "bracketId": "",
      "bracketRegion": "",
      "bracketRound": "",
      "contestClock": "0:00",
      "currentPeriod": "Final",
      "finalMessage": "Final",
      "gameID": "9bed332d-2215-42fc-8c7a-cbee125c131b",
      "gameState": "final",
      "home": {
        "conferenceNames": {
          "conferenceDisplay": "Atlantic Coast Conference",
          "conferenceDivision": "fbs",
          "conferenceName": "ACC",
          "conferenceSeo": "atlantic-coast"
        },
        "description": "(2-1)",
        "names": {
          "char6": "UVA",
          "full": "University of Virginia",
          "seo": "virginia",
          "short": "Virginia"
        },
        "rank": "",
        "score": "23",
        "seed": "",
        "winner": true
      },
      "liveVideoEnabled": false,
      "network": "",
      "startDate": "09-13-2014",
      "startTime": "12:30PM ET",
      "startTimeEpoch": "1410625800",
      "title": "Virginia Louisville",
      "url": "/game/football/fbs/2014/09/13/louisville-virginia",
      "videoState": ""
    }},
    {"game": {
      "away": {
        "conferenceNames": {
          "conferenceDisplay": "Mountain West Conference",
          "conferenceDivision": "fbs",
          "conferenceName": "MWC",
          "conferenceSeo": "mountain-west"
        },
        "description": "(2-1)",
        "names": {
          "char6": "AIRFOR",
          "full": "U.S. Air Force Academy",
          "seo": "air-force",
          "short": "Air Force"
        },
        "rank": "",
        "score": "48",
        "seed": "",
        "winner": true
      },
      "bracketId": "",
      "bracketRegion": "",
      "bracketRound": "",
      "contestClock": "0:00",
      "currentPeriod": "Final",
      "finalMessage": "Final",
      "gameID": "0a4a1485-ec70-4f21-ad60-256a5c160e5b",
      "gameState": "final",
      "home": {
        "conferenceNames": {
          "conferenceDisplay": "Sun Belt Conference",
          "conferenceDivision": "fbs",
          "conferenceName": "Sun Belt",
          "conferenceSeo": "sun-belt"
        },
        "description": "(1-2)",
        "names": {
          "char6": "GA ST",
          "full": "Georgia State University",
          "seo": "georgia-st",
          "short": "Georgia St."
        },
        "rank": "",
        "score": "38",
        "seed": "",
        "winner": false
      },
      "liveVideoEnabled": false,
      "network": "",
      "startDate": "09-13-2014",
      "startTime": "02:00PM ET",
      "startTimeEpoch": "1410631200",
      "title": "Georgia St. Air Force",
      "url": "/game/football/fbs/2014/09/13/air-force-georgia-st",
      "videoState": ""
    }},
    {"game": {
      "away": {
        "conferenceNames": {
          "conferenceDisplay": "Mountain West Conference",
          "conferenceDivision": "fbs",
          "conferenceName": "MWC",
          "conferenceSeo": "mountain-west"
        },
        "description": "(2-1)",
        "names": {
          "char6": "WYO",
          "full": "University of Wyoming",
          "seo": "wyoming",
          "short": "Wyoming"
        },
        "rank": "",
        "score": "14",
        "seed": "",
        "winner": false
      },
      "bracketId": "",
      "bracketRegion": "",
      "bracketRound": "",
      "contestClock": "0:00",
      "currentPeriod": "Final",
      "finalMessage": "Final",
      "gameID": "4a88bbbb-f652-47a0-9294-2380a7886fcc",
      "gameState": "final",
      "home": {
        "conferenceNames": {
          "conferenceDisplay": "Pac-12 Conference",
          "conferenceDivision": "fbs",
          "conferenceName": "Pac-12",
          "conferenceSeo": "pac-12"
        },
        "description": "(3-0)",
        "names": {
          "char6": "OREGN",
          "full": "University of Oregon",
          "seo": "oregon",
          "short": "Oregon"
        },
        "rank": "2",
        "score": "48",
        "seed": "",
        "winner": true
      },
      "liveVideoEnabled": false,
      "network": "",
      "startDate": "09-13-2014",
      "startTime": "02:00PM ET",
      "startTimeEpoch": "1410631200",
      "title": "Oregon Wyoming",
      "url": "/game/football/fbs/2014/09/13/wyoming-oregon",
      "videoState": ""
    }},
    {"game": {
      "away": {
        "conferenceNames": {
          "conferenceDisplay": "Missouri Valley Football Conference",
          "conferenceDivision": "fcs",
          "conferenceName": "Missouri Valley",
          "conferenceSeo": "mvfc"
        },
        "description": "(2-1)",
        "names": {
          "char6": "IND ST",
          "full": "Indiana State University",
          "seo": "indiana-st",
          "short": "Indiana St."
        },
        "rank": "",
        "score": "27",
        "seed": "",
        "winner": true
      },
      "bracketId": "",
      "bracketRegion": "",
      "bracketRound": "",
      "contestClock": "0:00",
      "currentPeriod": "Final",
      "finalMessage": "Final",
      "gameID": "3099d070-2410-466f-84dc-76864ac04d06",
      "gameState": "final",
      "home": {
        "conferenceNames": {
          "conferenceDisplay": "Mid-American Conference",
          "conferenceDivision": "fbs",
          "conferenceName": "MAC",
          "conferenceSeo": "mid-american"
        },
        "description": "(1-2)",
        "names": {
          "char6": "BALLST",
          "full": "Ball State University",
          "seo": "ball-st",
          "short": "Ball St."
        },
        "rank": "",
        "score": "20",
        "seed": "",
        "winner": false
      },
      "liveVideoEnabled": false,
      "network": "",
      "startDate": "09-13-2014",
      "startTime": "03:00PM ET",
      "startTimeEpoch": "1410634800",
      "title": "Ball St. Indiana St.",
      "url": "/game/football/fbs/2014/09/13/indiana-st-ball-st",
      "videoState": ""
    }},
    {"game": {
      "away": {
        "conferenceNames": {
          "conferenceDisplay": "Big Sky Conference",
          "conferenceDivision": "fcs",
          "conferenceName": "Big Sky",
          "conferenceSeo": "big-sky"
        },
        "description": "(1-2)",
        "names": {
          "char6": "UC DAV",
          "full": "University of California, Davis",
          "seo": "uc-davis",
          "short": "UC Davis"
        },
        "rank": "",
        "score": "21",
        "seed": "",
        "winner": false
      },
      "bracketId": "",
      "bracketRegion": "",
      "bracketRound": "",
      "contestClock": "0:00",
      "currentPeriod": "Final",
      "finalMessage": "Final",
      "gameID": "b3f137f9-0d14-4bcf-b953-76ea793efac3",
      "gameState": "final",
      "home": {
        "conferenceNames": {
          "conferenceDisplay": "Mountain West Conference",
          "conferenceDivision": "fbs",
          "conferenceName": "MWC",
          "conferenceSeo": "mountain-west"
        },
        "description": "(2-1)",
        "names": {
          "char6": "CO ST",
          "full": "Colorado State University",
          "seo": "colorado-st",
          "short": "Colorado St."
        },
        "rank": "",
        "score": "49",
        "seed": "",
        "winner": true
      },
      "liveVideoEnabled": false,
      "network": "",
      "startDate": "09-13-2014",
      "startTime": "03:00PM ET",
      "startTimeEpoch": "1410634800",
      "title": "Colorado St. UC Davis",
      "url": "/game/football/fbs/2014/09/13/uc-davis-colorado-st",
      "videoState": ""
    }},
    {"game": {
      "away": {
        "conferenceNames": {
          "conferenceDisplay": "Big 12 Conference",
          "conferenceDivision": "fbs",
          "conferenceName": "Big 12",
          "conferenceSeo": "big-12"
        },
        "description": "(1-1)",
        "names": {
          "char6": "KANSAS",
          "full": "University of Kansas",
          "seo": "kansas",
          "short": "Kansas"
        },
        "rank": "",
        "score": "3",
        "seed": "",
        "winner": false
      },
      "bracketId": "",
      "bracketRegion": "",
      "bracketRound": "",
      "contestClock": "0:00",
      "currentPeriod": "Final",
      "finalMessage": "Final",
      "gameID": "3a89d87b-8a27-47fe-8c91-13e12ff6944f",
      "gameState": "final",
      "home": {
        "conferenceNames": {
          "conferenceDisplay": "Atlantic Coast Conference",
          "conferenceDivision": "fbs",
          "conferenceName": "ACC",
          "conferenceSeo": "atlantic-coast"
        },
        "description": "(3-0)",
        "names": {
          "char6": "DUKE",
          "full": "Duke University",
          "seo": "duke",
          "short": "Duke"
        },
        "rank": "",
        "score": "41",
        "seed": "",
        "winner": true
      },
      "liveVideoEnabled": false,
      "network": "",
      "startDate": "09-13-2014",
      "startTime": "03:30PM ET",
      "startTimeEpoch": "1410636600",
      "title": "Duke Kansas",
      "url": "/game/football/fbs/2014/09/13/kansas-duke",
      "videoState": ""
    }},
    {"game": {
      "away": {
        "conferenceNames": {
          "conferenceDisplay": "Southeastern Conference",
          "conferenceDivision": "fbs",
          "conferenceName": "SEC",
          "conferenceSeo": "southeastern"
        },
        "description": "(2-1)",
        "names": {
          "char6": "ARK",
          "full": "University of Arkansas, Fayetteville",
          "seo": "arkansas",
          "short": "Arkansas"
        },
        "rank": "",
        "score": "49",
        "seed": "",
        "winner": true
      },
      "bracketId": "",
      "bracketRegion": "",
      "bracketRound": "",
      "contestClock": "0:00",
      "currentPeriod": "Final",
      "finalMessage": "Final",
      "gameID": "b979a8a4-fd8b-47c0-bf63-6db3a213f7bd",
      "gameState": "final",
      "home": {
        "conferenceNames": {
          "conferenceDisplay": "Big 12 Conference",
          "conferenceDivision": "fbs",
          "conferenceName": "Big 12",
          "conferenceSeo": "big-12"
        },
        "description": "(2-1)",
        "names": {
          "char6": "TXTECH",
          "full": "Texas Tech University",
          "seo": "texas-tech",
          "short": "Texas Tech"
        },
        "rank": "",
        "score": "28",
        "seed": "",
        "winner": false
      },
      "liveVideoEnabled": false,
      "network": "",
      "startDate": "09-13-2014",
      "startTime": "03:30PM ET",
      "startTimeEpoch": "1410636600",
      "title": "Texas Tech Arkansas",
      "url": "/game/football/fbs/2014/09/13/arkansas-texas-tech",
      "videoState": ""
    }},
    {"game": {
      "away": {
        "conferenceNames": {
          "conferenceDisplay": "Big 12 Conference",
          "conferenceDivision": "fbs",
          "conferenceName": "Big 12",
          "conferenceSeo": "big-12"
        },
        "description": "(1-2)",
        "names": {
          "char6": "IOWAST",
          "full": "Iowa State University",
          "seo": "iowa-st",
          "short": "Iowa St."
        },
        "rank": "",
        "score": "20",
        "seed": "",
        "winner": true
      },
      "bracketId": "",
      "bracketRegion": "",
      "bracketRound": "",
      "contestClock": "0:00",
      "currentPeriod": "Final",
      "finalMessage": "Final",
      "gameID": "ff3112e9-34b7-40ea-a1de-83f8d4d4d86b",
      "gameState": "final",
      "home": {
        "conferenceNames": {
          "conferenceDisplay": "Big Ten Conference",
          "conferenceDivision": "fbs",
          "conferenceName": "Big Ten",
          "conferenceSeo": "big-ten"
        },
        "description": "(2-1)",
        "names": {
          "char6": "IOWA",
          "full": "University of Iowa",
          "seo": "iowa",
          "short": "Iowa"
        },
        "rank": "",
        "score": "17",
        "seed": "",
        "winner": false
      },
      "liveVideoEnabled": false,
      "network": "",
      "startDate": "09-13-2014",
      "startTime": "03:30PM ET",
      "startTimeEpoch": "1410636600",
      "title": "Iowa Iowa St.",
      "url": "/game/football/fbs/2014/09/13/iowa-st-iowa",
      "videoState": ""
    }},
    {"game": {
      "away": {
        "conferenceNames": {
          "conferenceDisplay": "Atlantic Coast Conference",
          "conferenceDivision": "fbs",
          "conferenceName": "ACC",
          "conferenceSeo": "atlantic-coast"
        },
        "description": "(3-0)",
        "names": {
          "char6": "NC ST",
          "full": "North Carolina State University",
          "seo": "north-carolina-st",
          "short": "North Carolina St."
        },
        "rank": "",
        "score": "49",
        "seed": "",
        "winner": true
      },
      "bracketId": "",
      "bracketRegion": "",
      "bracketRound": "",
      "contestClock": "0:00",
      "currentPeriod": "Final",
      "finalMessage": "Final",
      "gameID": "3ac6eb0b-df32-4d3a-89c7-5b8839ac6c08",
      "gameState": "final",
      "home": {
        "conferenceNames": {
          "conferenceDisplay": "American Athletic Conference",
          "conferenceDivision": "fbs",
          "conferenceName": "AAC",
          "conferenceSeo": "american-athletic"
        },
        "description": "(1-2)",
        "names": {
          "char6": "USF",
          "full": "University of South Florida",
          "seo": "south-fla",
          "short": "South Fla."
        },
        "rank": "",
        "score": "17",
        "seed": "",
        "winner": false
      },
      "liveVideoEnabled": false,
      "network": "",
      "startDate": "09-13-2014",
      "startTime": "03:30PM ET",
      "startTimeEpoch": "1410636600",
      "title": "South Fla. North Carolina St.",
      "url": "/game/football/fbs/2014/09/13/north-carolina-st-south-fla",
      "videoState": ""
    }},
    {"game": {
      "away": {
        "conferenceNames": {
          "conferenceDisplay": "Mid-American Conference",
          "conferenceDivision": "fbs",
          "conferenceName": "MAC",
          "conferenceSeo": "mid-american"
        },
        "description": "(0-3)",
        "names": {
          "char6": "MIA OH",
          "full": "Miami University (Ohio)",
          "seo": "miami-oh",
          "short": "Miami (OH)"
        },
        "rank": "",
        "score": "10",
        "seed": "",
        "winner": false
      },
      "bracketId": "",
      "bracketRegion": "",
      "bracketRound": "",
      "contestClock": "0:00",
      "currentPeriod": "Final",
      "finalMessage": "Final",
      "gameID": "15870f12-7a81-4539-b8c5-c8dc24fc35af",
      "gameState": "final",
      "home": {
        "conferenceNames": {
          "conferenceDisplay": "Big Ten Conference",
          "conferenceDivision": "fbs",
          "conferenceName": "Big Ten",
          "conferenceSeo": "big-ten"
        },
        "description": "(2-1)",
        "names": {
          "char6": "MICH",
          "full": "University of Michigan",
          "seo": "michigan",
          "short": "Michigan"
        },
        "rank": "",
        "score": "34",
        "seed": "",
        "winner": true
      },
      "liveVideoEnabled": false,
      "network": "",
      "startDate": "09-13-2014",
      "startTime": "03:30PM ET",
      "startTimeEpoch": "1410636600",
      "title": "Michigan Miami (OH)",
      "url": "/game/football/fbs/2014/09/13/miami-oh-michigan",
      "videoState": ""
    }},
    {"game": {
      "away": {
        "conferenceNames": {
          "conferenceDisplay": "Southeastern Conference",
          "conferenceDivision": "fbs",
          "conferenceName": "SEC",
          "conferenceSeo": "southeastern"
        },
        "description": "(1-1)",
        "names": {
          "char6": "UGA",
          "full": "University of Georgia",
          "seo": "georgia",
          "short": "Georgia"
        },
        "rank": "6",
        "score": "35",
        "seed": "",
        "winner": false
      },
      "bracketId": "",
      "bracketRegion": "",
      "bracketRound": "",
      "contestClock": "0:00",
      "currentPeriod": "Final",
      "finalMessage": "Final",
      "gameID": "d7a14397-17bd-46ba-9647-885120ba6b3b",
      "gameState": "final",
      "home": {
        "conferenceNames": {
          "conferenceDisplay": "Southeastern Conference",
          "conferenceDivision": "fbs",
          "conferenceName": "SEC",
          "conferenceSeo": "southeastern"
        },
        "description": "(2-1)",
        "names": {
          "char6": "S CAR",
          "full": "University of South Carolina, Columbia",
          "seo": "south-carolina",
          "short": "South Carolina"
        },
        "rank": "24",
        "score": "38",
        "seed": "",
        "winner": true
      },
      "liveVideoEnabled": false,
      "network": "",
      "startDate": "09-13-2014",
      "startTime": "03:30PM ET",
      "startTimeEpoch": "1410636600",
      "title": "South Carolina Georgia",
      "url": "/game/football/fbs/2014/09/13/georgia-south-carolina",
      "videoState": ""
    }},
    {"game": {
      "away": {
        "conferenceNames": {
          "conferenceDisplay": "Southwestern Athletic Conf.",
          "conferenceDivision": "fcs",
          "conferenceName": "SWAC",
          "conferenceSeo": "southwestern"
        },
        "description": "(1-2)",
        "names": {
          "char6": "AL A&M",
          "full": "Alabama A&M University",
          "seo": "alabama-am",
          "short": "Alabama A&M"
        },
        "rank": "",
        "score": "14",
        "seed": "",
        "winner": false
      },
      "bracketId": "",
      "bracketRegion": "",
      "bracketRound": "",
      "contestClock": "0:00",
      "currentPeriod": "Final",
      "finalMessage": "Final",
      "gameID": "056694e4-a36b-4e12-9b74-87ef211e7424",
      "gameState": "final",
      "home": {
        "conferenceNames": {
          "conferenceDisplay": "Conference USA",
          "conferenceDivision": "fbs",
          "conferenceName": "C-USA",
          "conferenceSeo": "conference-usa"
        },
        "description": "(2-1)",
        "names": {
          "char6": "UAB",
          "full": "University of Alabama at Birmingham",
          "seo": "uab",
          "short": "UAB"
        },
        "rank": "",
        "score": "41",
        "seed": "",
        "winner": true
      },
      "liveVideoEnabled": false,
      "network": "",
      "startDate": "09-13-2014",
      "startTime": "03:30PM ET",
      "startTimeEpoch": "1410636600",
      "title": "UAB Alabama A&M",
      "url": "/game/football/fbs/2014/09/13/alabama-am-uab",
      "videoState": ""
    }},
    {"game": {
      "away": {
        "conferenceNames": {
          "conferenceDisplay": "Sun Belt Conference",
          "conferenceDivision": "fbs",
          "conferenceName": "Sun Belt",
          "conferenceSeo": "sun-belt"
        },
        "description": "(1-2)",
        "names": {
          "char6": "ARK ST",
          "full": "Arkansas State University",
          "seo": "arkansas-st",
          "short": "Arkansas St."
        },
        "rank": "",
        "score": "20",
        "seed": "",
        "winner": false
      },
      "bracketId": "",
      "bracketRegion": "",
      "bracketRound": "",
      "contestClock": "0:00",
      "currentPeriod": "Final",
      "finalMessage": "Final",
      "gameID": "f3da810f-85f3-423d-964f-79e788337b31",
      "gameState": "final",
      "home": {
        "conferenceNames": {
          "conferenceDisplay": "Atlantic Coast Conference",
          "conferenceDivision": "fbs",
          "conferenceName": "ACC",
          "conferenceSeo": "atlantic-coast"
        },
        "description": "(2-1)",
        "names": {
          "char6": "MIAMI",
          "full": "University of Miami (Florida)",
          "seo": "miami-fl",
          "short": "Miami (FL)"
        },
        "rank": "",
        "score": "41",
        "seed": "",
        "winner": true
      },
      "liveVideoEnabled": false,
      "network": "",
      "startDate": "09-13-2014",
      "startTime": "03:30PM ET",
      "startTimeEpoch": "1410636600",
      "title": "Miami (FL) Arkansas St.",
      "url": "/game/football/fbs/2014/09/13/arkansas-st-miami-fl",
      "videoState": ""
    }},
    {"game": {
      "away": {
        "conferenceNames": {
          "conferenceDisplay": "Big Ten Conference",
          "conferenceDivision": "fbs",
          "conferenceName": "Big Ten",
          "conferenceSeo": "big-ten"
        },
        "description": "(2-1)",
        "names": {
          "char6": "ILL",
          "full": "University of Illinois, Champaign",
          "seo": "illinois",
          "short": "Illinois"
        },
        "rank": "",
        "score": "19",
        "seed": "",
        "winner": false
      },
      "bracketId": "",
      "bracketRegion": "",
      "bracketRound": "",
      "contestClock": "0:00",
      "currentPeriod": "Final",
      "finalMessage": "Final",
      "gameID": "3e93bf25-b5f2-4563-94b6-59d4923a4ac6",
      "gameState": "final",
      "home": {
        "conferenceNames": {
          "conferenceDisplay": "Pac-12 Conference",
          "conferenceDivision": "fbs",
          "conferenceName": "Pac-12",
          "conferenceSeo": "pac-12"
        },
        "description": "(3-0)",
        "names": {
          "char6": "WASH",
          "full": "University of Washington",
          "seo": "washington",
          "short": "Washington"
        },
        "rank": "",
        "score": "44",
        "seed": "",
        "winner": true
      },
      "liveVideoEnabled": false,
      "network": "",
      "startDate": "09-13-2014",
      "startTime": "04:00PM ET",
      "startTimeEpoch": "1410638400",
      "title": "Washington Illinois",
      "url": "/game/football/fbs/2014/09/13/illinois-washington",
      "videoState": ""
    }},
    {"game": {
      "away": {
        "conferenceNames": {
          "conferenceDisplay": "Sun Belt Conference",
          "conferenceDivision": "fbs",
          "conferenceName": "Sun Belt",
          "conferenceSeo": "sun-belt"
        },
        "description": "(1-2)",
        "names": {
          "char6": "ULL",
          "full": "University of Louisiana at Lafayette",
          "seo": "la-lafayette",
          "short": "Louisiana"
        },
        "rank": "",
        "score": "15",
        "seed": "",
        "winner": false
      },
      "bracketId": "",
      "bracketRegion": "",
      "bracketRound": "",
      "contestClock": "0:00",
      "currentPeriod": "Final",
      "finalMessage": "Final",
      "gameID": "acb6a7bb-87b6-4df0-8350-0266881ca3d8",
      "gameState": "final",
      "home": {
        "conferenceNames": {
          "conferenceDisplay": "Southeastern Conference",
          "conferenceDivision": "fbs",
          "conferenceName": "SEC",
          "conferenceSeo": "southeastern"
        },
        "description": "(3-0)",
        "names": {
          "char6": "MISS",
          "full": "University of Mississippi",
          "seo": "ole-miss",
          "short": "Ole Miss"
        },
        "rank": "14",
        "score": "56",
        "seed": "",
        "winner": true
      },
      "liveVideoEnabled": false,
      "network": "",
      "startDate": "09-13-2014",
      "startTime": "04:00PM ET",
      "startTimeEpoch": "1410638400",
      "title": "Ole Miss Louisiana",
      "url": "/game/football/fbs/2014/09/13/la-lafayette-ole-miss",
      "videoState": ""
    }},
    {"game": {
      "away": {
        "conferenceNames": {
          "conferenceDisplay": "Big Ten Conference",
          "conferenceDivision": "fbs",
          "conferenceName": "Big Ten",
          "conferenceSeo": "big-ten"
        },
        "description": "(2-1)",
        "names": {
          "char6": "MINN",
          "full": "University of Minnesota, Twin Cities",
          "seo": "minnesota",
          "short": "Minnesota"
        },
        "rank": "",
        "score": "7",
        "seed": "",
        "winner": false
      },
      "bracketId": "",
      "bracketRegion": "",
      "bracketRound": "",
      "contestClock": "0:00",
      "currentPeriod": "Final",
      "finalMessage": "Final",
      "gameID": "752129fa-cdb2-47fe-982d-e1de699db7c7",
      "gameState": "final",
      "home": {
        "conferenceNames": {
          "conferenceDisplay": "Big 12 Conference",
          "conferenceDivision": "fbs",
          "conferenceName": "Big 12",
          "conferenceSeo": "big-12"
        },
        "description": "(2-0)",
        "names": {
          "char6": "TCU",
          "full": "Texas Christian University",
          "seo": "tcu",
          "short": "TCU"
        },
        "rank": "",
        "score": "30",
        "seed": "",
        "winner": true
      },
      "liveVideoEnabled": false,
      "network": "",
      "startDate": "09-13-2014",
      "startTime": "04:00PM ET",
      "startTimeEpoch": "1410638400",
      "title": "TCU Minnesota",
      "url": "/game/football/fbs/2014/09/13/minnesota-tcu",
      "videoState": ""
    }},
    {"game": {
      "away": {
        "conferenceNames": {
          "conferenceDisplay": "Southeastern Conference",
          "conferenceDivision": "fbs",
          "conferenceName": "SEC",
          "conferenceSeo": "southeastern"
        },
        "description": "(3-0)",
        "names": {
          "char6": "MISSST",
          "full": "Mississippi State University",
          "seo": "mississippi-st",
          "short": "Mississippi St."
        },
        "rank": "",
        "score": "35",
        "seed": "",
        "winner": true
      },
      "bracketId": "",
      "bracketRegion": "",
      "bracketRound": "",
      "contestClock": "0:00",
      "currentPeriod": "Final",
      "finalMessage": "Final",
      "gameID": "8407c997-1088-4975-b8d2-f56ecd23c8ca",
      "gameState": "final",
      "home": {
        "conferenceNames": {
          "conferenceDisplay": "Sun Belt Conference",
          "conferenceDivision": "fbs",
          "conferenceName": "Sun Belt",
          "conferenceSeo": "sun-belt"
        },
        "description": "(1-1)",
        "names": {
          "char6": "S ALA",
          "full": "University of South Alabama",
          "seo": "south-ala",
          "short": "South Ala."
        },
        "rank": "",
        "score": "3",
        "seed": "",
        "winner": false
      },
      "liveVideoEnabled": false,
      "network": "",
      "startDate": "09-13-2014",
      "startTime": "04:00PM ET",
      "startTimeEpoch": "1410638400",
      "title": "South Ala. Mississippi St.",
      "url": "/game/football/fbs/2014/09/13/mississippi-st-south-ala",
      "videoState": ""
    }},
    {"game": {
      "away": {
        "conferenceNames": {
          "conferenceDisplay": "Mid-American Conference",
          "conferenceDivision": "fbs",
          "conferenceName": "MAC",
          "conferenceSeo": "mid-american"
        },
        "description": "(1-1)",
        "names": {
          "char6": "W MICH",
          "full": "Western Michigan University",
          "seo": "western-mich",
          "short": "Western Mich."
        },
        "rank": "",
        "score": "45",
        "seed": "",
        "winner": true
      },
      "bracketId": "",
      "bracketRegion": "",
      "bracketRound": "",
      "contestClock": "0:00",
      "currentPeriod": "Final",
      "finalMessage": "Final",
      "gameID": "2ce5d1cd-d7a0-483c-bad5-28c6c167bda6",
      "gameState": "final",
      "home": {
        "conferenceNames": {
          "conferenceDisplay": "Sun Belt Conference",
          "conferenceDivision": "fbs",
          "conferenceName": "Sun Belt",
          "conferenceSeo": "sun-belt"
        },
        "description": "(0-2)",
        "names": {
          "char6": "IDAHO",
          "full": "University of Idaho",
          "seo": "idaho",
          "short": "Idaho"
        },
        "rank": "",
        "score": "33",
        "seed": "",
        "winner": false
      },
      "liveVideoEnabled": false,
      "network": "",
      "startDate": "09-13-2014",
      "startTime": "05:00PM ET",
      "startTimeEpoch": "1410642000",
      "title": "Idaho Western Mich.",
      "url": "/game/football/fbs/2014/09/13/western-mich-idaho",
      "videoState": ""
    }},
    {"game": {
      "away": {
        "conferenceNames": {
          "conferenceDisplay": "FBS Independent",
          "conferenceDivision": "fbs",
          "conferenceName": "IND",
          "conferenceSeo": "fbs-independent"
        },
        "description": "(1-1)",
        "names": {
          "char6": "ARMY",
          "full": "U.S. Military Academy",
          "seo": "army",
          "short": "Army"
        },
        "rank": "",
        "score": "0",
        "seed": "",
        "winner": false
      },
      "bracketId": "",
      "bracketRegion": "",
      "bracketRound": "",
      "contestClock": "0:00",
      "currentPeriod": "Final",
      "finalMessage": "Final",
      "gameID": "ea6c4e1a-0f77-4ecf-b48c-779ff3d2953f",
      "gameState": "final",
      "home": {
        "conferenceNames": {
          "conferenceDisplay": "Pac-12 Conference",
          "conferenceDivision": "fbs",
          "conferenceName": "Pac-12",
          "conferenceSeo": "pac-12"
        },
        "description": "(2-1)",
        "names": {
          "char6": "STAN",
          "full": "Stanford University",
          "seo": "stanford",
          "short": "Stanford"
        },
        "rank": "15",
        "score": "35",
        "seed": "",
        "winner": true
      },
      "liveVideoEnabled": false,
      "network": "",
      "startDate": "09-13-2014",
      "startTime": "05:00PM ET",
      "startTimeEpoch": "1410642000",
      "title": "Stanford Army",
      "url": "/game/football/fbs/2014/09/13/army-stanford",
      "videoState": ""
    }},
    {"game": {
      "away": {
        "conferenceNames": {
          "conferenceDisplay": "Mid-American Conference",
          "conferenceDivision": "fbs",
          "conferenceName": "MAC",
          "conferenceSeo": "mid-american"
        },
        "description": "(1-2)",
        "names": {
          "char6": "E MICH",
          "full": "Eastern Michigan University",
          "seo": "eastern-mich",
          "short": "Eastern Mich."
        },
        "rank": "",
        "score": "3",
        "seed": "",
        "winner": false
      },
      "bracketId": "",
      "bracketRegion": "",
      "bracketRound": "",
      "contestClock": "0:00",
      "currentPeriod": "Final",
      "finalMessage": "Final",
      "gameID": "579cce2b-416c-4cc0-a3be-867406fb4603",
      "gameState": "final",
      "home": {
        "conferenceNames": {
          "conferenceDisplay": "Conference USA",
          "conferenceDivision": "fbs",
          "conferenceName": "C-USA",
          "conferenceSeo": "conference-usa"
        },
        "description": "(2-1)",
        "names": {
          "char6": "ODU",
          "full": "Old Dominion University",
          "seo": "old-dominion",
          "short": "Old Dominion"
        },
        "rank": "",
        "score": "17",
        "seed": "",
        "winner": true
      },
      "liveVideoEnabled": false,
      "network": "",
      "startDate": "09-13-2014",
      "startTime": "06:00PM ET",
      "startTimeEpoch": "1410645600",
      "title": "Old Dominion Eastern Mich.",
      "url": "/game/football/fbs/2014/09/13/eastern-mich-old-dominion",
      "videoState": ""
    }},
    {"game": {
      "away": {
        "conferenceNames": {
          "conferenceDisplay": "Conference USA",
          "conferenceDivision": "fbs",
          "conferenceName": "C-USA",
          "conferenceSeo": "conference-usa"
        },
        "description": "(1-2)",
        "names": {
          "char6": "S MISS",
          "full": "University of Southern Mississippi",
          "seo": "southern-miss",
          "short": "Southern Miss."
        },
        "rank": "",
        "score": "12",
        "seed": "",
        "winner": false
      },
      "bracketId": "",
      "bracketRegion": "",
      "bracketRound": "",
      "contestClock": "0:00",
      "currentPeriod": "Final",
      "finalMessage": "Final",
      "gameID": "c71f3ec0-ee50-45a4-8456-cb1858c185da",
      "gameState": "final",
      "home": {
        "conferenceNames": {
          "conferenceDisplay": "Southeastern Conference",
          "conferenceDivision": "fbs",
          "conferenceName": "SEC",
          "conferenceSeo": "southeastern"
        },
        "description": "(3-0)",
        "names": {
          "char6": "ALA",
          "full": "University of Alabama",
          "seo": "alabama",
          "short": "Alabama"
        },
        "rank": "3",
        "score": "52",
        "seed": "",
        "winner": true
      },
      "liveVideoEnabled": false,
      "network": "",
      "startDate": "09-13-2014",
      "startTime": "06:00PM ET",
      "startTimeEpoch": "1410645600",
      "title": "Alabama Southern Miss.",
      "url": "/game/football/fbs/2014/09/13/southern-miss-alabama",
      "videoState": ""
    }},
    {"game": {
      "away": {
        "conferenceNames": {
          "conferenceDisplay": "Atlantic Coast Conference",
          "conferenceDivision": "fbs",
          "conferenceName": "ACC",
          "conferenceSeo": "atlantic-coast"
        },
        "description": "(1-2)",
        "names": {
          "char6": "WAKE",
          "full": "Wake Forest University",
          "seo": "wake-forest",
          "short": "Wake Forest"
        },
        "rank": "",
        "score": "24",
        "seed": "",
        "winner": false
      },
      "bracketId": "",
      "bracketRegion": "",
      "bracketRound": "",
      "contestClock": "0:00",
      "currentPeriod": "Final",
      "finalMessage": "Final",
      "gameID": "dadca474-392b-4cb2-8191-8bf2269dd1fe",
      "gameState": "final",
      "home": {
        "conferenceNames": {
          "conferenceDisplay": "Mountain West Conference",
          "conferenceDivision": "fbs",
          "conferenceName": "MWC",
          "conferenceSeo": "mountain-west"
        },
        "description": "(2-1)",
        "names": {
          "char6": "UT ST",
          "full": "Utah State University",
          "seo": "utah-st",
          "short": "Utah St."
        },
        "rank": "",
        "score": "36",
        "seed": "",
        "winner": true
      },
      "liveVideoEnabled": false,
      "network": "",
      "startDate": "09-13-2014",
      "startTime": "07:00PM ET",
      "startTimeEpoch": "1410649200",
      "title": "Utah St. Wake Forest",
      "url": "/game/football/fbs/2014/09/13/wake-forest-utah-st",
      "videoState": ""
    }},
    {"game": {
      "away": {
        "conferenceNames": {
          "conferenceDisplay": "Southland Conference",
          "conferenceDivision": "fcs",
          "conferenceName": "Southland",
          "conferenceSeo": "southland"
        },
        "description": "(1-2)",
        "names": {
          "char6": "ABILCH",
          "full": "Abilene Christian University",
          "seo": "abilene-christian",
          "short": "Abilene Christian"
        },
        "rank": "",
        "score": "38",
        "seed": "",
        "winner": true
      },
      "bracketId": "",
      "bracketRegion": "",
      "bracketRound": "",
      "contestClock": "0:00",
      "currentPeriod": "Final",
      "finalMessage": "Final",
      "gameID": "c4041112-ebe3-4956-97b5-1ee9b53cad6c",
      "gameState": "final",
      "home": {
        "conferenceNames": {
          "conferenceDisplay": "Sun Belt Conference",
          "conferenceDivision": "fbs",
          "conferenceName": "Sun Belt",
          "conferenceSeo": "sun-belt"
        },
        "description": "(0-3)",
        "names": {
          "char6": "TROY",
          "full": "Troy University",
          "seo": "troy",
          "short": "Troy"
        },
        "rank": "",
        "score": "35",
        "seed": "",
        "winner": false
      },
      "liveVideoEnabled": false,
      "network": "",
      "startDate": "09-13-2014",
      "startTime": "07:00PM ET",
      "startTimeEpoch": "1410649200",
      "title": "Troy Abilene Christian",
      "url": "/game/football/fbs/2014/09/13/abilene-christian-troy",
      "videoState": ""
    }},
    {"game": {
      "away": {
        "conferenceNames": {
          "conferenceDisplay": "Sun Belt Conference",
          "conferenceDivision": "fbs",
          "conferenceName": "Sun Belt",
          "conferenceSeo": "sun-belt"
        },
        "description": "(-)",
        "names": {
          "char6": "LA MON",
          "full": "University of Louisiana at Monroe",
          "seo": "la-monroe",
          "short": "La.-Monroe"
        },
        "rank": "",
        "score": "0",
        "seed": "",
        "winner": true
      },
      "bracketId": "",
      "bracketRegion": "",
      "bracketRound": "",
      "contestClock": "",
      "currentPeriod": "Final",
      "finalMessage": "Final",
      "gameID": "b4d57975-a32d-46f1-bb3d-40d32a23d61c",
      "gameState": "final",
      "home": {
        "conferenceNames": {
          "conferenceDisplay": "Southeastern Conference",
          "conferenceDivision": "fbs",
          "conferenceName": "SEC",
          "conferenceSeo": "southeastern"
        },
        "description": "(-)",
        "names": {
          "char6": "LSU",
          "full": "Louisiana State University",
          "seo": "lsu",
          "short": "LSU"
        },
        "rank": "",
        "score": "0",
        "seed": "",
        "winner": true
      },
      "liveVideoEnabled": false,
      "network": "",
      "startDate": "09-13-2014",
      "startTime": "07:00PM ET",
      "startTimeEpoch": "1410649200",
      "title": "LSU La.-Monroe",
      "url": "/game/football/fbs/2014/09/13/la-monroe-lsu",
      "videoState": ""
    }},
    {"game": {
      "away": {
        "conferenceNames": {
          "conferenceDisplay": "Mid-American Conference",
          "conferenceDivision": "fbs",
          "conferenceName": "MAC",
          "conferenceSeo": "mid-american"
        },
        "description": "(3-0)",
        "names": {
          "char6": "NIU",
          "full": "Northern Illinois University",
          "seo": "northern-ill",
          "short": "Northern Ill."
        },
        "rank": "",
        "score": "48",
        "seed": "",
        "winner": true
      },
      "bracketId": "",
      "bracketRegion": "",
      "bracketRound": "",
      "contestClock": "0:00",
      "currentPeriod": "Final",
      "finalMessage": "Final",
      "gameID": "f54041f1-da35-40c7-8ab7-c475a08d0acb",
      "gameState": "final",
      "home": {
        "conferenceNames": {
          "conferenceDisplay": "Mountain West Conference",
          "conferenceDivision": "fbs",
          "conferenceName": "MWC",
          "conferenceSeo": "mountain-west"
        },
        "description": "(1-2)",
        "names": {
          "char6": "UNLV",
          "full": "University of Nevada, Las Vegas",
          "seo": "unlv",
          "short": "UNLV"
        },
        "rank": "",
        "score": "34",
        "seed": "",
        "winner": false
      },
      "liveVideoEnabled": false,
      "network": "",
      "startDate": "09-13-2014",
      "startTime": "07:00PM ET",
      "startTimeEpoch": "1410649200",
      "title": "UNLV Northern Ill.",
      "url": "/game/football/fbs/2014/09/13/northern-ill-unlv",
      "videoState": ""
    }},
    {"game": {
      "away": {
        "conferenceNames": {
          "conferenceDisplay": "Conference USA",
          "conferenceDivision": "fbs",
          "conferenceName": "C-USA",
          "conferenceSeo": "conference-usa"
        },
        "description": "(1-2)",
        "names": {
          "char6": "W KY",
          "full": "Western Kentucky University",
          "seo": "western-ky",
          "short": "Western Ky."
        },
        "rank": "",
        "score": "47",
        "seed": "",
        "winner": false
      },
      "bracketId": "",
      "bracketRegion": "",
      "bracketRound": "",
      "contestClock": "0:00",
      "currentPeriod": "Final/3OT",
      "finalMessage": "Final/3OT",
      "gameID": "9949cd38-f09d-4794-a7ec-dd535895d7ca",
      "gameState": "final",
      "home": {
        "conferenceNames": {
          "conferenceDisplay": "Conference USA",
          "conferenceDivision": "fbs",
          "conferenceName": "C-USA",
          "conferenceSeo": "conference-usa"
        },
        "description": "(2-1)",
        "names": {
          "char6": "MIDTEN",
          "full": "Middle Tennessee State University",
          "seo": "middle-tenn",
          "short": "Middle Tenn."
        },
        "rank": "",
        "score": "50",
        "seed": "",
        "winner": true
      },
      "liveVideoEnabled": false,
      "network": "",
      "startDate": "09-13-2014",
      "startTime": "07:00PM ET",
      "startTimeEpoch": "1410649200",
      "title": "Middle Tenn. Western Ky.",
      "url": "/game/football/fbs/2014/09/13/western-ky-middle-tenn",
      "videoState": ""
    }},
    {"game": {
      "away": {
        "conferenceNames": {
          "conferenceDisplay": "Big Ten Conference",
          "conferenceDivision": "fbs",
          "conferenceName": "Big Ten",
          "conferenceSeo": "big-ten"
        },
        "description": "(1-2)",
        "names": {
          "char6": "PURDUE",
          "full": "Purdue University",
          "seo": "purdue",
          "short": "Purdue"
        },
        "rank": "",
        "score": "14",
        "seed": "",
        "winner": false
      },
      "bracketId": "",
      "bracketRegion": "",
      "bracketRound": "",
      "contestClock": "0:00",
      "currentPeriod": "Final",
      "finalMessage": "Final",
      "gameID": "59f2133a-a84e-476e-99aa-c07df0fd1b60",
      "gameState": "final",
      "home": {
        "conferenceNames": {
          "conferenceDisplay": "FBS Independent",
          "conferenceDivision": "fbs",
          "conferenceName": "IND",
          "conferenceSeo": "fbs-independent"
        },
        "description": "(3-0)",
        "names": {
          "char6": "N DAME",
          "full": "University of Notre Dame",
          "seo": "notre-dame",
          "short": "Notre Dame"
        },
        "rank": "11",
        "score": "30",
        "seed": "",
        "winner": true
      },
      "liveVideoEnabled": false,
      "network": "",
      "startDate": "09-13-2014",
      "startTime": "07:30PM ET",
      "startTimeEpoch": "1410651000",
      "title": "Notre Dame Purdue",
      "url": "/game/football/fbs/2014/09/13/purdue-notre-dame",
      "videoState": ""
    }},
    {"game": {
      "away": {
        "conferenceNames": {
          "conferenceDisplay": "Big Ten Conference",
          "conferenceDivision": "fbs",
          "conferenceName": "Big Ten",
          "conferenceSeo": "big-ten"
        },
        "description": "(3-0)",
        "names": {
          "char6": "PENNST",
          "full": "Pennsylvania State University",
          "seo": "penn-st",
          "short": "Penn St."
        },
        "rank": "",
        "score": "13",
        "seed": "",
        "winner": true
      },
      "bracketId": "",
      "bracketRegion": "",
      "bracketRound": "",
      "contestClock": "0:00",
      "currentPeriod": "Final",
      "finalMessage": "Final",
      "gameID": "30d55b9a-2efc-42d0-9232-b2f34e27558d",
      "gameState": "final",
      "home": {
        "conferenceNames": {
          "conferenceDisplay": "Big Ten Conference",
          "conferenceDivision": "fbs",
          "conferenceName": "Big Ten",
          "conferenceSeo": "big-ten"
        },
        "description": "(2-1)",
        "names": {
          "char6": "RUTGER",
          "full": "Rutgers, State Univ of New Jersey, New Brunswick",
          "seo": "rutgers",
          "short": "Rutgers"
        },
        "rank": "",
        "score": "10",
        "seed": "",
        "winner": false
      },
      "liveVideoEnabled": false,
      "network": "",
      "startDate": "09-13-2014",
      "startTime": "08:00PM ET",
      "startTimeEpoch": "1410652800",
      "title": "Rutgers Penn St.",
      "url": "/game/football/fbs/2014/09/13/penn-st-rutgers",
      "videoState": ""
    }},
    {"game": {
      "away": {
        "conferenceNames": {
          "conferenceDisplay": "Big Sky Conference",
          "conferenceDivision": "fcs",
          "conferenceName": "Big Sky",
          "conferenceSeo": "big-sky"
        },
        "description": "(1-2)",
        "names": {
          "char6": "PORTST",
          "full": "Portland State University",
          "seo": "portland-st",
          "short": "Portland St."
        },
        "rank": "",
        "score": "21",
        "seed": "",
        "winner": false
      },
      "bracketId": "",
      "bracketRegion": "",
      "bracketRound": "",
      "contestClock": "0:00",
      "currentPeriod": "Final",
      "finalMessage": "Final",
      "gameID": "b388f61a-e5f3-4ff8-842c-53d011b5f76f",
      "gameState": "final",
      "home": {
        "conferenceNames": {
          "conferenceDisplay": "Pac-12 Conference",
          "conferenceDivision": "fbs",
          "conferenceName": "Pac-12",
          "conferenceSeo": "pac-12"
        },
        "description": "(1-2)",
        "names": {
          "char6": "WASHST",
          "full": "Washington State University",
          "seo": "washington-st",
          "short": "Washington St."
        },
        "rank": "",
        "score": "59",
        "seed": "",
        "winner": true
      },
      "liveVideoEnabled": false,
      "network": "",
      "startDate": "09-13-2014",
      "startTime": "08:00PM ET",
      "startTimeEpoch": "1410652800",
      "title": "Washington St. Portland St.",
      "url": "/game/football/fbs/2014/09/13/portland-st-washington-st",
      "videoState": ""
    }},
    {"game": {
      "away": {
        "conferenceNames": {
          "conferenceDisplay": "Southeastern Conference",
          "conferenceDivision": "fbs",
          "conferenceName": "SEC",
          "conferenceSeo": "southeastern"
        },
        "description": "(2-1)",
        "names": {
          "char6": "TENN",
          "full": "University of Tennessee, Knoxville",
          "seo": "tennessee",
          "short": "Tennessee"
        },
        "rank": "",
        "score": "10",
        "seed": "",
        "winner": false
      },
      "bracketId": "",
      "bracketRegion": "",
      "bracketRound": "",
      "contestClock": "0:00",
      "currentPeriod": "Final",
      "finalMessage": "Final",
      "gameID": "0a141ac7-d20a-4e69-a938-e9deb92cef7c",
      "gameState": "final",
      "home": {
        "conferenceNames": {
          "conferenceDisplay": "Big 12 Conference",
          "conferenceDivision": "fbs",
          "conferenceName": "Big 12",
          "conferenceSeo": "big-12"
        },
        "description": "(3-0)",
        "names": {
          "char6": "OKLA",
          "full": "University of Oklahoma",
          "seo": "oklahoma",
          "short": "Oklahoma"
        },
        "rank": "4",
        "score": "34",
        "seed": "",
        "winner": true
      },
      "liveVideoEnabled": false,
      "network": "",
      "startDate": "09-13-2014",
      "startTime": "08:00PM ET",
      "startTimeEpoch": "1410652800",
      "title": "Oklahoma Tennessee",
      "url": "/game/football/fbs/2014/09/13/tennessee-oklahoma",
      "videoState": ""
    }},
    {"game": {
      "away": {
        "conferenceNames": {
          "conferenceDisplay": "American Athletic Conference",
          "conferenceDivision": "fbs",
          "conferenceName": "AAC",
          "conferenceSeo": "american-athletic"
        },
        "description": "(2-1)",
        "names": {
          "char6": "NAVY",
          "full": "U.S. Naval Academy",
          "seo": "navy",
          "short": "Navy"
        },
        "rank": "",
        "score": "35",
        "seed": "",
        "winner": true
      },
      "bracketId": "",
      "bracketRegion": "",
      "bracketRound": "",
      "contestClock": "0:00",
      "currentPeriod": "Final",
      "finalMessage": "Final",
      "gameID": "5c6042f8-e68d-457d-8de7-78327bd52d97",
      "gameState": "final",
      "home": {
        "conferenceNames": {
          "conferenceDisplay": "Sun Belt Conference",
          "conferenceDivision": "fbs",
          "conferenceName": "Sun Belt",
          "conferenceSeo": "sun-belt"
        },
        "description": "(1-1)",
        "names": {
          "char6": "TX ST",
          "full": "Texas State University-San Marcos",
          "seo": "texas-st",
          "short": "Texas St."
        },
        "rank": "",
        "score": "21",
        "seed": "",
        "winner": false
      },
      "liveVideoEnabled": false,
      "network": "",
      "startDate": "09-13-2014",
      "startTime": "08:00PM ET",
      "startTimeEpoch": "1410652800",
      "title": "Texas St. Navy",
      "url": "/game/football/fbs/2014/09/13/navy-texas-st",
      "videoState": ""
    }},
    {"game": {
      "away": {
        "conferenceNames": {
          "conferenceDisplay": "Pac-12 Conference",
          "conferenceDivision": "fbs",
          "conferenceName": "Pac-12",
          "conferenceSeo": "pac-12"
        },
        "description": "(2-1)",
        "names": {
          "char6": "USC",
          "full": "University of Southern California",
          "seo": "southern-california",
          "short": "Southern California"
        },
        "rank": "9",
        "score": "31",
        "seed": "",
        "winner": false
      },
      "bracketId": "",
      "bracketRegion": "",
      "bracketRound": "",
      "contestClock": "0:00",
      "currentPeriod": "Final",
      "finalMessage": "Final",
      "gameID": "0dac0c97-b7d8-47a9-8f51-47a1f23c9a30",
      "gameState": "final",
      "home": {
        "conferenceNames": {
          "conferenceDisplay": "Atlantic Coast Conference",
          "conferenceDivision": "fbs",
          "conferenceName": "ACC",
          "conferenceSeo": "atlantic-coast"
        },
        "description": "(2-1)",
        "names": {
          "char6": "BC",
          "full": "Boston College",
          "seo": "boston-college",
          "short": "Boston College"
        },
        "rank": "",
        "score": "37",
        "seed": "",
        "winner": true
      },
      "liveVideoEnabled": false,
      "network": "",
      "startDate": "09-13-2014",
      "startTime": "08:00PM ET",
      "startTimeEpoch": "1410652800",
      "title": "Boston College Southern California",
      "url": "/game/football/fbs/2014/09/13/southern-california-boston-college",
      "videoState": ""
    }},
    {"game": {
      "away": {
        "conferenceNames": {
          "conferenceDisplay": "Pac-12 Conference",
          "conferenceDivision": "fbs",
          "conferenceName": "Pac-12",
          "conferenceSeo": "pac-12"
        },
        "description": "(3-0)",
        "names": {
          "char6": "UCLA",
          "full": "University of California, Los Angeles",
          "seo": "ucla",
          "short": "UCLA"
        },
        "rank": "12",
        "score": "20",
        "seed": "",
        "winner": true
      },
      "bracketId": "",
      "bracketRegion": "",
      "bracketRound": "",
      "contestClock": "0:00",
      "currentPeriod": "Final",
      "finalMessage": "Final",
      "gameID": "81e4055e-73d7-438f-9dbd-ec3f33718a31",
      "gameState": "final",
      "home": {
        "conferenceNames": {
          "conferenceDisplay": "Big 12 Conference",
          "conferenceDivision": "fbs",
          "conferenceName": "Big 12",
          "conferenceSeo": "big-12"
        },
        "description": "(1-2)",
        "names": {
          "char6": "TEXAS",
          "full": "University of Texas at Austin",
          "seo": "texas",
          "short": "Texas"
        },
        "rank": "",
        "score": "17",
        "seed": "",
        "winner": false
      },
      "liveVideoEnabled": false,
      "network": "",
      "startDate": "09-13-2014",
      "startTime": "08:00PM ET",
      "startTimeEpoch": "1410652800",
      "title": "Texas UCLA",
      "url": "/game/football/fbs/2014/09/13/ucla-texas",
      "videoState": ""
    }},
    {"game": {
      "away": {
        "conferenceNames": {
          "conferenceDisplay": "Sun Belt Conference",
          "conferenceDivision": "fbs",
          "conferenceName": "Sun Belt",
          "conferenceSeo": "sun-belt"
        },
        "description": "(2-1)",
        "names": {
          "char6": "NM ST",
          "full": "New Mexico State University",
          "seo": "new-mexico-st",
          "short": "New Mexico St."
        },
        "rank": "",
        "score": "24",
        "seed": "",
        "winner": false
      },
      "bracketId": "",
      "bracketRegion": "",
      "bracketRound": "",
      "contestClock": "0:00",
      "currentPeriod": "Final",
      "finalMessage": "Final",
      "gameID": "bd6872ac-2eb0-41a9-b33e-b23fa28de948",
      "gameState": "final",
      "home": {
        "conferenceNames": {
          "conferenceDisplay": "Conference USA",
          "conferenceDivision": "fbs",
          "conferenceName": "C-USA",
          "conferenceSeo": "conference-usa"
        },
        "description": "(2-1)",
        "names": {
          "char6": "UTEP",
          "full": "University of Texas at El Paso",
          "seo": "utep",
          "short": "UTEP"
        },
        "rank": "",
        "score": "42",
        "seed": "",
        "winner": true
      },
      "liveVideoEnabled": false,
      "network": "",
      "startDate": "09-13-2014",
      "startTime": "08:00PM ET",
      "startTimeEpoch": "1410652800",
      "title": "UTEP New Mexico St.",
      "url": "/game/football/fbs/2014/09/13/new-mexico-st-utep",
      "videoState": ""
    }},
    {"game": {
      "away": {
        "conferenceNames": {
          "conferenceDisplay": "Southland Conference",
          "conferenceDivision": "fcs",
          "conferenceName": "Southland",
          "conferenceSeo": "southland"
        },
        "description": "(2-1)",
        "names": {
          "char6": "SE LA",
          "full": "Southeastern Louisiana University",
          "seo": "southeastern-la",
          "short": "Southeastern La."
        },
        "rank": "",
        "score": "20",
        "seed": "",
        "winner": false
      },
      "bracketId": "",
      "bracketRegion": "",
      "bracketRound": "",
      "contestClock": "0:00",
      "currentPeriod": "Final",
      "finalMessage": "Final",
      "gameID": "9f74b021-8ca9-4df8-bba9-3fcd4231003f",
      "gameState": "final",
      "home": {
        "conferenceNames": {
          "conferenceDisplay": "American Athletic Conference",
          "conferenceDivision": "fbs",
          "conferenceName": "AAC",
          "conferenceSeo": "american-athletic"
        },
        "description": "(1-2)",
        "names": {
          "char6": "TULANE",
          "full": "Tulane University",
          "seo": "tulane",
          "short": "Tulane"
        },
        "rank": "",
        "score": "35",
        "seed": "",
        "winner": true
      },
      "liveVideoEnabled": false,
      "network": "",
      "startDate": "09-13-2014",
      "startTime": "08:00PM ET",
      "startTimeEpoch": "1410652800",
      "title": "Tulane Southeastern La.",
      "url": "/game/football/fbs/2014/09/13/southeastern-la-tulane",
      "videoState": ""
    }},
    {"game": {
      "away": {
        "conferenceNames": {
          "conferenceDisplay": "Conference USA",
          "conferenceDivision": "fbs",
          "conferenceName": "C-USA",
          "conferenceSeo": "conference-usa"
        },
        "description": "(0-2)",
        "names": {
          "char6": "RICE",
          "full": "Rice University",
          "seo": "rice",
          "short": "Rice"
        },
        "rank": "",
        "score": "10",
        "seed": "",
        "winner": false
      },
      "bracketId": "",
      "bracketRegion": "",
      "bracketRound": "",
      "contestClock": "0:00",
      "currentPeriod": "Final",
      "finalMessage": "Final",
      "gameID": "a2c27514-64b5-4f99-b7b4-0dfcc11407f8",
      "gameState": "final",
      "home": {
        "conferenceNames": {
          "conferenceDisplay": "Southeastern Conference",
          "conferenceDivision": "fbs",
          "conferenceName": "SEC",
          "conferenceSeo": "southeastern"
        },
        "description": "(3-0)",
        "names": {
          "char6": "TX A&M",
          "full": "Texas A&M University, College Station",
          "seo": "texas-am",
          "short": "Texas A&M"
        },
        "rank": "7",
        "score": "38",
        "seed": "",
        "winner": true
      },
      "liveVideoEnabled": false,
      "network": "",
      "startDate": "09-13-2014",
      "startTime": "09:00PM ET",
      "startTimeEpoch": "1410656400",
      "title": "Texas A&M Rice",
      "url": "/game/football/fbs/2014/09/13/rice-texas-am",
      "videoState": ""
    }},
    {"game": {
      "away": {
        "conferenceNames": {
          "conferenceDisplay": "Pac-12 Conference",
          "conferenceDivision": "fbs",
          "conferenceName": "Pac-12",
          "conferenceSeo": "pac-12"
        },
        "description": "(3-0)",
        "names": {
          "char6": "AZ ST",
          "full": "Arizona State University",
          "seo": "arizona-st",
          "short": "Arizona St."
        },
        "rank": "16",
        "score": "38",
        "seed": "",
        "winner": true
      },
      "bracketId": "",
      "bracketRegion": "",
      "bracketRound": "",
      "contestClock": "0:00",
      "currentPeriod": "Final",
      "finalMessage": "Final",
      "gameID": "7f83573c-3070-48be-9eb6-19c92d60cb8c",
      "gameState": "final",
      "home": {
        "conferenceNames": {
          "conferenceDisplay": "Pac-12 Conference",
          "conferenceDivision": "fbs",
          "conferenceName": "Pac-12",
          "conferenceSeo": "pac-12"
        },
        "description": "(1-2)",
        "names": {
          "char6": "COLO",
          "full": "University of Colorado, Boulder",
          "seo": "colorado",
          "short": "Colorado"
        },
        "rank": "",
        "score": "24",
        "seed": "",
        "winner": false
      },
      "liveVideoEnabled": false,
      "network": "",
      "startDate": "09-13-2014",
      "startTime": "10:00PM ET",
      "startTimeEpoch": "1410660000",
      "title": "Colorado Arizona St.",
      "url": "/game/football/fbs/2014/09/13/arizona-st-colorado",
      "videoState": ""
    }},
    {"game": {
      "away": {
        "conferenceNames": {
          "conferenceDisplay": "Big Ten Conference",
          "conferenceDivision": "fbs",
          "conferenceName": "Big Ten",
          "conferenceSeo": "big-ten"
        },
        "description": "(3-0)",
        "names": {
          "char6": "NEB",
          "full": "University of Nebraska, Lincoln",
          "seo": "nebraska",
          "short": "Nebraska"
        },
        "rank": "",
        "score": "55",
        "seed": "",
        "winner": true
      },
      "bracketId": "",
      "bracketRegion": "",
      "bracketRound": "",
      "contestClock": "0:00",
      "currentPeriod": "Final",
      "finalMessage": "Final",
      "gameID": "90f45d71-303d-4983-9658-c9de89e3d8e0",
      "gameState": "final",
      "home": {
        "conferenceNames": {
          "conferenceDisplay": "Mountain West Conference",
          "conferenceDivision": "fbs",
          "conferenceName": "MWC",
          "conferenceSeo": "mountain-west"
        },
        "description": "(0-3)",
        "names": {
          "char6": "FRESNO",
          "full": "California State University, Fresno",
          "seo": "fresno-st",
          "short": "Fresno St."
        },
        "rank": "",
        "score": "19",
        "seed": "",
        "winner": false
      },
      "liveVideoEnabled": false,
      "network": "",
      "startDate": "09-13-2014",
      "startTime": "10:30PM ET",
      "startTimeEpoch": "1410661800",
      "title": "Fresno St. Nebraska",
      "url": "/game/football/fbs/2014/09/13/nebraska-fresno-st",
      "videoState": ""
    }},
    {"game": {
      "away": {
        "conferenceNames": {
          "conferenceDisplay": "Mountain West Conference",
          "conferenceDivision": "fbs",
          "conferenceName": "MWC",
          "conferenceSeo": "mountain-west"
        },
        "description": "(2-1)",
        "names": {
          "char6": "NEVADA",
          "full": "University of Nevada",
          "seo": "nevada",
          "short": "Nevada"
        },
        "rank": "",
        "score": "28",
        "seed": "",
        "winner": false
      },
      "bracketId": "",
      "bracketRegion": "",
      "bracketRound": "",
      "contestClock": "0:00",
      "currentPeriod": "Final",
      "finalMessage": "Final",
      "gameID": "de5e5fa3-4bfd-4bce-8d78-b9b10b4aa890",
      "gameState": "final",
      "home": {
        "conferenceNames": {
          "conferenceDisplay": "Pac-12 Conference",
          "conferenceDivision": "fbs",
          "conferenceName": "Pac-12",
          "conferenceSeo": "pac-12"
        },
        "description": "(3-0)",
        "names": {
          "char6": "ARIZ",
          "full": "University of Arizona",
          "seo": "arizona",
          "short": "Arizona"
        },
        "rank": "",
        "score": "35",
        "seed": "",
        "winner": true
      },
      "liveVideoEnabled": false,
      "network": "",
      "startDate": "09-13-2014",
      "startTime": "11:00PM ET",
      "startTimeEpoch": "1410663600",
      "title": "Arizona Nevada",
      "url": "/game/football/fbs/2014/09/13/nevada-arizona",
      "videoState": ""
    }},
    {"game": {
      "away": {
        "conferenceNames": {
          "conferenceDisplay": "Missouri Valley Football Conference",
          "conferenceDivision": "fcs",
          "conferenceName": "Missouri Valley",
          "conferenceSeo": "mvfc"
        },
        "description": "(0-2)",
        "names": {
          "char6": "N IOWA",
          "full": "University of Northern Iowa",
          "seo": "uni",
          "short": "UNI"
        },
        "rank": "",
        "score": "24",
        "seed": "",
        "winner": false
      },
      "bracketId": "",
      "bracketRegion": "",
      "bracketRound": "",
      "contestClock": "0:00",
      "currentPeriod": "Final",
      "finalMessage": "Final",
      "gameID": "52a6c4c1-143c-4f32-aad3-42fd98f11c75",
      "gameState": "final",
      "home": {
        "conferenceNames": {
          "conferenceDisplay": "Mountain West Conference",
          "conferenceDivision": "fbs",
          "conferenceName": "MWC",
          "conferenceSeo": "mountain-west"
        },
        "description": "(1-2)",
        "names": {
          "char6": "HAWAII",
          "full": "University of Hawaii, Manoa",
          "seo": "hawaii",
          "short": "Hawaii"
        },
        "rank": "",
        "score": "27",
        "seed": "",
        "winner": true
      },
      "liveVideoEnabled": false,
      "network": "",
      "startDate": "09-14-2014",
      "startTime": "12:00AM ET",
      "startTimeEpoch": "1410667200",
      "title": "Hawaii UNI",
      "url": "/game/football/fbs/2014/09/14/uni-hawaii",
      "videoState": ""
    }}
  ],
  "inputMD5Sum": "21f46d22df9ae930db9ccc63df60dffd"
}