{
  "games": [
    {"game": {
      "away": {
        "conferenceNames": {
          "conferenceDisplay": "Pac-12 Conference",
          "conferenceDivision": "fbs",
          "conferenceName": "Pac-12",
          "conferenceSeo": "pac-12"
        },
        "description": "(-)",
        "names": {
          "char6": "WASHST",
          "full": "Washington State University",
          "seo": "washington-st",
          "short": "Washington St."
        },
        "rank": "",
        "score": "45",
        "seed": "",
        "winner": false
      },
      "bracketId": "",
      "bracketRegion": "",
      "bracketRound": "",
      "contestClock": "0:00",
      "currentPeriod": "Final",
      "finalMessage": "Final",
      "gameID": "ab5fa8f6-145a-49de-a0c3-10a77c960293",
      "gameState": "final",
      "home": {
        "conferenceNames": {
          "conferenceDisplay": "Mountain West Conference",
          "conferenceDivision": "fbs",
          "conferenceName": "MWC",
          "conferenceSeo": "mountain-west"
        },
        "description": "(-)",
        "names": {
          "char6": "CO ST",
          "full": "Colorado State University",
          "seo": "colorado-st",
          "short": "Colorado St."
        },
        "rank": "",
        "score": "48",
        "seed": "",
        "winner": true
      },
      "liveVideoEnabled": false,
      "network": "",
      "startDate": "12-21-2013",
      "startTime": "02:00PM ET",
      "startTimeEpoch": "1387652400",
      "title": "New Mexico Bowl",
      "url": "/game/football/fbs/2013/12/21/washington-st-colorado-st",
      "videoState": ""
    }},
    {"game": {
      "away": {
        "conferenceNames": {
          "conferenceDisplay": "Mountain West Conference",
          "conferenceDivision": "fbs",
          "conferenceName": "MWC",
          "conferenceSeo": "mountain-west"
        },
        "description": "(-)",
        "names": {
          "char6": "FRESNO",
          "full": "California State University, Fresno",
          "seo": "fresno-st",
          "short": "Fresno St."
        },
        "rank": "",
        "score": "20",
        "seed": "",
        "winner": false
      },
      "bracketId": "",
      "bracketRegion": "",
      "bracketRound": "",
      "contestClock": "0:00",
      "currentPeriod": "Final",
      "finalMessage": "Final",
      "gameID": "7db31d88-92f9-4afd-9f5e-57964b49559b",
      "gameState": "final",
      "home": {
        "conferenceNames": {
          "conferenceDisplay": "Pac-12 Conference",
          "conferenceDivision": "fbs",
          "conferenceName": "Pac-12",
          "conferenceSeo": "pac-12"
        },
        "description": "(-)",
        "names": {
          "char6": "USC",
          "full": "University of Southern California",
          "seo": "southern-california",
          "short": "Southern California"
        },
        "rank": "",
        "score": "45",
        "seed": "",
        "winner": true
      },
      "liveVideoEnabled": false,
      "network": "",
      "startDate": "12-21-2013",
      "startTime": "03:30PM ET",
      "startTimeEpoch": "1387657800",
      "title": "Las Vegas Bowl",
      "url": "/game/football/fbs/2013/12/21/fresno-st-southern-california",
      "videoState": ""
    }},
    {"game": {
      "away": {
        "conferenceNames": {
          "conferenceDisplay": "Mid-American Conference",
          "conferenceDivision": "fbs",
          "conferenceName": "MAC",
          "conferenceSeo": "mid-american"
        },
        "description": "(-)",
        "names": {
          "char6": "BUFF",
          "full": "University at Buffalo, the State University of New York",
          "seo": "buffalo",
          "short": "Buffalo"
        },
        "rank": "",
        "score": "24",
        "seed": "",
        "winner": false
      },
      "bracketId": "",
      "bracketRegion": "",
      "bracketRound": "",
      "contestClock": "0:00",
      "currentPeriod": "Final",
      "finalMessage": "Final",
      "gameID": "f0e26b4f-89f3-4fb9-b0a6-9cd50ef8449a",
      "gameState": "final",
      "home": {
        "conferenceNames": {
          "conferenceDisplay": "Mountain West Conference",
          "conferenceDivision": "fbs",
          "conferenceName": "MWC",
          "conferenceSeo": "mountain-west"
        },
        "description": "(-)",
        "names": {
          "char6": "SDSU",
          "full": "San Diego State University",
          "seo": "san-diego-st",
          "short": "San Diego St."
        },
        "rank": "",
        "score": "49",
        "seed": "",
        "winner": true
      },
      "liveVideoEnabled": false,
      "network": "",
      "startDate": "12-21-2013",
      "startTime": "05:30PM ET",
      "startTimeEpoch": "1387665000",
      "title": "Idaho Potato Bowl",
      "url": "/game/football/fbs/2013/12/21/buffalo-san-diego-st",
      "videoState": ""
    }},
    {"game": {
      "away": {
        "conferenceNames": {
          "conferenceDisplay": "American Athletic Conference",
          "conferenceDivision": "fbs",
          "conferenceName": "AAC",
          "conferenceSeo": "american-athletic"
        },
        "description": "(-)",
        "names": {
          "char6": "TULANE",
          "full": "Tulane University",
          "seo": "tulane",
          "short": "Tulane"
        },
        "rank": "",
        "score": "21",
        "seed": "",
        "winner": false
      },
      "bracketId": "",
      "bracketRegion": "",
      "bracketRound": "",
      "contestClock": "0:00",
      "currentPeriod": "Final",
      "finalMessage": "Final",
      "gameID": "d921d003-6f00-4177-9ffd-02104e497e53",
      "gameState": "final",
      "home": {
        "conferenceNames": {
          "conferenceDisplay": "Sun Belt Conference",
          "conferenceDivision": "fbs",
          "conferenceName": "Sun Belt",
          "conferenceSeo": "sun-belt"
        },
        "description": "(-)",
        "names": {
          "char6": "ULL",
          "full": "University of Louisiana at Lafayette",
          "seo": "la-lafayette",
          "short": "Louisiana"
        },
        "rank": "",
        "score": "24",
        "seed": "",
        "winner": true
      },
      "liveVideoEnabled": false,
      "network": "",
      "startDate": "12-21-2013",
      "startTime": "09:00PM ET",
      "startTimeEpoch": "1387677600",
      "title": "New Orleans Bowl",
      "url": "/game/football/fbs/2013/12/21/tulane-la-lafayette",
      "videoState": ""
    }},
    {"game": {
      "away": {
        "conferenceNames": {
          "conferenceDisplay": "Mountain West Conference",
          "conferenceDivision": "fbs",
          "conferenceName": "MWC",
          "conferenceSeo": "mountain-west"
        },
        "description": "(-)",
        "names": {
          "char6": "BOISE",
          "full": "Boise State University",
          "seo": "boise-st",
          "short": "Boise St."
        },
        "rank": "",
        "score": "23",
        "seed": "",
        "winner": false
      },
      "bracketId": "",
      "bracketRegion": "",
      "bracketRound": "",
      "contestClock": "0:00",
      "currentPeriod": "Final",
      "finalMessage": "Final",
      "gameID": "cf13f3fa-f369-4718-bb9b-50e5d47b77c2",
      "gameState": "final",
      "home": {
        "conferenceNames": {
          "conferenceDisplay": "Pac-12 Conference",
          "conferenceDivision": "fbs",
          "conferenceName": "Pac-12",
          "conferenceSeo": "pac-12"
        },
        "description": "(-)",
        "names": {
          "char6": "ORE ST",
          "full": "Oregon State University",
          "seo": "oregon-st",
          "short": "Oregon St."
        },
        "rank": "",
        "score": "38",
        "seed": "",
        "winner": true
      },
      "liveVideoEnabled": false,
      "network": "",
      "startDate": "12-24-2013",
      "startTime": "08:00PM ET",
      "startTimeEpoch": "1387933200",
      "title": "Hawaii Bowl",
      "url": "/game/football/fbs/2013/12/24/boise-st-oregon-st",
      "videoState": ""
    }},
    {"game": {
      "away": {
        "conferenceNames": {
          "conferenceDisplay": "Atlantic Coast Conference",
          "conferenceDivision": "fbs",
          "conferenceName": "ACC",
          "conferenceSeo": "atlantic-coast"
        },
        "description": "(-)",
        "names": {
          "char6": "PITT",
          "full": "University of Pittsburgh",
          "seo": "pittsburgh",
          "short": "Pittsburgh"
        },
        "rank": "",
        "score": "30",
        "seed": "",
        "winner": true
      },
      "bracketId": "",
      "bracketRegion": "",
      "bracketRound": "",
      "contestClock": "0:00",
      "currentPeriod": "Final",
      "finalMessage": "Final",
      "gameID": "a89489e4-44c9-46c0-aef7-105fb0e3717f",
      "gameState": "final",
      "home": {
        "conferenceNames": {
          "conferenceDisplay": "Mid-American Conference",
          "conferenceDivision": "fbs",
          "conferenceName": "MAC",
          "conferenceSeo": "mid-american"
        },
        "description": "(-)",
        "names": {
          "char6": "BGSU",
          "full": "Bowling Green State University",
          "seo": "bowling-green",
          "short": "Bowling Green"
        },
        "rank": "",
        "score": "27",
        "seed": "",
        "winner": false
      },
      "liveVideoEnabled": false,
      "network": "",
      "startDate": "12-26-2013",
      "startTime": "06:00PM ET",
      "startTimeEpoch": "1388098800",
      "title": "Little Caesars Bowl",
      "url": "/game/football/fbs/2013/12/26/pittsburgh-bowling-green",
      "videoState": ""
    }},
    {"game": {
      "away": {
        "conferenceNames": {
          "conferenceDisplay": "Mountain West Conference",
          "conferenceDivision": "fbs",
          "conferenceName": "MWC",
          "conferenceSeo": "mountain-west"
        },
        "description": "(-)",
        "names": {
          "char6": "UT ST",
          "full": "Utah State University",
          "seo": "utah-st",
          "short": "Utah St."
        },
        "rank": "",
        "score": "21",
        "seed": "",
        "winner": true
      },
      "bracketId": "",
      "bracketRegion": "",
      "bracketRound": "",
      "contestClock": "0:00",
      "currentPeriod": "Final",
      "finalMessage": "Final",
      "gameID": "494c9230-d15c-4fa1-828f-cd90cacc4337",
      "gameState": "final",
      "home": {
        "conferenceNames": {
          "conferenceDisplay": "Mid-American Conference",
          "conferenceDivision": "fbs",
          "conferenceName": "MAC",
          "conferenceSeo": "mid-american"
        },
        "description": "(-)",
        "names": {
          "char6": "NIU",
          "full": "Northern Illinois University",
          "seo": "northern-ill",
          "short": "Northern Ill."
        },
        "rank": "",
        "score": "14",
        "seed": "",
        "winner": false
      },
      "liveVideoEnabled": false,
      "network": "",
      "startDate": "12-26-2013",
      "startTime": "09:30PM ET",
      "startTimeEpoch": "1388111400",
      "title": "Poinsettia Bowl",
      "url": "/game/football/fbs/2013/12/26/utah-st-northern-ill",
      "videoState": ""
    }},
    {"game": {
      "away": {
        "conferenceNames": {
          "conferenceDisplay": "Conference USA",
          "conferenceDivision": "fbs",
          "conferenceName": "C-USA",
          "conferenceSeo": "conference-usa"
        },
        "description": "(-)",
        "names": {
          "char6": "MARSH",
          "full": "Marshall University",
          "seo": "marshall",
          "short": "Marshall"
        },
        "rank": "",
        "score": "31",
        "seed": "",
        "winner": true
      },
      "bracketId": "",
      "bracketRegion": "",
      "bracketRound": "",
      "contestClock": "0:00",
      "currentPeriod": "Final",
      "finalMessage": "Final",
      "gameID": "8018444d-ef77-428a-8667-0631ea9abff5",
      "gameState": "final",
      "home": {
        "conferenceNames": {
          "conferenceDisplay": "Big Ten Conference",
          "conferenceDivision": "fbs",
          "conferenceName": "Big Ten",
          "conferenceSeo": "big-ten"
        },
        "description": "(-)",
        "names": {
          "char6": "MD",
          "full": "University of Maryland, College Park",
          "seo": "maryland",
          "short": "Maryland"
        },
        "rank": "",
        "score": "20",
        "seed": "",
        "winner": false
      },
      "liveVideoEnabled": false,
      "network": "",
      "startDate": "12-27-2013",
      "startTime": "02:30PM ET",
      "startTimeEpoch": "1388172600",
      "title": "Military Bowl",
      "url": "/game/football/fbs/2013/12/27/marshall-maryland",
      "videoState": ""
    }},
    {"game": {
      "away": {
        "conferenceNames": {
          "conferenceDisplay": "Atlantic Coast Conference",
          "conferenceDivision": "fbs",
          "conferenceName": "ACC",
          "conferenceSeo": "atlantic-coast"
        },
        "description": "(-)",
        "names": {
          "char6": "SYR",
          "full": "Syracuse University",
          "seo": "syracuse",
          "short": "Syracuse"
        },
        "rank": "",
        "score": "21",
        "seed": "",
        "winner": true
      },
      "bracketId": "",
      "bracketRegion": "",
      "bracketRound": "",
      "contestClock": "0:00",
      "currentPeriod": "Final",
      "finalMessage": "Final",
      "gameID": "40937886-35ae-4547-a20a-8b5ab9eecc46",
      "gameState": "final",
      "home": {
        "conferenceNames": {
          "conferenceDisplay": "Big Ten Conference",
          "conferenceDivision": "fbs",
          "conferenceName": "Big Ten",
          "conferenceSeo": "big-ten"
        },
        "description": "(-)",
        "names": {
          "char6": "MINN",
          "full": "University of Minnesota, Twin Cities",
          "seo": "minnesota",
          "short": "Minnesota"
        },
        "rank": "",
        "score": "17",
        "seed": "",
        "winner": false
      },
      "liveVideoEnabled": false,
      "network": "",
      "startDate": "12-27-2013",
      "startTime": "06:00PM ET",
      "startTimeEpoch": "1388185200",
      "title": "Texas Bowl",
      "url": "/game/football/fbs/2013/12/27/syracuse-minnesota",
      "videoState": ""
    }},
    {"game": {
      "away": {
        "conferenceNames": {
          "conferenceDisplay": "FBS Independent",
          "conferenceDivision": "fbs",
          "conferenceName": "IND",
          "conferenceSeo": "fbs-independent"
        },
        "description": "(-)",
        "names": {
          "char6": "BYU",
          "full": "Brigham Young University",
          "seo": "byu",
          "short": "BYU"
        },
        "rank": "",
        "score": "16",
        "seed": "",
        "winner": false
      },
      "bracketId": "",
      "bracketRegion": "",
      "bracketRound": "",
      "contestClock": "0:00",
      "currentPeriod": "Final",
      "finalMessage": "Final",
      "gameID": "3c3df59c-e8ec-46e1-a195-e728dd006afc",
      "gameState": "final",
      "home": {
        "conferenceNames": {
          "conferenceDisplay": "Pac-12 Conference",
          "conferenceDivision": "fbs",
          "conferenceName": "Pac-12",
          "conferenceSeo": "pac-12"
        },
        "description": "(-)",
        "names": {
          "char6": "WASH",
          "full": "University of Washington",
          "seo": "washington",
          "short": "Washington"
        },
        "rank": "",
        "score": "31",
        "seed": "",
        "winner": true
      },
      "liveVideoEnabled": false,
      "network": "",
      "startDate": "12-27-2013",
      "startTime": "09:30PM ET",
      "startTimeEpoch": "1388197800",
      "title": "Fight Hunger Bowl",
      "url": "/game/football/fbs/2013/12/27/byu-washington",
      "videoState": ""
    }},
    {"game": {
      "away": {
        "conferenceNames": {
          "conferenceDisplay": "Big Ten Conference",
          "conferenceDivision": "fbs",
          "conferenceName": "Big Ten",
          "conferenceSeo": "big-ten"
        },
        "description": "(-)",
        "names": {
          "char6": "RUTGER",
          "full": "Rutgers, State Univ of New Jersey, New Brunswick",
          "seo": "rutgers",
          "short": "Rutgers"
        },
        "rank": "",
        "score": "16",
        "seed": "",
        "winner": false
      },
      "bracketId": "",
      "bracketRegion": "",
      "bracketRound": "",
      "contestClock": "0:00",
      "currentPeriod": "Final",
      "finalMessage": "Final",
      "gameID": "23857dff-e822-422a-ace2-6f2529a352f0",
      "gameState": "final",
      "home": {
        "conferenceNames": {
          "conferenceDisplay": "FBS Independent",
          "conferenceDivision": "fbs",
          "conferenceName": "IND",
          "conferenceSeo": "fbs-independent"
        },
        "description": "(-)",
        "names": {
          "char6": "N DAME",
          "full": "University of Notre Dame",
          "seo": "notre-dame",
          "short": "Notre Dame"
        },
        "rank": "",
        "score": "29",
        "seed": "",
        "winner": true
      },
      "liveVideoEnabled": false,
      "network": "",
      "startDate": "12-28-2013",
      "startTime": "12:00PM ET",
      "startTimeEpoch": "1388250000",
      "title": "Pinstripe Bowl",
      "url": "/game/football/fbs/2013/12/28/rutgers-notre-dame",
      "videoState": ""
    }},
    {"game": {
      "away": {
        "conferenceNames": {
          "conferenceDisplay": "American Athletic Conference",
          "conferenceDivision": "fbs",
          "conferenceName": "AAC",
          "conferenceSeo": "american-athletic"
        },
        "description": "(-)",
        "names": {
          "char6": "CINCY",
          "full": "University of Cincinnati",
          "seo": "cincinnati",
          "short": "Cincinnati"
        },
        "rank": "",
        "score": "17",
        "seed": "",
        "winner": false
      },
      "bracketId": "",
      "bracketRegion": "",
      "bracketRound": "",
      "contestClock": "0:00",
      "currentPeriod": "Final",
      "finalMessage": "Final",
      "gameID": "b70ac49e-4d3b-46c2-bb72-1b5948403b71",
      "gameState": "final",
      "home": {
        "conferenceNames": {
          "conferenceDisplay": "Atlantic Coast Conference",
          "conferenceDivision": "fbs",
          "conferenceName": "ACC",
          "conferenceSeo": "atlantic-coast"
        },
        "description": "(-)",
        "names": {
          "char6": "UNC",
          "full": "University of North Carolina, Chapel Hill",
          "seo": "north-carolina",
          "short": "North Carolina"
        },
        "rank": "",
        "score": "39",
        "seed": "",
        "winner": true
      },
      "liveVideoEnabled": false,
      "network": "",
      "startDate": "12-28-2013",
      "startTime": "03:20PM ET",
      "startTimeEpoch": "1388262000",
      "title": "Belk Bowl",
      "url": "/game/football/fbs/2013/12/28/cincinnati-north-carolina",
      "videoState": ""
    }},
    {"game": {
      "away": {
        "conferenceNames": {
          "conferenceDisplay": "Atlantic Coast Conference",
          "conferenceDivision": "fbs",
          "conferenceName": "ACC",
          "conferenceSeo": "atlantic-coast"
        },
        "description": "(-)",
        "names": {
          "char6": "MIAMI",
          "full": "University of Miami (Florida)",
          "seo": "miami-fl",
          "short": "Miami (FL)"
        },
        "rank": "",
        "score": "9",
        "seed": "",
        "winner": false
      },
      "bracketId": "",
      "bracketRegion": "",
      "bracketRound": "",
      "contestClock": "0:00",
      "currentPeriod": "Final",
      "finalMessage": "Final",
      "gameID": "96aaa29d-d135-4c30-ab0c-b87d1dc9dd9c",
      "gameState": "final",
      "home": {
        "conferenceNames": {
          "conferenceDisplay": "Atlantic Coast Conference",
          "conferenceDivision": "fbs",
          "conferenceName": "ACC",
          "conferenceSeo": "atlantic-coast"
        },
        "description": "(-)",
        "names": {
          "char6": "LOUIS",
          "full": "University of Louisville",
          "seo": "louisville",
          "short": "Louisville"
        },
        "rank": "",
        "score": "36",
        "seed": "",
        "winner": true
      },
      "liveVideoEnabled": false,
      "network": "",
      "startDate": "12-28-2013",
      "startTime": "06:45PM ET",
      "startTimeEpoch": "1388274300",
      "title": "Russell Athletic Bowl",
      "url": "/game/football/fbs/2013/12/28/miami-fl-louisville",
      "videoState": ""
    }},
    {"game": {
      "away": {
        "conferenceNames": {
          "conferenceDisplay": "Big Ten Conference",
          "conferenceDivision": "fbs",
          "conferenceName": "Big Ten",
          "conferenceSeo": "big-ten"
        },
        "description": "(-)",
        "names": {
          "char6": "MICH",
          "full": "University of Michigan",
          "seo": "michigan",
          "short": "Michigan"
        },
        "rank": "",
        "score": "14",
        "seed": "",
        "winner": false
      },
      "bracketId": "",
      "bracketRegion": "",
      "bracketRound": "",
      "contestClock": "0:00",
      "currentPeriod": "Final",
      "finalMessage": "Final",
      "gameID": "9dec4439-2cad-4d03-a210-bfed2fe08a43",
      "gameState": "final",
      "home": {
        "conferenceNames": {
          "conferenceDisplay": "Big 12 Conference",
          "conferenceDivision": "fbs",
          "conferenceName": "Big 12",
          "conferenceSeo": "big-12"
        },
        "description": "(-)",
        "names": {
          "char6": "KAN ST",
          "full": "Kansas State University",
          "seo": "kansas-st",
          "short": "Kansas St."
        },
        "rank": "",
        "score": "31",
        "seed": "",
        "winner": true
      },
      "liveVideoEnabled": false,
      "network": "",
      "startDate": "12-28-2013",
      "startTime": "10:15PM ET",
      "startTimeEpoch": "1388286900",
      "title": "Buffalo Wild Wings Bowl",
      "url": "/game/football/fbs/2013/12/28/michigan-kansas-st",
      "videoState": ""
    }},
    {"game": {
      "away": {
        "conferenceNames": {
          "conferenceDisplay": "Conference USA",
          "conferenceDivision": "fbs",
          "conferenceName": "C-USA",
          "conferenceSeo": "conference-usa"
        },
        "description": "(-)",
        "names": {
          "char6": "MIDTEN",
          "full": "Middle Tennessee State University",
          "seo": "middle-tenn",
          "short": "Middle Tenn."
        },
        "rank": "",
        "score": "6",
        "seed": "",
        "winner": false
      },
      "bracketId": "",
      "bracketRegion": "",
      "bracketRound": "",
      "contestClock": "0:00",
      "currentPeriod": "Final",
      "finalMessage": "Final",
      "gameID": "809df8d3-0af9-4b7b-9a78-b1c197524a6d",
      "gameState": "final",
      "home": {
        "conferenceNames": {
          "conferenceDisplay": "American Athletic Conference",
          "conferenceDivision": "fbs",
          "conferenceName": "AAC",
          "conferenceSeo": "american-athletic"
        },
        "description": "(-)",
        "names": {
          "char6": "NAVY",
          "full": "U.S. Naval Academy",
          "seo": "navy",
          "short": "Navy"
        },
        "rank": "",
        "score": "24",
        "seed": "",
        "winner": true
      },
      "liveVideoEnabled": false,
      "network": "",
      "startDate": "12-30-2013",
      "startTime": "11:45AM ET",
      "startTimeEpoch": "1388421900",
      "title": "Armed Forces Bowl",
      "url": "/game/football/fbs/2013/12/30/middle-tenn-navy",
      "videoState": ""
    }},
    {"game": {
      "away": {
        "conferenceNames": {
          "conferenceDisplay": "Southeastern Conference",
          "conferenceDivision": "fbs",
          "conferenceName": "SEC",
          "conferenceSeo": "southeastern"
        },
        "description": "(-)",
        "names": {
          "char6": "MISS",
          "full": "University of Mississippi",
          "seo": "ole-miss",
          "short": "Ole Miss"
        },
        "rank": "",
        "score": "25",
        "seed": "",
        "winner": true
      },
      "bracketId": "",
      "bracketRegion": "",
      "bracketRound": "",
      "contestClock": "0:00",
      "currentPeriod": "Final",
      "finalMessage": "Final",
      "gameID": "1d1a8f13-c5a5-4359-b08c-a91e746b0549",
      "gameState": "final",
      "home": {
        "conferenceNames": {
          "conferenceDisplay": "Atlantic Coast Conference",
          "conferenceDivision": "fbs",
          "conferenceName": "ACC",
          "conferenceSeo": "atlantic-coast"
        },
        "description": "(-)",
        "names": {
          "char6": "GATECH",
          "full": "Georgia Institute of Technology",
          "seo": "georgia-tech",
          "short": "Georgia Tech"
        },
        "rank": "",
        "score": "17",
        "seed": "",
        "winner": false
      },
      "liveVideoEnabled": false,
      "network": "",
      "startDate": "12-30-2013",
      "startTime": "03:15PM ET",
      "startTimeEpoch": "1388434500",
      "title": "Music City Bowl",
      "url": "/game/football/fbs/2013/12/30/ole-miss-georgia-tech",
      "videoState": ""
    }},
    {"game": {
      "away": {
        "conferenceNames": {
          "conferenceDisplay": "Pac-12 Conference",
          "conferenceDivision": "fbs",
          "conferenceName": "Pac-12",
          "conferenceSeo": "pac-12"
        },
        "description": "(-)",
        "names": {
          "char6": "OREGN",
          "full": "University of Oregon",
          "seo": "oregon",
          "short": "Oregon"
        },
        "rank": "",
        "score": "30",
        "seed": "",
        "winner": true
      },
      "bracketId": "",
      "bracketRegion": "",
      "bracketRound": "",
      "contestClock": "0:00",
      "currentPeriod": "Final",
      "finalMessage": "Final",
      "gameID": "d629b465-0eea-4e5c-b987-5a7b1d2f3ddc",
      "gameState": "final",
      "home": {
        "conferenceNames": {
          "conferenceDisplay": "Big 12 Conference",
          "conferenceDivision": "fbs",
          "conferenceName": "Big 12",
          "conferenceSeo": "big-12"
        },
        "description": "(-)",
        "names": {
          "char6": "TEXAS",
          "full": "University of Texas at Austin",
          "seo": "texas",
          "short": "Texas"
        },
        "rank": "",
        "score": "7",
        "seed": "",
        "winner": false
      },
      "liveVideoEnabled": false,
      "network": "",
      "startDate": "12-30-2013",
      "startTime": "06:45PM ET",
      "startTimeEpoch": "1388447100",
      "title": "Alamo Bowl",
      "url": "/game/football/fbs/2013/12/30/oregon-texas",
      "videoState": ""
    }},
    {"game": {
      "away": {
        "conferenceNames": {
          "conferenceDisplay": "Pac-12 Conference",
          "conferenceDivision": "fbs",
          "conferenceName": "Pac-12",
          "conferenceSeo": "pac-12"
        },
        "description": "(-)",
        "names": {
          "char6": "AZ ST",
          "full": "Arizona State University",
          "seo": "arizona-st",
          "short": "Arizona St."
        },
        "rank": "",
        "score": "23",
        "seed": "",
        "winner": false
      },
      "bracketId": "",
      "bracketRegion": "",
      "bracketRound": "",
      "contestClock": "0:00",
      "currentPeriod": "Final",
      "finalMessage": "Final",
      "gameID": "58bbbd14-ff93-44dd-b2a5-d78cc57a2db3",
      "gameState": "final",
      "home": {
        "conferenceNames": {
          "conferenceDisplay": "Big 12 Conference",
          "conferenceDivision": "fbs",
          "conferenceName": "Big 12",
          "conferenceSeo": "big-12"
        },
        "description": "(-)",
        "names": {
          "char6": "TXTECH",
          "full": "Texas Tech University",
          "seo": "texas-tech",
          "short": "Texas Tech"
        },
        "rank": "",
        "score": "37",
        "seed": "",
        "winner": true
      },
      "liveVideoEnabled": false,
      "network": "",
      "startDate": "12-30-2013",
      "startTime": "10:15PM ET",
      "startTimeEpoch": "1388459700",
      "title": "Holiday Bowl",
      "url": "/game/football/fbs/2013/12/30/arizona-st-texas-tech",
      "videoState": ""
    }},
    {"game": {
      "away": {
        "conferenceNames": {
          "conferenceDisplay": "Pac-12 Conference",
          "conferenceDivision": "fbs",
          "conferenceName": "Pac-12",
          "conferenceSeo": "pac-12"
        },
        "description": "(-)",
        "names": {
          "char6": "ARIZ",
          "full": "University of Arizona",
          "seo": "arizona",
          "short": "Arizona"
        },
        "rank": "",
        "score": "42",
        "seed": "",
        "winner": true
      },
      "bracketId": "",
      "bracketRegion": "",
      "bracketRound": "",
      "contestClock": "0:00",
      "currentPeriod": "Final",
      "finalMessage": "Final",
      "gameID": "9097db20-7cde-458c-a784-21a0b3aa04d6",
      "gameState": "final",
      "home": {
        "conferenceNames": {
          "conferenceDisplay": "Atlantic Coast Conference",
          "conferenceDivision": "fbs",
          "conferenceName": "ACC",
          "conferenceSeo": "atlantic-coast"
        },
        "description": "(-)",
        "names": {
          "char6": "BC",
          "full": "Boston College",
          "seo": "boston-college",
          "short": "Boston College"
        },
        "rank": "",
        "score": "19",
        "seed": "",
        "winner": false
      },
      "liveVideoEnabled": false,
      "network": "",
      "startDate": "12-31-2013",
      "startTime": "12:30PM ET",
      "startTimeEpoch": "1388511000",
      "title": "Advocare V100 Bowl",
      "url": "/game/football/fbs/2013/12/31/arizona-boston-college",
      "videoState": ""
    }},
    {"game": {
      "away": {
        "conferenceNames": {
          "conferenceDisplay": "Atlantic Coast Conference",
          "conferenceDivision": "fbs",
          "conferenceName": "ACC",
          "conferenceSeo": "atlantic-coast"
        },
        "description": "(-)",
        "names": {
          "char6": "VATECH",
          "full": "Virginia Polytechnic Institute & State University",
          "seo": "virginia-tech",
          "short": "Virginia Tech"
        },
        "rank": "",
        "score": "12",
        "seed": "",
        "winner": false
      },
      "bracketId": "",
      "bracketRegion": "",
      "bracketRound": "",
      "contestClock": "0:00",
      "currentPeriod": "Final",
      "finalMessage": "Final",
      "gameID": "99ecbbcf-afa3-4e64-996a-857752601e44",
      "gameState": "final",
      "home": {
        "conferenceNames": {
          "conferenceDisplay": "Pac-12 Conference",
          "conferenceDivision": "fbs",
          "conferenceName": "Pac-12",
          "conferenceSeo": "pac-12"
        },
        "description": "(-)",
        "names": {
          "char6": "UCLA",
          "full": "University of California, Los Angeles",
          "seo": "ucla",
          "short": "UCLA"
        },
        "rank": "",
        "score": "42",
        "seed": "",
        "winner": true
      },
      "liveVideoEnabled": false,
      "network": "",
      "startDate": "12-31-2013",
      "startTime": "02:00PM ET",
      "startTimeEpoch": "1388516400",
      "title": "Sun Bowl",
      "url": "/game/football/fbs/2013/12/31/virginia-tech-ucla",
      "videoState": ""
    }},
    {"game": {
      "away": {
        "conferenceNames": {
          "conferenceDisplay": "Conference USA",
          "conferenceDivision": "fbs",
          "conferenceName": "C-USA",
          "conferenceSeo": "conference-usa"
        },
        "description": "(-)",
        "names": {
          "char6": "RICE",
          "full": "Rice University",
          "seo": "rice",
          "short": "Rice"
        },
        "rank": "",
        "score": "7",
        "seed": "",
        "winner": false
      },
      "bracketId": "",
      "bracketRegion": "",
      "bracketRound": "",
      "contestClock": "0:00",
      "currentPeriod": "Final",
      "finalMessage": "Final",
      "gameID": "92ca86b6-1bb0-49bd-848a-dba028395e0c",
      "gameState": "final",
      "home": {
        "conferenceNames": {
          "conferenceDisplay": "Southeastern Conference",
          "conferenceDivision": "fbs",
          "conferenceName": "SEC",
          "conferenceSeo": "southeastern"
        },
        "description": "(-)",
        "names": {
          "char6": "MISSST",
          "full": "Mississippi State University",
          "seo": "mississippi-st",
          "short": "Mississippi St."
        },
        "rank": "",
        "score": "44",
        "seed": "",
        "winner": true
      },
      "liveVideoEnabled": false,
      "network": "",
      "startDate": "12-31-2013",
      "startTime": "04:00PM ET",
      "startTimeEpoch": "1388523600",
      "title": "Liberty Bowl",
      "url": "/game/football/fbs/2013/12/31/rice-mississippi-st",
      "videoState": ""
    }},
    {"game": {
      "away": {
        "conferenceNames": {
          "conferenceDisplay": "Atlantic Coast Conference",
          "conferenceDivision": "fbs",
          "conferenceName": "ACC",
          "conferenceSeo": "atlantic-coast"
        },
        "description": "(-)",
        "names": {
          "char6": "DUKE",
          "full": "Duke University",
          "seo": "duke",
          "short": "Duke"
        },
        "rank": "",
        "score": "48",
        "seed": "",
        "winner": false
      },
      "bracketId": "",
      "bracketRegion": "",
      "bracketRound": "",
      "contestClock": "0:00",
      "currentPeriod": "Final",
      "finalMessage": "Final",
      "gameID": "c546958a-bc54-4a52-a73f-55143197d6f5",
      "gameState": "final",
      "home": {
        "conferenceNames": {
          "conferenceDisplay": "Southeastern Conference",
          "conferenceDivision": "fbs",
          "conferenceName": "SEC",
          "conferenceSeo": "southeastern"
        },
        "description": "(-)",
        "names": {
          "char6": "TX A&M",
          "full": "Texas A&M University, College Station",
          "seo": "texas-am",
          "short": "Texas A&M"
        },
        "rank": "",
        "score": "52",
        "seed": "",
        "winner": true
      },
      "liveVideoEnabled": false,
      "network": "",
      "startDate": "12-31-2013",
      "startTime": "08:00PM ET",
      "startTimeEpoch": "1388538000",
      "title": "Chick-fil-A Bowl",
      "url": "/game/football/fbs/2013/12/31/duke-texas-am",
      "videoState": ""
    }},
    {"game": {
      "away": {
        "conferenceNames": {
          "conferenceDisplay": "Mountain West Conference",
          "conferenceDivision": "fbs",
          "conferenceName": "MWC",
          "conferenceSeo": "mountain-west"
        },
        "description": "(-)",
        "names": {
          "char6": "UNLV",
          "full": "University of Nevada, Las Vegas",
          "seo": "unlv",
          "short": "UNLV"
        },
        "rank": "",
        "score": "14",
        "seed": "",
        "winner": false
      },
      "bracketId": "",
      "bracketRegion": "",
      "bracketRound": "",
      "contestClock": "0:00",
      "currentPeriod": "Final",
      "finalMessage": "Final",
      "gameID": "1c6b94f0-7e01-4604-94e7-1de918c9ea23",
      "gameState": "final",
      "home": {
        "conferenceNames": {
          "conferenceDisplay": "Conference USA",
          "conferenceDivision": "fbs",
          "conferenceName": "C-USA",
          "conferenceSeo": "conference-usa"
        },
        "description": "(-)",
        "names": {
          "char6": "NO TEX",
          "full": "University of North Texas",
          "seo": "north-texas",
          "short": "North Texas"
        },
        "rank": "",
        "score": "36",
        "seed": "",
        "winner": true
      },
      "liveVideoEnabled": false,
      "network": "",
      "startDate": "01-01-2014",
      "startTime": "12:00PM ET",
      "startTimeEpoch": "1388595600",
      "title": "Heart of Dallas Bowl",
      "url": "/game/football/fbs/2014/01/01/unlv-north-texas",
      "videoState": ""
    }},
    {"game": {
      "away": {
        "conferenceNames": {
          "conferenceDisplay": "Big Ten Conference",
          "conferenceDivision": "fbs",
          "conferenceName": "Big Ten",
          "conferenceSeo": "big-ten"
        },
        "description": "(-)",
        "names": {
          "char6": "NEB",
          "full": "University of Nebraska, Lincoln",
          "seo": "nebraska",
          "short": "Nebraska"
        },
        "rank": "",
        "score": "24",
        "seed": "",
        "winner": true
      },
      "bracketId": "",
      "bracketRegion": "",
      "bracketRound": "",
      "contestClock": "0:00",
      "currentPeriod": "Final",
      "finalMessage": "Final",
      "gameID": "3a3483cb-f282-409f-817c-7cfa24a3afae",
      "gameState": "final",
      "home": {
        "conferenceNames": {
          "conferenceDisplay": "Southeastern Conference",
          "conferenceDivision": "fbs",
          "conferenceName": "SEC",
          "conferenceSeo": "southeastern"
        },
        "description": "(-)",
        "names": {
          "char6": "UGA",
          "full": "University of Georgia",
          "seo": "georgia",
          "short": "Georgia"
        },
        "rank": "",
        "score": "19",
        "seed": "",
        "winner": false
      },
      "liveVideoEnabled": false,
      "network": "",
      "startDate": "01-01-2014",
      "startTime": "12:00PM ET",
      "startTimeEpoch": "1388595600",
      "title": "Gator Bowl",
      "url": "/game/football/fbs/2014/01/01/nebraska-georgia",
      "videoState": ""
    }},
    {"game": {
      "away": {
        "conferenceNames": {
          "conferenceDisplay": "Big Ten Conference",
          "conferenceDivision": "fbs",
          "conferenceName": "Big Ten",
          "conferenceSeo": "big-ten"
        },
        "description": "(-)",
        "names": {
          "char6": "WISC",
          "full": "University of Wisconsin, Madison",
          "seo": "wisconsin",
          "short": "Wisconsin"
        },
        "rank": "",
        "score": "24",
        "seed": "",
        "winner": false
      },
      "bracketId": "",
      "bracketRegion": "",
      "bracketRound": "",
      "contestClock": "0:00",
      "currentPeriod": "Final",
      "finalMessage": "Final",
      "gameID": "84b56b64-7a5f-4f93-9504-c2bad35f52d6",
      "gameState": "final",
      "home": {
        "conferenceNames": {
          "conferenceDisplay": "Southeastern Conference",
          "conferenceDivision": "fbs",
          "conferenceName": "SEC",
          "conferenceSeo": "southeastern"
        },
        "description": "(-)",
        "names": {
          "char6": "S CAR",
          "full": "University of South Carolina, Columbia",
          "seo": "south-carolina",
          "short": "South Carolina"
        },
        "rank": "",
        "score": "34",
        "seed": "",
        "winner": true
      },
      "liveVideoEnabled": false,
      "network": "",
      "startDate": "01-01-2014",
      "startTime": "01:00PM ET",
      "startTimeEpoch": "1388599200",
      "title": "Capital One Bowl",
      "url": "/game/football/fbs/2014/01/01/wisconsin-south-carolina",
      "videoState": ""
    }},
    {"game": {
      "away": {
        "conferenceNames": {
          "conferenceDisplay": "Big Ten Conference",
          "conferenceDivision": "fbs",
          "conferenceName": "Big Ten",
          "conferenceSeo": "big-ten"
        },
        "description": "(-)",
        "names": {
          "char6": "IOWA",
          "full": "University of Iowa",
          "seo": "iowa",
          "short": "Iowa"
        },
        "rank": "",
        "score": "14",
        "seed": "",
        "winner": false
      },
      "bracketId": "",
      "bracketRegion": "",
      "bracketRound": "",
      "contestClock": "0:00",
      "currentPeriod": "Final",
      "finalMessage": "Final",
      "gameID": "d0e860a7-ed8f-49cb-9915-0f5794cf1df7",
      "gameState": "final",
      "home": {
        "conferenceNames": {
          "conferenceDisplay": "Southeastern Conference",
          "conferenceDivision": "fbs",
          "conferenceName": "SEC",
          "conferenceSeo": "southeastern"
        },
        "description": "(-)",
        "names": {
          "char6": "LSU",
          "full": "Louisiana State University",
          "seo": "lsu",
          "short": "LSU"
        },
        "rank": "",
        "score": "21",
        "seed": "",
        "winner": true
      },
      "liveVideoEnabled": false,
      "network": "",
      "startDate": "01-01-2014",
      "startTime": "01:00PM ET",
      "startTimeEpoch": "1388599200",
      "title": "Outback Bowl",
      "url": "/game/football/fbs/2014/01/01/iowa-lsu",
      "videoState": ""
    }},
    {"game": {
      "away": {
        "conferenceNames": {
          "conferenceDisplay": "Pac-12 Conference",
          "conferenceDivision": "fbs",
          "conferenceName": "Pac-12",
          "conferenceSeo": "pac-12"
        },
        "description": "(-)",
        "names": {
          "char6": "STAN",
          "full": "Stanford University",
          "seo": "stanford",
          "short": "Stanford"
        },
        "rank": "",
        "score": "20",
        "seed": "",
        "winner": false
      },
      "bracketId": "",
      "bracketRegion": "",
      "bracketRound": "",
      "contestClock": "0:00",
      "currentPeriod": "Final",
      "finalMessage": "Final",
      "gameID": "7cef64ce-9898-4977-af2b-2032dd1e3888",
      "gameState": "final",
      "home": {
        "conferenceNames": {
          "conferenceDisplay": "Big Ten Conference",
          "conferenceDivision": "fbs",
          "conferenceName": "Big Ten",
          "conferenceSeo": "big-ten"
        },
        "description": "(-)",
        "names": {
          "char6": "MICHST",
          "full": "Michigan State University",
          "seo": "michigan-st",
          "short": "Michigan St."
        },
        "rank": "",
        "score": "24",
        "seed": "",
        "winner": true
      },
      "liveVideoEnabled": false,
      "network": "",
      "startDate": "01-01-2014",
      "startTime": "05:00PM ET",
      "startTimeEpoch": "1388613600",
      "title": "Rose Bowl",
      "url": "/game/football/fbs/2014/01/01/stanford-michigan-st",
      "videoState": ""
    }},
    {"game": {
      "away": {
        "conferenceNames": {
          "conferenceDisplay": "American Athletic Conference",
          "conferenceDivision": "fbs",
          "conferenceName": "AAC",
          "conferenceSeo": "american-athletic"
        },
        "description": "(-)",
        "names": {
          "char6": "UCF",
          "full": "University of Central Florida",
          "seo": "ucf",
          "short": "UCF"
        },
        "rank": "",
        "score": "52",
        "seed": "",
        "winner": true
      },
      "bracketId": "",
      "bracketRegion": "",
      "bracketRound": "",
      "contestClock": "0:00",
      "currentPeriod": "Final",
      "finalMessage": "Final",
      "gameID": "2bfb13a5-ced8-49a7-a260-f9c4c6b8c7a8",
      "gameState": "final",
      "home": {
        "conferenceNames": {
          "conferenceDisplay": "Big 12 Conference",
          "conferenceDivision": "fbs",
          "conferenceName": "Big 12",
          "conferenceSeo": "big-12"
        },
        "description": "(-)",
        "names": {
          "char6": "BAYLOR",
          "full": "Baylor University",
          "seo": "baylor",
          "short": "Baylor"
        },
        "rank": "",
        "score": "42",
        "seed": "",
        "winner": false
      },
      "liveVideoEnabled": false,
      "network": "",
      "startDate": "01-01-2014",
      "startTime": "08:30PM ET",
      "startTimeEpoch": "1388626200",
      "title": "Fiesta Bowl",
      "url": "/game/football/fbs/2014/01/01/ucf-baylor",
      "videoState": ""
    }},
    {"game": {
      "away": {
        "conferenceNames": {
          "conferenceDisplay": "Big 12 Conference",
          "conferenceDivision": "fbs",
          "conferenceName": "Big 12",
          "conferenceSeo": "big-12"
        },
        "description": "(-)",
        "names": {
          "char6": "OKLA",
          "full": "University of Oklahoma",
          "seo": "oklahoma",
          "short": "Oklahoma"
        },
        "rank": "",
        "score": "45",
        "seed": "",
        "winner": true
      },
      "bracketId": "",
      "bracketRegion": "",
      "bracketRound": "",
      "contestClock": "0:00",
      "currentPeriod": "Final",
      "finalMessage": "Final",
      "gameID": "a55dd3a9-8d28-4e30-875f-77603c82348a",
      "gameState": "final",
      "home": {
        "conferenceNames": {
          "conferenceDisplay": "Southeastern Conference",
          "conferenceDivision": "fbs",
          "conferenceName": "SEC",
          "conferenceSeo": "southeastern"
        },
        "description": "(-)",
        "names": {
          "char6": "ALA",
          "full": "University of Alabama",
          "seo": "alabama",
          "short": "Alabama"
        },
        "rank": "",
        "score": "31",
        "seed": "",
        "winner": false
      },
      "liveVideoEnabled": false,
      "network": "",
      "startDate": "01-02-2014",
      "startTime": "08:30PM ET",
      "startTimeEpoch": "1388712600",
      "title": "Sugar Bowl",
      "url": "/game/football/fbs/2014/01/02/oklahoma-alabama",
      "videoState": ""
    }},
    {"game": {
      "away": {
        "conferenceNames": {
          "conferenceDisplay": "Big 12 Conference",
          "conferenceDivision": "fbs",
          "conferenceName": "Big 12",
          "conferenceSeo": "big-12"
        },
        "description": "(-)",
        "names": {
          "char6": "OKLAST",
          "full": "Oklahoma State University",
          "seo": "oklahoma-st",
          "short": "Oklahoma St."
        },
        "rank": "",
        "score": "31",
        "seed": "",
        "winner": false
      },
      "bracketId": "",
      "bracketRegion": "",
      "bracketRound": "",
      "contestClock": "0:00",
      "currentPeriod": "Final",
      "finalMessage": "Final",
      "gameID": "7942ffd8-a8d8-418f-9b11-040c3abe2e6f",
      "gameState": "final",
      "home": {
        "conferenceNames": {
          "conferenceDisplay": "Southeastern Conference",
          "conferenceDivision": "fbs",
          "conferenceName": "SEC",
          "conferenceSeo": "southeastern"
        },
        "description": "(-)",
        "names": {
          "char6": "MIZZOU",
          "full": "University of Missouri, Columbia",
          "seo": "missouri",
          "short": "Missouri"
        },
        "rank": "",
        "score": "41",
        "seed": "",
        "winner": true
      },
      "liveVideoEnabled": false,
      "network": "",
      "startDate": "01-03-2014",
      "startTime": "07:30PM ET",
      "startTimeEpoch": "1388795400",
      "title": "Cotton Bowl",
      "url": "/game/football/fbs/2014/01/03/oklahoma-st-missouri",
      "videoState": ""
    }},
    {"game": {
      "away": {
        "conferenceNames": {
          "conferenceDisplay": "Atlantic Coast Conference",
          "conferenceDivision": "fbs",
          "conferenceName": "ACC",
          "conferenceSeo": "atlantic-coast"
        },
        "description": "(-)",
        "names": {
          "char6": "CLEM",
          "full": "Clemson University",
          "seo": "clemson",
          "short": "Clemson"
        },
        "rank": "",
        "score": "40",
        "seed": "",
        "winner": true
      },
      "bracketId": "",
      "bracketRegion": "",
      "bracketRound": "",
      "contestClock": "0:00",
      "currentPeriod": "Final",
      "finalMessage": "Final",
      "gameID": "65090ec7-8993-4038-9ed8-63f12cdd0fa8",
      "gameState": "final",
      "home": {
        "conferenceNames": {
          "conferenceDisplay": "Big Ten Conference",
          "conferenceDivision": "fbs",
          "conferenceName": "Big Ten",
          "conferenceSeo": "big-ten"
        },
        "description": "(-)",
        "names": {
          "char6": "OHIOST",
          "full": "The Ohio State University",
          "seo": "ohio-st",
          "short": "Ohio St."
        },
        "rank": "",
        "score": "35",
        "seed": "",
        "winner": false
      },
      "liveVideoEnabled": false,
      "network": "",
      "startDate": "01-03-2014",
      "startTime": "08:30PM ET",
      "startTimeEpoch": "1388799000",
      "title": "Orange Bowl",
      "url": "/game/football/fbs/2014/01/03/clemson-ohio-st",
      "videoState": ""
    }},
    {"game": {
      "away": {
        "conferenceNames": {
          "conferenceDisplay": "Southeastern Conference",
          "conferenceDivision": "fbs",
          "conferenceName": "SEC",
          "conferenceSeo": "southeastern"
        },
        "description": "(-)",
        "names": {
          "char6": "VANDY",
          "full": "Vanderbilt University",
          "seo": "vanderbilt",
          "short": "Vanderbilt"
        },
        "rank": "",
        "score": "41",
        "seed": "",
        "winner": true
      },
      "bracketId": "",
      "bracketRegion": "",
      "bracketRound": "",
      "contestClock": "0:00",
      "currentPeriod": "Final",
      "finalMessage": "Final",
      "gameID": "d7c55060-9751-40ee-b6ea-6204d6b59ca5",
      "gameState": "final",
      "home": {
        "conferenceNames": {
          "conferenceDisplay": "American Athletic Conference",
          "conferenceDivision": "fbs",
          "conferenceName": "AAC",
          "conferenceSeo": "american-athletic"
        },
        "description": "(-)",
        "names": {
          "char6": "HOU",
          "full": "University of Houston",
          "seo": "houston",
          "short": "Houston"
        },
        "rank": "",
        "score": "24",
        "seed": "",
        "winner": false
      },
      "liveVideoEnabled": false,
      "network": "",
      "startDate": "01-04-2014",
      "startTime": "01:00PM ET",
      "startTimeEpoch": "1388858400",
      "title": "BBVA Compass Bowl",
      "url": "/game/football/fbs/2014/01/04/vanderbilt-houston",
      "videoState": ""
    }},
    {"game": {
      "away": {
        "conferenceNames": {
          "conferenceDisplay": "Sun Belt Conference",
          "conferenceDivision": "fbs",
          "conferenceName": "Sun Belt",
          "conferenceSeo": "sun-belt"
        },
        "description": "(-)",
        "names": {
          "char6": "ARK ST",
          "full": "Arkansas State University",
          "seo": "arkansas-st",
          "short": "Arkansas St."
        },
        "rank": "",
        "score": "23",
        "seed": "",
        "winner": true
      },
      "bracketId": "",
      "bracketRegion": "",
      "bracketRound": "",
      "contestClock": "0:00",
      "currentPeriod": "Final",
      "finalMessage": "Final",
      "gameID": "e821426b-1bd9-49df-b934-3fa4783360d7",
      "gameState": "final",
      "home": {
        "conferenceNames": {
          "conferenceDisplay": "Mid-American Conference",
          "conferenceDivision": "fbs",
          "conferenceName": "MAC",
          "conferenceSeo": "mid-american"
        },
        "description": "(-)",
        "names": {
          "char6": "BALLST",
          "full": "Ball State University",
          "seo": "ball-st",
          "short": "Ball St."
        },
        "rank": "",
        "score": "20",
        "seed": "",
        "winner": false
      },
      "liveVideoEnabled": false,
      "network": "",
      "startDate": "01-05-2014",
      "startTime": "09:00PM ET",
      "startTimeEpoch": "1388973600",
      "title": "GoDaddy Bowl",
      "url": "/game/football/fbs/2014/01/05/arkansas-st-ball-st",
      "videoState": ""
    }},
    {"game": {
      "away": {
        "conferenceNames": {
          "conferenceDisplay": "Southeastern Conference",
          "conferenceDivision": "fbs",
          "conferenceName": "SEC",
          "conferenceSeo": "southeastern"
        },
        "description": "(-)",
        "names": {
          "char6": "AUBURN",
          "full": "Auburn University",
          "seo": "auburn",
          "short": "Auburn"
        },
        "rank": "",
        "score": "31",
        "seed": "",
        "winner": false
      },
      "bracketId": "",
      "bracketRegion": "",
      "bracketRound": "",
      "contestClock": "0:00",
      "currentPeriod": "Final",
      "finalMessage": "Final",
      "gameID": "1aca6cf5-b995-48ca-a401-f4eacf986af7",
      "gameState": "final",
      "home": {
        "conferenceNames": {
          "conferenceDisplay": "Atlantic Coast Conference",
          "conferenceDivision": "fbs",
          "conferenceName": "ACC",
          "conferenceSeo": "atlantic-coast"
        },
        "description": "(-)",
        "names": {
          "char6": "FSU",
          "full": "Florida State University",
          "seo": "florida-st",
          "short": "Florida St."
        },
        "rank": "",
        "score": "34",
        "seed": "",
        "winner": true
      },
      "liveVideoEnabled": false,
      "network": "",
      "startDate": "01-06-2014",
      "startTime": "08:30PM ET",
      "startTimeEpoch": "1389058200",
      "title": "BCS Championship",
      "url": "/game/football/fbs/2014/01/06/auburn-florida-st",
      "videoState": ""
    }}
  ],
  "inputMD5Sum": "70522f04b748015bf97e7c14544653c3"
}