{
  "games": [
    {"game": {
      "away": {
        "conferences": [{
          "conferenceName": "Sun Belt",
          "conferenceSeo": "sun-belt"
        }],
        "description": "(6-2)",
        "names": {
          "char6": "TROY",
          "full": "Troy University",
          "seo": "troy",
          "short": "Troy"
        },
        "rank": "",
        "score": "38",
        "seed": "",
        "winner": true
      },
      "bracketId": "",
      "bracketRegion": "",
      "bracketRound": "",
      "contestClock": "0:00",
      "currentPeriod": "FINAL",
      "finalMessage": "FINAL",
      "gameID": "11e64bc6-3e21-4fe9-a7e3-fbbf13d945fe",
      "gameState": "final",
      "home": {
        "conferences": [{
          "conferenceName": "Sun Belt",
          "conferenceSeo": "sun-belt"
        }],
        "description": "(2-6)",
        "names": {
          "char6": "S ALA",
          "full": "University of South Alabama",
          "seo": "south-ala",
          "short": "South Alabama"
        },
        "rank": "",
        "score": "17",
        "seed": "",
        "winner": false
      },
      "liveVideoEnabled": false,
      "network": "",
      "startDate": "10-23-2018",
      "startTime": "08:00PM ET",
      "startTimeEpoch": "1540339200",
      "title": "South Alabama Troy",
      "url": "/game/football/fbs/2018/10/23/troy-south-ala",
      "videoState": ""
    }},
    {"game": {
      "away": {
        "conferences": [{
          "conferenceName": "MAC",
          "conferenceSeo": "mac"
        }],
        "description": "(4-4)",
        "names": {
          "char6": "TOLEDO",
          "full": "University of Toledo",
          "seo": "toledo",
          "short": "Toledo"
        },
        "rank": "",
        "score": "51",
        "seed": "",
        "winner": true
      },
      "bracketId": "",
      "bracketRegion": "",
      "bracketRound": "",
      "contestClock": "0:00",
      "currentPeriod": "FINAL",
      "finalMessage": "FINAL",
      "gameID": "ee0c22c9-061c-48c4-8414-e19d03905c43",
      "gameState": "final",
      "home": {
        "conferences": [{
          "conferenceName": "MAC",
          "conferenceSeo": "mac"
        }],
        "description": "(6-3)",
        "names": {
          "char6": "W MICH",
          "full": "Western Michigan University",
          "seo": "western-mich",
          "short": "Western Mich."
        },
        "rank": "",
        "score": "24",
        "seed": "",
        "winner": false
      },
      "liveVideoEnabled": false,
      "network": "",
      "startDate": "10-25-2018",
      "startTime": "07:00PM ET",
      "startTimeEpoch": "1540508400",
      "title": "Western Mich. Toledo",
      "url": "/game/football/fbs/2018/10/25/toledo-western-mich",
      "videoState": ""
    }},
    {"game": {
      "away": {
        "conferences": [{
          "conferenceName": "Big 12",
          "conferenceSeo": "big-12"
        }],
        "description": "(4-4)",
        "names": {
          "char6": "BAYLOR",
          "full": "Baylor University",
          "seo": "baylor",
          "short": "Baylor"
        },
        "rank": "",
        "score": "14",
        "seed": "",
        "winner": false
      },
      "bracketId": "",
      "bracketRegion": "",
      "bracketRound": "",
      "contestClock": "0:00",
      "currentPeriod": "FINAL",
      "finalMessage": "FINAL",
      "gameID": "5d49fe9b-564e-4d4d-8f3a-6308fca321e2",
      "gameState": "final",
      "home": {
        "conferences": [
          {
            "conferenceName": "Big 12",
            "conferenceSeo": "big-12"
          },
          {
            "conferenceName": "Top 25",
            "conferenceSeo": "top-25"
          }
        ],
        "description": "(6-1)",
        "names": {
          "char6": "WVU",
          "full": "West Virginia University",
          "seo": "west-virginia",
          "short": "West Virginia"
        },
        "rank": "13",
        "score": "58",
        "seed": "",
        "winner": true
      },
      "liveVideoEnabled": false,
      "network": "",
      "startDate": "10-25-2018",
      "startTime": "07:00PM ET",
      "startTimeEpoch": "1540508400",
      "title": "West Virginia Baylor",
      "url": "/game/football/fbs/2018/10/25/baylor-west-virginia",
      "videoState": ""
    }},
    {"game": {
      "away": {
        "conferences": [{
          "conferenceName": "MAC",
          "conferenceSeo": "mac"
        }],
        "description": "(3-6)",
        "names": {
          "char6": "BALLST",
          "full": "Ball State University",
          "seo": "ball-st",
          "short": "Ball State"
        },
        "rank": "",
        "score": "14",
        "seed": "",
        "winner": false
      },
      "bracketId": "",
      "bracketRegion": "",
      "bracketRound": "",
      "contestClock": "0:00",
      "currentPeriod": "FINAL",
      "finalMessage": "FINAL",
      "gameID": "6d7cead7-84e3-4779-aa60-c8e280d95a51",
      "gameState": "final",
      "home": {
        "conferences": [{
          "conferenceName": "MAC",
          "conferenceSeo": "mac"
        }],
        "description": "(5-3)",
        "names": {
          "char6": "OHIO",
          "full": "Ohio University",
          "seo": "ohio",
          "short": "Ohio"
        },
        "rank": "",
        "score": "52",
        "seed": "",
        "winner": true
      },
      "liveVideoEnabled": false,
      "network": "",
      "startDate": "10-25-2018",
      "startTime": "07:00PM ET",
      "startTimeEpoch": "1540508400",
      "title": "Ohio Ball St.",
      "url": "/game/football/fbs/2018/10/25/ball-st-ohio",
      "videoState": ""
    }},
    {"game": {
      "away": {
        "conferences": [
          {
            "conferenceName": "Sun Belt",
            "conferenceSeo": "sun-belt"
          },
          {
            "conferenceName": "Top 25",
            "conferenceSeo": "top-25"
          }
        ],
        "description": "(5-2)",
        "names": {
          "char6": "APP ST",
          "full": "Appalachian State University",
          "seo": "appalachian-st",
          "short": "Appalachian St."
        },
        "rank": "25",
        "score": "14",
        "seed": "",
        "winner": false
      },
      "bracketId": "",
      "bracketRegion": "",
      "bracketRound": "",
      "contestClock": "0:00",
      "currentPeriod": "FINAL",
      "finalMessage": "FINAL",
      "gameID": "ad9d1722-fbbc-44d9-9206-43dfe4784b6d",
      "gameState": "final",
      "home": {
        "conferences": [{
          "conferenceName": "Sun Belt",
          "conferenceSeo": "sun-belt"
        }],
        "description": "(7-1)",
        "names": {
          "char6": "GA SOU",
          "full": "Georgia Southern University",
          "seo": "ga-southern",
          "short": "Ga. Southern"
        },
        "rank": "",
        "score": "34",
        "seed": "",
        "winner": true
      },
      "liveVideoEnabled": false,
      "network": "",
      "startDate": "10-25-2018",
      "startTime": "07:30PM ET",
      "startTimeEpoch": "1540510200",
      "title": "Ga. Southern Appalachian St.",
      "url": "/game/football/fbs/2018/10/25/appalachian-st-ga-southern",
      "videoState": ""
    }},
    {"game": {
      "away": {
        "conferences": [{
          "conferenceName": "ACC",
          "conferenceSeo": "acc"
        }],
        "description": "(4-4)",
        "names": {
          "char6": "GATECH",
          "full": "Georgia Institute of Technology",
          "seo": "georgia-tech",
          "short": "Georgia Tech"
        },
        "rank": "",
        "score": "49",
        "seed": "",
        "winner": true
      },
      "bracketId": "",
      "bracketRegion": "",
      "bracketRound": "",
      "contestClock": "0:00",
      "currentPeriod": "FINAL",
      "finalMessage": "FINAL",
      "gameID": "c788f9d0-7d60-41cd-9d92-99e6f610de34",
      "gameState": "final",
      "home": {
        "conferences": [{
          "conferenceName": "ACC",
          "conferenceSeo": "acc"
        }],
        "description": "(4-3)",
        "names": {
          "char6": "VT",
          "full": "Virginia Polytechnic Institute and State University",
          "seo": "virginia-tech",
          "short": "Virginia Tech"
        },
        "rank": "",
        "score": "28",
        "seed": "",
        "winner": false
      },
      "liveVideoEnabled": false,
      "network": "",
      "startDate": "10-25-2018",
      "startTime": "07:30PM ET",
      "startTimeEpoch": "1540510200",
      "title": "Virginia Tech Georgia Tech",
      "url": "/game/football/fbs/2018/10/25/georgia-tech-virginia-tech",
      "videoState": ""
    }},
    {"game": {
      "away": {
        "conferences": [{
          "conferenceName": "C-USA",
          "conferenceSeo": "c-usa"
        }],
        "description": "(6-2)",
        "names": {
          "char6": "LATECH",
          "full": "Louisiana Tech University",
          "seo": "louisiana-tech",
          "short": "Louisiana Tech"
        },
        "rank": "",
        "score": "21",
        "seed": "",
        "winner": true
      },
      "bracketId": "",
      "bracketRegion": "",
      "bracketRound": "",
      "contestClock": "0:00",
      "currentPeriod": "FINAL",
      "finalMessage": "FINAL",
      "gameID": "b217f46d-beb1-4e16-9e3c-e0434ce92cb6",
      "gameState": "final",
      "home": {
        "conferences": [{
          "conferenceName": "C-USA",
          "conferenceSeo": "c-usa"
        }],
        "description": "(3-5)",
        "names": {
          "char6": "FAU",
          "full": "Florida Atlantic University",
          "seo": "fla-atlantic",
          "short": "Florida Atlantic"
        },
        "rank": "",
        "score": "13",
        "seed": "",
        "winner": false
      },
      "liveVideoEnabled": false,
      "network": "",
      "startDate": "10-26-2018",
      "startTime": "06:30PM ET",
      "startTimeEpoch": "1540593000",
      "title": "Fla. Atlantic Louisiana Tech",
      "url": "/game/football/fbs/2018/10/26/louisiana-tech-fla-atlantic",
      "videoState": ""
    }},
    {"game": {
      "away": {
        "conferences": [{
          "conferenceName": "ACC",
          "conferenceSeo": "acc"
        }],
        "description": "(5-3)",
        "names": {
          "char6": "MIAMI",
          "full": "University of Miami (Florida)",
          "seo": "miami-fl",
          "short": "Miami (Fla.)"
        },
        "rank": "",
        "score": "14",
        "seed": "",
        "winner": false
      },
      "bracketId": "",
      "bracketRegion": "",
      "bracketRound": "",
      "contestClock": "0:00",
      "currentPeriod": "FINAL",
      "finalMessage": "FINAL",
      "gameID": "7d29b078-8f92-4283-b3c8-530157b3a97c",
      "gameState": "final",
      "home": {
        "conferences": [{
          "conferenceName": "ACC",
          "conferenceSeo": "acc"
        }],
        "description": "(6-2)",
        "names": {
          "char6": "BC",
          "full": "Boston College",
          "seo": "boston-college",
          "short": "Boston College"
        },
        "rank": "",
        "score": "27",
        "seed": "",
        "winner": true
      },
      "liveVideoEnabled": false,
      "network": "",
      "startDate": "10-26-2018",
      "startTime": "07:00PM ET",
      "startTimeEpoch": "1540594800",
      "title": "Boston College Miami (FL)",
      "url": "/game/football/fbs/2018/10/26/miami-fl-boston-college",
      "videoState": ""
    }},
    {"game": {
      "away": {
        "conferences": [{
          "conferenceName": "Big Ten",
          "conferenceSeo": "big-ten"
        }],
        "description": "(4-5)",
        "names": {
          "char6": "IND",
          "full": "Indiana University, Bloomington",
          "seo": "indiana",
          "short": "Indiana"
        },
        "rank": "",
        "score": "31",
        "seed": "",
        "winner": false
      },
      "bracketId": "",
      "bracketRegion": "",
      "bracketRound": "",
      "contestClock": "0:00",
      "currentPeriod": "FINAL",
      "finalMessage": "FINAL",
      "gameID": "31004f71-f7a4-44a1-9a36-81976395d8d1",
      "gameState": "final",
      "home": {
        "conferences": [{
          "conferenceName": "Big Ten",
          "conferenceSeo": "big-ten"
        }],
        "description": "(4-4)",
        "names": {
          "char6": "MINN",
          "full": "University of Minnesota, Twin Cities",
          "seo": "minnesota",
          "short": "Minnesota"
        },
        "rank": "",
        "score": "38",
        "seed": "",
        "winner": true
      },
      "liveVideoEnabled": false,
      "network": "",
      "startDate": "10-26-2018",
      "startTime": "08:00PM ET",
      "startTimeEpoch": "1540598400",
      "title": "Minnesota Indiana",
      "url": "/game/football/fbs/2018/10/26/indiana-minnesota",
      "videoState": ""
    }},
    {"game": {
      "away": {
        "conferences": [{
          "conferenceName": "MWC",
          "conferenceSeo": "mwc"
        }],
        "description": "(3-6)",
        "names": {
          "char6": "WYO",
          "full": "University of Wyoming",
          "seo": "wyoming",
          "short": "Wyoming"
        },
        "rank": "",
        "score": "34",
        "seed": "",
        "winner": true
      },
      "bracketId": "",
      "bracketRegion": "",
      "bracketRound": "",
      "contestClock": "0:00",
      "currentPeriod": "FINAL",
      "finalMessage": "FINAL",
      "gameID": "6576f545-08f8-4fd9-88a8-c9afe571d19a",
      "gameState": "final",
      "home": {
        "conferences": [{
          "conferenceName": "MWC",
          "conferenceSeo": "mwc"
        }],
        "description": "(3-6)",
        "names": {
          "char6": "CO ST",
          "full": "Colorado State University",
          "seo": "colorado-st",
          "short": "Colorado State"
        },
        "rank": "",
        "score": "21",
        "seed": "",
        "winner": false
      },
      "liveVideoEnabled": false,
      "network": "",
      "startDate": "10-26-2018",
      "startTime": "10:00PM ET",
      "startTimeEpoch": "1540605600",
      "title": "Colorado St. Wyoming",
      "url": "/game/football/fbs/2018/10/26/wyoming-colorado-st",
      "videoState": ""
    }},
    {"game": {
      "away": {
        "conferences": [
          {
            "conferenceName": "Pac-12",
            "conferenceSeo": "pac-12"
          },
          {
            "conferenceName": "Top 25",
            "conferenceSeo": "top-25"
          }
        ],
        "description": "(6-2)",
        "names": {
          "char6": "UTAH",
          "full": "University of Utah",
          "seo": "utah",
          "short": "Utah"
        },
        "rank": "23",
        "score": "41",
        "seed": "",
        "winner": true
      },
      "bracketId": "",
      "bracketRegion": "",
      "bracketRound": "",
      "contestClock": "0:00",
      "currentPeriod": "FINAL",
      "finalMessage": "FINAL",
      "gameID": "ede0a6bb-6e8a-49b0-a8ea-004300404a11",
      "gameState": "final",
      "home": {
        "conferences": [{
          "conferenceName": "Pac-12",
          "conferenceSeo": "pac-12"
        }],
        "description": "(2-6)",
        "names": {
          "char6": "UCLA",
          "full": "University of California, Los Angeles",
          "seo": "ucla",
          "short": "UCLA"
        },
        "rank": "",
        "score": "10",
        "seed": "",
        "winner": false
      },
      "liveVideoEnabled": false,
      "network": "",
      "startDate": "10-26-2018",
      "startTime": "10:30PM ET",
      "startTimeEpoch": "1540607400",
      "title": "UCLA Utah",
      "url": "/game/football/fbs/2018/10/26/utah-ucla",
      "videoState": ""
    }},
    {"game": {
      "away": {
        "conferences": [{
          "conferenceName": "FBS Independent",
          "conferenceSeo": "fbs-independent"
        }],
        "description": "(6-2)",
        "names": {
          "char6": "ARMY",
          "full": "U.S. Military Academy",
          "seo": "army",
          "short": "Army West Point"
        },
        "rank": "",
        "score": "37",
        "seed": "",
        "winner": true
      },
      "bracketId": "",
      "bracketRegion": "",
      "bracketRound": "",
      "contestClock": "0:00",
      "currentPeriod": "FINAL",
      "finalMessage": "FINAL",
      "gameID": "06275526-9bf4-44c8-9619-5275527e38f2",
      "gameState": "final",
      "home": {
        "conferences": [{
          "conferenceName": "MAC",
          "conferenceSeo": "mac"
        }],
        "description": "(4-5)",
        "names": {
          "char6": "E MICH",
          "full": "Eastern Michigan University",
          "seo": "eastern-mich",
          "short": "Eastern Mich."
        },
        "rank": "",
        "score": "22",
        "seed": "",
        "winner": false
      },
      "liveVideoEnabled": false,
      "network": "",
      "startDate": "10-27-2018",
      "startTime": "12:00PM ET",
      "startTimeEpoch": "1540656000",
      "title": "Eastern Mich. Army West Point",
      "url": "/game/football/fbs/2018/10/27/army-eastern-mich",
      "videoState": ""
    }},
    {"game": {
      "away": {
        "conferences": [{
          "conferenceName": "FBS Independent",
          "conferenceSeo": "fbs-independent"
        }],
        "description": "(3-6)",
        "names": {
          "char6": "UMASS",
          "full": "University of Massachusetts, Amherst",
          "seo": "massachusetts",
          "short": "Massachusetts"
        },
        "rank": "",
        "score": "22",
        "seed": "",
        "winner": true
      },
      "bracketId": "",
      "bracketRegion": "",
      "bracketRound": "",
      "contestClock": "0:00",
      "currentPeriod": "FINAL",
      "finalMessage": "FINAL",
      "gameID": "a83498c0-3191-48a7-b9b5-14a2b9476947",
      "gameState": "final",
      "home": {
        "conferences": [{
          "conferenceName": "AAC",
          "conferenceSeo": "aac"
        }],
        "description": "(1-7)",
        "names": {
          "char6": "UCONN",
          "full": "University of Connecticut",
          "seo": "uconn",
          "short": "UConn"
        },
        "rank": "",
        "score": "17",
        "seed": "",
        "winner": false
      },
      "liveVideoEnabled": false,
      "network": "",
      "startDate": "10-27-2018",
      "startTime": "12:00PM ET",
      "startTimeEpoch": "1540656000",
      "title": "UConn Massachusetts",
      "url": "/game/football/fbs/2018/10/27/massachusetts-uconn",
      "videoState": ""
    }},
    {"game": {
      "away": {
        "conferences": [{
          "conferenceName": "SEC",
          "conferenceSeo": "sec"
        }],
        "description": "(4-5)",
        "names": {
          "char6": "VANDY",
          "full": "Vanderbilt University",
          "seo": "vanderbilt",
          "short": "Vanderbilt"
        },
        "rank": "",
        "score": "45",
        "seed": "",
        "winner": true
      },
      "bracketId": "",
      "bracketRegion": "",
      "bracketRound": "",
      "contestClock": "0:00",
      "currentPeriod": "FINAL",
      "finalMessage": "FINAL",
      "gameID": "41457a9e-e0f6-4945-9272-1e7cace3578c",
      "gameState": "final",
      "home": {
        "conferences": [{
          "conferenceName": "SEC",
          "conferenceSeo": "sec"
        }],
        "description": "(2-7)",
        "names": {
          "char6": "ARK",
          "full": "University of Arkansas, Fayetteville",
          "seo": "arkansas",
          "short": "Arkansas"
        },
        "rank": "",
        "score": "31",
        "seed": "",
        "winner": false
      },
      "liveVideoEnabled": false,
      "network": "",
      "startDate": "10-27-2018",
      "startTime": "12:00PM ET",
      "startTimeEpoch": "1540656000",
      "title": "Arkansas Vanderbilt",
      "url": "/game/football/fbs/2018/10/27/vanderbilt-arkansas",
      "videoState": ""
    }},
    {"game": {
      "away": {
        "conferences": [
          {
            "conferenceName": "Big Ten",
            "conferenceSeo": "big-ten"
          },
          {
            "conferenceName": "Top 25",
            "conferenceSeo": "top-25"
          }
        ],
        "description": "(5-3)",
        "names": {
          "char6": "WISC",
          "full": "University of Wisconsin-Madison",
          "seo": "wisconsin",
          "short": "Wisconsin"
        },
        "rank": "20",
        "score": "17",
        "seed": "",
        "winner": false
      },
      "bracketId": "",
      "bracketRegion": "",
      "bracketRound": "",
      "contestClock": "0:00",
      "currentPeriod": "FINAL",
      "finalMessage": "FINAL",
      "gameID": "c56074c5-92ec-424f-a45c-9ee2a2cf2fe8",
      "gameState": "final",
      "home": {
        "conferences": [{
          "conferenceName": "Big Ten",
          "conferenceSeo": "big-ten"
        }],
        "description": "(5-3)",
        "names": {
          "char6": "NWSTRN",
          "full": "Northwestern University",
          "seo": "northwestern",
          "short": "Northwestern"
        },
        "rank": "",
        "score": "31",
        "seed": "",
        "winner": true
      },
      "liveVideoEnabled": false,
      "network": "",
      "startDate": "10-27-2018",
      "startTime": "12:00PM ET",
      "startTimeEpoch": "1540656000",
      "title": "Northwestern Wisconsin",
      "url": "/game/football/fbs/2018/10/27/wisconsin-northwestern",
      "videoState": ""
    }},
    {"game": {
      "away": {
        "conferences": [{
          "conferenceName": "MAC",
          "conferenceSeo": "mac"
        }],
        "description": "(1-8)",
        "names": {
          "char6": "C MICH",
          "full": "Central Michigan University",
          "seo": "central-mich",
          "short": "Central Mich."
        },
        "rank": "",
        "score": "10",
        "seed": "",
        "winner": false
      },
      "bracketId": "",
      "bracketRegion": "",
      "bracketRound": "",
      "contestClock": "0:00",
      "currentPeriod": "FINAL",
      "finalMessage": "FINAL",
      "gameID": "bfb57733-a6e4-482d-a041-fa91645f1776",
      "gameState": "final",
      "home": {
        "conferences": [{
          "conferenceName": "MAC",
          "conferenceSeo": "mac"
        }],
        "description": "(4-3)",
        "names": {
          "char6": "AKRON",
          "full": "University of Akron",
          "seo": "akron",
          "short": "Akron"
        },
        "rank": "",
        "score": "17",
        "seed": "",
        "winner": true
      },
      "liveVideoEnabled": false,
      "network": "",
      "startDate": "10-27-2018",
      "startTime": "12:00PM ET",
      "startTimeEpoch": "1540656000",
      "title": "Akron Central Mich.",
      "url": "/game/football/fbs/2018/10/27/central-mich-akron",
      "videoState": ""
    }},
    {"game": {
      "away": {
        "conferences": [{
          "conferenceName": "Big 12",
          "conferenceSeo": "big-12"
        }],
        "description": "(5-3)",
        "names": {
          "char6": "TXTECH",
          "full": "Texas Tech University",
          "seo": "texas-tech",
          "short": "Texas Tech"
        },
        "rank": "",
        "score": "31",
        "seed": "",
        "winner": false
      },
      "bracketId": "",
      "bracketRegion": "",
      "bracketRound": "",
      "contestClock": "0:00",
      "currentPeriod": "FINAL",
      "finalMessage": "FINAL",
      "gameID": "0fb7c561-aeec-45bb-8a51-ad06cc34791c",
      "gameState": "final",
      "home": {
        "conferences": [{
          "conferenceName": "Big 12",
          "conferenceSeo": "big-12"
        }],
        "description": "(4-3)",
        "names": {
          "char6": "IOWAST",
          "full": "Iowa State University",
          "seo": "iowa-st",
          "short": "Iowa State"
        },
        "rank": "",
        "score": "40",
        "seed": "",
        "winner": true
      },
      "liveVideoEnabled": false,
      "network": "",
      "startDate": "10-27-2018",
      "startTime": "12:00PM ET",
      "startTimeEpoch": "1540656000",
      "title": "Iowa St. Texas Tech",
      "url": "/game/football/fbs/2018/10/27/texas-tech-iowa-st",
      "videoState": ""
    }},
    {"game": {
      "away": {
        "conferences": [{
          "conferenceName": "ACC",
          "conferenceSeo": "acc"
        }],
        "description": "(4-4)",
        "names": {
          "char6": "WAKE",
          "full": "Wake Forest University",
          "seo": "wake-forest",
          "short": "Wake Forest"
        },
        "rank": "",
        "score": "56",
        "seed": "",
        "winner": true
      },
      "bracketId": "",
      "bracketRegion": "",
      "bracketRound": "",
      "contestClock": "0:00",
      "currentPeriod": "FINAL",
      "finalMessage": "FINAL",
      "gameID": "ef576181-14a3-4a55-9f41-bba0137417ac",
      "gameState": "final",
      "home": {
        "conferences": [{
          "conferenceName": "ACC",
          "conferenceSeo": "acc"
        }],
        "description": "(2-6)",
        "names": {
          "char6": "LOUIS",
          "full": "University of Louisville",
          "seo": "louisville",
          "short": "Louisville"
        },
        "rank": "",
        "score": "35",
        "seed": "",
        "winner": false
      },
      "liveVideoEnabled": false,
      "network": "",
      "startDate": "10-27-2018",
      "startTime": "12:00PM ET",
      "startTimeEpoch": "1540656000",
      "title": "Louisville Wake Forest",
      "url": "/game/football/fbs/2018/10/27/wake-forest-louisville",
      "videoState": ""
    }},
    {"game": {
      "away": {
        "conferences": [{
          "conferenceName": "Big Ten",
          "conferenceSeo": "big-ten"
        }],
        "description": "(4-4)",
        "names": {
          "char6": "PURDUE",
          "full": "Purdue University",
          "seo": "purdue",
          "short": "Purdue"
        },
        "rank": "",
        "score": "13",
        "seed": "",
        "winner": false
      },
      "bracketId": "",
      "bracketRegion": "",
      "bracketRound": "",
      "contestClock": "0:00",
      "currentPeriod": "FINAL",
      "finalMessage": "FINAL",
      "gameID": "268b1a3f-dcc7-4201-bf05-b77f53f554d8",
      "gameState": "final",
      "home": {
        "conferences": [{
          "conferenceName": "Big Ten",
          "conferenceSeo": "big-ten"
        }],
        "description": "(5-3)",
        "names": {
          "char6": "MICHST",
          "full": "Michigan State University",
          "seo": "michigan-st",
          "short": "Mich. St. "
        },
        "rank": "",
        "score": "23",
        "seed": "",
        "winner": true
      },
      "liveVideoEnabled": false,
      "network": "",
      "startDate": "10-27-2018",
      "startTime": "12:00PM ET",
      "startTimeEpoch": "1540656000",
      "title": "Michigan St. Purdue",
      "url": "/game/football/fbs/2018/10/27/purdue-michigan-st",
      "videoState": ""
    }},
    {"game": {
      "away": {
        "conferences": [{
          "conferenceName": "MEAC",
          "conferenceSeo": "meac"
        }],
        "description": "(4-5)",
        "names": {
          "char6": "BECOOK",
          "full": "Bethune-Cookman University",
          "seo": "bethune-cookman",
          "short": "Bethune-Cookman"
        },
        "rank": "",
        "score": "9",
        "seed": "",
        "winner": false
      },
      "bracketId": "",
      "bracketRegion": "",
      "bracketRound": "",
      "contestClock": "0:00",
      "currentPeriod": "FINAL",
      "finalMessage": "FINAL",
      "gameID": "50c06d6e-f2ea-4850-8b06-140aeb82e00c",
      "gameState": "final",
      "home": {
        "conferences": [{
          "conferenceName": "Big Ten",
          "conferenceSeo": "big-ten"
        }],
        "description": "(2-6)",
        "names": {
          "char6": "NEB",
          "full": "University of Nebraska, Lincoln",
          "seo": "nebraska",
          "short": "Nebraska"
        },
        "rank": "",
        "score": "45",
        "seed": "",
        "winner": true
      },
      "liveVideoEnabled": false,
      "network": "",
      "startDate": "10-27-2018",
      "startTime": "12:00PM ET",
      "startTimeEpoch": "1540656000",
      "title": "Nebraska Bethune-Cookman",
      "url": "/game/football/fbs/2018/10/27/bethune-cookman-nebraska",
      "videoState": ""
    }},
    {"game": {
      "away": {
        "conferences": [
          {
            "conferenceName": "ACC",
            "conferenceSeo": "acc"
          },
          {
            "conferenceName": "Top 25",
            "conferenceSeo": "top-25"
          }
        ],
        "description": "(8-0)",
        "names": {
          "char6": "CLEM",
          "full": "Clemson University",
          "seo": "clemson",
          "short": "Clemson"
        },
        "rank": "2",
        "score": "59",
        "seed": "",
        "winner": true
      },
      "bracketId": "",
      "bracketRegion": "",
      "bracketRound": "",
      "contestClock": "0:00",
      "currentPeriod": "FINAL",
      "finalMessage": "FINAL",
      "gameID": "6b931c92-599c-44cd-931f-efd8c4513ee4",
      "gameState": "final",
      "home": {
        "conferences": [{
          "conferenceName": "ACC",
          "conferenceSeo": "acc"
        }],
        "description": "(4-4)",
        "names": {
          "char6": "FSU",
          "full": "Florida State University",
          "seo": "florida-st",
          "short": "Florida State"
        },
        "rank": "",
        "score": "10",
        "seed": "",
        "winner": false
      },
      "liveVideoEnabled": false,
      "network": "",
      "startDate": "10-27-2018",
      "startTime": "12:00PM ET",
      "startTimeEpoch": "1540656000",
      "title": "Florida St. Clemson",
      "url": "/game/football/fbs/2018/10/27/clemson-florida-st",
      "videoState": ""
    }},
    {"game": {
      "away": {
        "conferences": [{
          "conferenceName": "ACC",
          "conferenceSeo": "acc"
        }],
        "description": "(1-6)",
        "names": {
          "char6": "UNC",
          "full": "University of North Carolina, Chapel Hill",
          "seo": "north-carolina",
          "short": "North Carolina"
        },
        "rank": "",
        "score": "21",
        "seed": "",
        "winner": false
      },
      "bracketId": "",
      "bracketRegion": "",
      "bracketRound": "",
      "contestClock": "0:00",
      "currentPeriod": "FINAL",
      "finalMessage": "FINAL",
      "gameID": "6d82dd35-fe8d-4143-9565-8a9220dd4921",
      "gameState": "final",
      "home": {
        "conferences": [{
          "conferenceName": "ACC",
          "conferenceSeo": "acc"
        }],
        "description": "(6-2)",
        "names": {
          "char6": "UVA",
          "full": "University of Virginia",
          "seo": "virginia",
          "short": "Virginia"
        },
        "rank": "",
        "score": "31",
        "seed": "",
        "winner": true
      },
      "liveVideoEnabled": false,
      "network": "",
      "startDate": "10-27-2018",
      "startTime": "12:20PM ET",
      "startTimeEpoch": "1540657200",
      "title": "Virginia North Carolina",
      "url": "/game/football/fbs/2018/10/27/north-carolina-virginia",
      "videoState": ""
    }},
    {"game": {
      "away": {
        "conferences": [{
          "conferenceName": "C-USA",
          "conferenceSeo": "c-usa"
        }],
        "description": "(3-4)",
        "names": {
          "char6": "S MISS",
          "full": "The University of Southern Mississippi",
          "seo": "southern-miss",
          "short": "Southern Miss"
        },
        "rank": "",
        "score": "17",
        "seed": "",
        "winner": false
      },
      "bracketId": "",
      "bracketRegion": "",
      "bracketRound": "",
      "contestClock": "0:00",
      "currentPeriod": "FINAL",
      "finalMessage": "FINAL",
      "gameID": "13310a0e-625b-4480-88b6-d03554e51ee9",
      "gameState": "final",
      "home": {
        "conferences": [{
          "conferenceName": "C-USA",
          "conferenceSeo": "c-usa"
        }],
        "description": "(4-4)",
        "names": {
          "char6": "CHAR",
          "full": "The University of North Carolina at Charlotte",
          "seo": "charlotte",
          "short": "Charlotte"
        },
        "rank": "",
        "score": "20",
        "seed": "",
        "winner": true
      },
      "liveVideoEnabled": false,
      "network": "",
      "startDate": "10-27-2018",
      "startTime": "02:00PM ET",
      "startTimeEpoch": "1540663200",
      "title": "Charlotte Southern Miss.",
      "url": "/game/football/fbs/2018/10/27/southern-miss-charlotte",
      "videoState": ""
    }},
    {"game": {
      "away": {
        "conferences": [{
          "conferenceName": "Sun Belt",
          "conferenceSeo": "sun-belt"
        }],
        "description": "(5-3)",
        "names": {
          "char6": "CO CAR",
          "full": "Coastal Carolina University",
          "seo": "coastal-caro",
          "short": "Coastal Caro."
        },
        "rank": "",
        "score": "37",
        "seed": "",
        "winner": true
      },
      "bracketId": "",
      "bracketRegion": "",
      "bracketRound": "",
      "contestClock": "0:00",
      "currentPeriod": "FINAL",
      "finalMessage": "FINAL",
      "gameID": "2bb6d53e-aef2-4493-80f9-da1f9dda7fde",
      "gameState": "final",
      "home": {
        "conferences": [{
          "conferenceName": "Sun Belt",
          "conferenceSeo": "sun-belt"
        }],
        "description": "(2-6)",
        "names": {
          "char6": "GA ST",
          "full": "Georgia State University",
          "seo": "georgia-st",
          "short": "Georgia State"
        },
        "rank": "",
        "score": "34",
        "seed": "",
        "winner": false
      },
      "liveVideoEnabled": false,
      "network": "",
      "startDate": "10-27-2018",
      "startTime": "02:00PM ET",
      "startTimeEpoch": "1540663200",
      "title": "Georgia St. Coastal Caro.",
      "url": "/game/football/fbs/2018/10/27/coastal-caro-georgia-st",
      "videoState": ""
    }},
    {"game": {
      "away": {
        "conferences": [{
          "conferenceName": "Big 12",
          "conferenceSeo": "big-12"
        }],
        "description": "(3-5)",
        "names": {
          "char6": "TCU",
          "full": "Texas Christian University",
          "seo": "tcu",
          "short": "TCU"
        },
        "rank": "",
        "score": "26",
        "seed": "",
        "winner": false
      },
      "bracketId": "",
      "bracketRegion": "",
      "bracketRound": "",
      "contestClock": "0:00",
      "currentPeriod": "FINAL",
      "finalMessage": "FINAL",
      "gameID": "c3fabbd4-5943-4e6f-b66e-430f969261e1",
      "gameState": "final",
      "home": {
        "conferences": [{
          "conferenceName": "Big 12",
          "conferenceSeo": "big-12"
        }],
        "description": "(3-5)",
        "names": {
          "char6": "KANSAS",
          "full": "University of Kansas",
          "seo": "kansas",
          "short": "Kansas"
        },
        "rank": "",
        "score": "27",
        "seed": "",
        "winner": true
      },
      "liveVideoEnabled": false,
      "network": "",
      "startDate": "10-27-2018",
      "startTime": "03:00PM ET",
      "startTimeEpoch": "1540666800",
      "title": "Kansas TCU",
      "url": "/game/football/fbs/2018/10/27/tcu-kansas",
      "videoState": ""
    }},
    {"game": {
      "away": {
        "conferences": [{
          "conferenceName": "Pac-12",
          "conferenceSeo": "pac-12"
        }],
        "description": "(2-6)",
        "names": {
          "char6": "ORE ST",
          "full": "Oregon State University",
          "seo": "oregon-st",
          "short": "Oregon St."
        },
        "rank": "",
        "score": "41",
        "seed": "",
        "winner": true
      },
      "bracketId": "",
      "bracketRegion": "",
      "bracketRound": "",
      "contestClock": "",
      "currentPeriod": "FINAL (OT)",
      "finalMessage": "FINAL (OT)",
      "gameID": "3c487353-63f2-40bd-b926-96affe05ced7",
      "gameState": "final",
      "home": {
        "conferences": [{
          "conferenceName": "Pac-12",
          "conferenceSeo": "pac-12"
        }],
        "description": "(5-3)",
        "names": {
          "char6": "COLO",
          "full": "University of Colorado, Boulder",
          "seo": "colorado",
          "short": "Colorado"
        },
        "rank": "",
        "score": "34",
        "seed": "",
        "winner": false
      },
      "liveVideoEnabled": false,
      "network": "",
      "startDate": "10-27-2018",
      "startTime": "03:00PM ET",
      "startTimeEpoch": "1540666800",
      "title": "Colorado Oregon St.",
      "url": "/game/football/fbs/2018/10/27/oregon-st-colorado",
      "videoState": ""
    }},
    {"game": {
      "away": {
        "conferences": [{
          "conferenceName": "Big Ten",
          "conferenceSeo": "big-ten"
        }],
        "description": "(3-5)",
        "names": {
          "char6": "ILL",
          "full": "University of Illinois Urbana-Champaign",
          "seo": "illinois",
          "short": "Illinois"
        },
        "rank": "",
        "score": "33",
        "seed": "",
        "winner": false
      },
      "bracketId": "",
      "bracketRegion": "",
      "bracketRound": "",
      "contestClock": "0:00",
      "currentPeriod": "FINAL",
      "finalMessage": "FINAL",
      "gameID": "7b1fc1f3-9d89-4f38-a6a2-450b79ee5e4e",
      "gameState": "final",
      "home": {
        "conferences": [{
          "conferenceName": "Big Ten",
          "conferenceSeo": "big-ten"
        }],
        "description": "(5-3)",
        "names": {
          "char6": "MD",
          "full": "University of Maryland, College Park",
          "seo": "maryland",
          "short": "Maryland"
        },
        "rank": "",
        "score": "63",
        "seed": "",
        "winner": true
      },
      "liveVideoEnabled": false,
      "network": "",
      "startDate": "10-27-2018",
      "startTime": "03:30PM ET",
      "startTimeEpoch": "1540668600",
      "title": "Maryland Illinois",
      "url": "/game/football/fbs/2018/10/27/illinois-maryland",
      "videoState": ""
    }},
    {"game": {
      "away": {
        "conferences": [
          {
            "conferenceName": "Big Ten",
            "conferenceSeo": "big-ten"
          },
          {
            "conferenceName": "Top 25",
            "conferenceSeo": "top-25"
          }
        ],
        "description": "(6-2)",
        "names": {
          "char6": "IOWA",
          "full": "University of Iowa",
          "seo": "iowa",
          "short": "Iowa"
        },
        "rank": "18",
        "score": "24",
        "seed": "",
        "winner": false
      },
      "bracketId": "",
      "bracketRegion": "",
      "bracketRound": "",
      "contestClock": "0:00",
      "currentPeriod": "FINAL",
      "finalMessage": "FINAL",
      "gameID": "2bbdf21b-6bde-47b3-b179-f8cf9d6d6a60",
      "gameState": "final",
      "home": {
        "conferences": [
          {
            "conferenceName": "Big Ten",
            "conferenceSeo": "big-ten"
          },
          {
            "conferenceName": "Top 25",
            "conferenceSeo": "top-25"
          }
        ],
        "description": "(6-2)",
        "names": {
          "char6": "PENNST",
          "full": "Pennsylvania State University",
          "seo": "penn-st",
          "short": "Penn St."
        },
        "rank": "17",
        "score": "30",
        "seed": "",
        "winner": true
      },
      "liveVideoEnabled": false,
      "network": "",
      "startDate": "10-27-2018",
      "startTime": "03:30PM ET",
      "startTimeEpoch": "1540668600",
      "title": "Penn St. Iowa",
      "url": "/game/football/fbs/2018/10/27/iowa-penn-st",
      "videoState": ""
    }},
    {"game": {
      "away": {
        "conferences": [{
          "conferenceName": "Pac-12",
          "conferenceSeo": "pac-12"
        }],
        "description": "(4-4)",
        "names": {
          "char6": "AZ ST",
          "full": "Arizona State University",
          "seo": "arizona-st",
          "short": "Arizona St."
        },
        "rank": "",
        "score": "38",
        "seed": "",
        "winner": true
      },
      "bracketId": "",
      "bracketRegion": "",
      "bracketRound": "",
      "contestClock": "0:00",
      "currentPeriod": "FINAL",
      "finalMessage": "FINAL",
      "gameID": "269a3ed8-e83c-4731-97eb-e1c3bcad6025",
      "gameState": "final",
      "home": {
        "conferences": [{
          "conferenceName": "Pac-12",
          "conferenceSeo": "pac-12"
        }],
        "description": "(4-4)",
        "names": {
          "char6": "USC",
          "full": "University of Southern California",
          "seo": "southern-california",
          "short": "USC"
        },
        "rank": "",
        "score": "35",
        "seed": "",
        "winner": false
      },
      "liveVideoEnabled": false,
      "network": "",
      "startDate": "10-27-2018",
      "startTime": "03:30PM ET",
      "startTimeEpoch": "1540668600",
      "title": "Southern California Arizona St.",
      "url": "/game/football/fbs/2018/10/27/arizona-st-southern-california",
      "videoState": ""
    }},
    {"game": {
      "away": {
        "conferences": [{
          "conferenceName": "MAC",
          "conferenceSeo": "mac"
        }],
        "description": "(5-3)",
        "names": {
          "char6": "NIU",
          "full": "Northern Illinois University",
          "seo": "northern-ill",
          "short": "Northern Ill."
        },
        "rank": "",
        "score": "7",
        "seed": "",
        "winner": true
      },
      "bracketId": "",
      "bracketRegion": "",
      "bracketRound": "",
      "contestClock": "0:00",
      "currentPeriod": "FINAL",
      "finalMessage": "FINAL",
      "gameID": "d158682c-7740-41e0-a81e-f882edab7c79",
      "gameState": "final",
      "home": {
        "conferences": [{
          "conferenceName": "FBS Independent",
          "conferenceSeo": "fbs-independent"
        }],
        "description": "(4-4)",
        "names": {
          "char6": "BYU",
          "full": "Brigham Young University",
          "seo": "byu",
          "short": "BYU"
        },
        "rank": "",
        "score": "6",
        "seed": "",
        "winner": false
      },
      "liveVideoEnabled": false,
      "network": "",
      "startDate": "10-27-2018",
      "startTime": "03:30PM ET",
      "startTimeEpoch": "1540668600",
      "title": "BYU Northern Ill.",
      "url": "/game/football/fbs/2018/10/27/northern-ill-byu",
      "videoState": ""
    }},
    {"game": {
      "away": {
        "conferences": [{
          "conferenceName": "C-USA",
          "conferenceSeo": "c-usa"
        }],
        "description": "(5-3)",
        "names": {
          "char6": "MIDTEN",
          "full": "Middle Tennessee State University",
          "seo": "middle-tenn",
          "short": "Middle Tenn."
        },
        "rank": "",
        "score": "51",
        "seed": "",
        "winner": true
      },
      "bracketId": "",
      "bracketRegion": "",
      "bracketRound": "",
      "contestClock": "0:00",
      "currentPeriod": "FINAL",
      "finalMessage": "FINAL",
      "gameID": "8cdb3944-2895-4261-a5e2-8ac706541a8c",
      "gameState": "final",
      "home": {
        "conferences": [{
          "conferenceName": "C-USA",
          "conferenceSeo": "c-usa"
        }],
        "description": "(2-7)",
        "names": {
          "char6": "ODU",
          "full": "Old Dominion University",
          "seo": "old-dominion",
          "short": "Old Dominion"
        },
        "rank": "",
        "score": "17",
        "seed": "",
        "winner": false
      },
      "liveVideoEnabled": false,
      "network": "",
      "startDate": "10-27-2018",
      "startTime": "03:30PM ET",
      "startTimeEpoch": "1540668600",
      "title": "Old Dominion Middle Tenn.",
      "url": "/game/football/fbs/2018/10/27/middle-tenn-old-dominion",
      "videoState": ""
    }},
    {"game": {
      "away": {
        "conferences": [{
          "conferenceName": "ACC",
          "conferenceSeo": "acc"
        }],
        "description": "(5-3)",
        "names": {
          "char6": "DUKE",
          "full": "Duke University",
          "seo": "duke",
          "short": "Duke"
        },
        "rank": "",
        "score": "45",
        "seed": "",
        "winner": false
      },
      "bracketId": "",
      "bracketRegion": "",
      "bracketRound": "",
      "contestClock": "0:00",
      "currentPeriod": "FINAL",
      "finalMessage": "FINAL",
      "gameID": "82d8b9df-40d4-4caf-9f23-54f39437d73a",
      "gameState": "final",
      "home": {
        "conferences": [{
          "conferenceName": "ACC",
          "conferenceSeo": "acc"
        }],
        "description": "(4-4)",
        "names": {
          "char6": "PITT",
          "full": "University of Pittsburgh",
          "seo": "pittsburgh",
          "short": "Pittsburgh"
        },
        "rank": "",
        "score": "54",
        "seed": "",
        "winner": true
      },
      "liveVideoEnabled": false,
      "network": "",
      "startDate": "10-27-2018",
      "startTime": "03:30PM ET",
      "startTimeEpoch": "1540668600",
      "title": "Pittsburgh Duke",
      "url": "/game/football/fbs/2018/10/27/duke-pittsburgh",
      "videoState": ""
    }},
    {"game": {
      "away": {
        "conferences": [{
          "conferenceName": "Big 12",
          "conferenceSeo": "big-12"
        }],
        "description": "(3-5)",
        "names": {
          "char6": "KAN ST",
          "full": "Kansas State University",
          "seo": "kansas-st",
          "short": "Kansas St."
        },
        "rank": "",
        "score": "14",
        "seed": "",
        "winner": false
      },
      "bracketId": "",
      "bracketRegion": "",
      "bracketRound": "",
      "contestClock": "0:00",
      "currentPeriod": "FINAL",
      "finalMessage": "FINAL",
      "gameID": "96eca2e4-c25c-4258-93c8-dddcfb488623",
      "gameState": "final",
      "home": {
        "conferences": [
          {
            "conferenceName": "Big 12",
            "conferenceSeo": "big-12"
          },
          {
            "conferenceName": "Top 25",
            "conferenceSeo": "top-25"
          }
        ],
        "description": "(7-1)",
        "names": {
          "char6": "OKLA",
          "full": "University of Oklahoma",
          "seo": "oklahoma",
          "short": "Oklahoma"
        },
        "rank": "8",
        "score": "51",
        "seed": "",
        "winner": true
      },
      "liveVideoEnabled": false,
      "network": "",
      "startDate": "10-27-2018",
      "startTime": "03:30PM ET",
      "startTimeEpoch": "1540668600",
      "title": "Oklahoma Kansas St.",
      "url": "/game/football/fbs/2018/10/27/kansas-st-oklahoma",
      "videoState": ""
    }},
    {"game": {
      "away": {
        "conferences": [{
          "conferenceName": "AAC",
          "conferenceSeo": "aac"
        }],
        "description": "(7-1)",
        "names": {
          "char6": "CINCY",
          "full": "University of Cincinnati",
          "seo": "cincinnati",
          "short": "Cincinnati"
        },
        "rank": "",
        "score": "26",
        "seed": "",
        "winner": true
      },
      "bracketId": "",
      "bracketRegion": "",
      "bracketRound": "",
      "contestClock": "",
      "currentPeriod": "FINAL (OT)",
      "finalMessage": "FINAL (OT)",
      "gameID": "7786c093-2280-4c5e-b9e7-463a53852c1b",
      "gameState": "final",
      "home": {
        "conferences": [{
          "conferenceName": "AAC",
          "conferenceSeo": "aac"
        }],
        "description": "(3-5)",
        "names": {
          "char6": "SMU",
          "full": "Southern Methodist University",
          "seo": "smu",
          "short": "SMU"
        },
        "rank": "",
        "score": "20",
        "seed": "",
        "winner": false
      },
      "liveVideoEnabled": false,
      "network": "",
      "startDate": "10-27-2018",
      "startTime": "03:30PM ET",
      "startTimeEpoch": "1540668600",
      "title": "SMU Cincinnati",
      "url": "/game/football/fbs/2018/10/27/cincinnati-smu",
      "videoState": ""
    }},
    {"game": {
      "away": {
        "conferences": [
          {
            "conferenceName": "SEC",
            "conferenceSeo": "sec"
          },
          {
            "conferenceName": "Top 25",
            "conferenceSeo": "top-25"
          }
        ],
        "description": "(6-2)",
        "names": {
          "char6": "FLA",
          "full": "University of Florida",
          "seo": "florida",
          "short": "Florida"
        },
        "rank": "9",
        "score": "17",
        "seed": "",
        "winner": false
      },
      "bracketId": "",
      "bracketRegion": "",
      "bracketRound": "",
      "contestClock": "0:00",
      "currentPeriod": "FINAL",
      "finalMessage": "FINAL",
      "gameID": "6c7d6a2b-9009-465a-8be8-2e84d23c5ee6",
      "gameState": "final",
      "home": {
        "conferences": [
          {
            "conferenceName": "SEC",
            "conferenceSeo": "sec"
          },
          {
            "conferenceName": "Top 25",
            "conferenceSeo": "top-25"
          }
        ],
        "description": "(7-1)",
        "names": {
          "char6": "UGA",
          "full": "University of Georgia",
          "seo": "georgia",
          "short": "Georgia"
        },
        "rank": "7",
        "score": "36",
        "seed": "",
        "winner": true
      },
      "liveVideoEnabled": false,
      "network": "",
      "startDate": "10-27-2018",
      "startTime": "03:30PM ET",
      "startTimeEpoch": "1540668600",
      "title": "Georgia Florida",
      "url": "/game/football/fbs/2018/10/27/florida-georgia",
      "videoState": ""
    }},
    {"game": {
      "away": {
        "conferences": [
          {
            "conferenceName": "AAC",
            "conferenceSeo": "aac"
          },
          {
            "conferenceName": "Top 25",
            "conferenceSeo": "top-25"
          }
        ],
        "description": "(7-1)",
        "names": {
          "char6": "USF",
          "full": "University of South Florida",
          "seo": "south-fla",
          "short": "South Florida"
        },
        "rank": "21",
        "score": "36",
        "seed": "",
        "winner": false
      },
      "bracketId": "",
      "bracketRegion": "",
      "bracketRound": "",
      "contestClock": "0:00",
      "currentPeriod": "FINAL",
      "finalMessage": "FINAL",
      "gameID": "e3de91e1-1304-4e86-9154-640f1ec60493",
      "gameState": "final",
      "home": {
        "conferences": [{
          "conferenceName": "AAC",
          "conferenceSeo": "aac"
        }],
        "description": "(7-1)",
        "names": {
          "char6": "HOU",
          "full": "University of Houston",
          "seo": "houston",
          "short": "Houston"
        },
        "rank": "",
        "score": "57",
        "seed": "",
        "winner": true
      },
      "liveVideoEnabled": false,
      "network": "",
      "startDate": "10-27-2018",
      "startTime": "03:30PM ET",
      "startTimeEpoch": "1540668600",
      "title": "Houston South Fla.",
      "url": "/game/football/fbs/2018/10/27/south-fla-houston",
      "videoState": ""
    }},
    {"game": {
      "away": {
        "conferences": [
          {
            "conferenceName": "SEC",
            "conferenceSeo": "sec"
          },
          {
            "conferenceName": "Top 25",
            "conferenceSeo": "top-25"
          }
        ],
        "description": "(7-1)",
        "names": {
          "char6": "UK",
          "full": "University of Kentucky",
          "seo": "kentucky",
          "short": "Kentucky"
        },
        "rank": "12",
        "score": "15",
        "seed": "",
        "winner": true
      },
      "bracketId": "",
      "bracketRegion": "",
      "bracketRound": "",
      "contestClock": "0:00",
      "currentPeriod": "FINAL",
      "finalMessage": "FINAL",
      "gameID": "db5dd584-dcde-40ec-b16c-4c50ffadac77",
      "gameState": "final",
      "home": {
        "conferences": [{
          "conferenceName": "SEC",
          "conferenceSeo": "sec"
        }],
        "description": "(4-4)",
        "names": {
          "char6": "MIZZOU",
          "full": "University of Missouri, Columbia",
          "seo": "missouri",
          "short": "Missouri"
        },
        "rank": "",
        "score": "14",
        "seed": "",
        "winner": false
      },
      "liveVideoEnabled": false,
      "network": "",
      "startDate": "10-27-2018",
      "startTime": "04:00PM ET",
      "startTimeEpoch": "1540670400",
      "title": "Missouri Kentucky",
      "url": "/game/football/fbs/2018/10/27/kentucky-missouri",
      "videoState": ""
    }},
    {"game": {
      "away": {
        "conferences": [{
          "conferenceName": "MWC",
          "conferenceSeo": "mwc"
        }],
        "description": "(3-5)",
        "names": {
          "char6": "N MEX",
          "full": "University of New Mexico",
          "seo": "new-mexico",
          "short": "New Mexico"
        },
        "rank": "",
        "score": "19",
        "seed": "",
        "winner": false
      },
      "bracketId": "",
      "bracketRegion": "",
      "bracketRound": "",
      "contestClock": "0:00",
      "currentPeriod": "FINAL",
      "finalMessage": "FINAL",
      "gameID": "9604c5ca-f2f3-4528-8a20-235aae2de26b",
      "gameState": "final",
      "home": {
        "conferences": [{
          "conferenceName": "MWC",
          "conferenceSeo": "mwc"
        }],
        "description": "(7-1)",
        "names": {
          "char6": "UT ST",
          "full": "Utah State University",
          "seo": "utah-st",
          "short": "Utah State"
        },
        "rank": "",
        "score": "61",
        "seed": "",
        "winner": true
      },
      "liveVideoEnabled": false,
      "network": "",
      "startDate": "10-27-2018",
      "startTime": "04:00PM ET",
      "startTimeEpoch": "1540670400",
      "title": "Utah St. New Mexico",
      "url": "/game/football/fbs/2018/10/27/new-mexico-utah-st",
      "videoState": ""
    }},
    {"game": {
      "away": {
        "conferences": [{
          "conferenceName": "C-USA",
          "conferenceSeo": "c-usa"
        }],
        "description": "(1-8)",
        "names": {
          "char6": "RICE",
          "full": "Rice University",
          "seo": "rice",
          "short": "Rice"
        },
        "rank": "",
        "score": "17",
        "seed": "",
        "winner": false
      },
      "bracketId": "",
      "bracketRegion": "",
      "bracketRound": "",
      "contestClock": "0:00",
      "currentPeriod": "FINAL",
      "finalMessage": "FINAL",
      "gameID": "b25b7a9d-9e15-4d6e-9203-b61b0ad26bf3",
      "gameState": "final",
      "home": {
        "conferences": [{
          "conferenceName": "C-USA",
          "conferenceSeo": "c-usa"
        }],
        "description": "(7-2)",
        "names": {
          "char6": "NO TEX",
          "full": "University of North Texas",
          "seo": "north-texas",
          "short": "North Texas"
        },
        "rank": "",
        "score": "41",
        "seed": "",
        "winner": true
      },
      "liveVideoEnabled": false,
      "network": "",
      "startDate": "10-27-2018",
      "startTime": "04:00PM ET",
      "startTimeEpoch": "1540670400",
      "title": "North Texas Rice",
      "url": "/game/football/fbs/2018/10/27/rice-north-texas",
      "videoState": ""
    }},
    {"game": {
      "away": {
        "conferences": [{
          "conferenceName": "MWC",
          "conferenceSeo": "mwc"
        }],
        "description": "(2-6)",
        "names": {
          "char6": "UNLV",
          "full": "University of Nevada, Las Vegas",
          "seo": "unlv",
          "short": "UNLV"
        },
        "rank": "",
        "score": "37",
        "seed": "",
        "winner": false
      },
      "bracketId": "",
      "bracketRegion": "",
      "bracketRound": "",
      "contestClock": "0:00",
      "currentPeriod": "FINAL",
      "finalMessage": "FINAL",
      "gameID": "086a8334-402b-4a14-939c-c340814d76d6",
      "gameState": "final",
      "home": {
        "conferences": [{
          "conferenceName": "MWC",
          "conferenceSeo": "mwc"
        }],
        "description": "(1-7)",
        "names": {
          "char6": "SJSU",
          "full": "San Jose State University",
          "seo": "san-jose-st",
          "short": "San Jose State"
        },
        "rank": "",
        "score": "50",
        "seed": "",
        "winner": true
      },
      "liveVideoEnabled": false,
      "network": "",
      "startDate": "10-27-2018",
      "startTime": "06:30PM ET",
      "startTimeEpoch": "1540679400",
      "title": "San Jose St. UNLV",
      "url": "/game/football/fbs/2018/10/27/unlv-san-jose-st",
      "videoState": ""
    }},
    {"game": {
      "away": {
        "conferences": [
          {
            "conferenceName": "Pac-12",
            "conferenceSeo": "pac-12"
          },
          {
            "conferenceName": "Top 25",
            "conferenceSeo": "top-25"
          }
        ],
        "description": "(6-3)",
        "names": {
          "char6": "WASH",
          "full": "University of Washington",
          "seo": "washington",
          "short": "Washington"
        },
        "rank": "15",
        "score": "10",
        "seed": "",
        "winner": false
      },
      "bracketId": "",
      "bracketRegion": "",
      "bracketRound": "",
      "contestClock": "0:00",
      "currentPeriod": "FINAL",
      "finalMessage": "FINAL",
      "gameID": "2b939822-e603-4569-8e4e-5d8bb566ccba",
      "gameState": "final",
      "home": {
        "conferences": [{
          "conferenceName": "Pac-12",
          "conferenceSeo": "pac-12"
        }],
        "description": "(5-3)",
        "names": {
          "char6": "CAL",
          "full": "University of California, Berkeley",
          "seo": "california",
          "short": "California"
        },
        "rank": "",
        "score": "12",
        "seed": "",
        "winner": true
      },
      "liveVideoEnabled": false,
      "network": "",
      "startDate": "10-27-2018",
      "startTime": "06:30PM ET",
      "startTimeEpoch": "1540679400",
      "title": "California Washington",
      "url": "/game/football/fbs/2018/10/27/washington-california",
      "videoState": ""
    }},
    {"game": {
      "away": {
        "conferences": [{
          "conferenceName": "FBS Independent",
          "conferenceSeo": "fbs-independent"
        }],
        "description": "(2-7)",
        "names": {
          "char6": "NM ST",
          "full": "New Mexico State University",
          "seo": "new-mexico-st",
          "short": "New Mexico St."
        },
        "rank": "",
        "score": "20",
        "seed": "",
        "winner": false
      },
      "bracketId": "",
      "bracketRegion": "",
      "bracketRound": "",
      "contestClock": "0:00",
      "currentPeriod": "FINAL",
      "finalMessage": "FINAL",
      "gameID": "a0f4e76f-ca56-4e81-951e-92c7d23ab5e4",
      "gameState": "final",
      "home": {
        "conferences": [{
          "conferenceName": "Sun Belt",
          "conferenceSeo": "sun-belt"
        }],
        "description": "(2-6)",
        "names": {
          "char6": "TX ST",
          "full": "Texas State University",
          "seo": "texas-st",
          "short": "Texas State"
        },
        "rank": "",
        "score": "27",
        "seed": "",
        "winner": true
      },
      "liveVideoEnabled": false,
      "network": "",
      "startDate": "10-27-2018",
      "startTime": "07:00PM ET",
      "startTimeEpoch": "1540681200",
      "title": "Texas St. New Mexico St.",
      "url": "/game/football/fbs/2018/10/27/new-mexico-st-texas-st",
      "videoState": ""
    }},
    {"game": {
      "away": {
        "conferences": [{
          "conferenceName": "Sun Belt",
          "conferenceSeo": "sun-belt"
        }],
        "description": "(4-4)",
        "names": {
          "char6": "ARK ST",
          "full": "Arkansas State University",
          "seo": "arkansas-st",
          "short": "Arkansas State"
        },
        "rank": "",
        "score": "43",
        "seed": "",
        "winner": false
      },
      "bracketId": "",
      "bracketRegion": "",
      "bracketRound": "",
      "contestClock": "0:00",
      "currentPeriod": "FINAL",
      "finalMessage": "FINAL",
      "gameID": "7246a134-da1b-445b-9dad-4d30dad6f7c7",
      "gameState": "final",
      "home": {
        "conferences": [{
          "conferenceName": "Sun Belt",
          "conferenceSeo": "sun-belt"
        }],
        "description": "(4-4)",
        "names": {
          "char6": "ULL",
          "full": "University of Louisiana at Lafayette",
          "seo": "la-lafayette",
          "short": "Louisiana"
        },
        "rank": "",
        "score": "47",
        "seed": "",
        "winner": true
      },
      "liveVideoEnabled": false,
      "network": "",
      "startDate": "10-27-2018",
      "startTime": "07:00PM ET",
      "startTimeEpoch": "1540681200",
      "title": "Louisiana Arkansas St.",
      "url": "/game/football/fbs/2018/10/27/arkansas-st-la-lafayette",
      "videoState": ""
    }},
    {"game": {
      "away": {
        "conferences": [{
          "conferenceName": "MWC",
          "conferenceSeo": "mwc"
        }],
        "description": "(6-2)",
        "names": {
          "char6": "BOISE",
          "full": "Boise State University",
          "seo": "boise-st",
          "short": "Boise State"
        },
        "rank": "",
        "score": "48",
        "seed": "",
        "winner": true
      },
      "bracketId": "",
      "bracketRegion": "",
      "bracketRound": "",
      "contestClock": "0:00",
      "currentPeriod": "FINAL",
      "finalMessage": "FINAL",
      "gameID": "c8a5111b-459b-448a-b50b-70fa76a016ac",
      "gameState": "final",
      "home": {
        "conferences": [{
          "conferenceName": "MWC",
          "conferenceSeo": "mwc"
        }],
        "description": "(3-5)",
        "names": {
          "char6": "AIRFOR",
          "full": "U.S. Air Force Academy",
          "seo": "air-force",
          "short": "Air Force"
        },
        "rank": "",
        "score": "38",
        "seed": "",
        "winner": false
      },
      "liveVideoEnabled": false,
      "network": "",
      "startDate": "10-27-2018",
      "startTime": "07:00PM ET",
      "startTimeEpoch": "1540681200",
      "title": "Air Force Boise St.",
      "url": "/game/football/fbs/2018/10/27/boise-st-air-force",
      "videoState": ""
    }},
    {"game": {
      "away": {
        "conferences": [
          {
            "conferenceName": "SEC",
            "conferenceSeo": "sec"
          },
          {
            "conferenceName": "Top 25",
            "conferenceSeo": "top-25"
          }
        ],
        "description": "(5-3)",
        "names": {
          "char6": "TX A&M",
          "full": "Texas A&M University, College Station",
          "seo": "texas-am",
          "short": "Texas A&M"
        },
        "rank": "16",
        "score": "13",
        "seed": "",
        "winner": false
      },
      "bracketId": "",
      "bracketRegion": "",
      "bracketRound": "",
      "contestClock": "0:00",
      "currentPeriod": "FINAL",
      "finalMessage": "FINAL",
      "gameID": "8d425b05-b78b-42de-b7f4-236ce1d516b7",
      "gameState": "final",
      "home": {
        "conferences": [{
          "conferenceName": "SEC",
          "conferenceSeo": "sec"
        }],
        "description": "(5-3)",
        "names": {
          "char6": "MISSST",
          "full": "Mississippi State University",
          "seo": "mississippi-st",
          "short": "Mississippi St."
        },
        "rank": "",
        "score": "28",
        "seed": "",
        "winner": true
      },
      "liveVideoEnabled": false,
      "network": "",
      "startDate": "10-27-2018",
      "startTime": "07:00PM ET",
      "startTimeEpoch": "1540681200",
      "title": "Mississippi St. Texas A&M",
      "url": "/game/football/fbs/2018/10/27/texas-am-mississippi-st",
      "videoState": ""
    }},
    {"game": {
      "away": {
        "conferences": [
          {
            "conferenceName": "Pac-12",
            "conferenceSeo": "pac-12"
          },
          {
            "conferenceName": "Top 25",
            "conferenceSeo": "top-25"
          }
        ],
        "description": "(7-1)",
        "names": {
          "char6": "WASHST",
          "full": "Washington State University",
          "seo": "washington-st",
          "short": "Washington St."
        },
        "rank": "14",
        "score": "41",
        "seed": "",
        "winner": true
      },
      "bracketId": "",
      "bracketRegion": "",
      "bracketRound": "",
      "contestClock": "0:00",
      "currentPeriod": "FINAL",
      "finalMessage": "FINAL",
      "gameID": "404f4dad-0e2a-439c-b0f5-24f3e13d5add",
      "gameState": "final",
      "home": {
        "conferences": [
          {
            "conferenceName": "Pac-12",
            "conferenceSeo": "pac-12"
          },
          {
            "conferenceName": "Top 25",
            "conferenceSeo": "top-25"
          }
        ],
        "description": "(5-3)",
        "names": {
          "char6": "STAN",
          "full": "Stanford University",
          "seo": "stanford",
          "short": "Stanford"
        },
        "rank": "24",
        "score": "38",
        "seed": "",
        "winner": false
      },
      "liveVideoEnabled": false,
      "network": "",
      "startDate": "10-27-2018",
      "startTime": "07:00PM ET",
      "startTimeEpoch": "1540681200",
      "title": "Stanford Washington St.",
      "url": "/game/football/fbs/2018/10/27/washington-st-stanford",
      "videoState": ""
    }},
    {"game": {
      "away": {
        "conferences": [
          {
            "conferenceName": "ACC",
            "conferenceSeo": "acc"
          },
          {
            "conferenceName": "Top 25",
            "conferenceSeo": "top-25"
          }
        ],
        "description": "(5-2)",
        "names": {
          "char6": "NC ST",
          "full": "North Carolina State University",
          "seo": "north-carolina-st",
          "short": "NC State"
        },
        "rank": "22",
        "score": "41",
        "seed": "",
        "winner": false
      },
      "bracketId": "",
      "bracketRegion": "",
      "bracketRound": "",
      "contestClock": "0:00",
      "currentPeriod": "FINAL",
      "finalMessage": "FINAL",
      "gameID": "789f9f72-6e86-4c79-ad05-0c27a41c4f31",
      "gameState": "final",
      "home": {
        "conferences": [{
          "conferenceName": "ACC",
          "conferenceSeo": "acc"
        }],
        "description": "(6-2)",
        "names": {
          "char6": "SYR",
          "full": "Syracuse University",
          "seo": "syracuse",
          "short": "Syracuse"
        },
        "rank": "",
        "score": "51",
        "seed": "",
        "winner": true
      },
      "liveVideoEnabled": false,
      "network": "",
      "startDate": "10-27-2018",
      "startTime": "07:00PM ET",
      "startTimeEpoch": "1540681200",
      "title": "Syracuse NC State",
      "url": "/game/football/fbs/2018/10/27/north-carolina-st-syracuse",
      "videoState": ""
    }},
    {"game": {
      "away": {
        "conferences": [{
          "conferenceName": "AAC",
          "conferenceSeo": "aac"
        }],
        "description": "(3-5)",
        "names": {
          "char6": "TULANE",
          "full": "Tulane University",
          "seo": "tulane",
          "short": "Tulane"
        },
        "rank": "",
        "score": "24",
        "seed": "",
        "winner": true
      },
      "bracketId": "",
      "bracketRegion": "",
      "bracketRound": "",
      "contestClock": "0:00",
      "currentPeriod": "FINAL",
      "finalMessage": "FINAL",
      "gameID": "972a2991-6ecd-416e-a7be-91ab42e7195e",
      "gameState": "final",
      "home": {
        "conferences": [{
          "conferenceName": "AAC",
          "conferenceSeo": "aac"
        }],
        "description": "(1-7)",
        "names": {
          "char6": "TULSA",
          "full": "The University of Tulsa",
          "seo": "tulsa",
          "short": "Tulsa"
        },
        "rank": "",
        "score": "17",
        "seed": "",
        "winner": false
      },
      "liveVideoEnabled": false,
      "network": "",
      "startDate": "10-27-2018",
      "startTime": "07:00PM ET",
      "startTimeEpoch": "1540681200",
      "title": "Tulsa Tulane",
      "url": "/game/football/fbs/2018/10/27/tulane-tulsa",
      "videoState": ""
    }},
    {"game": {
      "away": {
        "conferences": [{
          "conferenceName": "C-USA",
          "conferenceSeo": "c-usa"
        }],
        "description": "(6-2)",
        "names": {
          "char6": "FIU",
          "full": "Florida International University",
          "seo": "fiu",
          "short": "FIU"
        },
        "rank": "",
        "score": "38",
        "seed": "",
        "winner": true
      },
      "bracketId": "",
      "bracketRegion": "",
      "bracketRound": "",
      "contestClock": "0:00",
      "currentPeriod": "FINAL",
      "finalMessage": "FINAL",
      "gameID": "e997ce9e-9c67-44c6-bdab-2e65a5ac3037",
      "gameState": "final",
      "home": {
        "conferences": [{
          "conferenceName": "C-USA",
          "conferenceSeo": "c-usa"
        }],
        "description": "(1-7)",
        "names": {
          "char6": "W KY",
          "full": "Western Kentucky University",
          "seo": "western-ky",
          "short": "Western Ky."
        },
        "rank": "",
        "score": "17",
        "seed": "",
        "winner": false
      },
      "liveVideoEnabled": false,
      "network": "",
      "startDate": "10-27-2018",
      "startTime": "07:30PM ET",
      "startTimeEpoch": "1540683000",
      "title": "Western Ky. FIU",
      "url": "/game/football/fbs/2018/10/27/fiu-western-ky",
      "videoState": ""
    }},
    {"game": {
      "away": {
        "conferences": [{
          "conferenceName": "C-USA",
          "conferenceSeo": "c-usa"
        }],
        "description": "(7-1)",
        "names": {
          "char6": "UAB",
          "full": "University of Alabama at Birmingham",
          "seo": "uab",
          "short": "UAB"
        },
        "rank": "",
        "score": "19",
        "seed": "",
        "winner": true
      },
      "bracketId": "",
      "bracketRegion": "",
      "bracketRound": "",
      "contestClock": "0:00",
      "currentPeriod": "FINAL",
      "finalMessage": "FINAL",
      "gameID": "a1aeda92-f728-4dc2-9f0d-94a204e99673",
      "gameState": "final",
      "home": {
        "conferences": [{
          "conferenceName": "C-USA",
          "conferenceSeo": "c-usa"
        }],
        "description": "(0-8)",
        "names": {
          "char6": "UTEP",
          "full": "University of Texas at El Paso",
          "seo": "utep",
          "short": "UTEP"
        },
        "rank": "",
        "score": "0",
        "seed": "",
        "winner": false
      },
      "liveVideoEnabled": false,
      "network": "",
      "startDate": "10-27-2018",
      "startTime": "07:30PM ET",
      "startTimeEpoch": "1540683000",
      "title": "UTEP UAB",
      "url": "/game/football/fbs/2018/10/27/uab-utep",
      "videoState": ""
    }},
    {"game": {
      "away": {
        "conferences": [{
          "conferenceName": "SEC",
          "conferenceSeo": "sec"
        }],
        "description": "(3-5)",
        "names": {
          "char6": "TENN",
          "full": "University of Tennessee, Knoxville",
          "seo": "tennessee",
          "short": "Tennessee"
        },
        "rank": "",
        "score": "24",
        "seed": "",
        "winner": false
      },
      "bracketId": "",
      "bracketRegion": "",
      "bracketRound": "",
      "contestClock": "0:00",
      "currentPeriod": "FINAL",
      "finalMessage": "FINAL",
      "gameID": "f4663640-a85b-4737-9b8f-2dbeddad1a1d",
      "gameState": "final",
      "home": {
        "conferences": [{
          "conferenceName": "SEC",
          "conferenceSeo": "sec"
        }],
        "description": "(4-3)",
        "names": {
          "char6": "S CAR",
          "full": "University of South Carolina, Columbia",
          "seo": "south-carolina",
          "short": "South Carolina"
        },
        "rank": "",
        "score": "27",
        "seed": "",
        "winner": true
      },
      "liveVideoEnabled": false,
      "network": "",
      "startDate": "10-27-2018",
      "startTime": "07:30PM ET",
      "startTimeEpoch": "1540683000",
      "title": "South Carolina Tennessee",
      "url": "/game/football/fbs/2018/10/27/tennessee-south-carolina",
      "videoState": ""
    }},
    {"game": {
      "away": {
        "conferences": [
          {
            "conferenceName": "Big 12",
            "conferenceSeo": "big-12"
          },
          {
            "conferenceName": "Top 25",
            "conferenceSeo": "top-25"
          }
        ],
        "description": "(6-2)",
        "names": {
          "char6": "TEXAS",
          "full": "University of Texas at Austin",
          "seo": "texas",
          "short": "Texas"
        },
        "rank": "6",
        "score": "35",
        "seed": "",
        "winner": false
      },
      "bracketId": "",
      "bracketRegion": "",
      "bracketRound": "",
      "contestClock": "0:00",
      "currentPeriod": "FINAL",
      "finalMessage": "FINAL",
      "gameID": "6409accc-585e-436b-b4d8-f9acce85ca31",
      "gameState": "final",
      "home": {
        "conferences": [{
          "conferenceName": "Big 12",
          "conferenceSeo": "big-12"
        }],
        "description": "(5-3)",
        "names": {
          "char6": "OKLAST",
          "full": "Oklahoma State University",
          "seo": "oklahoma-st",
          "short": "Oklahoma State"
        },
        "rank": "",
        "score": "38",
        "seed": "",
        "winner": true
      },
      "liveVideoEnabled": false,
      "network": "",
      "startDate": "10-27-2018",
      "startTime": "08:00PM ET",
      "startTimeEpoch": "1540684800",
      "title": "Oklahoma St. Texas",
      "url": "/game/football/fbs/2018/10/27/texas-oklahoma-st",
      "videoState": ""
    }},
    {"game": {
      "away": {
        "conferences": [
          {
            "conferenceName": "FBS Independent",
            "conferenceSeo": "fbs-independent"
          },
          {
            "conferenceName": "Top 25",
            "conferenceSeo": "top-25"
          }
        ],
        "description": "(8-0)",
        "names": {
          "char6": "N DAME",
          "full": "University of Notre Dame",
          "seo": "notre-dame",
          "short": "Notre Dame"
        },
        "rank": "3",
        "score": "44",
        "seed": "",
        "winner": true
      },
      "bracketId": "",
      "bracketRegion": "",
      "bracketRound": "",
      "contestClock": "0:00",
      "currentPeriod": "FINAL",
      "finalMessage": "FINAL",
      "gameID": "fe9b60f3-7f46-4a0b-967a-ab1a70b84318",
      "gameState": "final",
      "home": {
        "conferences": [{
          "conferenceName": "AAC",
          "conferenceSeo": "aac"
        }],
        "description": "(2-6)",
        "names": {
          "char6": "NAVY",
          "full": "U.S. Naval Academy",
          "seo": "navy",
          "short": "Navy"
        },
        "rank": "",
        "score": "22",
        "seed": "",
        "winner": false
      },
      "liveVideoEnabled": false,
      "network": "",
      "startDate": "10-27-2018",
      "startTime": "08:00PM ET",
      "startTimeEpoch": "1540684800",
      "title": "Navy Notre Dame",
      "url": "/game/football/fbs/2018/10/27/notre-dame-navy",
      "videoState": ""
    }},
    {"game": {
      "away": {
        "conferences": [{
          "conferenceName": "MWC",
          "conferenceSeo": "mwc"
        }],
        "description": "(6-2)",
        "names": {
          "char6": "SDSU",
          "full": "San Diego State University",
          "seo": "san-diego-st",
          "short": "San Diego State"
        },
        "rank": "",
        "score": "24",
        "seed": "",
        "winner": false
      },
      "bracketId": "",
      "bracketRegion": "",
      "bracketRound": "",
      "contestClock": "0:00",
      "currentPeriod": "FINAL",
      "finalMessage": "FINAL",
      "gameID": "ecf7f7a5-6361-46ac-95a4-d0f09f829a91",
      "gameState": "final",
      "home": {
        "conferences": [{
          "conferenceName": "MWC",
          "conferenceSeo": "mwc"
        }],
        "description": "(5-4)",
        "names": {
          "char6": "NEVADA",
          "full": "University of Nevada, Reno",
          "seo": "nevada",
          "short": "Nevada"
        },
        "rank": "",
        "score": "28",
        "seed": "",
        "winner": true
      },
      "liveVideoEnabled": false,
      "network": "",
      "startDate": "10-27-2018",
      "startTime": "10:30PM ET",
      "startTimeEpoch": "1540693800",
      "title": "Nevada San Diego St.",
      "url": "/game/football/fbs/2018/10/27/san-diego-st-nevada",
      "videoState": ""
    }},
    {"game": {
      "away": {
        "conferences": [{
          "conferenceName": "MWC",
          "conferenceSeo": "mwc"
        }],
        "description": "(6-4)",
        "names": {
          "char6": "HAWAII",
          "full": "University of Hawaii, Manoa",
          "seo": "hawaii",
          "short": "Hawaii"
        },
        "rank": "",
        "score": "20",
        "seed": "",
        "winner": false
      },
      "bracketId": "",
      "bracketRegion": "",
      "bracketRound": "",
      "contestClock": "0:00",
      "currentPeriod": "FINAL",
      "finalMessage": "FINAL",
      "gameID": "5a7a8baf-f6a8-4410-be83-2a63b739c231",
      "gameState": "final",
      "home": {
        "conferences": [{
          "conferenceName": "MWC",
          "conferenceSeo": "mwc"
        }],
        "description": "(7-1)",
        "names": {
          "char6": "FRESNO",
          "full": "California State University, Fresno",
          "seo": "fresno-st",
          "short": "Fresno State"
        },
        "rank": "",
        "score": "50",
        "seed": "",
        "winner": true
      },
      "liveVideoEnabled": false,
      "network": "",
      "startDate": "10-27-2018",
      "startTime": "10:30PM ET",
      "startTimeEpoch": "1540693800",
      "title": "Fresno St. Hawaii",
      "url": "/game/football/fbs/2018/10/27/hawaii-fresno-st",
      "videoState": ""
    }},
    {"game": {
      "away": {
        "conferences": [
          {
            "conferenceName": "Pac-12",
            "conferenceSeo": "pac-12"
          },
          {
            "conferenceName": "Top 25",
            "conferenceSeo": "top-25"
          }
        ],
        "description": "(5-3)",
        "names": {
          "char6": "OREGN",
          "full": "University of Oregon",
          "seo": "oregon",
          "short": "Oregon"
        },
        "rank": "19",
        "score": "15",
        "seed": "",
        "winner": false
      },
      "bracketId": "",
      "bracketRegion": "",
      "bracketRound": "",
      "contestClock": "0:00",
      "currentPeriod": "FINAL",
      "finalMessage": "FINAL",
      "gameID": "c346bed2-0281-44e7-aa65-a389de941ab3",
      "gameState": "final",
      "home": {
        "conferences": [{
          "conferenceName": "Pac-12",
          "conferenceSeo": "pac-12"
        }],
        "description": "(4-5)",
        "names": {
          "char6": "ARIZ",
          "full": "University of Arizona",
          "seo": "arizona",
          "short": "Arizona"
        },
        "rank": "",
        "score": "44",
        "seed": "",
        "winner": true
      },
      "liveVideoEnabled": false,
      "network": "",
      "startDate": "10-27-2018",
      "startTime": "10:30PM ET",
      "startTimeEpoch": "1540693800",
      "title": "Arizona Oregon",
      "url": "/game/football/fbs/2018/10/27/oregon-arizona",
      "videoState": ""
    }}
  ],
  "inputMD5Sum": "0012fc0d14bec617309e1319216432ce",
  "updated_at": "08-06-2019 13:12:09"
}