{
  "VirginiaTech vs Pittsburgh": {
    "stadium": "HeinzField-Pittsburgh-PA",
    "VirginiaTech": {
      "points": 39,
      "1st downs": 29,
      "rushing 1st downs": 8,
      "passing 1st downs": 19,
      "penalty 1st downs": 2,
      "rushing yards": 150,
      "rushing attempts": 39,
      "passing yards": 406,
      "passing attempts": 43,
      "passing completions": 24,
      "passing interceptions": 0,
      "total yards": 556,
      "total plays": 82,
      "fumbles": 1,
      "fumbles lost": 0,
      "penalties": 4,
      "penalty yards": 35,
      "punts": 3,
      "punt yards": 94,
      "punt returns": 4,
      "punt return yards": 33,
      "kickoff returns": 5,
      "kickoff return yards": 64,
      "interception returns": 1,
      "interception return yards": 1,
      "3rd down conversions": 4,
      "3rd down attempts": 14,
      "4th down conversions": 0,
      "4th down attempts": 0
    },
    "Pittsburgh": {
      "points": 36,
      "1st downs": 17,
      "rushing 1st downs": 5,
      "passing 1st downs": 10,
      "penalty 1st downs": 2,
      "rushing yards": 180,
      "rushing attempts": 32,
      "passing yards": 278,
      "passing attempts": 23,
      "passing completions": 14,
      "passing interceptions": 1,
      "total yards": 458,
      "total plays": 55,
      "fumbles": 3,
      "fumbles lost": 1,
      "penalties": 9,
      "penalty yards": 63,
      "punts": 6,
      "punt yards": 239,
      "punt returns": 0,
      "punt return yards": 0,
      "kickoff returns": 4,
      "kickoff return yards": 57,
      "interception returns": 0,
      "interception return yards": 0,
      "3rd down conversions": 3,
      "3rd down attempts": 10,
      "4th down conversions": 0,
      "4th down attempts": 0
    }
  },
  "Akron vs Buffalo": {
    "stadium": "UBStadium-Amherst-NY",
    "Akron": {
      "points": 20,
      "1st downs": 18,
      "rushing 1st downs": 9,
      "passing 1st downs": 7,
      "penalty 1st downs": 2,
      "rushing yards": 128,
      "rushing attempts": 42,
      "passing yards": 178,
      "passing attempts": 42,
      "passing completions": 18,
      "passing interceptions": 1,
      "total yards": 306,
      "total plays": 84,
      "fumbles": 2,
      "fumbles lost": 0,
      "penalties": 4,
      "penalty yards": 40,
      "punts": 6,
      "punt yards": 197,
      "punt returns": 3,
      "punt return yards": 116,
      "kickoff returns": 6,
      "kickoff return yards": 87,
      "interception returns": 1,
      "interception return yards": 34,
      "3rd down conversions": 7,
      "3rd down attempts": 21,
      "4th down conversions": 1,
      "4th down attempts": 5
    },
    "Buffalo": {
      "points": 41,
      "1st downs": 19,
      "rushing 1st downs": 15,
      "passing 1st downs": 4,
      "penalty 1st downs": 0,
      "rushing yards": 378,
      "rushing attempts": 42,
      "passing yards": 140,
      "passing attempts": 21,
      "passing completions": 7,
      "passing interceptions": 1,
      "total yards": 518,
      "total plays": 63,
      "fumbles": 0,
      "fumbles lost": 0,
      "penalties": 6,
      "penalty yards": 66,
      "punts": 7,
      "punt yards": 262,
      "punt returns": 2,
      "punt return yards": 24,
      "kickoff returns": 5,
      "kickoff return yards": 99,
      "interception returns": 1,
      "interception return yards": 0,
      "3rd down conversions": 1,
      "3rd down attempts": 10,
      "4th down conversions": 0,
      "4th down attempts": 0
    }
  },
  "AppalachianState vs GeorgiaSouthern": {
    "stadium": "AllenEPaulsonStadium-Statesboro-GA",
    "AppalachianState": {
      "points": 34,
      "1st downs": 28,
      "rushing 1st downs": 16,
      "passing 1st downs": 10,
      "penalty 1st downs": 2,
      "rushing yards": 299,
      "rushing attempts": 47,
      "passing yards": 199,
      "passing attempts": 27,
      "passing completions": 16,
      "passing interceptions": 2,
      "total yards": 498,
      "total plays": 74,
      "fumbles": 2,
      "fumbles lost": 0,
      "penalties": 4,
      "penalty yards": 36,
      "punts": 4,
      "punt yards": 125,
      "punt returns": 3,
      "punt return yards": 32,
      "kickoff returns": 3,
      "kickoff return yards": 66,
      "interception returns": 3,
      "interception return yards": 2,
      "3rd down conversions": 1,
      "3rd down attempts": 12,
      "4th down conversions": 3,
      "4th down attempts": 4
    },
    "GeorgiaSouthern": {
      "points": 10,
      "1st downs": 9,
      "rushing 1st downs": 3,
      "passing 1st downs": 5,
      "penalty 1st downs": 1,
      "rushing yards": 65,
      "rushing attempts": 26,
      "passing yards": 94,
      "passing attempts": 29,
      "passing completions": 12,
      "passing interceptions": 3,
      "total yards": 159,
      "total plays": 55,
      "fumbles": 0,
      "fumbles lost": 0,
      "penalties": 4,
      "penalty yards": 45,
      "punts": 8,
      "punt yards": 303,
      "punt returns": 0,
      "punt return yards": 0,
      "kickoff returns": 5,
      "kickoff return yards": 116,
      "interception returns": 2,
      "interception return yards": 22,
      "3rd down conversions": 2,
      "3rd down attempts": 13,
      "4th down conversions": 0,
      "4th down attempts": 1
    }
  },
  "Ohio vs Toledo": {
    "stadium": "TheGlassBowl-Toledo-OH",
    "Ohio": {
      "points": 31,
      "1st downs": 23,
      "rushing 1st downs": 12,
      "passing 1st downs": 9,
      "penalty 1st downs": 2,
      "rushing yards": 269,
      "rushing attempts": 48,
      "passing yards": 243,
      "passing attempts": 22,
      "passing completions": 11,
      "passing interceptions": 0,
      "total yards": 512,
      "total plays": 70,
      "fumbles": 3,
      "fumbles lost": 1,
      "penalties": 5,
      "penalty yards": 55,
      "punts": 7,
      "punt yards": 244,
      "punt returns": 1,
      "punt return yards": 19,
      "kickoff returns": 4,
      "kickoff return yards": 102,
      "interception returns": 1,
      "interception return yards": 3,
      "3rd down conversions": 5,
      "3rd down attempts": 14,
      "4th down conversions": 0,
      "4th down attempts": 0
    },
    "Toledo": {
      "points": 26,
      "1st downs": 24,
      "rushing 1st downs": 8,
      "passing 1st downs": 15,
      "penalty 1st downs": 1,
      "rushing yards": 122,
      "rushing attempts": 29,
      "passing yards": 438,
      "passing attempts": 46,
      "passing completions": 32,
      "passing interceptions": 1,
      "total yards": 560,
      "total plays": 75,
      "fumbles": 1,
      "fumbles lost": 1,
      "penalties": 9,
      "penalty yards": 66,
      "punts": 6,
      "punt yards": 245,
      "punt returns": 0,
      "punt return yards": 0,
      "kickoff returns": 6,
      "kickoff return yards": 129,
      "interception returns": 0,
      "interception return yards": 0,
      "3rd down conversions": 6,
      "3rd down attempts": 15,
      "4th down conversions": 0,
      "4th down attempts": 1
    }
  },
  "California vs USC": {
    "stadium": "LosAngelesMemorialColiseum-LosAngeles-CA",
    "California": {
      "points": 24,
      "1st downs": 29,
      "rushing 1st downs": 8,
      "passing 1st downs": 16,
      "penalty 1st downs": 5,
      "rushing yards": 142,
      "rushing attempts": 30,
      "passing yards": 333,
      "passing attempts": 53,
      "passing completions": 34,
      "passing interceptions": 1,
      "total yards": 475,
      "total plays": 83,
      "fumbles": 2,
      "fumbles lost": 1,
      "penalties": 7,
      "penalty yards": 65,
      "punts": 4,
      "punt yards": 178,
      "punt returns": 0,
      "punt return yards": 0,
      "kickoff returns": 5,
      "kickoff return yards": 79,
      "interception returns": 1,
      "interception return yards": 27,
      "3rd down conversions": 3,
      "3rd down attempts": 12,
      "4th down conversions": 2,
      "4th down attempts": 4
    },
    "USC": {
      "points": 45,
      "1st downs": 31,
      "rushing 1st downs": 17,
      "passing 1st downs": 13,
      "penalty 1st downs": 1,
      "rushing yards": 398,
      "rushing attempts": 48,
      "passing yards": 231,
      "passing attempts": 25,
      "passing completions": 18,
      "passing interceptions": 1,
      "total yards": 629,
      "total plays": 73,
      "fumbles": 2,
      "fumbles lost": 2,
      "penalties": 13,
      "penalty yards": 125,
      "punts": 2,
      "punt yards": 75,
      "punt returns": 2,
      "punt return yards": 33,
      "kickoff returns": 4,
      "kickoff return yards": 69,
      "interception returns": 1,
      "interception return yards": 0,
      "3rd down conversions": 6,
      "3rd down attempts": 10,
      "4th down conversions": 1,
      "4th down attempts": 1
    }
  },
  "Navy vs SouthFlorida": {
    "stadium": "RaymondJamesStadium-Tampa-FL",
    "Navy": {
      "points": 45,
      "1st downs": 29,
      "rushing 1st downs": 19,
      "passing 1st downs": 10,
      "penalty 1st downs": 0,
      "rushing yards": 317,
      "rushing attempts": 54,
      "passing yards": 299,
      "passing attempts": 27,
      "passing completions": 15,
      "passing interceptions": 1,
      "total yards": 616,
      "total plays": 81,
      "fumbles": 0,
      "fumbles lost": 0,
      "penalties": 2,
      "penalty yards": 10,
      "punts": 3,
      "punt yards": 144,
      "punt returns": 1,
      "punt return yards": 6,
      "kickoff returns": 4,
      "kickoff return yards": 77,
      "interception returns": 0,
      "interception return yards": 0,
      "3rd down conversions": 8,
      "3rd down attempts": 13,
      "4th down conversions": 1,
      "4th down attempts": 2
    },
    "SouthFlorida": {
      "points": 52,
      "1st downs": 25,
      "rushing 1st downs": 14,
      "passing 1st downs": 11,
      "penalty 1st downs": 0,
      "rushing yards": 412,
      "rushing attempts": 44,
      "passing yards": 217,
      "passing attempts": 30,
      "passing completions": 20,
      "passing interceptions": 0,
      "total yards": 629,
      "total plays": 74,
      "fumbles": 1,
      "fumbles lost": 1,
      "penalties": 8,
      "penalty yards": 50,
      "punts": 2,
      "punt yards": 77,
      "punt returns": 1,
      "punt return yards": 31,
      "kickoff returns": 5,
      "kickoff return yards": 39,
      "interception returns": 1,
      "interception return yards": 0,
      "3rd down conversions": 12,
      "3rd down attempts": 16,
      "4th down conversions": 0,
      "4th down attempts": 0
    }
  },
  "SanDiegoState vs UtahState": {
    "stadium": "MerlinOlsenFieldatMaverikStadium-Logan-UT",
    "SanDiegoState": {
      "points": 40,
      "1st downs": 20,
      "rushing 1st downs": 18,
      "passing 1st downs": 0,
      "penalty 1st downs": 2,
      "rushing yards": 400,
      "rushing attempts": 57,
      "passing yards": 14,
      "passing attempts": 10,
      "passing completions": 4,
      "passing interceptions": 0,
      "total yards": 414,
      "total plays": 67,
      "fumbles": 0,
      "fumbles lost": 0,
      "penalties": 4,
      "penalty yards": 40,
      "punts": 3,
      "punt yards": 132,
      "punt returns": 0,
      "punt return yards": 0,
      "kickoff returns": 2,
      "kickoff return yards": 62,
      "interception returns": 1,
      "interception return yards": 28,
      "3rd down conversions": 7,
      "3rd down attempts": 14,
      "4th down conversions": 0,
      "4th down attempts": 0
    },
    "UtahState": {
      "points": 13,
      "1st downs": 12,
      "rushing 1st downs": 4,
      "passing 1st downs": 6,
      "penalty 1st downs": 2,
      "rushing yards": 71,
      "rushing attempts": 28,
      "passing yards": 181,
      "passing attempts": 26,
      "passing completions": 11,
      "passing interceptions": 1,
      "total yards": 252,
      "total plays": 54,
      "fumbles": 1,
      "fumbles lost": 1,
      "penalties": 4,
      "penalty yards": 39,
      "punts": 7,
      "punt yards": 310,
      "punt returns": 2,
      "punt return yards": -3,
      "kickoff returns": 6,
      "kickoff return yards": 100,
      "interception returns": 0,
      "interception return yards": 0,
      "3rd down conversions": 6,
      "3rd down attempts": 15,
      "4th down conversions": 1,
      "4th down attempts": 1
    }
  },
  "AirForce vs FresnoState": {
    "stadium": "BulldogStadiumatJimSweeneyField-Fresno-CA",
    "AirForce": {
      "points": 31,
      "1st downs": 23,
      "rushing 1st downs": 19,
      "passing 1st downs": 4,
      "penalty 1st downs": 0,
      "rushing yards": 327,
      "rushing attempts": 73,
      "passing yards": 97,
      "passing attempts": 9,
      "passing completions": 5,
      "passing interceptions": 0,
      "total yards": 424,
      "total plays": 82,
      "fumbles": 2,
      "fumbles lost": 1,
      "penalties": 6,
      "penalty yards": 47,
      "punts": 4,
      "punt yards": 117,
      "punt returns": 1,
      "punt return yards": -1,
      "kickoff returns": 4,
      "kickoff return yards": 69,
      "interception returns": 4,
      "interception return yards": 65,
      "3rd down conversions": 9,
      "3rd down attempts": 17,
      "4th down conversions": 1,
      "4th down attempts": 2
    },
    "FresnoState": {
      "points": 21,
      "1st downs": 18,
      "rushing 1st downs": 4,
      "passing 1st downs": 10,
      "penalty 1st downs": 4,
      "rushing yards": 37,
      "rushing attempts": 30,
      "passing yards": 312,
      "passing attempts": 38,
      "passing completions": 19,
      "passing interceptions": 4,
      "total yards": 349,
      "total plays": 68,
      "fumbles": 1,
      "fumbles lost": 0,
      "penalties": 8,
      "penalty yards": 55,
      "punts": 3,
      "punt yards": 112,
      "punt returns": 2,
      "punt return yards": 1,
      "kickoff returns": 6,
      "kickoff return yards": 113,
      "interception returns": 0,
      "interception return yards": 0,
      "3rd down conversions": 7,
      "3rd down attempts": 14,
      "4th down conversions": 1,
      "4th down attempts": 3
    }
  },
  "Connecticut vs EastCarolina": {
    "stadium": "BagwellFieldatDowdyFicklenStadium-Greenville-NC",
    "Connecticut": {
      "points": 3,
      "1st downs": 15,
      "rushing 1st downs": 4,
      "passing 1st downs": 9,
      "penalty 1st downs": 2,
      "rushing yards": 89,
      "rushing attempts": 31,
      "passing yards": 206,
      "passing attempts": 35,
      "passing completions": 18,
      "passing interceptions": 2,
      "total yards": 295,
      "total plays": 66,
      "fumbles": 1,
      "fumbles lost": 1,
      "penalties": 4,
      "penalty yards": 34,
      "punts": 4,
      "punt yards": 170,
      "punt returns": 0,
      "punt return yards": 0,
      "kickoff returns": 6,
      "kickoff return yards": 147,
      "interception returns": 0,
      "interception return yards": 0,
      "3rd down conversions": 5,
      "3rd down attempts": 15,
      "4th down conversions": 0,
      "4th down attempts": 4
    },
    "EastCarolina": {
      "points": 41,
      "1st downs": 25,
      "rushing 1st downs": 8,
      "passing 1st downs": 16,
      "penalty 1st downs": 1,
      "rushing yards": 136,
      "rushing attempts": 40,
      "passing yards": 294,
      "passing attempts": 47,
      "passing completions": 33,
      "passing interceptions": 0,
      "total yards": 430,
      "total plays": 87,
      "fumbles": 1,
      "fumbles lost": 0,
      "penalties": 5,
      "penalty yards": 35,
      "punts": 5,
      "punt yards": 230,
      "punt returns": 1,
      "punt return yards": -1,
      "kickoff returns": 0,
      "kickoff return yards": 0,
      "interception returns": 2,
      "interception return yards": 32,
      "3rd down conversions": 6,
      "3rd down attempts": 17,
      "4th down conversions": 3,
      "4th down attempts": 4
    }
  },
  "Michigan vs MichiganState": {
    "stadium": "SpartanStadium-EastLansing-MI",
    "Michigan": {
      "points": 32,
      "1st downs": 24,
      "rushing 1st downs": 9,
      "passing 1st downs": 11,
      "penalty 1st downs": 4,
      "rushing yards": 192,
      "rushing attempts": 42,
      "passing yards": 244,
      "passing attempts": 25,
      "passing completions": 16,
      "passing interceptions": 1,
      "total yards": 436,
      "total plays": 67,
      "fumbles": 0,
      "fumbles lost": 0,
      "penalties": 5,
      "penalty yards": 62,
      "punts": 3,
      "punt yards": 122,
      "punt returns": 1,
      "punt return yards": 8,
      "kickoff returns": 2,
      "kickoff return yards": 28,
      "interception returns": 1,
      "interception return yards": 0,
      "3rd down conversions": 5,
      "3rd down attempts": 12,
      "4th down conversions": 1,
      "4th down attempts": 1
    },
    "MichiganState": {
      "points": 23,
      "1st downs": 23,
      "rushing 1st downs": 12,
      "passing 1st downs": 7,
      "penalty 1st downs": 4,
      "rushing yards": 217,
      "rushing attempts": 42,
      "passing yards": 184,
      "passing attempts": 28,
      "passing completions": 13,
      "passing interceptions": 1,
      "total yards": 401,
      "total plays": 70,
      "fumbles": 1,
      "fumbles lost": 0,
      "penalties": 7,
      "penalty yards": 57,
      "punts": 1,
      "punt yards": 49,
      "punt returns": 2,
      "punt return yards": 5,
      "kickoff returns": 3,
      "kickoff return yards": 65,
      "interception returns": 1,
      "interception return yards": 42,
      "3rd down conversions": 4,
      "3rd down attempts": 12,
      "4th down conversions": 1,
      "4th down attempts": 4
    }
  },
  "UCF vs Houston": {
    "stadium": "JohnOQuinnFieldatTDECUStadium-Houston-TX",
    "UCF": {
      "points": 24,
      "1st downs": 15,
      "rushing 1st downs": 6,
      "passing 1st downs": 6,
      "penalty 1st downs": 3,
      "rushing yards": 40,
      "rushing attempts": 33,
      "passing yards": 155,
      "passing attempts": 33,
      "passing completions": 19,
      "passing interceptions": 2,
      "total yards": 195,
      "total plays": 66,
      "fumbles": 3,
      "fumbles lost": 2,
      "penalties": 4,
      "penalty yards": 25,
      "punts": 6,
      "punt yards": 249,
      "punt returns": 1,
      "punt return yards": 3,
      "kickoff returns": 4,
      "kickoff return yards": 86,
      "interception returns": 3,
      "interception return yards": 22,
      "3rd down conversions": 3,
      "3rd down attempts": 15,
      "4th down conversions": 1,
      "4th down attempts": 2
    },
    "Houston": {
      "points": 31,
      "1st downs": 22,
      "rushing 1st downs": 10,
      "passing 1st downs": 12,
      "penalty 1st downs": 0,
      "rushing yards": 158,
      "rushing attempts": 49,
      "passing yards": 240,
      "passing attempts": 37,
      "passing completions": 26,
      "passing interceptions": 3,
      "total yards": 398,
      "total plays": 86,
      "fumbles": 2,
      "fumbles lost": 1,
      "penalties": 6,
      "penalty yards": 71,
      "punts": 4,
      "punt yards": 140,
      "punt returns": 2,
      "punt return yards": 4,
      "kickoff returns": 2,
      "kickoff return yards": 55,
      "interception returns": 2,
      "interception return yards": 26,
      "3rd down conversions": 11,
      "3rd down attempts": 20,
      "4th down conversions": 1,
      "4th down attempts": 2
    }
  },
  "Kentucky vs Missouri": {
    "stadium": "FaurotFieldatMemorialStadium-Columbia-MO",
    "Kentucky": {
      "points": 35,
      "1st downs": 25,
      "rushing 1st downs": 14,
      "passing 1st downs": 9,
      "penalty 1st downs": 2,
      "rushing yards": 377,
      "rushing attempts": 59,
      "passing yards": 205,
      "passing attempts": 24,
      "passing completions": 15,
      "passing interceptions": 1,
      "total yards": 582,
      "total plays": 83,
      "fumbles": 1,
      "fumbles lost": 1,
      "penalties": 3,
      "penalty yards": 25,
      "punts": 5,
      "punt yards": 179,
      "punt returns": 1,
      "punt return yards": 4,
      "kickoff returns": 0,
      "kickoff return yards": 0,
      "interception returns": 0,
      "interception return yards": 0,
      "3rd down conversions": 10,
      "3rd down attempts": 18,
      "4th down conversions": 1,
      "4th down attempts": 2
    },
    "Missouri": {
      "points": 21,
      "1st downs": 18,
      "rushing 1st downs": 8,
      "passing 1st downs": 9,
      "penalty 1st downs": 1,
      "rushing yards": 157,
      "rushing attempts": 37,
      "passing yards": 229,
      "passing attempts": 32,
      "passing completions": 19,
      "passing interceptions": 0,
      "total yards": 386,
      "total plays": 69,
      "fumbles": 1,
      "fumbles lost": 0,
      "penalties": 9,
      "penalty yards": 65,
      "punts": 9,
      "punt yards": 414,
      "punt returns": 3,
      "punt return yards": 53,
      "kickoff returns": 2,
      "kickoff return yards": 30,
      "interception returns": 1,
      "interception return yards": 13,
      "3rd down conversions": 4,
      "3rd down attempts": 16,
      "4th down conversions": 1,
      "4th down attempts": 1
    }
  },
  "PennState vs Purdue": {
    "stadium": "RossAdeStadium-WestLafayette-IN",
    "PennState": {
      "points": 62,
      "1st downs": 24,
      "rushing 1st downs": 11,
      "passing 1st downs": 10,
      "penalty 1st downs": 3,
      "rushing yards": 257,
      "rushing attempts": 38,
      "passing yards": 254,
      "passing attempts": 25,
      "passing completions": 13,
      "passing interceptions": 0,
      "total yards": 511,
      "total plays": 63,
      "fumbles": 0,
      "fumbles lost": 0,
      "penalties": 11,
      "penalty yards": 91,
      "punts": 3,
      "punt yards": 124,
      "punt returns": 0,
      "punt return yards": 0,
      "kickoff returns": 3,
      "kickoff return yards": 27,
      "interception returns": 2,
      "interception return yards": 40,
      "3rd down conversions": 2,
      "3rd down attempts": 9,
      "4th down conversions": 1,
      "4th down attempts": 1
    },
    "Purdue": {
      "points": 24,
      "1st downs": 23,
      "rushing 1st downs": 4,
      "passing 1st downs": 12,
      "penalty 1st downs": 7,
      "rushing yards": 46,
      "rushing attempts": 26,
      "passing yards": 295,
      "passing attempts": 55,
      "passing completions": 36,
      "passing interceptions": 2,
      "total yards": 341,
      "total plays": 81,
      "fumbles": 3,
      "fumbles lost": 2,
      "penalties": 8,
      "penalty yards": 76,
      "punts": 5,
      "punt yards": 234,
      "punt returns": 2,
      "punt return yards": 22,
      "kickoff returns": 5,
      "kickoff return yards": 97,
      "interception returns": 0,
      "interception return yards": 0,
      "3rd down conversions": 9,
      "3rd down attempts": 22,
      "4th down conversions": 1,
      "4th down attempts": 1
    }
  },
  "WestVirginia vs OklahomaState": {
    "stadium": "BoonePickensStadium-Stillwater-OK",
    "WestVirginia": {
      "points": 20,
      "1st downs": 27,
      "rushing 1st downs": 12,
      "passing 1st downs": 14,
      "penalty 1st downs": 1,
      "rushing yards": 209,
      "rushing attempts": 41,
      "passing yards": 212,
      "passing attempts": 39,
      "passing completions": 24,
      "passing interceptions": 2,
      "total yards": 421,
      "total plays": 80,
      "fumbles": 1,
      "fumbles lost": 1,
      "penalties": 6,
      "penalty yards": 46,
      "punts": 3,
      "punt yards": 136,
      "punt returns": 2,
      "punt return yards": 1,
      "kickoff returns": 1,
      "kickoff return yards": 27,
      "interception returns": 0,
      "interception return yards": 0,
      "3rd down conversions": 8,
      "3rd down attempts": 16,
      "4th down conversions": 0,
      "4th down attempts": 0
    },
    "OklahomaState": {
      "points": 37,
      "1st downs": 17,
      "rushing 1st downs": 2,
      "passing 1st downs": 13,
      "penalty 1st downs": 2,
      "rushing yards": 85,
      "rushing attempts": 31,
      "passing yards": 273,
      "passing attempts": 36,
      "passing completions": 26,
      "passing interceptions": 0,
      "total yards": 358,
      "total plays": 67,
      "fumbles": 0,
      "fumbles lost": 0,
      "penalties": 3,
      "penalty yards": 30,
      "punts": 4,
      "punt yards": 179,
      "punt returns": 1,
      "punt return yards": 7,
      "kickoff returns": 2,
      "kickoff return yards": 51,
      "interception returns": 2,
      "interception return yards": 85,
      "3rd down conversions": 8,
      "3rd down attempts": 16,
      "4th down conversions": 0,
      "4th down attempts": 0
    }
  },
  "Minnesota vs Illinois": {
    "stadium": "MemorialStadiumChampaign-IL-Champaign",
    "Minnesota": {
      "points": 40,
      "1st downs": 15,
      "rushing 1st downs": 10,
      "passing 1st downs": 4,
      "penalty 1st downs": 1,
      "rushing yards": 171,
      "rushing attempts": 48,
      "passing yards": 112,
      "passing attempts": 19,
      "passing completions": 10,
      "passing interceptions": 0,
      "total yards": 283,
      "total plays": 67,
      "fumbles": 2,
      "fumbles lost": 0,
      "penalties": 6,
      "penalty yards": 56,
      "punts": 8,
      "punt yards": 260,
      "punt returns": 3,
      "punt return yards": 43,
      "kickoff returns": 3,
      "kickoff return yards": 64,
      "interception returns": 0,
      "interception return yards": 0,
      "3rd down conversions": 7,
      "3rd down attempts": 17,
      "4th down conversions": 0,
      "4th down attempts": 1
    },
    "Illinois": {
      "points": 17,
      "1st downs": 17,
      "rushing 1st downs": 7,
      "passing 1st downs": 7,
      "penalty 1st downs": 3,
      "rushing yards": 89,
      "rushing attempts": 34,
      "passing yards": 156,
      "passing attempts": 34,
      "passing completions": 16,
      "passing interceptions": 0,
      "total yards": 245,
      "total plays": 68,
      "fumbles": 5,
      "fumbles lost": 3,
      "penalties": 3,
      "penalty yards": 33,
      "punts": 6,
      "punt yards": 206,
      "punt returns": 3,
      "punt return yards": -3,
      "kickoff returns": 4,
      "kickoff return yards": 53,
      "interception returns": 0,
      "interception return yards": 0,
      "3rd down conversions": 5,
      "3rd down attempts": 15,
      "4th down conversions": 1,
      "4th down attempts": 3
    }
  },
  "KansasState vs IowaState": {
    "stadium": "JackTriceStadium-Ames-IA",
    "KansasState": {
      "points": 31,
      "1st downs": 27,
      "rushing 1st downs": 14,
      "passing 1st downs": 11,
      "penalty 1st downs": 2,
      "rushing yards": 247,
      "rushing attempts": 43,
      "passing yards": 151,
      "passing attempts": 28,
      "passing completions": 18,
      "passing interceptions": 0,
      "total yards": 398,
      "total plays": 71,
      "fumbles": 1,
      "fumbles lost": 0,
      "penalties": 4,
      "penalty yards": 35,
      "punts": 3,
      "punt yards": 158,
      "punt returns": 1,
      "punt return yards": 0,
      "kickoff returns": 2,
      "kickoff return yards": 29,
      "interception returns": 1,
      "interception return yards": 0,
      "3rd down conversions": 8,
      "3rd down attempts": 13,
      "4th down conversions": 0,
      "4th down attempts": 0
    },
    "IowaState": {
      "points": 26,
      "1st downs": 25,
      "rushing 1st downs": 8,
      "passing 1st downs": 16,
      "penalty 1st downs": 1,
      "rushing yards": 154,
      "rushing attempts": 31,
      "passing yards": 339,
      "passing attempts": 43,
      "passing completions": 24,
      "passing interceptions": 1,
      "total yards": 493,
      "total plays": 74,
      "fumbles": 0,
      "fumbles lost": 0,
      "penalties": 6,
      "penalty yards": 51,
      "punts": 2,
      "punt yards": 68,
      "punt returns": 2,
      "punt return yards": 28,
      "kickoff returns": 5,
      "kickoff return yards": 107,
      "interception returns": 0,
      "interception return yards": 0,
      "3rd down conversions": 7,
      "3rd down attempts": 16,
      "4th down conversions": 2,
      "4th down attempts": 5
    }
  },
  "Duke vs GeorgiaTech": {
    "stadium": "BobbyDoddStadium-Atlanta-GA",
    "Duke": {
      "points": 35,
      "1st downs": 24,
      "rushing 1st downs": 9,
      "passing 1st downs": 14,
      "penalty 1st downs": 1,
      "rushing yards": 254,
      "rushing attempts": 37,
      "passing yards": 305,
      "passing attempts": 36,
      "passing completions": 22,
      "passing interceptions": 1,
      "total yards": 559,
      "total plays": 73,
      "fumbles": 2,
      "fumbles lost": 2,
      "penalties": 4,
      "penalty yards": 20,
      "punts": 2,
      "punt yards": 88,
      "punt returns": 1,
      "punt return yards": 0,
      "kickoff returns": 1,
      "kickoff return yards": 14,
      "interception returns": 0,
      "interception return yards": 0,
      "3rd down conversions": 8,
      "3rd down attempts": 13,
      "4th down conversions": 0,
      "4th down attempts": 2
    },
    "GeorgiaTech": {
      "points": 38,
      "1st downs": 20,
      "rushing 1st downs": 11,
      "passing 1st downs": 9,
      "penalty 1st downs": 0,
      "rushing yards": 341,
      "rushing attempts": 47,
      "passing yards": 264,
      "passing attempts": 14,
      "passing completions": 10,
      "passing interceptions": 0,
      "total yards": 605,
      "total plays": 61,
      "fumbles": 2,
      "fumbles lost": 2,
      "penalties": 8,
      "penalty yards": 46,
      "punts": 3,
      "punt yards": 145,
      "punt returns": 0,
      "punt return yards": 0,
      "kickoff returns": 6,
      "kickoff return yards": 76,
      "interception returns": 1,
      "interception return yards": 0,
      "3rd down conversions": 6,
      "3rd down attempts": 12,
      "4th down conversions": 0,
      "4th down attempts": 1
    }
  },
  "FCS vs Massachusetts": {
    "stadium": "WarrenMcGuirkAlumniStadium-Amherst-MA",
    "FCS": {
      "points": 10,
      "1st downs": 0,
      "rushing 1st downs": 0,
      "passing 1st downs": 0,
      "penalty 1st downs": 0,
      "rushing yards": 67,
      "rushing attempts": 32,
      "passing yards": 295,
      "passing attempts": 35,
      "passing completions": 21,
      "passing interceptions": 1,
      "total yards": 362,
      "total plays": 67,
      "fumbles": 0,
      "fumbles lost": 0,
      "penalties": 7,
      "penalty yards": 89,
      "punts": 5,
      "punt yards": 172,
      "punt returns": 2,
      "punt return yards": -4,
      "kickoff returns": 5,
      "kickoff return yards": 99,
      "interception returns": 1,
      "interception return yards": 0,
      "3rd down conversions": 0,
      "3rd down attempts": 0,
      "4th down conversions": 0,
      "4th down attempts": 0
    },
    "Massachusetts": {
      "points": 34,
      "1st downs": 0,
      "rushing 1st downs": 0,
      "passing 1st downs": 0,
      "penalty 1st downs": 0,
      "rushing yards": 143,
      "rushing attempts": 24,
      "passing yards": 364,
      "passing attempts": 41,
      "passing completions": 26,
      "passing interceptions": 1,
      "total yards": 507,
      "total plays": 65,
      "fumbles": 0,
      "fumbles lost": 0,
      "penalties": 7,
      "penalty yards": 60,
      "punts": 3,
      "punt yards": 147,
      "punt returns": 1,
      "punt return yards": 10,
      "kickoff returns": 2,
      "kickoff return yards": 46,
      "interception returns": 1,
      "interception return yards": 0,
      "3rd down conversions": 0,
      "3rd down attempts": 0,
      "4th down conversions": 0,
      "4th down attempts": 0
    }
  },
  "Louisville vs Virginia": {
    "stadium": "ScottStadium-Charlottesville-VA",
    "Louisville": {
      "points": 32,
      "1st downs": 27,
      "rushing 1st downs": 10,
      "passing 1st downs": 16,
      "penalty 1st downs": 1,
      "rushing yards": 147,
      "rushing attempts": 34,
      "passing yards": 361,
      "passing attempts": 41,
      "passing completions": 24,
      "passing interceptions": 1,
      "total yards": 508,
      "total plays": 75,
      "fumbles": 2,
      "fumbles lost": 1,
      "penalties": 7,
      "penalty yards": 68,
      "punts": 5,
      "punt yards": 189,
      "punt returns": 0,
      "punt return yards": 0,
      "kickoff returns": 2,
      "kickoff return yards": 50,
      "interception returns": 2,
      "interception return yards": 37,
      "3rd down conversions": 3,
      "3rd down attempts": 12,
      "4th down conversions": 2,
      "4th down attempts": 3
    },
    "Virginia": {
      "points": 25,
      "1st downs": 18,
      "rushing 1st downs": 6,
      "passing 1st downs": 10,
      "penalty 1st downs": 2,
      "rushing yards": 84,
      "rushing attempts": 28,
      "passing yards": 238,
      "passing attempts": 40,
      "passing completions": 25,
      "passing interceptions": 2,
      "total yards": 322,
      "total plays": 68,
      "fumbles": 1,
      "fumbles lost": 0,
      "penalties": 5,
      "penalty yards": 48,
      "punts": 5,
      "punt yards": 233,
      "punt returns": 3,
      "punt return yards": 71,
      "kickoff returns": 5,
      "kickoff return yards": 100,
      "interception returns": 1,
      "interception return yards": 30,
      "3rd down conversions": 4,
      "3rd down attempts": 14,
      "4th down conversions": 2,
      "4th down attempts": 3
    }
  },
  "KentState vs CentralMichigan": {
    "stadium": "KellyShortsStadium-MountPleasant-MI",
    "KentState": {
      "points": 27,
      "1st downs": 14,
      "rushing 1st downs": 8,
      "passing 1st downs": 6,
      "penalty 1st downs": 0,
      "rushing yards": 228,
      "rushing attempts": 42,
      "passing yards": 102,
      "passing attempts": 18,
      "passing completions": 10,
      "passing interceptions": 1,
      "total yards": 330,
      "total plays": 60,
      "fumbles": 2,
      "fumbles lost": 1,
      "penalties": 5,
      "penalty yards": 44,
      "punts": 4,
      "punt yards": 149,
      "punt returns": 2,
      "punt return yards": 5,
      "kickoff returns": 3,
      "kickoff return yards": 26,
      "interception returns": 3,
      "interception return yards": 67,
      "3rd down conversions": 4,
      "3rd down attempts": 12,
      "4th down conversions": 0,
      "4th down attempts": 0
    },
    "CentralMichigan": {
      "points": 24,
      "1st downs": 20,
      "rushing 1st downs": 9,
      "passing 1st downs": 10,
      "penalty 1st downs": 1,
      "rushing yards": 105,
      "rushing attempts": 30,
      "passing yards": 244,
      "passing attempts": 43,
      "passing completions": 20,
      "passing interceptions": 3,
      "total yards": 349,
      "total plays": 73,
      "fumbles": 2,
      "fumbles lost": 1,
      "penalties": 4,
      "penalty yards": 45,
      "punts": 4,
      "punt yards": 187,
      "punt returns": 1,
      "punt return yards": 8,
      "kickoff returns": 5,
      "kickoff return yards": 84,
      "interception returns": 1,
      "interception return yards": 28,
      "3rd down conversions": 6,
      "3rd down attempts": 16,
      "4th down conversions": 1,
      "4th down attempts": 1
    }
  },
  "BostonCollege vs NorthCarolinaState": {
    "stadium": "WayneDayFamilyFieldatCarterFinleyStadium-Raleigh-NC",
    "BostonCollege": {
      "points": 21,
      "1st downs": 21,
      "rushing 1st downs": 7,
      "passing 1st downs": 11,
      "penalty 1st downs": 3,
      "rushing yards": 168,
      "rushing attempts": 44,
      "passing yards": 218,
      "passing attempts": 34,
      "passing completions": 19,
      "passing interceptions": 1,
      "total yards": 386,
      "total plays": 78,
      "fumbles": 2,
      "fumbles lost": 1,
      "penalties": 6,
      "penalty yards": 44,
      "punts": 5,
      "punt yards": 164,
      "punt returns": 1,
      "punt return yards": 15,
      "kickoff returns": 1,
      "kickoff return yards": 20,
      "interception returns": 2,
      "interception return yards": 0,
      "3rd down conversions": 6,
      "3rd down attempts": 17,
      "4th down conversions": 1,
      "4th down attempts": 2
    },
    "NorthCarolinaState": {
      "points": 14,
      "1st downs": 14,
      "rushing 1st downs": 2,
      "passing 1st downs": 10,
      "penalty 1st downs": 2,
      "rushing yards": 31,
      "rushing attempts": 23,
      "passing yards": 307,
      "passing attempts": 41,
      "passing completions": 23,
      "passing interceptions": 2,
      "total yards": 338,
      "total plays": 64,
      "fumbles": 1,
      "fumbles lost": 1,
      "penalties": 8,
      "penalty yards": 94,
      "punts": 6,
      "punt yards": 226,
      "punt returns": 2,
      "punt return yards": 0,
      "kickoff returns": 1,
      "kickoff return yards": 56,
      "interception returns": 1,
      "interception return yards": 0,
      "3rd down conversions": 5,
      "3rd down attempts": 16,
      "4th down conversions": 0,
      "4th down attempts": 3
    }
  },
  "TexasTech vs TCU": {
    "stadium": "AmonGCarterStadium-FortWorth-TX",
    "TexasTech": {
      "points": 27,
      "1st downs": 23,
      "rushing 1st downs": 15,
      "passing 1st downs": 8,
      "penalty 1st downs": 0,
      "rushing yards": 139,
      "rushing attempts": 49,
      "passing yards": 206,
      "passing attempts": 40,
      "passing completions": 24,
      "passing interceptions": 1,
      "total yards": 345,
      "total plays": 89,
      "fumbles": 3,
      "fumbles lost": 1,
      "penalties": 1,
      "penalty yards": 5,
      "punts": 4,
      "punt yards": 172,
      "punt returns": 1,
      "punt return yards": 15,
      "kickoff returns": 0,
      "kickoff return yards": 0,
      "interception returns": 1,
      "interception return yards": 0,
      "3rd down conversions": 10,
      "3rd down attempts": 20,
      "4th down conversions": 1,
      "4th down attempts": 2
    },
    "TCU": {
      "points": 24,
      "1st downs": 25,
      "rushing 1st downs": 11,
      "passing 1st downs": 14,
      "penalty 1st downs": 0,
      "rushing yards": 172,
      "rushing attempts": 39,
      "passing yards": 246,
      "passing attempts": 47,
      "passing completions": 22,
      "passing interceptions": 1,
      "total yards": 418,
      "total plays": 86,
      "fumbles": 0,
      "fumbles lost": 0,
      "penalties": 4,
      "penalty yards": 25,
      "punts": 4,
      "punt yards": 146,
      "punt returns": 2,
      "punt return yards": 6,
      "kickoff returns": 1,
      "kickoff return yards": 28,
      "interception returns": 1,
      "interception return yards": 0,
      "3rd down conversions": 5,
      "3rd down attempts": 15,
      "4th down conversions": 1,
      "4th down attempts": 1
    }
  },
  "Northwestern vs OhioState": {
    "stadium": "OhioStadium-Columbus-OH",
    "Northwestern": {
      "points": 20,
      "1st downs": 21,
      "rushing 1st downs": 6,
      "passing 1st downs": 15,
      "penalty 1st downs": 0,
      "rushing yards": 148,
      "rushing attempts": 29,
      "passing yards": 258,
      "passing attempts": 44,
      "passing completions": 23,
      "passing interceptions": 1,
      "total yards": 406,
      "total plays": 73,
      "fumbles": 0,
      "fumbles lost": 0,
      "penalties": 2,
      "penalty yards": 20,
      "punts": 4,
      "punt yards": 157,
      "punt returns": 0,
      "punt return yards": 0,
      "kickoff returns": 1,
      "kickoff return yards": 12,
      "interception returns": 0,
      "interception return yards": 0,
      "3rd down conversions": 8,
      "3rd down attempts": 16,
      "4th down conversions": 2,
      "4th down attempts": 2
    },
    "OhioState": {
      "points": 24,
      "1st downs": 23,
      "rushing 1st downs": 13,
      "passing 1st downs": 10,
      "penalty 1st downs": 0,
      "rushing yards": 208,
      "rushing attempts": 41,
      "passing yards": 223,
      "passing attempts": 32,
      "passing completions": 21,
      "passing interceptions": 0,
      "total yards": 431,
      "total plays": 73,
      "fumbles": 0,
      "fumbles lost": 0,
      "penalties": 2,
      "penalty yards": 10,
      "punts": 5,
      "punt yards": 183,
      "punt returns": 1,
      "punt return yards": 7,
      "kickoff returns": 1,
      "kickoff return yards": 20,
      "interception returns": 1,
      "interception return yards": 0,
      "3rd down conversions": 10,
      "3rd down attempts": 17,
      "4th down conversions": 0,
      "4th down attempts": 0
    }
  },
  "Army vs WakeForest": {
    "stadium": "BBTField-WinstonSalem-NC",
    "Army": {
      "points": 21,
      "1st downs": 21,
      "rushing 1st downs": 17,
      "passing 1st downs": 4,
      "penalty 1st downs": 0,
      "rushing yards": 238,
      "rushing attempts": 64,
      "passing yards": 145,
      "passing attempts": 9,
      "passing completions": 6,
      "passing interceptions": 1,
      "total yards": 383,
      "total plays": 73,
      "fumbles": 3,
      "fumbles lost": 1,
      "penalties": 2,
      "penalty yards": 20,
      "punts": 3,
      "punt yards": 119,
      "punt returns": 3,
      "punt return yards": 64,
      "kickoff returns": 0,
      "kickoff return yards": 0,
      "interception returns": 3,
      "interception return yards": 31,
      "3rd down conversions": 7,
      "3rd down attempts": 14,
      "4th down conversions": 0,
      "4th down attempts": 2
    },
    "WakeForest": {
      "points": 13,
      "1st downs": 17,
      "rushing 1st downs": 10,
      "passing 1st downs": 7,
      "penalty 1st downs": 0,
      "rushing yards": 123,
      "rushing attempts": 23,
      "passing yards": 220,
      "passing attempts": 43,
      "passing completions": 23,
      "passing interceptions": 3,
      "total yards": 343,
      "total plays": 66,
      "fumbles": 0,
      "fumbles lost": 0,
      "penalties": 7,
      "penalty yards": 45,
      "punts": 5,
      "punt yards": 228,
      "punt returns": 0,
      "punt return yards": 0,
      "kickoff returns": 4,
      "kickoff return yards": 61,
      "interception returns": 1,
      "interception return yards": 25,
      "3rd down conversions": 3,
      "3rd down attempts": 13,
      "4th down conversions": 1,
      "4th down attempts": 1
    }
  },
  "WesternKentucky vs FloridaAtlantic": {
    "stadium": "FAUStadium-BocaRaton-FL",
    "WesternKentucky": {
      "points": 52,
      "1st downs": 22,
      "rushing 1st downs": 11,
      "passing 1st downs": 11,
      "penalty 1st downs": 0,
      "rushing yards": 268,
      "rushing attempts": 45,
      "passing yards": 393,
      "passing attempts": 25,
      "passing completions": 16,
      "passing interceptions": 0,
      "total yards": 661,
      "total plays": 70,
      "fumbles": 2,
      "fumbles lost": 1,
      "penalties": 8,
      "penalty yards": 80,
      "punts": 4,
      "punt yards": 189,
      "punt returns": 1,
      "punt return yards": 2,
      "kickoff returns": 1,
      "kickoff return yards": 19,
      "interception returns": 1,
      "interception return yards": 0,
      "3rd down conversions": 10,
      "3rd down attempts": 16,
      "4th down conversions": 0,
      "4th down attempts": 0
    },
    "FloridaAtlantic": {
      "points": 3,
      "1st downs": 12,
      "rushing 1st downs": 6,
      "passing 1st downs": 4,
      "penalty 1st downs": 2,
      "rushing yards": 125,
      "rushing attempts": 33,
      "passing yards": 77,
      "passing attempts": 34,
      "passing completions": 15,
      "passing interceptions": 1,
      "total yards": 202,
      "total plays": 67,
      "fumbles": 1,
      "fumbles lost": 1,
      "penalties": 1,
      "penalty yards": 10,
      "punts": 10,
      "punt yards": 466,
      "punt returns": 0,
      "punt return yards": 0,
      "kickoff returns": 6,
      "kickoff return yards": 121,
      "interception returns": 0,
      "interception return yards": 0,
      "3rd down conversions": 1,
      "3rd down attempts": 14,
      "4th down conversions": 0,
      "4th down attempts": 1
    }
  },
  "MiamiFL vs NotreDame": {
    "stadium": "NotreDameStadium-SouthBend-IN",
    "MiamiFL": {
      "points": 27,
      "1st downs": 20,
      "rushing 1st downs": 3,
      "passing 1st downs": 15,
      "penalty 1st downs": 2,
      "rushing yards": 18,
      "rushing attempts": 35,
      "passing yards": 288,
      "passing attempts": 42,
      "passing completions": 26,
      "passing interceptions": 1,
      "total yards": 306,
      "total plays": 77,
      "fumbles": 0,
      "fumbles lost": 0,
      "penalties": 10,
      "penalty yards": 86,
      "punts": 7,
      "punt yards": 314,
      "punt returns": 1,
      "punt return yards": 30,
      "kickoff returns": 3,
      "kickoff return yards": 56,
      "interception returns": 0,
      "interception return yards": 0,
      "3rd down conversions": 7,
      "3rd down attempts": 19,
      "4th down conversions": 0,
      "4th down attempts": 1
    },
    "NotreDame": {
      "points": 30,
      "1st downs": 21,
      "rushing 1st downs": 7,
      "passing 1st downs": 12,
      "penalty 1st downs": 2,
      "rushing yards": 148,
      "rushing attempts": 29,
      "passing yards": 263,
      "passing attempts": 38,
      "passing completions": 25,
      "passing interceptions": 0,
      "total yards": 411,
      "total plays": 67,
      "fumbles": 3,
      "fumbles lost": 2,
      "penalties": 7,
      "penalty yards": 53,
      "punts": 3,
      "punt yards": 130,
      "punt returns": 5,
      "punt return yards": 45,
      "kickoff returns": 2,
      "kickoff return yards": 55,
      "interception returns": 1,
      "interception return yards": 14,
      "3rd down conversions": 8,
      "3rd down attempts": 16,
      "4th down conversions": 0,
      "4th down attempts": 1
    }
  },
  "Washington vs Utah": {
    "stadium": "RiceEcclesStadium-SaltLakeCity-UT",
    "Washington": {
      "points": 31,
      "1st downs": 22,
      "rushing 1st downs": 9,
      "passing 1st downs": 12,
      "penalty 1st downs": 1,
      "rushing yards": 199,
      "rushing attempts": 36,
      "passing yards": 186,
      "passing attempts": 20,
      "passing completions": 12,
      "passing interceptions": 1,
      "total yards": 385,
      "total plays": 56,
      "fumbles": 1,
      "fumbles lost": 0,
      "penalties": 4,
      "penalty yards": 21,
      "punts": 4,
      "punt yards": 171,
      "punt returns": 4,
      "punt return yards": 60,
      "kickoff returns": 1,
      "kickoff return yards": 5,
      "interception returns": 0,
      "interception return yards": 0,
      "3rd down conversions": 4,
      "3rd down attempts": 11,
      "4th down conversions": 0,
      "4th down attempts": 0
    },
    "Utah": {
      "points": 24,
      "1st downs": 25,
      "rushing 1st downs": 13,
      "passing 1st downs": 8,
      "penalty 1st downs": 4,
      "rushing yards": 213,
      "rushing attempts": 47,
      "passing yards": 163,
      "passing attempts": 33,
      "passing completions": 14,
      "passing interceptions": 0,
      "total yards": 376,
      "total plays": 80,
      "fumbles": 1,
      "fumbles lost": 0,
      "penalties": 10,
      "penalty yards": 65,
      "punts": 6,
      "punt yards": 322,
      "punt returns": 1,
      "punt return yards": 0,
      "kickoff returns": 2,
      "kickoff return yards": 42,
      "interception returns": 1,
      "interception return yards": 30,
      "3rd down conversions": 6,
      "3rd down attempts": 16,
      "4th down conversions": 0,
      "4th down attempts": 1
    }
  },
  "Florida vs Georgia": {
    "stadium": "EverBankField-Jacksonville-FL",
    "Florida": {
      "points": 24,
      "1st downs": 20,
      "rushing 1st downs": 9,
      "passing 1st downs": 8,
      "penalty 1st downs": 3,
      "rushing yards": 100,
      "rushing attempts": 48,
      "passing yards": 131,
      "passing attempts": 25,
      "passing completions": 15,
      "passing interceptions": 1,
      "total yards": 231,
      "total plays": 73,
      "fumbles": 1,
      "fumbles lost": 0,
      "penalties": 6,
      "penalty yards": 45,
      "punts": 6,
      "punt yards": 287,
      "punt returns": 3,
      "punt return yards": 10,
      "kickoff returns": 2,
      "kickoff return yards": 55,
      "interception returns": 0,
      "interception return yards": 0,
      "3rd down conversions": 9,
      "3rd down attempts": 18,
      "4th down conversions": 1,
      "4th down attempts": 1
    },
    "Georgia": {
      "points": 10,
      "1st downs": 8,
      "rushing 1st downs": 0,
      "passing 1st downs": 7,
      "penalty 1st downs": 1,
      "rushing yards": 21,
      "rushing attempts": 19,
      "passing yards": 143,
      "passing attempts": 33,
      "passing completions": 15,
      "passing interceptions": 0,
      "total yards": 164,
      "total plays": 52,
      "fumbles": 0,
      "fumbles lost": 0,
      "penalties": 5,
      "penalty yards": 49,
      "punts": 8,
      "punt yards": 256,
      "punt returns": 2,
      "punt return yards": 29,
      "kickoff returns": 1,
      "kickoff return yards": 26,
      "interception returns": 1,
      "interception return yards": 31,
      "3rd down conversions": 4,
      "3rd down attempts": 14,
      "4th down conversions": 0,
      "4th down attempts": 2
    }
  },
  "FCS vs MississippiState": {
    "stadium": "DavisWadeStadiumatScottField-Starkville-MS",
    "FCS": {
      "points": 41,
      "1st downs": 28,
      "rushing 1st downs": 7,
      "passing 1st downs": 20,
      "penalty 1st downs": 1,
      "rushing yards": 159,
      "rushing attempts": 34,
      "passing yards": 468,
      "passing attempts": 70,
      "passing completions": 42,
      "passing interceptions": 3,
      "total yards": 627,
      "total plays": 104,
      "fumbles": 1,
      "fumbles lost": 0,
      "penalties": 9,
      "penalty yards": 77,
      "punts": 6,
      "punt yards": 227,
      "punt returns": 0,
      "punt return yards": 0,
      "kickoff returns": 5,
      "kickoff return yards": 96,
      "interception returns": 2,
      "interception return yards": 1,
      "3rd down conversions": 9,
      "3rd down attempts": 23,
      "4th down conversions": 4,
      "4th down attempts": 5
    },
    "MississippiState": {
      "points": 56,
      "1st downs": 29,
      "rushing 1st downs": 13,
      "passing 1st downs": 14,
      "penalty 1st downs": 2,
      "rushing yards": 252,
      "rushing attempts": 46,
      "passing yards": 417,
      "passing attempts": 35,
      "passing completions": 20,
      "passing interceptions": 2,
      "total yards": 669,
      "total plays": 81,
      "fumbles": 1,
      "fumbles lost": 1,
      "penalties": 4,
      "penalty yards": 35,
      "punts": 3,
      "punt yards": 116,
      "punt returns": 1,
      "punt return yards": 5,
      "kickoff returns": 2,
      "kickoff return yards": 39,
      "interception returns": 3,
      "interception return yards": 83,
      "3rd down conversions": 7,
      "3rd down attempts": 15,
      "4th down conversions": 1,
      "4th down attempts": 3
    }
  },
  "Maryland vs Indiana": {
    "stadium": "MemorialStadiumBloomington-IN-Bloomington",
    "Maryland": {
      "points": 36,
      "1st downs": 29,
      "rushing 1st downs": 13,
      "passing 1st downs": 14,
      "penalty 1st downs": 2,
      "rushing yards": 269,
      "rushing attempts": 50,
      "passing yards": 248,
      "passing attempts": 34,
      "passing completions": 22,
      "passing interceptions": 1,
      "total yards": 517,
      "total plays": 84,
      "fumbles": 2,
      "fumbles lost": 1,
      "penalties": 6,
      "penalty yards": 60,
      "punts": 4,
      "punt yards": 155,
      "punt returns": 1,
      "punt return yards": 7,
      "kickoff returns": 2,
      "kickoff return yards": 19,
      "interception returns": 0,
      "interception return yards": 0,
      "3rd down conversions": 7,
      "3rd down attempts": 16,
      "4th down conversions": 3,
      "4th down attempts": 3
    },
    "Indiana": {
      "points": 42,
      "1st downs": 34,
      "rushing 1st downs": 18,
      "passing 1st downs": 14,
      "penalty 1st downs": 2,
      "rushing yards": 414,
      "rushing attempts": 57,
      "passing yards": 236,
      "passing attempts": 26,
      "passing completions": 17,
      "passing interceptions": 0,
      "total yards": 650,
      "total plays": 83,
      "fumbles": 0,
      "fumbles lost": 0,
      "penalties": 6,
      "penalty yards": 65,
      "punts": 2,
      "punt yards": 85,
      "punt returns": 3,
      "punt return yards": 8,
      "kickoff returns": 5,
      "kickoff return yards": 86,
      "interception returns": 1,
      "interception return yards": -5,
      "3rd down conversions": 9,
      "3rd down attempts": 14,
      "4th down conversions": 0,
      "4th down attempts": 1
    }
  },
  "Baylor vs Texas": {
    "stadium": "DarrellKRoyalTexasMemorialStadium-Austin-TX",
    "Baylor": {
      "points": 34,
      "1st downs": 31,
      "rushing 1st downs": 22,
      "passing 1st downs": 9,
      "penalty 1st downs": 0,
      "rushing yards": 398,
      "rushing attempts": 68,
      "passing yards": 226,
      "passing attempts": 28,
      "passing completions": 14,
      "passing interceptions": 1,
      "total yards": 624,
      "total plays": 96,
      "fumbles": 3,
      "fumbles lost": 1,
      "penalties": 10,
      "penalty yards": 39,
      "punts": 5,
      "punt yards": 196,
      "punt returns": 1,
      "punt return yards": 12,
      "kickoff returns": 2,
      "kickoff return yards": 40,
      "interception returns": 1,
      "interception return yards": 0,
      "3rd down conversions": 10,
      "3rd down attempts": 20,
      "4th down conversions": 1,
      "4th down attempts": 3
    },
    "Texas": {
      "points": 35,
      "1st downs": 19,
      "rushing 1st downs": 11,
      "passing 1st downs": 8,
      "penalty 1st downs": 0,
      "rushing yards": 257,
      "rushing attempts": 51,
      "passing yards": 291,
      "passing attempts": 21,
      "passing completions": 12,
      "passing interceptions": 1,
      "total yards": 548,
      "total plays": 72,
      "fumbles": 3,
      "fumbles lost": 1,
      "penalties": 4,
      "penalty yards": 23,
      "punts": 7,
      "punt yards": 352,
      "punt returns": 1,
      "punt return yards": 1,
      "kickoff returns": 6,
      "kickoff return yards": 109,
      "interception returns": 1,
      "interception return yards": 0,
      "3rd down conversions": 7,
      "3rd down attempts": 17,
      "4th down conversions": 0,
      "4th down attempts": 1
    }
  },
  "Cincinnati vs Temple": {
    "stadium": "LincolnFinancialField-Philadelphia-PA",
    "Cincinnati": {
      "points": 13,
      "1st downs": 10,
      "rushing 1st downs": 2,
      "passing 1st downs": 8,
      "penalty 1st downs": 0,
      "rushing yards": 67,
      "rushing attempts": 22,
      "passing yards": 119,
      "passing attempts": 27,
      "passing completions": 15,
      "passing interceptions": 0,
      "total yards": 186,
      "total plays": 49,
      "fumbles": 2,
      "fumbles lost": 2,
      "penalties": 4,
      "penalty yards": 35,
      "punts": 6,
      "punt yards": 223,
      "punt returns": 2,
      "punt return yards": 24,
      "kickoff returns": 6,
      "kickoff return yards": 152,
      "interception returns": 0,
      "interception return yards": 0,
      "3rd down conversions": 5,
      "3rd down attempts": 12,
      "4th down conversions": 0,
      "4th down attempts": 0
    },
    "Temple": {
      "points": 34,
      "1st downs": 25,
      "rushing 1st downs": 16,
      "passing 1st downs": 7,
      "penalty 1st downs": 2,
      "rushing yards": 275,
      "rushing attempts": 60,
      "passing yards": 199,
      "passing attempts": 19,
      "passing completions": 12,
      "passing interceptions": 0,
      "total yards": 474,
      "total plays": 79,
      "fumbles": 1,
      "fumbles lost": 1,
      "penalties": 3,
      "penalty yards": 25,
      "punts": 3,
      "punt yards": 139,
      "punt returns": 0,
      "punt return yards": 0,
      "kickoff returns": 1,
      "kickoff return yards": 14,
      "interception returns": 0,
      "interception return yards": 0,
      "3rd down conversions": 7,
      "3rd down attempts": 14,
      "4th down conversions": 1,
      "4th down attempts": 2
    }
  },
  "MiamiOH vs EasternMichigan": {
    "stadium": "RynearsonStadium-Ypsilanti-MI",
    "MiamiOH": {
      "points": 28,
      "1st downs": 23,
      "rushing 1st downs": 12,
      "passing 1st downs": 9,
      "penalty 1st downs": 2,
      "rushing yards": 230,
      "rushing attempts": 43,
      "passing yards": 175,
      "passing attempts": 23,
      "passing completions": 15,
      "passing interceptions": 0,
      "total yards": 405,
      "total plays": 66,
      "fumbles": 1,
      "fumbles lost": 1,
      "penalties": 2,
      "penalty yards": 15,
      "punts": 5,
      "punt yards": 212,
      "punt returns": 1,
      "punt return yards": 8,
      "kickoff returns": 3,
      "kickoff return yards": 75,
      "interception returns": 1,
      "interception return yards": 0,
      "3rd down conversions": 4,
      "3rd down attempts": 9,
      "4th down conversions": 0,
      "4th down attempts": 0
    },
    "EasternMichigan": {
      "points": 15,
      "1st downs": 16,
      "rushing 1st downs": 3,
      "passing 1st downs": 13,
      "penalty 1st downs": 0,
      "rushing yards": 33,
      "rushing attempts": 23,
      "passing yards": 328,
      "passing attempts": 39,
      "passing completions": 23,
      "passing interceptions": 1,
      "total yards": 361,
      "total plays": 62,
      "fumbles": 2,
      "fumbles lost": 0,
      "penalties": 7,
      "penalty yards": 67,
      "punts": 6,
      "punt yards": 288,
      "punt returns": 2,
      "punt return yards": 14,
      "kickoff returns": 3,
      "kickoff return yards": 56,
      "interception returns": 0,
      "interception return yards": 0,
      "3rd down conversions": 4,
      "3rd down attempts": 14,
      "4th down conversions": 2,
      "4th down attempts": 3
    }
  },
  "SouthernMethodist vs Tulane": {
    "stadium": "YulmanStadium-NewOrleans-LA",
    "SouthernMethodist": {
      "points": 35,
      "1st downs": 22,
      "rushing 1st downs": 7,
      "passing 1st downs": 12,
      "penalty 1st downs": 3,
      "rushing yards": 137,
      "rushing attempts": 43,
      "passing yards": 302,
      "passing attempts": 31,
      "passing completions": 16,
      "passing interceptions": 2,
      "total yards": 439,
      "total plays": 74,
      "fumbles": 1,
      "fumbles lost": 0,
      "penalties": 6,
      "penalty yards": 57,
      "punts": 6,
      "punt yards": 223,
      "punt returns": 0,
      "punt return yards": 0,
      "kickoff returns": 3,
      "kickoff return yards": 65,
      "interception returns": 1,
      "interception return yards": 0,
      "3rd down conversions": 10,
      "3rd down attempts": 17,
      "4th down conversions": 0,
      "4th down attempts": 0
    },
    "Tulane": {
      "points": 31,
      "1st downs": 18,
      "rushing 1st downs": 9,
      "passing 1st downs": 7,
      "penalty 1st downs": 2,
      "rushing yards": 227,
      "rushing attempts": 46,
      "passing yards": 164,
      "passing attempts": 26,
      "passing completions": 13,
      "passing interceptions": 1,
      "total yards": 391,
      "total plays": 72,
      "fumbles": 0,
      "fumbles lost": 0,
      "penalties": 10,
      "penalty yards": 100,
      "punts": 7,
      "punt yards": 288,
      "punt returns": 1,
      "punt return yards": 0,
      "kickoff returns": 5,
      "kickoff return yards": 126,
      "interception returns": 2,
      "interception return yards": 26,
      "3rd down conversions": 4,
      "3rd down attempts": 16,
      "4th down conversions": 3,
      "4th down attempts": 4
    }
  },
  "ArizonaState vs Oregon": {
    "stadium": "AutzenStadium-Eugene-OR",
    "ArizonaState": {
      "points": 35,
      "1st downs": 23,
      "rushing 1st downs": 8,
      "passing 1st downs": 14,
      "penalty 1st downs": 1,
      "rushing yards": 139,
      "rushing attempts": 36,
      "passing yards": 329,
      "passing attempts": 40,
      "passing completions": 23,
      "passing interceptions": 3,
      "total yards": 468,
      "total plays": 76,
      "fumbles": 0,
      "fumbles lost": 0,
      "penalties": 6,
      "penalty yards": 49,
      "punts": 6,
      "punt yards": 246,
      "punt returns": 1,
      "punt return yards": 2,
      "kickoff returns": 7,
      "kickoff return yards": 162,
      "interception returns": 0,
      "interception return yards": 0,
      "3rd down conversions": 4,
      "3rd down attempts": 13,
      "4th down conversions": 0,
      "4th down attempts": 1
    },
    "Oregon": {
      "points": 54,
      "1st downs": 30,
      "rushing 1st downs": 14,
      "passing 1st downs": 16,
      "penalty 1st downs": 0,
      "rushing yards": 245,
      "rushing attempts": 46,
      "passing yards": 489,
      "passing attempts": 42,
      "passing completions": 31,
      "passing interceptions": 0,
      "total yards": 734,
      "total plays": 88,
      "fumbles": 1,
      "fumbles lost": 1,
      "penalties": 9,
      "penalty yards": 73,
      "punts": 3,
      "punt yards": 110,
      "punt returns": 2,
      "punt return yards": 6,
      "kickoff returns": 3,
      "kickoff return yards": 75,
      "interception returns": 3,
      "interception return yards": 84,
      "3rd down conversions": 4,
      "3rd down attempts": 15,
      "4th down conversions": 3,
      "4th down attempts": 3
    }
  },
  "GeorgiaState vs SouthAlabama": {
    "stadium": "LaddPeeblesStadium-Mobile-AL",
    "GeorgiaState": {
      "points": 10,
      "1st downs": 14,
      "rushing 1st downs": 8,
      "passing 1st downs": 5,
      "penalty 1st downs": 1,
      "rushing yards": 127,
      "rushing attempts": 40,
      "passing yards": 113,
      "passing attempts": 18,
      "passing completions": 11,
      "passing interceptions": 0,
      "total yards": 240,
      "total plays": 58,
      "fumbles": 1,
      "fumbles lost": 1,
      "penalties": 5,
      "penalty yards": 37,
      "punts": 7,
      "punt yards": 236,
      "punt returns": 1,
      "punt return yards": 0,
      "kickoff returns": 3,
      "kickoff return yards": 57,
      "interception returns": 1,
      "interception return yards": 0,
      "3rd down conversions": 5,
      "3rd down attempts": 14,
      "4th down conversions": 0,
      "4th down attempts": 0
    },
    "SouthAlabama": {
      "points": 13,
      "1st downs": 19,
      "rushing 1st downs": 11,
      "passing 1st downs": 7,
      "penalty 1st downs": 1,
      "rushing yards": 182,
      "rushing attempts": 43,
      "passing yards": 124,
      "passing attempts": 27,
      "passing completions": 15,
      "passing interceptions": 1,
      "total yards": 306,
      "total plays": 70,
      "fumbles": 1,
      "fumbles lost": 1,
      "penalties": 5,
      "penalty yards": 44,
      "punts": 5,
      "punt yards": 203,
      "punt returns": 2,
      "punt return yards": 14,
      "kickoff returns": 3,
      "kickoff return yards": 48,
      "interception returns": 0,
      "interception return yards": 0,
      "3rd down conversions": 3,
      "3rd down attempts": 13,
      "4th down conversions": 1,
      "4th down attempts": 3
    }
  },
  "LouisianaMonroe vs ArkansasState": {
    "stadium": "CentennialBankStadium-Jonesboro-AR",
    "LouisianaMonroe": {
      "points": 10,
      "1st downs": 0,
      "rushing 1st downs": 0,
      "passing 1st downs": 0,
      "penalty 1st downs": 0,
      "rushing yards": 174,
      "rushing attempts": 42,
      "passing yards": 162,
      "passing attempts": 29,
      "passing completions": 14,
      "passing interceptions": 2,
      "total yards": 336,
      "total plays": 71,
      "fumbles": 0,
      "fumbles lost": 0,
      "penalties": 7,
      "penalty yards": 51,
      "punts": 5,
      "punt yards": 201,
      "punt returns": 2,
      "punt return yards": 4,
      "kickoff returns": 5,
      "kickoff return yards": 76,
      "interception returns": 0,
      "interception return yards": 0,
      "3rd down conversions": 0,
      "3rd down attempts": 0,
      "4th down conversions": 0,
      "4th down attempts": 0
    },
    "ArkansasState": {
      "points": 51,
      "1st downs": 0,
      "rushing 1st downs": 0,
      "passing 1st downs": 0,
      "penalty 1st downs": 0,
      "rushing yards": 118,
      "rushing attempts": 31,
      "passing yards": 316,
      "passing attempts": 41,
      "passing completions": 24,
      "passing interceptions": 0,
      "total yards": 434,
      "total plays": 72,
      "fumbles": 0,
      "fumbles lost": 0,
      "penalties": 7,
      "penalty yards": 58,
      "punts": 4,
      "punt yards": 164,
      "punt returns": 2,
      "punt return yards": 1,
      "kickoff returns": 2,
      "kickoff return yards": 109,
      "interception returns": 2,
      "interception return yards": 0,
      "3rd down conversions": 0,
      "3rd down attempts": 0,
      "4th down conversions": 0,
      "4th down attempts": 0
    }
  },
  "NorthTexas vs UTSA": {
    "stadium": "Alamodome-SanAntonio-TX",
    "NorthTexas": {
      "points": 17,
      "1st downs": 0,
      "rushing 1st downs": 0,
      "passing 1st downs": 0,
      "penalty 1st downs": 0,
      "rushing yards": 152,
      "rushing attempts": 34,
      "passing yards": 257,
      "passing attempts": 38,
      "passing completions": 27,
      "passing interceptions": 2,
      "total yards": 409,
      "total plays": 72,
      "fumbles": 0,
      "fumbles lost": 0,
      "penalties": 2,
      "penalty yards": 25,
      "punts": 4,
      "punt yards": 177,
      "punt returns": 3,
      "punt return yards": 48,
      "kickoff returns": 4,
      "kickoff return yards": 72,
      "interception returns": 0,
      "interception return yards": 0,
      "3rd down conversions": 0,
      "3rd down attempts": 0,
      "4th down conversions": 0,
      "4th down attempts": 0
    },
    "UTSA": {
      "points": 31,
      "1st downs": 0,
      "rushing 1st downs": 0,
      "passing 1st downs": 0,
      "penalty 1st downs": 0,
      "rushing yards": 176,
      "rushing attempts": 41,
      "passing yards": 142,
      "passing attempts": 19,
      "passing completions": 10,
      "passing interceptions": 0,
      "total yards": 318,
      "total plays": 60,
      "fumbles": 0,
      "fumbles lost": 0,
      "penalties": 4,
      "penalty yards": 39,
      "punts": 6,
      "punt yards": 238,
      "punt returns": 2,
      "punt return yards": 17,
      "kickoff returns": 2,
      "kickoff return yards": 34,
      "interception returns": 2,
      "interception return yards": 0,
      "3rd down conversions": 0,
      "3rd down attempts": 0,
      "4th down conversions": 0,
      "4th down attempts": 0
    }
  },
  "Nebraska vs Wisconsin": {
    "stadium": "CampRandallStadium-Madison-WI",
    "Nebraska": {
      "points": 17,
      "1st downs": 16,
      "rushing 1st downs": 7,
      "passing 1st downs": 9,
      "penalty 1st downs": 0,
      "rushing yards": 152,
      "rushing attempts": 44,
      "passing yards": 153,
      "passing attempts": 31,
      "passing completions": 12,
      "passing interceptions": 2,
      "total yards": 305,
      "total plays": 75,
      "fumbles": 0,
      "fumbles lost": 0,
      "penalties": 2,
      "penalty yards": 10,
      "punts": 7,
      "punt yards": 291,
      "punt returns": 4,
      "punt return yards": 36,
      "kickoff returns": 2,
      "kickoff return yards": 34,
      "interception returns": 2,
      "interception return yards": 10,
      "3rd down conversions": 9,
      "3rd down attempts": 18,
      "4th down conversions": 0,
      "4th down attempts": 1
    },
    "Wisconsin": {
      "points": 23,
      "1st downs": 16,
      "rushing 1st downs": 9,
      "passing 1st downs": 7,
      "penalty 1st downs": 0,
      "rushing yards": 223,
      "rushing attempts": 38,
      "passing yards": 114,
      "passing attempts": 23,
      "passing completions": 14,
      "passing interceptions": 2,
      "total yards": 337,
      "total plays": 61,
      "fumbles": 0,
      "fumbles lost": 0,
      "penalties": 1,
      "penalty yards": 5,
      "punts": 6,
      "punt yards": 230,
      "punt returns": 1,
      "punt return yards": 24,
      "kickoff returns": 2,
      "kickoff return yards": 45,
      "interception returns": 2,
      "interception return yards": 5,
      "3rd down conversions": 5,
      "3rd down attempts": 13,
      "4th down conversions": 0,
      "4th down attempts": 0
    }
  },
  "Kansas vs Oklahoma": {
    "stadium": "GaylordFamilyOklahomaMemorialStadium-Norman-OK",
    "Kansas": {
      "points": 3,
      "1st downs": 11,
      "rushing 1st downs": 5,
      "passing 1st downs": 4,
      "penalty 1st downs": 2,
      "rushing yards": 49,
      "rushing attempts": 28,
      "passing yards": 121,
      "passing attempts": 37,
      "passing completions": 21,
      "passing interceptions": 2,
      "total yards": 170,
      "total plays": 65,
      "fumbles": 0,
      "fumbles lost": 0,
      "penalties": 6,
      "penalty yards": 40,
      "punts": 9,
      "punt yards": 354,
      "punt returns": 0,
      "punt return yards": 0,
      "kickoff returns": 2,
      "kickoff return yards": 29,
      "interception returns": 0,
      "interception return yards": 0,
      "3rd down conversions": 5,
      "3rd down attempts": 18,
      "4th down conversions": 0,
      "4th down attempts": 1
    },
    "Oklahoma": {
      "points": 56,
      "1st downs": 24,
      "rushing 1st downs": 9,
      "passing 1st downs": 14,
      "penalty 1st downs": 1,
      "rushing yards": 267,
      "rushing attempts": 38,
      "passing yards": 271,
      "passing attempts": 33,
      "passing completions": 20,
      "passing interceptions": 0,
      "total yards": 538,
      "total plays": 71,
      "fumbles": 1,
      "fumbles lost": 1,
      "penalties": 6,
      "penalty yards": 45,
      "punts": 4,
      "punt yards": 153,
      "punt returns": 1,
      "punt return yards": 71,
      "kickoff returns": 1,
      "kickoff return yards": 30,
      "interception returns": 2,
      "interception return yards": 33,
      "3rd down conversions": 5,
      "3rd down attempts": 12,
      "4th down conversions": 2,
      "4th down attempts": 3
    }
  },
  "BoiseState vs Wyoming": {
    "stadium": "JonahFieldatWarMemorialStadium-Laramie-WY",
    "BoiseState": {
      "points": 28,
      "1st downs": 24,
      "rushing 1st downs": 8,
      "passing 1st downs": 16,
      "penalty 1st downs": 0,
      "rushing yards": 159,
      "rushing attempts": 27,
      "passing yards": 328,
      "passing attempts": 36,
      "passing completions": 23,
      "passing interceptions": 1,
      "total yards": 487,
      "total plays": 63,
      "fumbles": 3,
      "fumbles lost": 1,
      "penalties": 4,
      "penalty yards": 24,
      "punts": 5,
      "punt yards": 227,
      "punt returns": 2,
      "punt return yards": 2,
      "kickoff returns": 4,
      "kickoff return yards": 82,
      "interception returns": 1,
      "interception return yards": 0,
      "3rd down conversions": 2,
      "3rd down attempts": 8,
      "4th down conversions": 0,
      "4th down attempts": 0
    },
    "Wyoming": {
      "points": 30,
      "1st downs": 25,
      "rushing 1st downs": 13,
      "passing 1st downs": 12,
      "penalty 1st downs": 0,
      "rushing yards": 215,
      "rushing attempts": 49,
      "passing yards": 274,
      "passing attempts": 31,
      "passing completions": 18,
      "passing interceptions": 1,
      "total yards": 489,
      "total plays": 80,
      "fumbles": 0,
      "fumbles lost": 0,
      "penalties": 0,
      "penalty yards": 0,
      "punts": 5,
      "punt yards": 232,
      "punt returns": 2,
      "punt return yards": -1,
      "kickoff returns": 0,
      "kickoff return yards": 0,
      "interception returns": 1,
      "interception return yards": 32,
      "3rd down conversions": 10,
      "3rd down attempts": 18,
      "4th down conversions": 0,
      "4th down attempts": 1
    }
  },
  "Marshall vs SouthernMiss": {
    "stadium": "MMRobertsStadium-Hattiesburg-MS",
    "Marshall": {
      "points": 14,
      "1st downs": 11,
      "rushing 1st downs": 2,
      "passing 1st downs": 8,
      "penalty 1st downs": 1,
      "rushing yards": 60,
      "rushing attempts": 25,
      "passing yards": 166,
      "passing attempts": 34,
      "passing completions": 20,
      "passing interceptions": 0,
      "total yards": 226,
      "total plays": 59,
      "fumbles": 1,
      "fumbles lost": 0,
      "penalties": 5,
      "penalty yards": 65,
      "punts": 10,
      "punt yards": 469,
      "punt returns": 2,
      "punt return yards": 23,
      "kickoff returns": 4,
      "kickoff return yards": 108,
      "interception returns": 0,
      "interception return yards": 0,
      "3rd down conversions": 1,
      "3rd down attempts": 13,
      "4th down conversions": 1,
      "4th down attempts": 1
    },
    "SouthernMiss": {
      "points": 24,
      "1st downs": 26,
      "rushing 1st downs": 10,
      "passing 1st downs": 14,
      "penalty 1st downs": 2,
      "rushing yards": 174,
      "rushing attempts": 45,
      "passing yards": 300,
      "passing attempts": 40,
      "passing completions": 22,
      "passing interceptions": 0,
      "total yards": 474,
      "total plays": 85,
      "fumbles": 1,
      "fumbles lost": 1,
      "penalties": 4,
      "penalty yards": 44,
      "punts": 6,
      "punt yards": 261,
      "punt returns": 3,
      "punt return yards": 12,
      "kickoff returns": 0,
      "kickoff return yards": 0,
      "interception returns": 0,
      "interception return yards": 0,
      "3rd down conversions": 6,
      "3rd down attempts": 18,
      "4th down conversions": 2,
      "4th down attempts": 3
    }
  },
  "MiddleTennessee vs FloridaInternational": {
    "stadium": "RiccardoSilvaStadium-Miami-FL",
    "MiddleTennessee": {
      "points": 42,
      "1st downs": 0,
      "rushing 1st downs": 0,
      "passing 1st downs": 0,
      "penalty 1st downs": 0,
      "rushing yards": 170,
      "rushing attempts": 22,
      "passing yards": 296,
      "passing attempts": 32,
      "passing completions": 19,
      "passing interceptions": 0,
      "total yards": 466,
      "total plays": 54,
      "fumbles": 0,
      "fumbles lost": 0,
      "penalties": 2,
      "penalty yards": 30,
      "punts": 6,
      "punt yards": 234,
      "punt returns": 1,
      "punt return yards": 27,
      "kickoff returns": 1,
      "kickoff return yards": 10,
      "interception returns": 1,
      "interception return yards": 0,
      "3rd down conversions": 0,
      "3rd down attempts": 0,
      "4th down conversions": 0,
      "4th down attempts": 0
    },
    "FloridaInternational": {
      "points": 35,
      "1st downs": 0,
      "rushing 1st downs": 0,
      "passing 1st downs": 0,
      "penalty 1st downs": 0,
      "rushing yards": 210,
      "rushing attempts": 44,
      "passing yards": 307,
      "passing attempts": 40,
      "passing completions": 27,
      "passing interceptions": 1,
      "total yards": 517,
      "total plays": 84,
      "fumbles": 0,
      "fumbles lost": 0,
      "penalties": 3,
      "penalty yards": 25,
      "punts": 5,
      "punt yards": 208,
      "punt returns": 1,
      "punt return yards": 18,
      "kickoff returns": 5,
      "kickoff return yards": 76,
      "interception returns": 0,
      "interception return yards": 0,
      "3rd down conversions": 0,
      "3rd down attempts": 0,
      "4th down conversions": 0,
      "4th down attempts": 0
    }
  },
  "Rice vs LouisianaTech": {
    "stadium": "JoeAilletStadium-Ruston-LA",
    "Rice": {
      "points": 16,
      "1st downs": 0,
      "rushing 1st downs": 0,
      "passing 1st downs": 0,
      "penalty 1st downs": 0,
      "rushing yards": 153,
      "rushing attempts": 43,
      "passing yards": 152,
      "passing attempts": 27,
      "passing completions": 15,
      "passing interceptions": 1,
      "total yards": 305,
      "total plays": 70,
      "fumbles": 0,
      "fumbles lost": 0,
      "penalties": 1,
      "penalty yards": 6,
      "punts": 8,
      "punt yards": 349,
      "punt returns": 0,
      "punt return yards": 0,
      "kickoff returns": 4,
      "kickoff return yards": 84,
      "interception returns": 0,
      "interception return yards": 0,
      "3rd down conversions": 0,
      "3rd down attempts": 0,
      "4th down conversions": 0,
      "4th down attempts": 0
    },
    "LouisianaTech": {
      "points": 61,
      "1st downs": 0,
      "rushing 1st downs": 0,
      "passing 1st downs": 0,
      "penalty 1st downs": 0,
      "rushing yards": 301,
      "rushing attempts": 39,
      "passing yards": 434,
      "passing attempts": 31,
      "passing completions": 24,
      "passing interceptions": 0,
      "total yards": 735,
      "total plays": 70,
      "fumbles": 0,
      "fumbles lost": 0,
      "penalties": 3,
      "penalty yards": 25,
      "punts": 2,
      "punt yards": 105,
      "punt returns": 2,
      "punt return yards": 21,
      "kickoff returns": 0,
      "kickoff return yards": 0,
      "interception returns": 1,
      "interception return yards": 0,
      "3rd down conversions": 0,
      "3rd down attempts": 0,
      "4th down conversions": 0,
      "4th down attempts": 0
    }
  },
  "Tennessee vs SouthCarolina": {
    "stadium": "WilliamsBriceStadium-Columbia-SC",
    "Tennessee": {
      "points": 21,
      "1st downs": 16,
      "rushing 1st downs": 9,
      "passing 1st downs": 5,
      "penalty 1st downs": 2,
      "rushing yards": 136,
      "rushing attempts": 37,
      "passing yards": 161,
      "passing attempts": 27,
      "passing completions": 12,
      "passing interceptions": 2,
      "total yards": 297,
      "total plays": 64,
      "fumbles": 1,
      "fumbles lost": 1,
      "penalties": 9,
      "penalty yards": 87,
      "punts": 6,
      "punt yards": 294,
      "punt returns": 2,
      "punt return yards": 10,
      "kickoff returns": 3,
      "kickoff return yards": 150,
      "interception returns": 0,
      "interception return yards": 0,
      "3rd down conversions": 5,
      "3rd down attempts": 14,
      "4th down conversions": 0,
      "4th down attempts": 1
    },
    "SouthCarolina": {
      "points": 24,
      "1st downs": 19,
      "rushing 1st downs": 9,
      "passing 1st downs": 8,
      "penalty 1st downs": 2,
      "rushing yards": 158,
      "rushing attempts": 49,
      "passing yards": 167,
      "passing attempts": 21,
      "passing completions": 15,
      "passing interceptions": 0,
      "total yards": 325,
      "total plays": 70,
      "fumbles": 0,
      "fumbles lost": 0,
      "penalties": 7,
      "penalty yards": 77,
      "punts": 9,
      "punt yards": 385,
      "punt returns": 0,
      "punt return yards": 0,
      "kickoff returns": 1,
      "kickoff return yards": 27,
      "interception returns": 2,
      "interception return yards": 0,
      "3rd down conversions": 5,
      "3rd down attempts": 16,
      "4th down conversions": 1,
      "4th down attempts": 1
    }
  },
  "Auburn vs OleMiss": {
    "stadium": "VaughtHemingwayStadium-University-MS",
    "Auburn": {
      "points": 40,
      "1st downs": 26,
      "rushing 1st downs": 14,
      "passing 1st downs": 12,
      "penalty 1st downs": 0,
      "rushing yards": 307,
      "rushing attempts": 52,
      "passing yards": 247,
      "passing attempts": 22,
      "passing completions": 15,
      "passing interceptions": 0,
      "total yards": 554,
      "total plays": 74,
      "fumbles": 1,
      "fumbles lost": 0,
      "penalties": 4,
      "penalty yards": 30,
      "punts": 2,
      "punt yards": 86,
      "punt returns": 1,
      "punt return yards": 10,
      "kickoff returns": 2,
      "kickoff return yards": 34,
      "interception returns": 1,
      "interception return yards": 47,
      "3rd down conversions": 7,
      "3rd down attempts": 14,
      "4th down conversions": 1,
      "4th down attempts": 1
    },
    "OleMiss": {
      "points": 29,
      "1st downs": 32,
      "rushing 1st downs": 5,
      "passing 1st downs": 26,
      "penalty 1st downs": 1,
      "rushing yards": 105,
      "rushing attempts": 31,
      "passing yards": 465,
      "passing attempts": 59,
      "passing completions": 36,
      "passing interceptions": 1,
      "total yards": 570,
      "total plays": 90,
      "fumbles": 0,
      "fumbles lost": 0,
      "penalties": 6,
      "penalty yards": 35,
      "punts": 2,
      "punt yards": 87,
      "punt returns": 0,
      "punt return yards": 0,
      "kickoff returns": 3,
      "kickoff return yards": 83,
      "interception returns": 0,
      "interception return yards": 0,
      "3rd down conversions": 7,
      "3rd down attempts": 16,
      "4th down conversions": 1,
      "4th down attempts": 3
    }
  },
  "NewMexicoState vs TexasAM": {
    "stadium": "KyleField-CollegeStation-TX",
    "NewMexicoState": {
      "points": 10,
      "1st downs": 18,
      "rushing 1st downs": 8,
      "passing 1st downs": 6,
      "penalty 1st downs": 4,
      "rushing yards": 169,
      "rushing attempts": 39,
      "passing yards": 147,
      "passing attempts": 38,
      "passing completions": 21,
      "passing interceptions": 0,
      "total yards": 316,
      "total plays": 77,
      "fumbles": 1,
      "fumbles lost": 0,
      "penalties": 5,
      "penalty yards": 30,
      "punts": 9,
      "punt yards": 363,
      "punt returns": 1,
      "punt return yards": 5,
      "kickoff returns": 1,
      "kickoff return yards": 14,
      "interception returns": 0,
      "interception return yards": 0,
      "3rd down conversions": 5,
      "3rd down attempts": 20,
      "4th down conversions": 1,
      "4th down attempts": 4
    },
    "TexasAM": {
      "points": 52,
      "1st downs": 28,
      "rushing 1st downs": 13,
      "passing 1st downs": 15,
      "penalty 1st downs": 0,
      "rushing yards": 233,
      "rushing attempts": 39,
      "passing yards": 282,
      "passing attempts": 34,
      "passing completions": 22,
      "passing interceptions": 0,
      "total yards": 515,
      "total plays": 73,
      "fumbles": 2,
      "fumbles lost": 1,
      "penalties": 5,
      "penalty yards": 53,
      "punts": 4,
      "punt yards": 177,
      "punt returns": 2,
      "punt return yards": 143,
      "kickoff returns": 2,
      "kickoff return yards": 77,
      "interception returns": 0,
      "interception return yards": 0,
      "3rd down conversions": 7,
      "3rd down attempts": 13,
      "4th down conversions": 0,
      "4th down attempts": 0
    }
  },
  "OldDominion vs UTEP": {
    "stadium": "SunBowlStadium-ElPaso-TX",
    "OldDominion": {
      "points": 31,
      "1st downs": 0,
      "rushing 1st downs": 0,
      "passing 1st downs": 0,
      "penalty 1st downs": 0,
      "rushing yards": 131,
      "rushing attempts": 30,
      "passing yards": 262,
      "passing attempts": 22,
      "passing completions": 14,
      "passing interceptions": 1,
      "total yards": 393,
      "total plays": 52,
      "fumbles": 0,
      "fumbles lost": 0,
      "penalties": 5,
      "penalty yards": 52,
      "punts": 4,
      "punt yards": 170,
      "punt returns": 1,
      "punt return yards": 12,
      "kickoff returns": 0,
      "kickoff return yards": 0,
      "interception returns": 1,
      "interception return yards": 0,
      "3rd down conversions": 0,
      "3rd down attempts": 0,
      "4th down conversions": 0,
      "4th down attempts": 0
    },
    "UTEP": {
      "points": 21,
      "1st downs": 0,
      "rushing 1st downs": 0,
      "passing 1st downs": 0,
      "penalty 1st downs": 0,
      "rushing yards": 132,
      "rushing attempts": 35,
      "passing yards": 205,
      "passing attempts": 37,
      "passing completions": 22,
      "passing interceptions": 1,
      "total yards": 337,
      "total plays": 72,
      "fumbles": 0,
      "fumbles lost": 0,
      "penalties": 2,
      "penalty yards": 10,
      "punts": 4,
      "punt yards": 200,
      "punt returns": 1,
      "punt return yards": 39,
      "kickoff returns": 4,
      "kickoff return yards": 60,
      "interception returns": 1,
      "interception return yards": 0,
      "3rd down conversions": 0,
      "3rd down attempts": 0,
      "4th down conversions": 0,
      "4th down attempts": 0
    }
  },
  "Clemson vs FloridaState": {
    "stadium": "BobbyBowdenFieldatDoakCampbellStadium-Tallahassee-FL",
    "Clemson": {
      "points": 37,
      "1st downs": 25,
      "rushing 1st downs": 7,
      "passing 1st downs": 16,
      "penalty 1st downs": 2,
      "rushing yards": 133,
      "rushing attempts": 38,
      "passing yards": 378,
      "passing attempts": 43,
      "passing completions": 27,
      "passing interceptions": 2,
      "total yards": 511,
      "total plays": 81,
      "fumbles": 0,
      "fumbles lost": 0,
      "penalties": 9,
      "penalty yards": 84,
      "punts": 4,
      "punt yards": 152,
      "punt returns": 1,
      "punt return yards": -8,
      "kickoff returns": 1,
      "kickoff return yards": 22,
      "interception returns": 1,
      "interception return yards": 3,
      "3rd down conversions": 7,
      "3rd down attempts": 17,
      "4th down conversions": 2,
      "4th down attempts": 2
    },
    "FloridaState": {
      "points": 34,
      "1st downs": 23,
      "rushing 1st downs": 6,
      "passing 1st downs": 13,
      "penalty 1st downs": 4,
      "rushing yards": 163,
      "rushing attempts": 28,
      "passing yards": 286,
      "passing attempts": 35,
      "passing completions": 17,
      "passing interceptions": 1,
      "total yards": 449,
      "total plays": 63,
      "fumbles": 1,
      "fumbles lost": 0,
      "penalties": 13,
      "penalty yards": 111,
      "punts": 7,
      "punt yards": 265,
      "punt returns": 0,
      "punt return yards": 0,
      "kickoff returns": 5,
      "kickoff return yards": 93,
      "interception returns": 2,
      "interception return yards": 15,
      "3rd down conversions": 4,
      "3rd down attempts": 12,
      "4th down conversions": 0,
      "4th down attempts": 1
    }
  },
  "Tulsa vs Memphis": {
    "stadium": "LibertyBowlMemorialStadium-Memphis-TN",
    "Tulsa": {
      "points": 59,
      "1st downs": 29,
      "rushing 1st downs": 14,
      "passing 1st downs": 13,
      "penalty 1st downs": 2,
      "rushing yards": 362,
      "rushing attempts": 54,
      "passing yards": 234,
      "passing attempts": 33,
      "passing completions": 20,
      "passing interceptions": 0,
      "total yards": 596,
      "total plays": 87,
      "fumbles": 1,
      "fumbles lost": 1,
      "penalties": 7,
      "penalty yards": 63,
      "punts": 5,
      "punt yards": 189,
      "punt returns": 0,
      "punt return yards": 0,
      "kickoff returns": 1,
      "kickoff return yards": 17,
      "interception returns": 2,
      "interception return yards": 29,
      "3rd down conversions": 10,
      "3rd down attempts": 16,
      "4th down conversions": 0,
      "4th down attempts": 0
    },
    "Memphis": {
      "points": 30,
      "1st downs": 22,
      "rushing 1st downs": 9,
      "passing 1st downs": 11,
      "penalty 1st downs": 2,
      "rushing yards": 176,
      "rushing attempts": 41,
      "passing yards": 349,
      "passing attempts": 41,
      "passing completions": 19,
      "passing interceptions": 2,
      "total yards": 525,
      "total plays": 82,
      "fumbles": 3,
      "fumbles lost": 2,
      "penalties": 12,
      "penalty yards": 115,
      "punts": 5,
      "punt yards": 213,
      "punt returns": 2,
      "punt return yards": 11,
      "kickoff returns": 6,
      "kickoff return yards": 161,
      "interception returns": 0,
      "interception return yards": 0,
      "3rd down conversions": 9,
      "3rd down attempts": 19,
      "4th down conversions": 2,
      "4th down attempts": 2
    }
  },
  "UNLV vs SanJoseState": {
    "stadium": "CEFCUStadium-SanJose-CA",
    "UNLV": {
      "points": 24,
      "1st downs": 20,
      "rushing 1st downs": 10,
      "passing 1st downs": 7,
      "penalty 1st downs": 3,
      "rushing yards": 217,
      "rushing attempts": 40,
      "passing yards": 185,
      "passing attempts": 30,
      "passing completions": 12,
      "passing interceptions": 1,
      "total yards": 402,
      "total plays": 70,
      "fumbles": 2,
      "fumbles lost": 0,
      "penalties": 11,
      "penalty yards": 87,
      "punts": 8,
      "punt yards": 312,
      "punt returns": 1,
      "punt return yards": -6,
      "kickoff returns": 3,
      "kickoff return yards": 70,
      "interception returns": 0,
      "interception return yards": 0,
      "3rd down conversions": 4,
      "3rd down attempts": 15,
      "4th down conversions": 1,
      "4th down attempts": 1
    },
    "SanJoseState": {
      "points": 30,
      "1st downs": 24,
      "rushing 1st downs": 9,
      "passing 1st downs": 14,
      "penalty 1st downs": 1,
      "rushing yards": 132,
      "rushing attempts": 42,
      "passing yards": 292,
      "passing attempts": 40,
      "passing completions": 24,
      "passing interceptions": 0,
      "total yards": 424,
      "total plays": 82,
      "fumbles": 0,
      "fumbles lost": 0,
      "penalties": 4,
      "penalty yards": 50,
      "punts": 6,
      "punt yards": 264,
      "punt returns": 0,
      "punt return yards": 0,
      "kickoff returns": 4,
      "kickoff return yards": 111,
      "interception returns": 1,
      "interception return yards": 4,
      "3rd down conversions": 5,
      "3rd down attempts": 17,
      "4th down conversions": 2,
      "4th down attempts": 3
    }
  },
  "WashingtonState vs OregonState": {
    "stadium": "ReserStadium-Corvallis-OR",
    "WashingtonState": {
      "points": 35,
      "1st downs": 27,
      "rushing 1st downs": 7,
      "passing 1st downs": 17,
      "penalty 1st downs": 3,
      "rushing yards": 137,
      "rushing attempts": 26,
      "passing yards": 415,
      "passing attempts": 46,
      "passing completions": 33,
      "passing interceptions": 0,
      "total yards": 552,
      "total plays": 72,
      "fumbles": 4,
      "fumbles lost": 2,
      "penalties": 6,
      "penalty yards": 65,
      "punts": 4,
      "punt yards": 177,
      "punt returns": 3,
      "punt return yards": -13,
      "kickoff returns": 4,
      "kickoff return yards": 54,
      "interception returns": 0,
      "interception return yards": 0,
      "3rd down conversions": 4,
      "3rd down attempts": 12,
      "4th down conversions": 0,
      "4th down attempts": 3
    },
    "OregonState": {
      "points": 31,
      "1st downs": 20,
      "rushing 1st downs": 6,
      "passing 1st downs": 12,
      "penalty 1st downs": 2,
      "rushing yards": 171,
      "rushing attempts": 28,
      "passing yards": 327,
      "passing attempts": 39,
      "passing completions": 23,
      "passing interceptions": 0,
      "total yards": 498,
      "total plays": 67,
      "fumbles": 0,
      "fumbles lost": 0,
      "penalties": 13,
      "penalty yards": 110,
      "punts": 6,
      "punt yards": 256,
      "punt returns": 1,
      "punt return yards": 10,
      "kickoff returns": 5,
      "kickoff return yards": 90,
      "interception returns": 0,
      "interception return yards": 0,
      "3rd down conversions": 3,
      "3rd down attempts": 13,
      "4th down conversions": 0,
      "4th down attempts": 2
    }
  },
  "Stanford vs Arizona": {
    "stadium": "ArizonaStadium-Tucson-AZ",
    "Stanford": {
      "points": 34,
      "1st downs": 17,
      "rushing 1st downs": 12,
      "passing 1st downs": 4,
      "penalty 1st downs": 1,
      "rushing yards": 237,
      "rushing attempts": 42,
      "passing yards": 104,
      "passing attempts": 31,
      "passing completions": 14,
      "passing interceptions": 1,
      "total yards": 341,
      "total plays": 73,
      "fumbles": 1,
      "fumbles lost": 0,
      "penalties": 6,
      "penalty yards": 55,
      "punts": 6,
      "punt yards": 268,
      "punt returns": 3,
      "punt return yards": 29,
      "kickoff returns": 1,
      "kickoff return yards": 2,
      "interception returns": 1,
      "interception return yards": 35,
      "3rd down conversions": 8,
      "3rd down attempts": 18,
      "4th down conversions": 1,
      "4th down attempts": 2
    },
    "Arizona": {
      "points": 10,
      "1st downs": 15,
      "rushing 1st downs": 9,
      "passing 1st downs": 4,
      "penalty 1st downs": 2,
      "rushing yards": 170,
      "rushing attempts": 44,
      "passing yards": 116,
      "passing attempts": 20,
      "passing completions": 5,
      "passing interceptions": 1,
      "total yards": 286,
      "total plays": 64,
      "fumbles": 3,
      "fumbles lost": 2,
      "penalties": 5,
      "penalty yards": 55,
      "punts": 7,
      "punt yards": 275,
      "punt returns": 2,
      "punt return yards": 16,
      "kickoff returns": 1,
      "kickoff return yards": 25,
      "interception returns": 1,
      "interception return yards": 3,
      "3rd down conversions": 3,
      "3rd down attempts": 14,
      "4th down conversions": 1,
      "4th down attempts": 3
    }
  },
  "NewMexico vs Hawaii": {
    "stadium": "HawaiianTelFederalCreditUnionField-Honolulu-HI",
    "NewMexico": {
      "points": 28,
      "1st downs": 0,
      "rushing 1st downs": 0,
      "passing 1st downs": 0,
      "penalty 1st downs": 0,
      "rushing yards": 237,
      "rushing attempts": 40,
      "passing yards": 84,
      "passing attempts": 15,
      "passing completions": 11,
      "passing interceptions": 1,
      "total yards": 321,
      "total plays": 55,
      "fumbles": 0,
      "fumbles lost": 0,
      "penalties": 8,
      "penalty yards": 79,
      "punts": 6,
      "punt yards": 283,
      "punt returns": 4,
      "punt return yards": 16,
      "kickoff returns": 1,
      "kickoff return yards": 18,
      "interception returns": 0,
      "interception return yards": 0,
      "3rd down conversions": 0,
      "3rd down attempts": 0,
      "4th down conversions": 0,
      "4th down attempts": 0
    },
    "Hawaii": {
      "points": 21,
      "1st downs": 0,
      "rushing 1st downs": 0,
      "passing 1st downs": 0,
      "penalty 1st downs": 0,
      "rushing yards": 125,
      "rushing attempts": 40,
      "passing yards": 173,
      "passing attempts": 28,
      "passing completions": 16,
      "passing interceptions": 0,
      "total yards": 298,
      "total plays": 68,
      "fumbles": 0,
      "fumbles lost": 0,
      "penalties": 1,
      "penalty yards": 10,
      "punts": 6,
      "punt yards": 269,
      "punt returns": 4,
      "punt return yards": 36,
      "kickoff returns": 2,
      "kickoff return yards": 67,
      "interception returns": 1,
      "interception return yards": 0,
      "3rd down conversions": 0,
      "3rd down attempts": 0,
      "4th down conversions": 0,
      "4th down attempts": 0
    }
  }
}