{
  "inputMD5Sum": "99369341bc42ec52658ef8a2808577d0",
  "updated_at": "11-11-2022 21:02:00",
  "games": [
    {"game": {
      "gameID": "2279548",
      "away": {
        "score": "34",
        "names": {
          "char6": "E MICH",
          "short": "Eastern Mich.",
          "seo": "eastern-mich",
          "full": "Eastern Michigan University"
        },
        "winner": true,
        "seed": "",
        "description": "(6-4)",
        "rank": "",
        "conferences": [{
          "conferenceName": "MAC",
          "conferenceSeo": "mac"
        }]
      },
      "finalMessage": "FINAL",
      "bracketRound": "",
      "title": "Akron Eastern Mich.",
      "contestName": "",
      "url": "/game/6006230",
      "network": "",
      "home": {
        "score": "28",
        "names": {
          "char6": "AKRON",
          "short": "Akron",
          "seo": "akron",
          "full": "University of Akron"
        },
        "winner": false,
        "seed": "",
        "description": "(1-9)",
        "rank": "",
        "conferences": [{
          "conferenceName": "MAC",
          "conferenceSeo": "mac"
        }]
      },
      "liveVideoEnabled": false,
      "startTime": "07:00PM ET",
      "startTimeEpoch": "1667952000",
      "bracketId": "",
      "gameState": "final",
      "startDate": "11-08-2022",
      "currentPeriod": "FINAL",
      "videoState": "",
      "bracketRegion": "",
      "contestClock": "0:00"
    }},
    {"game": {
      "gameID": "2279546",
      "away": {
        "score": "37",
        "names": {
          "char6": "OHIO",
          "short": "Ohio",
          "seo": "ohio",
          "full": "Ohio University"
        },
        "winner": true,
        "seed": "",
        "description": "(7-3)",
        "rank": "",
        "conferences": [{
          "conferenceName": "MAC",
          "conferenceSeo": "mac"
        }]
      },
      "finalMessage": "FINAL",
      "bracketRound": "",
      "title": "Miami (OH) Ohio",
      "contestName": "",
      "url": "/game/6006228",
      "network": "",
      "home": {
        "score": "21",
        "names": {
          "char6": "MIA OH",
          "short": "Miami (OH)",
          "seo": "miami-oh",
          "full": "Miami University (Ohio)"
        },
        "winner": false,
        "seed": "",
        "description": "(4-6)",
        "rank": "",
        "conferences": [{
          "conferenceName": "MAC",
          "conferenceSeo": "mac"
        }]
      },
      "liveVideoEnabled": false,
      "startTime": "07:30PM ET",
      "startTimeEpoch": "1667953800",
      "bracketId": "",
      "gameState": "final",
      "startDate": "11-08-2022",
      "currentPeriod": "FINAL",
      "videoState": "",
      "bracketRegion": "",
      "contestClock": "0:00"
    }},
    {"game": {
      "gameID": "410462",
      "away": {
        "score": "21",
        "names": {
          "char6": "BALLST",
          "short": "Ball St.",
          "seo": "ball-st",
          "full": "Ball State University"
        },
        "winner": false,
        "seed": "",
        "description": "(5-5)",
        "rank": "",
        "conferences": [{
          "conferenceName": "MAC",
          "conferenceSeo": "mac"
        }]
      },
      "finalMessage": "FINAL",
      "bracketRound": "",
      "title": "Toledo Ball St.",
      "contestName": "",
      "url": "/game/6006229",
      "network": "",
      "home": {
        "score": "28",
        "names": {
          "char6": "TOLEDO",
          "short": "Toledo",
          "seo": "toledo",
          "full": "University of Toledo"
        },
        "winner": true,
        "seed": "",
        "description": "(7-3)",
        "rank": "",
        "conferences": [{
          "conferenceName": "MAC",
          "conferenceSeo": "mac"
        }]
      },
      "liveVideoEnabled": false,
      "startTime": "08:00PM ET",
      "startTimeEpoch": "1667955600",
      "bracketId": "",
      "gameState": "final",
      "startDate": "11-08-2022",
      "currentPeriod": "FINAL",
      "videoState": "",
      "bracketRegion": "",
      "contestClock": "0:00"
    }},
    {"game": {
      "gameID": "410687",
      "away": {
        "score": "24",
        "names": {
          "char6": "NIU",
          "short": "NIU",
          "seo": "northern-ill",
          "full": "Northern Illinois University"
        },
        "winner": true,
        "seed": "",
        "description": "(3-7)",
        "rank": "",
        "conferences": [{
          "conferenceName": "MAC",
          "conferenceSeo": "mac"
        }]
      },
      "finalMessage": "FINAL",
      "bracketRound": "",
      "title": "Western Mich. NIU",
      "contestName": "",
      "url": "/game/6006231",
      "network": "",
      "home": {
        "score": "21",
        "names": {
          "char6": "W MICH",
          "short": "Western Mich.",
          "seo": "western-mich",
          "full": "Western Michigan University"
        },
        "winner": false,
        "seed": "",
        "description": "(3-7)",
        "rank": "",
        "conferences": [{
          "conferenceName": "MAC",
          "conferenceSeo": "mac"
        }]
      },
      "liveVideoEnabled": false,
      "startTime": "07:00PM ET",
      "startTimeEpoch": "1668038400",
      "bracketId": "",
      "gameState": "final",
      "startDate": "11-09-2022",
      "currentPeriod": "FINAL",
      "videoState": "",
      "bracketRegion": "",
      "contestClock": "0:00"
    }},
    {"game": {
      "gameID": "2279550",
      "away": {
        "score": "27",
        "names": {
          "char6": "BUFF",
          "short": "Buffalo",
          "seo": "buffalo",
          "full": "University at Buffalo, the State University of New York"
        },
        "winner": false,
        "seed": "",
        "description": "(5-5)",
        "rank": "",
        "conferences": [{
          "conferenceName": "MAC",
          "conferenceSeo": "mac"
        }]
      },
      "finalMessage": "FINAL",
      "bracketRound": "",
      "title": "Central Mich. Buffalo",
      "contestName": "",
      "url": "/game/6006232",
      "network": "",
      "home": {
        "score": "31",
        "names": {
          "char6": "C MICH",
          "short": "Central Mich.",
          "seo": "central-mich",
          "full": "Central Michigan University"
        },
        "winner": true,
        "seed": "",
        "description": "(4-6)",
        "rank": "",
        "conferences": [{
          "conferenceName": "MAC",
          "conferenceSeo": "mac"
        }]
      },
      "liveVideoEnabled": false,
      "startTime": "07:00PM ET",
      "startTimeEpoch": "1668038400",
      "bracketId": "",
      "gameState": "final",
      "startDate": "11-09-2022",
      "currentPeriod": "FINAL",
      "videoState": "",
      "bracketRegion": "",
      "contestClock": "0:00"
    }},
    {"game": {
      "gameID": "2279551",
      "away": {
        "score": "40",
        "names": {
          "char6": "KENT",
          "short": "Kent St.",
          "seo": "kent-st",
          "full": "Kent State University"
        },
        "winner": true,
        "seed": "",
        "description": "(4-6)",
        "rank": "",
        "conferences": [{
          "conferenceName": "MAC",
          "conferenceSeo": "mac"
        }]
      },
      "finalMessage": "FINAL",
      "bracketRound": "",
      "title": "Bowling Green Kent St.",
      "contestName": "",
      "url": "/game/6006233",
      "network": "",
      "home": {
        "score": "6",
        "names": {
          "char6": "BGSU",
          "short": "Bowling Green",
          "seo": "bowling-green",
          "full": "Bowling Green State University"
        },
        "winner": false,
        "seed": "",
        "description": "(5-5)",
        "rank": "",
        "conferences": [{
          "conferenceName": "MAC",
          "conferenceSeo": "mac"
        }]
      },
      "liveVideoEnabled": false,
      "startTime": "07:00PM ET",
      "startTimeEpoch": "1668038400",
      "bracketId": "",
      "gameState": "final",
      "startDate": "11-09-2022",
      "currentPeriod": "FINAL",
      "videoState": "",
      "bracketRegion": "",
      "contestClock": "0:00"
    }},
    {"game": {
      "gameID": "409145",
      "away": {
        "score": "17",
        "names": {
          "char6": "GA SOU",
          "short": "Ga. Southern",
          "seo": "ga-southern",
          "full": "Georgia Southern University"
        },
        "winner": false,
        "seed": "",
        "description": "(5-5)",
        "rank": "",
        "conferences": [{
          "conferenceName": "Sun Belt",
          "conferenceSeo": "sun-belt"
        }]
      },
      "finalMessage": "FINAL",
      "bracketRound": "",
      "title": "Louisiana Ga. Southern",
      "contestName": "",
      "url": "/game/6006234",
      "network": "",
      "home": {
        "score": "36",
        "names": {
          "char6": "LA",
          "short": "Louisiana",
          "seo": "la-lafayette",
          "full": "University of Louisiana at Lafayette"
        },
        "winner": true,
        "seed": "",
        "description": "(5-5)",
        "rank": "",
        "conferences": [{
          "conferenceName": "Sun Belt",
          "conferenceSeo": "sun-belt"
        }]
      },
      "liveVideoEnabled": false,
      "startTime": "07:30PM ET",
      "startTimeEpoch": "1668126600",
      "bracketId": "",
      "gameState": "final",
      "startDate": "11-10-2022",
      "currentPeriod": "FINAL",
      "videoState": "",
      "bracketRegion": "",
      "contestClock": "0:00"
    }},
    {"game": {
      "gameID": "409957",
      "away": {
        "score": "10",
        "names": {
          "char6": "TULSA",
          "short": "Tulsa",
          "seo": "tulsa",
          "full": "The University of Tulsa"
        },
        "winner": false,
        "seed": "",
        "description": "(3-7)",
        "rank": "",
        "conferences": [{
          "conferenceName": "AAC",
          "conferenceSeo": "aac"
        }]
      },
      "finalMessage": "FINAL",
      "bracketRound": "",
      "title": "Memphis Tulsa",
      "contestName": "",
      "url": "/game/6006235",
      "network": "",
      "home": {
        "score": "26",
        "names": {
          "char6": "MEM",
          "short": "Memphis",
          "seo": "memphis",
          "full": "University of Memphis"
        },
        "winner": true,
        "seed": "",
        "description": "(5-5)",
        "rank": "",
        "conferences": [{
          "conferenceName": "AAC",
          "conferenceSeo": "aac"
        }]
      },
      "liveVideoEnabled": false,
      "startTime": "07:30PM ET",
      "startTimeEpoch": "1668126600",
      "bracketId": "",
      "gameState": "final",
      "startDate": "11-10-2022",
      "currentPeriod": "FINAL",
      "videoState": "",
      "bracketRegion": "",
      "contestClock": "0:00"
    }},
    {"game": {
      "gameID": "31676",
      "away": {
        "score": "5",
        "names": {
          "char6": "E CAR",
          "short": "East Carolina",
          "seo": "east-carolina",
          "full": "East Carolina University"
        },
        "winner": false,
        "seed": "",
        "description": "(5-3)",
        "rank": "",
        "conferences": [{
          "conferenceName": "AAC",
          "conferenceSeo": "aac"
        }]
      },
      "finalMessage": "2ND",
      "bracketRound": "",
      "title": "Cincinnati East Carolina",
      "contestName": "",
      "url": "/game/6006236",
      "network": "",
      "home": {
        "score": "14",
        "names": {
          "char6": "CINCY",
          "short": "Cincinnati",
          "seo": "cincinnati",
          "full": "University of Cincinnati"
        },
        "winner": false,
        "seed": "",
        "description": "(7-2)",
        "rank": "",
        "conferences": [{
          "conferenceName": "AAC",
          "conferenceSeo": "aac"
        }]
      },
      "liveVideoEnabled": false,
      "startTime": "08:00PM ET",
      "startTimeEpoch": "1668214800",
      "bracketId": "",
      "gameState": "live",
      "startDate": "11-11-2022",
      "currentPeriod": "2ND",
      "videoState": "",
      "bracketRegion": "",
      "contestClock": "11:34"
    }},
    {"game": {
      "gameID": "422148",
      "away": {
        "score": "",
        "names": {
          "char6": "COLO",
          "short": "Colorado",
          "seo": "colorado",
          "full": "University of Colorado, Boulder"
        },
        "winner": false,
        "seed": "",
        "description": "(1-8)",
        "rank": "",
        "conferences": [{
          "conferenceName": "Pac-12",
          "conferenceSeo": "pac-12"
        }]
      },
      "finalMessage": "",
      "bracketRound": "",
      "title": "Southern California Colorado",
      "contestName": "",
      "url": "/game/6006237",
      "network": "",
      "home": {
        "score": "",
        "names": {
          "char6": "USC",
          "short": "Southern California",
          "seo": "southern-california",
          "full": "University of Southern California"
        },
        "winner": false,
        "seed": "",
        "description": "(8-1)",
        "rank": "8",
        "conferences": [
          {
            "conferenceName": "Pac-12",
            "conferenceSeo": "pac-12"
          },
          {
            "conferenceName": "Top 25",
            "conferenceSeo": "top-25"
          }
        ]
      },
      "liveVideoEnabled": false,
      "startTime": "09:30PM ET",
      "startTimeEpoch": "1668220200",
      "bracketId": "",
      "gameState": "pre",
      "startDate": "11-11-2022",
      "currentPeriod": "",
      "videoState": "",
      "bracketRegion": "",
      "contestClock": ""
    }},
    {"game": {
      "gameID": "31681",
      "away": {
        "score": "",
        "names": {
          "char6": "FRESNO",
          "short": "Fresno St.",
          "seo": "fresno-st",
          "full": "California State University, Fresno"
        },
        "winner": false,
        "seed": "",
        "description": "(5-4)",
        "rank": "",
        "conferences": [{
          "conferenceName": "Mountain West",
          "conferenceSeo": "mountain-west"
        }]
      },
      "finalMessage": "",
      "bracketRound": "",
      "title": "UNLV Fresno St.",
      "contestName": "",
      "url": "/game/6006238",
      "network": "",
      "home": {
        "score": "",
        "names": {
          "char6": "UNLV",
          "short": "UNLV",
          "seo": "unlv",
          "full": "University of Nevada, Las Vegas"
        },
        "winner": false,
        "seed": "",
        "description": "(4-5)",
        "rank": "",
        "conferences": [{
          "conferenceName": "Mountain West",
          "conferenceSeo": "mountain-west"
        }]
      },
      "liveVideoEnabled": false,
      "startTime": "10:30PM ET",
      "startTimeEpoch": "1668223800",
      "bracketId": "",
      "gameState": "pre",
      "startDate": "11-11-2022",
      "currentPeriod": "",
      "videoState": "",
      "bracketRegion": "",
      "contestClock": ""
    }},
    {"game": {
      "gameID": "410701",
      "away": {
        "score": "",
        "names": {
          "char6": "OKLA",
          "short": "Oklahoma",
          "seo": "oklahoma",
          "full": "University of Oklahoma"
        },
        "winner": false,
        "seed": "",
        "description": "(5-4)",
        "rank": "",
        "conferences": [{
          "conferenceName": "Big 12",
          "conferenceSeo": "big-12"
        }]
      },
      "finalMessage": "",
      "bracketRound": "",
      "title": "West Virginia Oklahoma",
      "contestName": "",
      "url": "/game/6006272",
      "network": "",
      "home": {
        "score": "",
        "names": {
          "char6": "WVU",
          "short": "West Virginia",
          "seo": "west-virginia",
          "full": "West Virginia University"
        },
        "winner": false,
        "seed": "",
        "description": "(3-6)",
        "rank": "",
        "conferences": [{
          "conferenceName": "Big 12",
          "conferenceSeo": "big-12"
        }]
      },
      "liveVideoEnabled": false,
      "startTime": "12:00PM ET",
      "startTimeEpoch": "1668272400",
      "bracketId": "",
      "gameState": "pre",
      "startDate": "11-12-2022",
      "currentPeriod": "",
      "videoState": "",
      "bracketRegion": "",
      "contestClock": ""
    }},
    {"game": {
      "gameID": "410042",
      "away": {
        "score": "",
        "names": {
          "char6": "RUTGER",
          "short": "Rutgers",
          "seo": "rutgers",
          "full": "Rutgers, The State University of New Jersey, New Brunswick"
        },
        "winner": false,
        "seed": "",
        "description": "(4-5)",
        "rank": "",
        "conferences": [{
          "conferenceName": "Big Ten",
          "conferenceSeo": "big-ten"
        }]
      },
      "finalMessage": "",
      "bracketRound": "",
      "title": "Michigan St. Rutgers",
      "contestName": "",
      "url": "/game/6006275",
      "network": "",
      "home": {
        "score": "",
        "names": {
          "char6": "MICHST",
          "short": "Michigan St.",
          "seo": "michigan-st",
          "full": "Michigan State University"
        },
        "winner": false,
        "seed": "",
        "description": "(4-5)",
        "rank": "",
        "conferences": [{
          "conferenceName": "Big Ten",
          "conferenceSeo": "big-ten"
        }]
      },
      "liveVideoEnabled": false,
      "startTime": "12:00PM ET",
      "startTimeEpoch": "1668272400",
      "bracketId": "",
      "gameState": "pre",
      "startDate": "11-12-2022",
      "currentPeriod": "",
      "videoState": "",
      "bracketRegion": "",
      "contestClock": ""
    }},
    {"game": {
      "gameID": "31726",
      "away": {
        "score": "",
        "names": {
          "char6": "SMU",
          "short": "SMU",
          "seo": "smu",
          "full": "Southern Methodist University"
        },
        "winner": false,
        "seed": "",
        "description": "(5-4)",
        "rank": "",
        "conferences": [{
          "conferenceName": "AAC",
          "conferenceSeo": "aac"
        }]
      },
      "finalMessage": "",
      "bracketRound": "",
      "title": "South Fla. SMU",
      "contestName": "",
      "url": "/game/6006278",
      "network": "",
      "home": {
        "score": "",
        "names": {
          "char6": "USF",
          "short": "South Fla.",
          "seo": "south-fla",
          "full": "University of South Florida"
        },
        "winner": false,
        "seed": "",
        "description": "(1-8)",
        "rank": "",
        "conferences": [{
          "conferenceName": "AAC",
          "conferenceSeo": "aac"
        }]
      },
      "liveVideoEnabled": false,
      "startTime": "12:00PM ET",
      "startTimeEpoch": "1668272400",
      "bracketId": "",
      "gameState": "pre",
      "startDate": "11-12-2022",
      "currentPeriod": "",
      "videoState": "",
      "bracketRegion": "",
      "contestClock": ""
    }},
    {"game": {
      "gameID": "409441",
      "away": {
        "score": "",
        "names": {
          "char6": "LSU",
          "short": "LSU",
          "seo": "lsu",
          "full": "Louisiana State University"
        },
        "winner": false,
        "seed": "",
        "description": "(7-2)",
        "rank": "7",
        "conferences": [
          {
            "conferenceName": "SEC",
            "conferenceSeo": "sec"
          },
          {
            "conferenceName": "Top 25",
            "conferenceSeo": "top-25"
          }
        ]
      },
      "finalMessage": "",
      "bracketRound": "",
      "title": "Arkansas LSU",
      "contestName": "",
      "url": "/game/6006279",
      "network": "",
      "home": {
        "score": "",
        "names": {
          "char6": "ARK",
          "short": "Arkansas",
          "seo": "arkansas",
          "full": "University of Arkansas, Fayetteville"
        },
        "winner": false,
        "seed": "",
        "description": "(5-4)",
        "rank": "",
        "conferences": [{
          "conferenceName": "SEC",
          "conferenceSeo": "sec"
        }]
      },
      "liveVideoEnabled": false,
      "startTime": "12:00PM ET",
      "startTimeEpoch": "1668272400",
      "bracketId": "",
      "gameState": "pre",
      "startDate": "11-12-2022",
      "currentPeriod": "",
      "videoState": "",
      "bracketRegion": "",
      "contestClock": ""
    }},
    {"game": {
      "gameID": "31778",
      "away": {
        "score": "",
        "names": {
          "char6": "LIBRTY",
          "short": "Liberty",
          "seo": "liberty",
          "full": "Liberty University"
        },
        "winner": false,
        "seed": "",
        "description": "(8-1)",
        "rank": "",
        "conferences": [{
          "conferenceName": "FBS Independent",
          "conferenceSeo": "fbs-independent"
        }]
      },
      "finalMessage": "",
      "bracketRound": "",
      "title": "UConn Liberty",
      "contestName": "",
      "url": "/game/6006284",
      "network": "",
      "home": {
        "score": "",
        "names": {
          "char6": "UCONN",
          "short": "UConn",
          "seo": "uconn",
          "full": "University of Connecticut"
        },
        "winner": false,
        "seed": "",
        "description": "(5-5)",
        "rank": "",
        "conferences": [{
          "conferenceName": "FBS Independent",
          "conferenceSeo": "fbs-independent"
        }]
      },
      "liveVideoEnabled": false,
      "startTime": "12:00PM ET",
      "startTimeEpoch": "1668272400",
      "bracketId": "",
      "gameState": "pre",
      "startDate": "11-12-2022",
      "currentPeriod": "",
      "videoState": "",
      "bracketRegion": "",
      "contestClock": ""
    }},
    {"game": {
      "gameID": "410070",
      "away": {
        "score": "",
        "names": {
          "char6": "N DAME",
          "short": "Notre Dame",
          "seo": "notre-dame",
          "full": "University of Notre Dame"
        },
        "winner": false,
        "seed": "",
        "description": "(6-3)",
        "rank": "20",
        "conferences": [
          {
            "conferenceName": "FBS Independent",
            "conferenceSeo": "fbs-independent"
          },
          {
            "conferenceName": "Top 25",
            "conferenceSeo": "top-25"
          }
        ]
      },
      "finalMessage": "",
      "bracketRound": "",
      "title": "Navy Notre Dame",
      "contestName": "",
      "url": "/game/6006285",
      "network": "",
      "home": {
        "score": "",
        "names": {
          "char6": "NAVY",
          "short": "Navy",
          "seo": "navy",
          "full": "U.S. Naval Academy"
        },
        "winner": false,
        "seed": "",
        "description": "(3-6)",
        "rank": "",
        "conferences": [{
          "conferenceName": "AAC",
          "conferenceSeo": "aac"
        }]
      },
      "liveVideoEnabled": false,
      "startTime": "12:00PM ET",
      "startTimeEpoch": "1668272400",
      "bracketId": "",
      "gameState": "pre",
      "startDate": "11-12-2022",
      "currentPeriod": "",
      "videoState": "",
      "bracketRegion": "",
      "contestClock": ""
    }},
    {"game": {
      "gameID": "410604",
      "away": {
        "score": "",
        "names": {
          "char6": "PITT",
          "short": "Pittsburgh",
          "seo": "pittsburgh",
          "full": "University of Pittsburgh"
        },
        "winner": false,
        "seed": "",
        "description": "(5-4)",
        "rank": "",
        "conferences": [{
          "conferenceName": "ACC",
          "conferenceSeo": "acc"
        }]
      },
      "finalMessage": "",
      "bracketRound": "",
      "title": "Virginia Pittsburgh",
      "contestName": "",
      "url": "/game/6006242",
      "network": "",
      "home": {
        "score": "",
        "names": {
          "char6": "UVA",
          "short": "Virginia",
          "seo": "virginia",
          "full": "University of Virginia"
        },
        "winner": false,
        "seed": "",
        "description": "(3-6)",
        "rank": "",
        "conferences": [{
          "conferenceName": "ACC",
          "conferenceSeo": "acc"
        }]
      },
      "liveVideoEnabled": false,
      "startTime": "12:00PM ET",
      "startTimeEpoch": "1668272400",
      "bracketId": "",
      "gameState": "pre",
      "startDate": "11-12-2022",
      "currentPeriod": "",
      "videoState": "",
      "bracketRegion": "",
      "contestClock": ""
    }},
    {"game": {
      "gameID": "410218",
      "away": {
        "score": "",
        "names": {
          "char6": "IND",
          "short": "Indiana",
          "seo": "indiana",
          "full": "Indiana University, Bloomington"
        },
        "winner": false,
        "seed": "",
        "description": "(3-6)",
        "rank": "",
        "conferences": [{
          "conferenceName": "Big Ten",
          "conferenceSeo": "big-ten"
        }]
      },
      "finalMessage": "",
      "bracketRound": "",
      "title": "Ohio St. Indiana",
      "contestName": "",
      "url": "/game/6006244",
      "network": "",
      "home": {
        "score": "",
        "names": {
          "char6": "OHIOST",
          "short": "Ohio St.",
          "seo": "ohio-st",
          "full": "The Ohio State University"
        },
        "winner": false,
        "seed": "",
        "description": "(9-0)",
        "rank": "2",
        "conferences": [
          {
            "conferenceName": "Big Ten",
            "conferenceSeo": "big-ten"
          },
          {
            "conferenceName": "Top 25",
            "conferenceSeo": "top-25"
          }
        ]
      },
      "liveVideoEnabled": false,
      "startTime": "12:00PM ET",
      "startTimeEpoch": "1668272400",
      "bracketId": "",
      "gameState": "pre",
      "startDate": "11-12-2022",
      "currentPeriod": "",
      "videoState": "",
      "bracketRegion": "",
      "contestClock": ""
    }},
    {"game": {
      "gameID": "409824",
      "away": {
        "score": "",
        "names": {
          "char6": "PURDUE",
          "short": "Purdue",
          "seo": "purdue",
          "full": "Purdue University"
        },
        "winner": false,
        "seed": "",
        "description": "(5-4)",
        "rank": "",
        "conferences": [{
          "conferenceName": "Big Ten",
          "conferenceSeo": "big-ten"
        }]
      },
      "finalMessage": "",
      "bracketRound": "",
      "title": "Illinois Purdue",
      "contestName": "",
      "url": "/game/6006246",
      "network": "",
      "home": {
        "score": "",
        "names": {
          "char6": "ILL",
          "short": "Illinois",
          "seo": "illinois",
          "full": "University of Illinois Urbana-Champaign"
        },
        "winner": false,
        "seed": "",
        "description": "(7-2)",
        "rank": "21",
        "conferences": [
          {
            "conferenceName": "Big Ten",
            "conferenceSeo": "big-ten"
          },
          {
            "conferenceName": "Top 25",
            "conferenceSeo": "top-25"
          }
        ]
      },
      "liveVideoEnabled": false,
      "startTime": "12:00PM ET",
      "startTimeEpoch": "1668272400",
      "bracketId": "",
      "gameState": "pre",
      "startDate": "11-12-2022",
      "currentPeriod": "",
      "videoState": "",
      "bracketRegion": "",
      "contestClock": ""
    }},
    {"game": {
      "gameID": "409654",
      "away": {
        "score": "",
        "names": {
          "char6": "VT",
          "short": "Virginia Tech",
          "seo": "virginia-tech",
          "full": "Virginia Polytechnic Institute and State University"
        },
        "winner": false,
        "seed": "",
        "description": "(2-7)",
        "rank": "",
        "conferences": [{
          "conferenceName": "ACC",
          "conferenceSeo": "acc"
        }]
      },
      "finalMessage": "",
      "bracketRound": "",
      "title": "Duke Virginia Tech",
      "contestName": "",
      "url": "/game/6006251",
      "network": "",
      "home": {
        "score": "",
        "names": {
          "char6": "DUKE",
          "short": "Duke",
          "seo": "duke",
          "full": "Duke University"
        },
        "winner": false,
        "seed": "",
        "description": "(6-3)",
        "rank": "",
        "conferences": [{
          "conferenceName": "ACC",
          "conferenceSeo": "acc"
        }]
      },
      "liveVideoEnabled": false,
      "startTime": "12:00PM ET",
      "startTimeEpoch": "1668272400",
      "bracketId": "",
      "gameState": "pre",
      "startDate": "11-12-2022",
      "currentPeriod": "",
      "videoState": "",
      "bracketRegion": "",
      "contestClock": ""
    }},
    {"game": {
      "gameID": "410436",
      "away": {
        "score": "",
        "names": {
          "char6": "MIZZOU",
          "short": "Missouri",
          "seo": "missouri",
          "full": "University of Missouri, Columbia"
        },
        "winner": false,
        "seed": "",
        "description": "(4-5)",
        "rank": "",
        "conferences": [{
          "conferenceName": "SEC",
          "conferenceSeo": "sec"
        }]
      },
      "finalMessage": "",
      "bracketRound": "",
      "title": "Tennessee Missouri",
      "contestName": "",
      "url": "/game/6006256",
      "network": "",
      "home": {
        "score": "",
        "names": {
          "char6": "TENN",
          "short": "Tennessee",
          "seo": "tennessee",
          "full": "University of Tennessee, Knoxville"
        },
        "winner": false,
        "seed": "",
        "description": "(8-1)",
        "rank": "5",
        "conferences": [
          {
            "conferenceName": "SEC",
            "conferenceSeo": "sec"
          },
          {
            "conferenceName": "Top 25",
            "conferenceSeo": "top-25"
          }
        ]
      },
      "liveVideoEnabled": false,
      "startTime": "12:00PM ET",
      "startTimeEpoch": "1668272400",
      "bracketId": "",
      "gameState": "pre",
      "startDate": "11-12-2022",
      "currentPeriod": "",
      "videoState": "",
      "bracketRegion": "",
      "contestClock": ""
    }},
    {"game": {
      "gameID": "409893",
      "away": {
        "score": "",
        "names": {
          "char6": "VANDY",
          "short": "Vanderbilt",
          "seo": "vanderbilt",
          "full": "Vanderbilt University"
        },
        "winner": false,
        "seed": "",
        "description": "(3-6)",
        "rank": "",
        "conferences": [{
          "conferenceName": "SEC",
          "conferenceSeo": "sec"
        }]
      },
      "finalMessage": "",
      "bracketRound": "",
      "title": "Kentucky Vanderbilt",
      "contestName": "",
      "url": "/game/6006264",
      "network": "",
      "home": {
        "score": "",
        "names": {
          "char6": "UK",
          "short": "Kentucky",
          "seo": "kentucky",
          "full": "University of Kentucky"
        },
        "winner": false,
        "seed": "",
        "description": "(6-3)",
        "rank": "24",
        "conferences": [
          {
            "conferenceName": "SEC",
            "conferenceSeo": "sec"
          },
          {
            "conferenceName": "Top 25",
            "conferenceSeo": "top-25"
          }
        ]
      },
      "liveVideoEnabled": false,
      "startTime": "12:00PM ET",
      "startTimeEpoch": "1668272400",
      "bracketId": "",
      "gameState": "pre",
      "startDate": "11-12-2022",
      "currentPeriod": "",
      "videoState": "",
      "bracketRegion": "",
      "contestClock": ""
    }},
    {"game": {
      "gameID": "31684",
      "away": {
        "score": "",
        "names": {
          "char6": "LA MON",
          "short": "ULM",
          "seo": "la-monroe",
          "full": "University of Louisiana Monroe"
        },
        "winner": false,
        "seed": "",
        "description": "(3-6)",
        "rank": "",
        "conferences": [{
          "conferenceName": "Sun Belt",
          "conferenceSeo": "sun-belt"
        }]
      },
      "finalMessage": "",
      "bracketRound": "",
      "title": "Georgia St. ULM",
      "contestName": "",
      "url": "/game/6006240",
      "network": "",
      "home": {
        "score": "",
        "names": {
          "char6": "GA ST",
          "short": "Georgia St.",
          "seo": "georgia-st",
          "full": "Georgia State University"
        },
        "winner": false,
        "seed": "",
        "description": "(4-5)",
        "rank": "",
        "conferences": [{
          "conferenceName": "Sun Belt",
          "conferenceSeo": "sun-belt"
        }]
      },
      "liveVideoEnabled": false,
      "startTime": "01:00PM ET",
      "startTimeEpoch": "1668276000",
      "bracketId": "",
      "gameState": "pre",
      "startDate": "11-12-2022",
      "currentPeriod": "",
      "videoState": "",
      "bracketRegion": "",
      "contestClock": ""
    }},
    {"game": {
      "gameID": "31690",
      "away": {
        "score": "",
        "names": {
          "char6": "JMU",
          "short": "James Madison",
          "seo": "james-madison",
          "full": "James Madison University"
        },
        "winner": false,
        "seed": "",
        "description": "(5-3)",
        "rank": "",
        "conferences": [{
          "conferenceName": "Sun Belt",
          "conferenceSeo": "sun-belt"
        }]
      },
      "finalMessage": "",
      "bracketRound": "",
      "title": "Old Dominion James Madison",
      "contestName": "",
      "url": "/game/6006247",
      "network": "",
      "home": {
        "score": "",
        "names": {
          "char6": "ODU",
          "short": "Old Dominion",
          "seo": "old-dominion",
          "full": "Old Dominion University"
        },
        "winner": false,
        "seed": "",
        "description": "(3-6)",
        "rank": "",
        "conferences": [{
          "conferenceName": "Sun Belt",
          "conferenceSeo": "sun-belt"
        }]
      },
      "liveVideoEnabled": false,
      "startTime": "01:00PM ET",
      "startTimeEpoch": "1668276000",
      "bracketId": "",
      "gameState": "pre",
      "startDate": "11-12-2022",
      "currentPeriod": "",
      "videoState": "",
      "bracketRegion": "",
      "contestClock": ""
    }},
    {"game": {
      "gameID": "31897",
      "away": {
        "score": "",
        "names": {
          "char6": "RICE",
          "short": "Rice",
          "seo": "rice",
          "full": "Rice University"
        },
        "winner": false,
        "seed": "",
        "description": "(5-4)",
        "rank": "",
        "conferences": [{
          "conferenceName": "C-USA",
          "conferenceSeo": "c-usa"
        }]
      },
      "finalMessage": "",
      "bracketRound": "",
      "title": "Western Ky. Rice",
      "contestName": "",
      "url": "/game/6006287",
      "network": "",
      "home": {
        "score": "",
        "names": {
          "char6": "W KY",
          "short": "Western Ky.",
          "seo": "western-ky",
          "full": "Western Kentucky University"
        },
        "winner": false,
        "seed": "",
        "description": "(6-4)",
        "rank": "",
        "conferences": [{
          "conferenceName": "C-USA",
          "conferenceSeo": "c-usa"
        }]
      },
      "liveVideoEnabled": false,
      "startTime": "02:00PM ET",
      "startTimeEpoch": "1668279600",
      "bracketId": "",
      "gameState": "pre",
      "startDate": "11-12-2022",
      "currentPeriod": "",
      "videoState": "",
      "bracketRegion": "",
      "contestClock": ""
    }},
    {"game": {
      "gameID": "31705",
      "away": {
        "score": "",
        "names": {
          "char6": "LAMAR",
          "short": "Lamar University",
          "seo": "lamar",
          "full": "Lamar University"
        },
        "winner": false,
        "seed": "",
        "description": "(1-8)",
        "rank": "",
        "conferences": [{
          "conferenceName": "Southland",
          "conferenceSeo": "southland"
        }]
      },
      "finalMessage": "",
      "bracketRound": "",
      "title": "New Mexico St. Lamar University",
      "contestName": "",
      "url": "/game/6006260",
      "network": "",
      "home": {
        "score": "",
        "names": {
          "char6": "NM ST",
          "short": "New Mexico St.",
          "seo": "new-mexico-st",
          "full": "New Mexico State University"
        },
        "winner": false,
        "seed": "",
        "description": "(2-5)",
        "rank": "",
        "conferences": [{
          "conferenceName": "FBS Independent",
          "conferenceSeo": "fbs-independent"
        }]
      },
      "liveVideoEnabled": false,
      "startTime": "02:00PM ET",
      "startTimeEpoch": "1668279600",
      "bracketId": "",
      "gameState": "pre",
      "startDate": "11-12-2022",
      "currentPeriod": "",
      "videoState": "",
      "bracketRegion": "",
      "contestClock": ""
    }},
    {"game": {
      "gameID": "31709",
      "away": {
        "score": "",
        "names": {
          "char6": "TEMPLE",
          "short": "Temple",
          "seo": "temple",
          "full": "Temple University"
        },
        "winner": false,
        "seed": "",
        "description": "(3-6)",
        "rank": "",
        "conferences": [{
          "conferenceName": "AAC",
          "conferenceSeo": "aac"
        }]
      },
      "finalMessage": "",
      "bracketRound": "",
      "title": "Houston Temple",
      "contestName": "",
      "url": "/game/6006263",
      "network": "",
      "home": {
        "score": "",
        "names": {
          "char6": "HOU",
          "short": "Houston",
          "seo": "houston",
          "full": "University of Houston"
        },
        "winner": false,
        "seed": "",
        "description": "(5-4)",
        "rank": "",
        "conferences": [{
          "conferenceName": "AAC",
          "conferenceSeo": "aac"
        }]
      },
      "liveVideoEnabled": false,
      "startTime": "03:00PM ET",
      "startTimeEpoch": "1668283200",
      "bracketId": "",
      "gameState": "pre",
      "startDate": "11-12-2022",
      "currentPeriod": "",
      "videoState": "",
      "bracketRegion": "",
      "contestClock": ""
    }},
    {"game": {
      "gameID": "31714",
      "away": {
        "score": "",
        "names": {
          "char6": "UMASS",
          "short": "Massachusetts",
          "seo": "massachusetts",
          "full": "University of Massachusetts, Amherst"
        },
        "winner": false,
        "seed": "",
        "description": "(1-8)",
        "rank": "",
        "conferences": [{
          "conferenceName": "FBS Independent",
          "conferenceSeo": "fbs-independent"
        }]
      },
      "finalMessage": "",
      "bracketRound": "",
      "title": "Arkansas St. Massachusetts",
      "contestName": "",
      "url": "/game/6006268",
      "network": "",
      "home": {
        "score": "",
        "names": {
          "char6": "ARK ST",
          "short": "Arkansas St.",
          "seo": "arkansas-st",
          "full": "Arkansas State University"
        },
        "winner": false,
        "seed": "",
        "description": "(2-7)",
        "rank": "",
        "conferences": [{
          "conferenceName": "Sun Belt",
          "conferenceSeo": "sun-belt"
        }]
      },
      "liveVideoEnabled": false,
      "startTime": "03:00PM ET",
      "startTimeEpoch": "1668283200",
      "bracketId": "",
      "gameState": "pre",
      "startDate": "11-12-2022",
      "currentPeriod": "",
      "videoState": "",
      "bracketRegion": "",
      "contestClock": ""
    }},
    {"game": {
      "gameID": "31720",
      "away": {
        "score": "",
        "names": {
          "char6": "APP ST",
          "short": "App State",
          "seo": "appalachian-st",
          "full": "Appalachian State University"
        },
        "winner": false,
        "seed": "",
        "description": "(5-4)",
        "rank": "",
        "conferences": [{
          "conferenceName": "Sun Belt",
          "conferenceSeo": "sun-belt"
        }]
      },
      "finalMessage": "",
      "bracketRound": "",
      "title": "Marshall App State",
      "contestName": "",
      "url": "/game/6006274",
      "network": "",
      "home": {
        "score": "",
        "names": {
          "char6": "MARSH",
          "short": "Marshall",
          "seo": "marshall",
          "full": "Marshall University"
        },
        "winner": false,
        "seed": "",
        "description": "(5-4)",
        "rank": "",
        "conferences": [{
          "conferenceName": "Sun Belt",
          "conferenceSeo": "sun-belt"
        }]
      },
      "liveVideoEnabled": false,
      "startTime": "03:30PM ET",
      "startTimeEpoch": "1668285000",
      "bracketId": "",
      "gameState": "pre",
      "startDate": "11-12-2022",
      "currentPeriod": "",
      "videoState": "",
      "bracketRegion": "",
      "contestClock": ""
    }},
    {"game": {
      "gameID": "410653",
      "away": {
        "score": "",
        "names": {
          "char6": "AZ ST",
          "short": "Arizona St.",
          "seo": "arizona-st",
          "full": "Arizona State University"
        },
        "winner": false,
        "seed": "",
        "description": "(3-6)",
        "rank": "",
        "conferences": [{
          "conferenceName": "Pac-12",
          "conferenceSeo": "pac-12"
        }]
      },
      "finalMessage": "",
      "bracketRound": "",
      "title": "Washington St. Arizona St.",
      "contestName": "",
      "url": "/game/6006276",
      "network": "",
      "home": {
        "score": "",
        "names": {
          "char6": "WASHST",
          "short": "Washington St.",
          "seo": "washington-st",
          "full": "Washington State University"
        },
        "winner": false,
        "seed": "",
        "description": "(5-4)",
        "rank": "",
        "conferences": [{
          "conferenceName": "Pac-12",
          "conferenceSeo": "pac-12"
        }]
      },
      "liveVideoEnabled": false,
      "startTime": "03:30PM ET",
      "startTimeEpoch": "1668285000",
      "bracketId": "",
      "gameState": "pre",
      "startDate": "11-12-2022",
      "currentPeriod": "",
      "videoState": "",
      "bracketRegion": "",
      "contestClock": ""
    }},
    {"game": {
      "gameID": "31730",
      "away": {
        "score": "",
        "names": {
          "char6": "ARMY",
          "short": "Army West Point",
          "seo": "army",
          "full": "U.S. Military Academy"
        },
        "winner": false,
        "seed": "",
        "description": "(3-5)",
        "rank": "",
        "conferences": [{
          "conferenceName": "FBS Independent",
          "conferenceSeo": "fbs-independent"
        }]
      },
      "finalMessage": "",
      "bracketRound": "",
      "title": "Troy Army West Point",
      "contestName": "",
      "url": "/game/6006281",
      "network": "",
      "home": {
        "score": "",
        "names": {
          "char6": "TROY",
          "short": "Troy",
          "seo": "troy",
          "full": "Troy University"
        },
        "winner": false,
        "seed": "",
        "description": "(7-2)",
        "rank": "",
        "conferences": [{
          "conferenceName": "Sun Belt",
          "conferenceSeo": "sun-belt"
        }]
      },
      "liveVideoEnabled": false,
      "startTime": "03:30PM ET",
      "startTimeEpoch": "1668285000",
      "bracketId": "",
      "gameState": "pre",
      "startDate": "11-12-2022",
      "currentPeriod": "",
      "videoState": "",
      "bracketRegion": "",
      "contestClock": ""
    }},
    {"game": {
      "gameID": "410196",
      "away": {
        "score": "",
        "names": {
          "char6": "ALA",
          "short": "Alabama",
          "seo": "alabama",
          "full": "University of Alabama"
        },
        "winner": false,
        "seed": "",
        "description": "(7-2)",
        "rank": "9",
        "conferences": [
          {
            "conferenceName": "SEC",
            "conferenceSeo": "sec"
          },
          {
            "conferenceName": "Top 25",
            "conferenceSeo": "top-25"
          }
        ]
      },
      "finalMessage": "",
      "bracketRound": "",
      "title": "Ole Miss Alabama",
      "contestName": "",
      "url": "/game/6006282",
      "network": "",
      "home": {
        "score": "",
        "names": {
          "char6": "MISS",
          "short": "Ole Miss",
          "seo": "ole-miss",
          "full": "University of Mississippi"
        },
        "winner": false,
        "seed": "",
        "description": "(8-1)",
        "rank": "11",
        "conferences": [
          {
            "conferenceName": "SEC",
            "conferenceSeo": "sec"
          },
          {
            "conferenceName": "Top 25",
            "conferenceSeo": "top-25"
          }
        ]
      },
      "liveVideoEnabled": false,
      "startTime": "03:30PM ET",
      "startTimeEpoch": "1668285000",
      "bracketId": "",
      "gameState": "pre",
      "startDate": "11-12-2022",
      "currentPeriod": "",
      "videoState": "",
      "bracketRegion": "",
      "contestClock": ""
    }},
    {"game": {
      "gameID": "31912",
      "away": {
        "score": "",
        "names": {
          "char6": "N MEX",
          "short": "New Mexico",
          "seo": "new-mexico",
          "full": "University of New Mexico"
        },
        "winner": false,
        "seed": "",
        "description": "(2-7)",
        "rank": "",
        "conferences": [{
          "conferenceName": "Mountain West",
          "conferenceSeo": "mountain-west"
        }]
      },
      "finalMessage": "",
      "bracketRound": "",
      "title": "Air Force New Mexico",
      "contestName": "",
      "url": "/game/6006288",
      "network": "",
      "home": {
        "score": "",
        "names": {
          "char6": "AIRFOR",
          "short": "Air Force",
          "seo": "air-force",
          "full": "U.S. Air Force Academy"
        },
        "winner": false,
        "seed": "",
        "description": "(6-3)",
        "rank": "",
        "conferences": [{
          "conferenceName": "Mountain West",
          "conferenceSeo": "mountain-west"
        }]
      },
      "liveVideoEnabled": false,
      "startTime": "03:30PM ET",
      "startTimeEpoch": "1668285000",
      "bracketId": "",
      "gameState": "pre",
      "startDate": "11-12-2022",
      "currentPeriod": "",
      "videoState": "",
      "bracketRegion": "",
      "contestClock": ""
    }},
    {"game": {
      "gameID": "31950",
      "away": {
        "score": "",
        "names": {
          "char6": "CHAR",
          "short": "Charlotte",
          "seo": "charlotte",
          "full": "The University of North Carolina at Charlotte"
        },
        "winner": false,
        "seed": "",
        "description": "(2-8)",
        "rank": "",
        "conferences": [{
          "conferenceName": "C-USA",
          "conferenceSeo": "c-usa"
        }]
      },
      "finalMessage": "",
      "bracketRound": "",
      "title": "Middle Tenn. Charlotte",
      "contestName": "",
      "url": "/game/6006289",
      "network": "",
      "home": {
        "score": "",
        "names": {
          "char6": "MIDTEN",
          "short": "Middle Tenn.",
          "seo": "middle-tenn",
          "full": "Middle Tennessee State University"
        },
        "winner": false,
        "seed": "",
        "description": "(4-5)",
        "rank": "",
        "conferences": [{
          "conferenceName": "C-USA",
          "conferenceSeo": "c-usa"
        }]
      },
      "liveVideoEnabled": false,
      "startTime": "03:30PM ET",
      "startTimeEpoch": "1668285000",
      "bracketId": "",
      "gameState": "pre",
      "startDate": "11-12-2022",
      "currentPeriod": "",
      "videoState": "",
      "bracketRegion": "",
      "contestClock": ""
    }},
    {"game": {
      "gameID": "31951",
      "away": {
        "score": "",
        "names": {
          "char6": "NO TEX",
          "short": "North Texas",
          "seo": "north-texas",
          "full": "University of North Texas"
        },
        "winner": false,
        "seed": "",
        "description": "(6-4)",
        "rank": "",
        "conferences": [{
          "conferenceName": "C-USA",
          "conferenceSeo": "c-usa"
        }]
      },
      "finalMessage": "",
      "bracketRound": "",
      "title": "UAB North Texas",
      "contestName": "",
      "url": "/game/6006290",
      "network": "",
      "home": {
        "score": "",
        "names": {
          "char6": "UAB",
          "short": "UAB",
          "seo": "uab",
          "full": "University of Alabama at Birmingham"
        },
        "winner": false,
        "seed": "",
        "description": "(4-5)",
        "rank": "",
        "conferences": [{
          "conferenceName": "C-USA",
          "conferenceSeo": "c-usa"
        }]
      },
      "liveVideoEnabled": false,
      "startTime": "03:30PM ET",
      "startTimeEpoch": "1668285000",
      "bracketId": "",
      "gameState": "pre",
      "startDate": "11-12-2022",
      "currentPeriod": "",
      "videoState": "",
      "bracketRegion": "",
      "contestClock": ""
    }},
    {"game": {
      "gameID": "31954",
      "away": {
        "score": "",
        "names": {
          "char6": "LATECH",
          "short": "Louisiana Tech",
          "seo": "louisiana-tech",
          "full": "Louisiana Tech University"
        },
        "winner": false,
        "seed": "",
        "description": "(3-6)",
        "rank": "",
        "conferences": [{
          "conferenceName": "C-USA",
          "conferenceSeo": "c-usa"
        }]
      },
      "finalMessage": "",
      "bracketRound": "",
      "title": "UTSA Louisiana Tech",
      "contestName": "",
      "url": "/game/6006291",
      "network": "",
      "home": {
        "score": "",
        "names": {
          "char6": "UTSA",
          "short": "UTSA",
          "seo": "utsa",
          "full": "University of Texas at San Antonio"
        },
        "winner": false,
        "seed": "",
        "description": "(7-2)",
        "rank": "",
        "conferences": [{
          "conferenceName": "C-USA",
          "conferenceSeo": "c-usa"
        }]
      },
      "liveVideoEnabled": false,
      "startTime": "03:30PM ET",
      "startTimeEpoch": "1668285000",
      "bracketId": "",
      "gameState": "pre",
      "startDate": "11-12-2022",
      "currentPeriod": "",
      "videoState": "",
      "bracketRegion": "",
      "contestClock": ""
    }},
    {"game": {
      "gameID": "410260",
      "away": {
        "score": "",
        "names": {
          "char6": "MD",
          "short": "Maryland",
          "seo": "maryland",
          "full": "University of Maryland, College Park"
        },
        "winner": false,
        "seed": "",
        "description": "(6-3)",
        "rank": "",
        "conferences": [{
          "conferenceName": "Big Ten",
          "conferenceSeo": "big-ten"
        }]
      },
      "finalMessage": "",
      "bracketRound": "",
      "title": "Penn St. Maryland",
      "contestName": "",
      "url": "/game/6006249",
      "network": "",
      "home": {
        "score": "",
        "names": {
          "char6": "PENNST",
          "short": "Penn St.",
          "seo": "penn-st",
          "full": "Pennsylvania State University"
        },
        "winner": false,
        "seed": "",
        "description": "(7-2)",
        "rank": "14",
        "conferences": [
          {
            "conferenceName": "Big Ten",
            "conferenceSeo": "big-ten"
          },
          {
            "conferenceName": "Top 25",
            "conferenceSeo": "top-25"
          }
        ]
      },
      "liveVideoEnabled": false,
      "startTime": "03:30PM ET",
      "startTimeEpoch": "1668285000",
      "bracketId": "",
      "gameState": "pre",
      "startDate": "11-12-2022",
      "currentPeriod": "",
      "videoState": "",
      "bracketRegion": "",
      "contestClock": ""
    }},
    {"game": {
      "gameID": "409993",
      "away": {
        "score": "",
        "names": {
          "char6": "NWSTRN",
          "short": "Northwestern",
          "seo": "northwestern",
          "full": "Northwestern University"
        },
        "winner": false,
        "seed": "",
        "description": "(1-8)",
        "rank": "",
        "conferences": [{
          "conferenceName": "Big Ten",
          "conferenceSeo": "big-ten"
        }]
      },
      "finalMessage": "",
      "bracketRound": "",
      "title": "Minnesota Northwestern",
      "contestName": "",
      "url": "/game/6006253",
      "network": "",
      "home": {
        "score": "",
        "names": {
          "char6": "MINN",
          "short": "Minnesota",
          "seo": "minnesota",
          "full": "University of Minnesota, Twin Cities"
        },
        "winner": false,
        "seed": "",
        "description": "(6-3)",
        "rank": "",
        "conferences": [{
          "conferenceName": "Big Ten",
          "conferenceSeo": "big-ten"
        }]
      },
      "liveVideoEnabled": false,
      "startTime": "03:30PM ET",
      "startTimeEpoch": "1668285000",
      "bracketId": "",
      "gameState": "pre",
      "startDate": "11-12-2022",
      "currentPeriod": "",
      "videoState": "",
      "bracketRegion": "",
      "contestClock": ""
    }},
    {"game": {
      "gameID": "409554",
      "away": {
        "score": "",
        "names": {
          "char6": "LOUIS",
          "short": "Louisville",
          "seo": "louisville",
          "full": "University of Louisville"
        },
        "winner": false,
        "seed": "",
        "description": "(6-3)",
        "rank": "",
        "conferences": [{
          "conferenceName": "ACC",
          "conferenceSeo": "acc"
        }]
      },
      "finalMessage": "",
      "bracketRound": "",
      "title": "Clemson Louisville",
      "contestName": "",
      "url": "/game/6006254",
      "network": "",
      "home": {
        "score": "",
        "names": {
          "char6": "CLEM",
          "short": "Clemson",
          "seo": "clemson",
          "full": "Clemson University"
        },
        "winner": false,
        "seed": "",
        "description": "(8-1)",
        "rank": "10",
        "conferences": [
          {
            "conferenceName": "ACC",
            "conferenceSeo": "acc"
          },
          {
            "conferenceName": "Top 25",
            "conferenceSeo": "top-25"
          }
        ]
      },
      "liveVideoEnabled": false,
      "startTime": "03:30PM ET",
      "startTimeEpoch": "1668285000",
      "bracketId": "",
      "gameState": "pre",
      "startDate": "11-12-2022",
      "currentPeriod": "",
      "videoState": "",
      "bracketRegion": "",
      "contestClock": ""
    }},
    {"game": {
      "gameID": "31701",
      "away": {
        "score": "",
        "names": {
          "char6": "UCF",
          "short": "UCF",
          "seo": "ucf",
          "full": "University of Central Florida"
        },
        "winner": false,
        "seed": "",
        "description": "(7-2)",
        "rank": "22",
        "conferences": [
          {
            "conferenceName": "AAC",
            "conferenceSeo": "aac"
          },
          {
            "conferenceName": "Top 25",
            "conferenceSeo": "top-25"
          }
        ]
      },
      "finalMessage": "",
      "bracketRound": "",
      "title": "Tulane UCF",
      "contestName": "",
      "url": "/game/6006257",
      "network": "",
      "home": {
        "score": "",
        "names": {
          "char6": "TULANE",
          "short": "Tulane",
          "seo": "tulane",
          "full": "Tulane University"
        },
        "winner": false,
        "seed": "",
        "description": "(8-1)",
        "rank": "17",
        "conferences": [
          {
            "conferenceName": "AAC",
            "conferenceSeo": "aac"
          },
          {
            "conferenceName": "Top 25",
            "conferenceSeo": "top-25"
          }
        ]
      },
      "liveVideoEnabled": false,
      "startTime": "03:30PM ET",
      "startTimeEpoch": "1668285000",
      "bracketId": "",
      "gameState": "pre",
      "startDate": "11-12-2022",
      "currentPeriod": "",
      "videoState": "",
      "bracketRegion": "",
      "contestClock": ""
    }},
    {"game": {
      "gameID": "410092",
      "away": {
        "score": "",
        "names": {
          "char6": "BC",
          "short": "Boston College",
          "seo": "boston-college",
          "full": "Boston College"
        },
        "winner": false,
        "seed": "",
        "description": "(2-7)",
        "rank": "",
        "conferences": [{
          "conferenceName": "ACC",
          "conferenceSeo": "acc"
        }]
      },
      "finalMessage": "",
      "bracketRound": "",
      "title": "NC State Boston College",
      "contestName": "",
      "url": "/game/6006259",
      "network": "",
      "home": {
        "score": "",
        "names": {
          "char6": "NC ST",
          "short": "NC State",
          "seo": "north-carolina-st",
          "full": "North Carolina State University"
        },
        "winner": false,
        "seed": "",
        "description": "(7-2)",
        "rank": "16",
        "conferences": [
          {
            "conferenceName": "ACC",
            "conferenceSeo": "acc"
          },
          {
            "conferenceName": "Top 25",
            "conferenceSeo": "top-25"
          }
        ]
      },
      "liveVideoEnabled": false,
      "startTime": "03:30PM ET",
      "startTimeEpoch": "1668285000",
      "bracketId": "",
      "gameState": "pre",
      "startDate": "11-12-2022",
      "currentPeriod": "",
      "videoState": "",
      "bracketRegion": "",
      "contestClock": ""
    }},
    {"game": {
      "gameID": "409760",
      "away": {
        "score": "",
        "names": {
          "char6": "MIAMI",
          "short": "Miami (FL)",
          "seo": "miami-fl",
          "full": "University of Miami (Florida)"
        },
        "winner": false,
        "seed": "",
        "description": "(4-5)",
        "rank": "",
        "conferences": [{
          "conferenceName": "ACC",
          "conferenceSeo": "acc"
        }]
      },
      "finalMessage": "",
      "bracketRound": "",
      "title": "Georgia Tech Miami (FL)",
      "contestName": "",
      "url": "/game/6006261",
      "network": "",
      "home": {
        "score": "",
        "names": {
          "char6": "GATECH",
          "short": "Georgia Tech",
          "seo": "georgia-tech",
          "full": "Georgia Institute of Technology"
        },
        "winner": false,
        "seed": "",
        "description": "(4-5)",
        "rank": "",
        "conferences": [{
          "conferenceName": "ACC",
          "conferenceSeo": "acc"
        }]
      },
      "liveVideoEnabled": false,
      "startTime": "03:30PM ET",
      "startTimeEpoch": "1668285000",
      "bracketId": "",
      "gameState": "pre",
      "startDate": "11-12-2022",
      "currentPeriod": "",
      "videoState": "",
      "bracketRegion": "",
      "contestClock": ""
    }},
    {"game": {
      "gameID": "409972",
      "away": {
        "score": "",
        "names": {
          "char6": "NEB",
          "short": "Nebraska",
          "seo": "nebraska",
          "full": "University of Nebraska, Lincoln"
        },
        "winner": false,
        "seed": "",
        "description": "(3-6)",
        "rank": "",
        "conferences": [{
          "conferenceName": "Big Ten",
          "conferenceSeo": "big-ten"
        }]
      },
      "finalMessage": "",
      "bracketRound": "",
      "title": "Michigan Nebraska",
      "contestName": "",
      "url": "/game/6006265",
      "network": "",
      "home": {
        "score": "",
        "names": {
          "char6": "MICH",
          "short": "Michigan",
          "seo": "michigan",
          "full": "University of Michigan"
        },
        "winner": false,
        "seed": "",
        "description": "(9-0)",
        "rank": "3",
        "conferences": [
          {
            "conferenceName": "Big Ten",
            "conferenceSeo": "big-ten"
          },
          {
            "conferenceName": "Top 25",
            "conferenceSeo": "top-25"
          }
        ]
      },
      "liveVideoEnabled": false,
      "startTime": "03:30PM ET",
      "startTimeEpoch": "1668285000",
      "bracketId": "",
      "gameState": "pre",
      "startDate": "11-12-2022",
      "currentPeriod": "",
      "videoState": "",
      "bracketRegion": "",
      "contestClock": ""
    }},
    {"game": {
      "gameID": "410182",
      "away": {
        "score": "",
        "names": {
          "char6": "IOWAST",
          "short": "Iowa St.",
          "seo": "iowa-st",
          "full": "Iowa State University"
        },
        "winner": false,
        "seed": "",
        "description": "(4-5)",
        "rank": "",
        "conferences": [{
          "conferenceName": "Big 12",
          "conferenceSeo": "big-12"
        }]
      },
      "finalMessage": "",
      "bracketRound": "",
      "title": "Oklahoma St. Iowa St.",
      "contestName": "",
      "url": "/game/6006271",
      "network": "",
      "home": {
        "score": "",
        "names": {
          "char6": "OKLAST",
          "short": "Oklahoma St.",
          "seo": "oklahoma-st",
          "full": "Oklahoma State University"
        },
        "winner": false,
        "seed": "",
        "description": "(6-3)",
        "rank": "",
        "conferences": [{
          "conferenceName": "Big 12",
          "conferenceSeo": "big-12"
        }]
      },
      "liveVideoEnabled": false,
      "startTime": "03:30PM ET",
      "startTimeEpoch": "1668285000",
      "bracketId": "",
      "gameState": "pre",
      "startDate": "11-12-2022",
      "currentPeriod": "",
      "videoState": "",
      "bracketRegion": "",
      "contestClock": ""
    }},
    {"game": {
      "gameID": "409851",
      "away": {
        "score": "",
        "names": {
          "char6": "WISC",
          "short": "Wisconsin",
          "seo": "wisconsin",
          "full": "University of Wisconsin-Madison"
        },
        "winner": false,
        "seed": "",
        "description": "(5-4)",
        "rank": "",
        "conferences": [{
          "conferenceName": "Big Ten",
          "conferenceSeo": "big-ten"
        }]
      },
      "finalMessage": "",
      "bracketRound": "",
      "title": "Iowa Wisconsin",
      "contestName": "",
      "url": "/game/6006273",
      "network": "",
      "home": {
        "score": "",
        "names": {
          "char6": "IOWA",
          "short": "Iowa",
          "seo": "iowa",
          "full": "University of Iowa"
        },
        "winner": false,
        "seed": "",
        "description": "(5-4)",
        "rank": "",
        "conferences": [{
          "conferenceName": "Big Ten",
          "conferenceSeo": "big-ten"
        }]
      },
      "liveVideoEnabled": false,
      "startTime": "03:35PM ET",
      "startTimeEpoch": "1668285300",
      "bracketId": "",
      "gameState": "pre",
      "startDate": "11-12-2022",
      "currentPeriod": "",
      "videoState": "",
      "bracketRegion": "",
      "contestClock": ""
    }},
    {"game": {
      "gameID": "409705",
      "away": {
        "score": "",
        "names": {
          "char6": "S CAR",
          "short": "South Carolina",
          "seo": "south-carolina",
          "full": "University of South Carolina, Columbia"
        },
        "winner": false,
        "seed": "",
        "description": "(6-3)",
        "rank": "",
        "conferences": [{
          "conferenceName": "SEC",
          "conferenceSeo": "sec"
        }]
      },
      "finalMessage": "",
      "bracketRound": "",
      "title": "Florida South Carolina",
      "contestName": "",
      "url": "/game/6006239",
      "network": "",
      "home": {
        "score": "",
        "names": {
          "char6": "FLA",
          "short": "Florida",
          "seo": "florida",
          "full": "University of Florida"
        },
        "winner": false,
        "seed": "",
        "description": "(5-4)",
        "rank": "",
        "conferences": [{
          "conferenceName": "SEC",
          "conferenceSeo": "sec"
        }]
      },
      "liveVideoEnabled": false,
      "startTime": "04:00PM ET",
      "startTimeEpoch": "1668286800",
      "bracketId": "",
      "gameState": "pre",
      "startDate": "11-12-2022",
      "currentPeriod": "",
      "videoState": "",
      "bracketRegion": "",
      "contestClock": ""
    }},
    {"game": {
      "gameID": "410308",
      "away": {
        "score": "",
        "names": {
          "char6": "TX ST",
          "short": "Texas St.",
          "seo": "texas-st",
          "full": "Texas State University"
        },
        "winner": false,
        "seed": "",
        "description": "(3-6)",
        "rank": "",
        "conferences": [{
          "conferenceName": "Sun Belt",
          "conferenceSeo": "sun-belt"
        }]
      },
      "finalMessage": "",
      "bracketRound": "",
      "title": "South Alabama Texas St.",
      "contestName": "",
      "url": "/game/6006267",
      "network": "",
      "home": {
        "score": "",
        "names": {
          "char6": "S ALA",
          "short": "South Alabama",
          "seo": "south-ala",
          "full": "University of South Alabama"
        },
        "winner": false,
        "seed": "",
        "description": "(7-2)",
        "rank": "",
        "conferences": [{
          "conferenceName": "Sun Belt",
          "conferenceSeo": "sun-belt"
        }]
      },
      "liveVideoEnabled": false,
      "startTime": "05:00PM ET",
      "startTimeEpoch": "1668290400",
      "bracketId": "",
      "gameState": "pre",
      "startDate": "11-12-2022",
      "currentPeriod": "",
      "videoState": "",
      "bracketRegion": "",
      "contestClock": ""
    }},
    {"game": {
      "gameID": "409617",
      "away": {
        "score": "",
        "names": {
          "char6": "WYO",
          "short": "Wyoming",
          "seo": "wyoming",
          "full": "University of Wyoming"
        },
        "winner": false,
        "seed": "",
        "description": "(6-3)",
        "rank": "",
        "conferences": [{
          "conferenceName": "Mountain West",
          "conferenceSeo": "mountain-west"
        }]
      },
      "finalMessage": "",
      "bracketRound": "",
      "title": "Colorado St. Wyoming",
      "contestName": "",
      "url": "/game/6006292",
      "network": "",
      "home": {
        "score": "",
        "names": {
          "char6": "CO ST",
          "short": "Colorado St.",
          "seo": "colorado-st",
          "full": "Colorado State University"
        },
        "winner": false,
        "seed": "",
        "description": "(2-7)",
        "rank": "",
        "conferences": [{
          "conferenceName": "Mountain West",
          "conferenceSeo": "mountain-west"
        }]
      },
      "liveVideoEnabled": false,
      "startTime": "07:00PM ET",
      "startTimeEpoch": "1668297600",
      "bracketId": "",
      "gameState": "pre",
      "startDate": "11-12-2022",
      "currentPeriod": "",
      "videoState": "",
      "bracketRegion": "",
      "contestClock": ""
    }},
    {"game": {
      "gameID": "31970",
      "away": {
        "score": "",
        "names": {
          "char6": "FAU",
          "short": "Fla. Atlantic",
          "seo": "fla-atlantic",
          "full": "Florida Atlantic University"
        },
        "winner": false,
        "seed": "",
        "description": "(4-5)",
        "rank": "",
        "conferences": [{
          "conferenceName": "C-USA",
          "conferenceSeo": "c-usa"
        }]
      },
      "finalMessage": "",
      "bracketRound": "",
      "title": "FIU Fla. Atlantic",
      "contestName": "",
      "url": "/game/6006293",
      "network": "",
      "home": {
        "score": "",
        "names": {
          "char6": "FIU",
          "short": "FIU",
          "seo": "fiu",
          "full": "Florida International University"
        },
        "winner": false,
        "seed": "",
        "description": "(4-5)",
        "rank": "",
        "conferences": [{
          "conferenceName": "C-USA",
          "conferenceSeo": "c-usa"
        }]
      },
      "liveVideoEnabled": false,
      "startTime": "07:00PM ET",
      "startTimeEpoch": "1668297600",
      "bracketId": "",
      "gameState": "pre",
      "startDate": "11-12-2022",
      "currentPeriod": "",
      "videoState": "",
      "bracketRegion": "",
      "contestClock": ""
    }},
    {"game": {
      "gameID": "410449",
      "away": {
        "score": "",
        "names": {
          "char6": "KANSAS",
          "short": "Kansas",
          "seo": "kansas",
          "full": "University of Kansas"
        },
        "winner": false,
        "seed": "",
        "description": "(6-3)",
        "rank": "",
        "conferences": [{
          "conferenceName": "Big 12",
          "conferenceSeo": "big-12"
        }]
      },
      "finalMessage": "",
      "bracketRound": "",
      "title": "Texas Tech Kansas",
      "contestName": "",
      "url": "/game/6006241",
      "network": "",
      "home": {
        "score": "",
        "names": {
          "char6": "TXTECH",
          "short": "Texas Tech",
          "seo": "texas-tech",
          "full": "Texas Tech University"
        },
        "winner": false,
        "seed": "",
        "description": "(4-5)",
        "rank": "",
        "conferences": [{
          "conferenceName": "Big 12",
          "conferenceSeo": "big-12"
        }]
      },
      "liveVideoEnabled": false,
      "startTime": "07:00PM ET",
      "startTimeEpoch": "1668297600",
      "bracketId": "",
      "gameState": "pre",
      "startDate": "11-12-2022",
      "currentPeriod": "",
      "videoState": "",
      "bracketRegion": "",
      "contestClock": ""
    }},
    {"game": {
      "gameID": "410202",
      "away": {
        "score": "",
        "names": {
          "char6": "WASH",
          "short": "Washington",
          "seo": "washington",
          "full": "University of Washington"
        },
        "winner": false,
        "seed": "",
        "description": "(7-2)",
        "rank": "25",
        "conferences": [
          {
            "conferenceName": "Pac-12",
            "conferenceSeo": "pac-12"
          },
          {
            "conferenceName": "Top 25",
            "conferenceSeo": "top-25"
          }
        ]
      },
      "finalMessage": "",
      "bracketRound": "",
      "title": "Oregon Washington",
      "contestName": "",
      "url": "/game/6006255",
      "network": "",
      "home": {
        "score": "",
        "names": {
          "char6": "OREGN",
          "short": "Oregon",
          "seo": "oregon",
          "full": "University of Oregon"
        },
        "winner": false,
        "seed": "",
        "description": "(8-1)",
        "rank": "6",
        "conferences": [
          {
            "conferenceName": "Pac-12",
            "conferenceSeo": "pac-12"
          },
          {
            "conferenceName": "Top 25",
            "conferenceSeo": "top-25"
          }
        ]
      },
      "liveVideoEnabled": false,
      "startTime": "07:00PM ET",
      "startTimeEpoch": "1668297600",
      "bracketId": "",
      "gameState": "pre",
      "startDate": "11-12-2022",
      "currentPeriod": "",
      "videoState": "",
      "bracketRegion": "",
      "contestClock": ""
    }},
    {"game": {
      "gameID": "409490",
      "away": {
        "score": "",
        "names": {
          "char6": "KAN ST",
          "short": "Kansas St.",
          "seo": "kansas-st",
          "full": "Kansas State University"
        },
        "winner": false,
        "seed": "",
        "description": "(6-3)",
        "rank": "19",
        "conferences": [
          {
            "conferenceName": "Big 12",
            "conferenceSeo": "big-12"
          },
          {
            "conferenceName": "Top 25",
            "conferenceSeo": "top-25"
          }
        ]
      },
      "finalMessage": "",
      "bracketRound": "",
      "title": "Baylor Kansas St.",
      "contestName": "",
      "url": "/game/6006266",
      "network": "",
      "home": {
        "score": "",
        "names": {
          "char6": "BAYLOR",
          "short": "Baylor",
          "seo": "baylor",
          "full": "Baylor University"
        },
        "winner": false,
        "seed": "",
        "description": "(6-3)",
        "rank": "",
        "conferences": [{
          "conferenceName": "Big 12",
          "conferenceSeo": "big-12"
        }]
      },
      "liveVideoEnabled": false,
      "startTime": "07:00PM ET",
      "startTimeEpoch": "1668297600",
      "bracketId": "",
      "gameState": "pre",
      "startDate": "11-12-2022",
      "currentPeriod": "",
      "videoState": "",
      "bracketRegion": "",
      "contestClock": ""
    }},
    {"game": {
      "gameID": "410035",
      "away": {
        "score": "",
        "names": {
          "char6": "UGA",
          "short": "Georgia",
          "seo": "georgia",
          "full": "University of Georgia"
        },
        "winner": false,
        "seed": "",
        "description": "(9-0)",
        "rank": "1",
        "conferences": [
          {
            "conferenceName": "SEC",
            "conferenceSeo": "sec"
          },
          {
            "conferenceName": "Top 25",
            "conferenceSeo": "top-25"
          }
        ]
      },
      "finalMessage": "",
      "bracketRound": "",
      "title": "Mississippi St. Georgia",
      "contestName": "",
      "url": "/game/6006269",
      "network": "",
      "home": {
        "score": "",
        "names": {
          "char6": "MISSST",
          "short": "Mississippi St.",
          "seo": "mississippi-st",
          "full": "Mississippi State University"
        },
        "winner": false,
        "seed": "",
        "description": "(6-3)",
        "rank": "",
        "conferences": [{
          "conferenceName": "SEC",
          "conferenceSeo": "sec"
        }]
      },
      "liveVideoEnabled": false,
      "startTime": "07:00PM ET",
      "startTimeEpoch": "1668297600",
      "bracketId": "",
      "gameState": "pre",
      "startDate": "11-12-2022",
      "currentPeriod": "",
      "videoState": "",
      "bracketRegion": "",
      "contestClock": ""
    }},
    {"game": {
      "gameID": "410639",
      "away": {
        "score": "",
        "names": {
          "char6": "UNC",
          "short": "North Carolina",
          "seo": "north-carolina",
          "full": "University of North Carolina, Chapel Hill"
        },
        "winner": false,
        "seed": "",
        "description": "(8-1)",
        "rank": "15",
        "conferences": [
          {
            "conferenceName": "ACC",
            "conferenceSeo": "acc"
          },
          {
            "conferenceName": "Top 25",
            "conferenceSeo": "top-25"
          }
        ]
      },
      "finalMessage": "",
      "bracketRound": "",
      "title": "Wake Forest North Carolina",
      "contestName": "",
      "url": "/game/6006277",
      "network": "",
      "home": {
        "score": "",
        "names": {
          "char6": "WAKE",
          "short": "Wake Forest",
          "seo": "wake-forest",
          "full": "Wake Forest University"
        },
        "winner": false,
        "seed": "",
        "description": "(6-3)",
        "rank": "",
        "conferences": [{
          "conferenceName": "ACC",
          "conferenceSeo": "acc"
        }]
      },
      "liveVideoEnabled": false,
      "startTime": "07:30PM ET",
      "startTimeEpoch": "1668299400",
      "bracketId": "",
      "gameState": "pre",
      "startDate": "11-12-2022",
      "currentPeriod": "",
      "videoState": "",
      "bracketRegion": "",
      "contestClock": ""
    }},
    {"game": {
      "gameID": "410442",
      "away": {
        "score": "",
        "names": {
          "char6": "TCU",
          "short": "TCU",
          "seo": "tcu",
          "full": "Texas Christian University"
        },
        "winner": false,
        "seed": "",
        "description": "(9-0)",
        "rank": "4",
        "conferences": [
          {
            "conferenceName": "Big 12",
            "conferenceSeo": "big-12"
          },
          {
            "conferenceName": "Top 25",
            "conferenceSeo": "top-25"
          }
        ]
      },
      "finalMessage": "",
      "bracketRound": "",
      "title": "Texas TCU",
      "contestName": "",
      "url": "/game/6006252",
      "network": "",
      "home": {
        "score": "",
        "names": {
          "char6": "TEXAS",
          "short": "Texas",
          "seo": "texas",
          "full": "University of Texas at Austin"
        },
        "winner": false,
        "seed": "",
        "description": "(6-3)",
        "rank": "18",
        "conferences": [
          {
            "conferenceName": "Big 12",
            "conferenceSeo": "big-12"
          },
          {
            "conferenceName": "Top 25",
            "conferenceSeo": "top-25"
          }
        ]
      },
      "liveVideoEnabled": false,
      "startTime": "07:30PM ET",
      "startTimeEpoch": "1668299400",
      "bracketId": "",
      "gameState": "pre",
      "startDate": "11-12-2022",
      "currentPeriod": "",
      "videoState": "",
      "bracketRegion": "",
      "contestClock": ""
    }},
    {"game": {
      "gameID": "409563",
      "away": {
        "score": "",
        "names": {
          "char6": "S MISS",
          "short": "Southern Miss.",
          "seo": "southern-miss",
          "full": "The University of Southern Mississippi"
        },
        "winner": false,
        "seed": "",
        "description": "(5-4)",
        "rank": "",
        "conferences": [{
          "conferenceName": "Sun Belt",
          "conferenceSeo": "sun-belt"
        }]
      },
      "finalMessage": "",
      "bracketRound": "",
      "title": "Coastal Carolina Southern Miss.",
      "contestName": "",
      "url": "/game/6006258",
      "network": "",
      "home": {
        "score": "",
        "names": {
          "char6": "CO CAR",
          "short": "Coastal Carolina",
          "seo": "coastal-caro",
          "full": "Coastal Carolina University"
        },
        "winner": false,
        "seed": "",
        "description": "(8-1)",
        "rank": "",
        "conferences": [{
          "conferenceName": "Sun Belt",
          "conferenceSeo": "sun-belt"
        }]
      },
      "liveVideoEnabled": false,
      "startTime": "07:30PM ET",
      "startTimeEpoch": "1668299400",
      "bracketId": "",
      "gameState": "pre",
      "startDate": "11-12-2022",
      "currentPeriod": "",
      "videoState": "",
      "bracketRegion": "",
      "contestClock": ""
    }},
    {"game": {
      "gameID": "409470",
      "away": {
        "score": "",
        "names": {
          "char6": "TX A&M",
          "short": "Texas A&M",
          "seo": "texas-am",
          "full": "Texas A&M University, College Station"
        },
        "winner": false,
        "seed": "",
        "description": "(3-6)",
        "rank": "",
        "conferences": [{
          "conferenceName": "SEC",
          "conferenceSeo": "sec"
        }]
      },
      "finalMessage": "",
      "bracketRound": "",
      "title": "Auburn Texas A&M",
      "contestName": "",
      "url": "/game/6006262",
      "network": "",
      "home": {
        "score": "",
        "names": {
          "char6": "AUBURN",
          "short": "Auburn",
          "seo": "auburn",
          "full": "Auburn University"
        },
        "winner": false,
        "seed": "",
        "description": "(3-6)",
        "rank": "",
        "conferences": [{
          "conferenceName": "SEC",
          "conferenceSeo": "sec"
        }]
      },
      "liveVideoEnabled": false,
      "startTime": "07:30PM ET",
      "startTimeEpoch": "1668299400",
      "bracketId": "",
      "gameState": "pre",
      "startDate": "11-12-2022",
      "currentPeriod": "",
      "videoState": "",
      "bracketRegion": "",
      "contestClock": ""
    }},
    {"game": {
      "gameID": "410401",
      "away": {
        "score": "",
        "names": {
          "char6": "FSU",
          "short": "Florida St.",
          "seo": "florida-st",
          "full": "Florida State University"
        },
        "winner": false,
        "seed": "",
        "description": "(6-3)",
        "rank": "23",
        "conferences": [
          {
            "conferenceName": "ACC",
            "conferenceSeo": "acc"
          },
          {
            "conferenceName": "Top 25",
            "conferenceSeo": "top-25"
          }
        ]
      },
      "finalMessage": "",
      "bracketRound": "",
      "title": "Syracuse Florida St.",
      "contestName": "",
      "url": "/game/6006270",
      "network": "",
      "home": {
        "score": "",
        "names": {
          "char6": "SYR",
          "short": "Syracuse",
          "seo": "syracuse",
          "full": "Syracuse University"
        },
        "winner": false,
        "seed": "",
        "description": "(6-3)",
        "rank": "",
        "conferences": [{
          "conferenceName": "ACC",
          "conferenceSeo": "acc"
        }]
      },
      "liveVideoEnabled": false,
      "startTime": "08:00PM ET",
      "startTimeEpoch": "1668301200",
      "bracketId": "",
      "gameState": "pre",
      "startDate": "11-12-2022",
      "currentPeriod": "",
      "videoState": "",
      "bracketRegion": "",
      "contestClock": ""
    }},
    {"game": {
      "gameID": "410209",
      "away": {
        "score": "",
        "names": {
          "char6": "CAL",
          "short": "California",
          "seo": "california",
          "full": "University of California, Berkeley"
        },
        "winner": false,
        "seed": "",
        "description": "(3-6)",
        "rank": "",
        "conferences": [{
          "conferenceName": "Pac-12",
          "conferenceSeo": "pac-12"
        }]
      },
      "finalMessage": "",
      "bracketRound": "",
      "title": "Oregon St. California",
      "contestName": "",
      "url": "/game/6006250",
      "network": "",
      "home": {
        "score": "",
        "names": {
          "char6": "ORE ST",
          "short": "Oregon St.",
          "seo": "oregon-st",
          "full": "Oregon State University"
        },
        "winner": false,
        "seed": "",
        "description": "(6-3)",
        "rank": "",
        "conferences": [{
          "conferenceName": "Pac-12",
          "conferenceSeo": "pac-12"
        }]
      },
      "liveVideoEnabled": false,
      "startTime": "09:00PM ET",
      "startTimeEpoch": "1668304800",
      "bracketId": "",
      "gameState": "pre",
      "startDate": "11-12-2022",
      "currentPeriod": "",
      "videoState": "",
      "bracketRegion": "",
      "contestClock": ""
    }},
    {"game": {
      "gameID": "410590",
      "away": {
        "score": "",
        "names": {
          "char6": "STAN",
          "short": "Stanford",
          "seo": "stanford",
          "full": "Stanford University"
        },
        "winner": false,
        "seed": "",
        "description": "(3-6)",
        "rank": "",
        "conferences": [{
          "conferenceName": "Pac-12",
          "conferenceSeo": "pac-12"
        }]
      },
      "finalMessage": "",
      "bracketRound": "",
      "title": "Utah Stanford",
      "contestName": "",
      "url": "/game/6006243",
      "network": "",
      "home": {
        "score": "",
        "names": {
          "char6": "UTAH",
          "short": "Utah",
          "seo": "utah",
          "full": "University of Utah"
        },
        "winner": false,
        "seed": "",
        "description": "(7-2)",
        "rank": "13",
        "conferences": [
          {
            "conferenceName": "Pac-12",
            "conferenceSeo": "pac-12"
          },
          {
            "conferenceName": "Top 25",
            "conferenceSeo": "top-25"
          }
        ]
      },
      "liveVideoEnabled": false,
      "startTime": "10:00PM ET",
      "startTimeEpoch": "1668308400",
      "bracketId": "",
      "gameState": "pre",
      "startDate": "11-12-2022",
      "currentPeriod": "",
      "videoState": "",
      "bracketRegion": "",
      "contestClock": ""
    }},
    {"game": {
      "gameID": "31729",
      "away": {
        "score": "",
        "names": {
          "char6": "SJSU",
          "short": "San Jose St.",
          "seo": "san-jose-st",
          "full": "San Jose State University"
        },
        "winner": false,
        "seed": "",
        "description": "(6-2)",
        "rank": "",
        "conferences": [{
          "conferenceName": "Mountain West",
          "conferenceSeo": "mountain-west"
        }]
      },
      "finalMessage": "",
      "bracketRound": "",
      "title": "San Diego St. San Jose St.",
      "contestName": "",
      "url": "/game/6006280",
      "network": "",
      "home": {
        "score": "",
        "names": {
          "char6": "SDSU",
          "short": "San Diego St.",
          "seo": "san-diego-st",
          "full": "San Diego State University"
        },
        "winner": false,
        "seed": "",
        "description": "(5-4)",
        "rank": "",
        "conferences": [{
          "conferenceName": "Mountain West",
          "conferenceSeo": "mountain-west"
        }]
      },
      "liveVideoEnabled": false,
      "startTime": "10:30PM ET",
      "startTimeEpoch": "1668310200",
      "bracketId": "",
      "gameState": "pre",
      "startDate": "11-12-2022",
      "currentPeriod": "",
      "videoState": "",
      "bracketRegion": "",
      "contestClock": ""
    }},
    {"game": {
      "gameID": "31973",
      "away": {
        "score": "",
        "names": {
          "char6": "BOISE",
          "short": "Boise St.",
          "seo": "boise-st",
          "full": "Boise State University"
        },
        "winner": false,
        "seed": "",
        "description": "(6-3)",
        "rank": "",
        "conferences": [{
          "conferenceName": "Mountain West",
          "conferenceSeo": "mountain-west"
        }]
      },
      "finalMessage": "",
      "bracketRound": "",
      "title": "Nevada Boise St.",
      "contestName": "",
      "url": "/game/6006294",
      "network": "",
      "home": {
        "score": "",
        "names": {
          "char6": "NEVADA",
          "short": "Nevada",
          "seo": "nevada",
          "full": "University of Nevada, Reno"
        },
        "winner": false,
        "seed": "",
        "description": "(2-7)",
        "rank": "",
        "conferences": [{
          "conferenceName": "Mountain West",
          "conferenceSeo": "mountain-west"
        }]
      },
      "liveVideoEnabled": false,
      "startTime": "10:30PM ET",
      "startTimeEpoch": "1668310200",
      "bracketId": "",
      "gameState": "pre",
      "startDate": "11-12-2022",
      "currentPeriod": "",
      "videoState": "",
      "bracketRegion": "",
      "contestClock": ""
    }},
    {"game": {
      "gameID": "410541",
      "away": {
        "score": "",
        "names": {
          "char6": "ARIZ",
          "short": "Arizona",
          "seo": "arizona",
          "full": "University of Arizona"
        },
        "winner": false,
        "seed": "",
        "description": "(3-6)",
        "rank": "",
        "conferences": [{
          "conferenceName": "Pac-12",
          "conferenceSeo": "pac-12"
        }]
      },
      "finalMessage": "",
      "bracketRound": "",
      "title": "UCLA Arizona",
      "contestName": "",
      "url": "/game/6006245",
      "network": "",
      "home": {
        "score": "",
        "names": {
          "char6": "UCLA",
          "short": "UCLA",
          "seo": "ucla",
          "full": "University of California, Los Angeles"
        },
        "winner": false,
        "seed": "",
        "description": "(8-1)",
        "rank": "12",
        "conferences": [
          {
            "conferenceName": "Pac-12",
            "conferenceSeo": "pac-12"
          },
          {
            "conferenceName": "Top 25",
            "conferenceSeo": "top-25"
          }
        ]
      },
      "liveVideoEnabled": false,
      "startTime": "10:30PM ET",
      "startTimeEpoch": "1668310200",
      "bracketId": "",
      "gameState": "pre",
      "startDate": "11-12-2022",
      "currentPeriod": "",
      "videoState": "",
      "bracketRegion": "",
      "contestClock": ""
    }},
    {"game": {
      "gameID": "31692",
      "away": {
        "score": "",
        "names": {
          "char6": "UT ST",
          "short": "Utah St.",
          "seo": "utah-st",
          "full": "Utah State University"
        },
        "winner": false,
        "seed": "",
        "description": "(4-5)",
        "rank": "",
        "conferences": [{
          "conferenceName": "Mountain West",
          "conferenceSeo": "mountain-west"
        }]
      },
      "finalMessage": "",
      "bracketRound": "",
      "title": "Hawaii Utah St.",
      "contestName": "",
      "url": "/game/6006248",
      "network": "",
      "home": {
        "score": "",
        "names": {
          "char6": "HAWAII",
          "short": "Hawaii",
          "seo": "hawaii",
          "full": "University of Hawaii, Manoa"
        },
        "winner": false,
        "seed": "",
        "description": "(2-8)",
        "rank": "",
        "conferences": [{
          "conferenceName": "Mountain West",
          "conferenceSeo": "mountain-west"
        }]
      },
      "liveVideoEnabled": false,
      "startTime": "11:00PM ET",
      "startTimeEpoch": "1668312000",
      "bracketId": "",
      "gameState": "pre",
      "startDate": "11-12-2022",
      "currentPeriod": "",
      "videoState": "",
      "bracketRegion": "",
      "contestClock": ""
    }}
  ]
}