{
  "FloridaAtlantic vs SouthernMiss": {
    "stadium": "MMRobertsStadium-Hattiesburg-MS",
    "FloridaAtlantic": {
      "points": 31,
      "1st downs": 19,
      "rushing 1st downs": 7,
      "passing 1st downs": 9,
      "penalty 1st downs": 3,
      "rushing yards": 164,
      "rushing attempts": 34,
      "passing yards": 162,
      "passing attempts": 34,
      "passing completions": 17,
      "passing interceptions": 1,
      "total yards": 326,
      "total plays": 68,
      "fumbles": 0,
      "fumbles lost": 0,
      "penalties": 7,
      "penalty yards": 60,
      "punts": 6,
      "punt yards": 259,
      "punt returns": 0,
      "punt return yards": 0,
      "kickoff returns": 5,
      "kickoff return yards": 115,
      "interception returns": 1,
      "interception return yards": 6,
      "3rd down conversions": 5,
      "3rd down attempts": 16,
      "4th down conversions": 2,
      "4th down attempts": 3
    },
    "SouthernMiss": {
      "points": 45,
      "1st downs": 22,
      "rushing 1st downs": 12,
      "passing 1st downs": 10,
      "penalty 1st downs": 0,
      "rushing yards": 305,
      "rushing attempts": 48,
      "passing yards": 209,
      "passing attempts": 19,
      "passing completions": 13,
      "passing interceptions": 1,
      "total yards": 514,
      "total plays": 67,
      "fumbles": 2,
      "fumbles lost": 2,
      "penalties": 8,
      "penalty yards": 83,
      "punts": 2,
      "punt yards": 76,
      "punt returns": 0,
      "punt return yards": 0,
      "kickoff returns": 3,
      "kickoff return yards": 145,
      "interception returns": 1,
      "interception return yards": 0,
      "3rd down conversions": 7,
      "3rd down attempts": 12,
      "4th down conversions": 0,
      "4th down attempts": 1
    }
  },
  "Pittsburgh vs GeorgiaTech": {
    "stadium": "BobbyDoddStadiumatHistoricGrantField-Atlanta-GA",
    "Pittsburgh": {
      "points": 34,
      "1st downs": 28,
      "rushing 1st downs": 14,
      "passing 1st downs": 8,
      "penalty 1st downs": 6,
      "rushing yards": 317,
      "rushing attempts": 54,
      "passing yards": 196,
      "passing attempts": 34,
      "passing completions": 17,
      "passing interceptions": 1,
      "total yards": 513,
      "total plays": 88,
      "fumbles": 3,
      "fumbles lost": 0,
      "penalties": 6,
      "penalty yards": 60,
      "punts": 2,
      "punt yards": 87,
      "punt returns": 1,
      "punt return yards": 8,
      "kickoff returns": 3,
      "kickoff return yards": 70,
      "interception returns": 2,
      "interception return yards": -2,
      "3rd down conversions": 8,
      "3rd down attempts": 18,
      "4th down conversions": 1,
      "4th down attempts": 3
    },
    "GeorgiaTech": {
      "points": 20,
      "1st downs": 21,
      "rushing 1st downs": 6,
      "passing 1st downs": 13,
      "penalty 1st downs": 2,
      "rushing yards": 98,
      "rushing attempts": 29,
      "passing yards": 250,
      "passing attempts": 36,
      "passing completions": 19,
      "passing interceptions": 2,
      "total yards": 348,
      "total plays": 65,
      "fumbles": 2,
      "fumbles lost": 1,
      "penalties": 8,
      "penalty yards": 86,
      "punts": 5,
      "punt yards": 255,
      "punt returns": 0,
      "punt return yards": 0,
      "kickoff returns": 1,
      "kickoff return yards": 5,
      "interception returns": 1,
      "interception return yards": 6,
      "3rd down conversions": 5,
      "3rd down attempts": 14,
      "4th down conversions": 3,
      "4th down attempts": 4
    }
  },
  "NorthTexas vs UTEP": {
    "stadium": "ApogeeStadium-Denton-TX",
    "NorthTexas": {
      "points": 45,
      "1st downs": 24,
      "rushing 1st downs": 10,
      "passing 1st downs": 9,
      "penalty 1st downs": 5,
      "rushing yards": 189,
      "rushing attempts": 44,
      "passing yards": 302,
      "passing attempts": 30,
      "passing completions": 16,
      "passing interceptions": 0,
      "total yards": 491,
      "total plays": 74,
      "fumbles": 1,
      "fumbles lost": 1,
      "penalties": 5,
      "penalty yards": 40,
      "punts": 4,
      "punt yards": 169,
      "punt returns": 0,
      "punt return yards": 0,
      "kickoff returns": 5,
      "kickoff return yards": 109,
      "interception returns": 4,
      "interception return yards": 1,
      "3rd down conversions": 2,
      "3rd down attempts": 10,
      "4th down conversions": 1,
      "4th down attempts": 2
    },
    "UTEP": {
      "points": 43,
      "1st downs": 27,
      "rushing 1st downs": 16,
      "passing 1st downs": 8,
      "penalty 1st downs": 3,
      "rushing yards": 301,
      "rushing attempts": 56,
      "passing yards": 196,
      "passing attempts": 26,
      "passing completions": 10,
      "passing interceptions": 4,
      "total yards": 497,
      "total plays": 82,
      "fumbles": 1,
      "fumbles lost": 0,
      "penalties": 12,
      "penalty yards": 93,
      "punts": 3,
      "punt yards": 117,
      "punt returns": 0,
      "punt return yards": 0,
      "kickoff returns": 7,
      "kickoff return yards": 137,
      "interception returns": 0,
      "interception return yards": 0,
      "3rd down conversions": 7,
      "3rd down attempts": 14,
      "4th down conversions": 0,
      "4th down attempts": 0
    }
  },
  "ArizonaState vs Arizona": {
    "stadium": "ArizonaStadium-Tucson-AZ",
    "ArizonaState": {
      "points": 70,
      "1st downs": 17,
      "rushing 1st downs": 8,
      "passing 1st downs": 7,
      "penalty 1st downs": 2,
      "rushing yards": 259,
      "rushing attempts": 50,
      "passing yards": 227,
      "passing attempts": 13,
      "passing completions": 10,
      "passing interceptions": 0,
      "total yards": 486,
      "total plays": 63,
      "fumbles": 2,
      "fumbles lost": 0,
      "penalties": 6,
      "penalty yards": 55,
      "punts": 2,
      "punt yards": 99,
      "punt returns": 1,
      "punt return yards": 9,
      "kickoff returns": 1,
      "kickoff return yards": 100,
      "interception returns": 3,
      "interception return yards": 14,
      "3rd down conversions": 4,
      "3rd down attempts": 10,
      "4th down conversions": 2,
      "4th down attempts": 3
    },
    "Arizona": {
      "points": 7,
      "1st downs": 18,
      "rushing 1st downs": 13,
      "passing 1st downs": 5,
      "penalty 1st downs": 0,
      "rushing yards": 137,
      "rushing attempts": 36,
      "passing yards": 213,
      "passing attempts": 46,
      "passing completions": 26,
      "passing interceptions": 3,
      "total yards": 350,
      "total plays": 82,
      "fumbles": 4,
      "fumbles lost": 4,
      "penalties": 6,
      "penalty yards": 64,
      "punts": 3,
      "punt yards": 141,
      "punt returns": 1,
      "punt return yards": 0,
      "kickoff returns": 3,
      "kickoff return yards": 50,
      "interception returns": 0,
      "interception return yards": 0,
      "3rd down conversions": 8,
      "3rd down attempts": 18,
      "4th down conversions": 0,
      "4th down attempts": 4
    }
  },
  "Nevada vs SanJoseState": {
    "stadium": "SamBoydStadium-LasVegas-NV",
    "Nevada": {
      "points": 20,
      "1st downs": 24,
      "rushing 1st downs": 7,
      "passing 1st downs": 14,
      "penalty 1st downs": 3,
      "rushing yards": 138,
      "rushing attempts": 26,
      "passing yards": 260,
      "passing attempts": 48,
      "passing completions": 33,
      "passing interceptions": 0,
      "total yards": 398,
      "total plays": 74,
      "fumbles": 2,
      "fumbles lost": 2,
      "penalties": 7,
      "penalty yards": 62,
      "punts": 3,
      "punt yards": 139,
      "punt returns": 0,
      "punt return yards": 0,
      "kickoff returns": 4,
      "kickoff return yards": 82,
      "interception returns": 1,
      "interception return yards": 31,
      "3rd down conversions": 6,
      "3rd down attempts": 13,
      "4th down conversions": 1,
      "4th down attempts": 2
    },
    "SanJoseState": {
      "points": 30,
      "1st downs": 18,
      "rushing 1st downs": 5,
      "passing 1st downs": 12,
      "penalty 1st downs": 1,
      "rushing yards": 200,
      "rushing attempts": 27,
      "passing yards": 306,
      "passing attempts": 30,
      "passing completions": 20,
      "passing interceptions": 1,
      "total yards": 506,
      "total plays": 57,
      "fumbles": 1,
      "fumbles lost": 0,
      "penalties": 11,
      "penalty yards": 93,
      "punts": 1,
      "punt yards": 51,
      "punt returns": 1,
      "punt return yards": 6,
      "kickoff returns": 3,
      "kickoff return yards": 131,
      "interception returns": 0,
      "interception return yards": 0,
      "3rd down conversions": 5,
      "3rd down attempts": 11,
      "4th down conversions": 0,
      "4th down attempts": 2
    }
  },
  "MichiganState vs PennState": {
    "stadium": "BeaverStadium-UniversityPark-PA",
    "MichiganState": {
      "points": 24,
      "1st downs": 21,
      "rushing 1st downs": 4,
      "passing 1st downs": 15,
      "penalty 1st downs": 2,
      "rushing yards": 64,
      "rushing attempts": 31,
      "passing yards": 325,
      "passing attempts": 39,
      "passing completions": 22,
      "passing interceptions": 1,
      "total yards": 389,
      "total plays": 70,
      "fumbles": 0,
      "fumbles lost": 0,
      "penalties": 7,
      "penalty yards": 57,
      "punts": 7,
      "punt yards": 310,
      "punt returns": 1,
      "punt return yards": 10,
      "kickoff returns": 1,
      "kickoff return yards": 20,
      "interception returns": 0,
      "interception return yards": 0,
      "3rd down conversions": 3,
      "3rd down attempts": 12,
      "4th down conversions": 0,
      "4th down attempts": 1
    },
    "PennState": {
      "points": 39,
      "1st downs": 21,
      "rushing 1st downs": 7,
      "passing 1st downs": 12,
      "penalty 1st downs": 2,
      "rushing yards": 119,
      "rushing attempts": 40,
      "passing yards": 286,
      "passing attempts": 30,
      "passing completions": 20,
      "passing interceptions": 0,
      "total yards": 405,
      "total plays": 70,
      "fumbles": 1,
      "fumbles lost": 1,
      "penalties": 5,
      "penalty yards": 45,
      "punts": 5,
      "punt yards": 209,
      "punt returns": 2,
      "punt return yards": 81,
      "kickoff returns": 5,
      "kickoff return yards": 102,
      "interception returns": 1,
      "interception return yards": 18,
      "3rd down conversions": 4,
      "3rd down attempts": 12,
      "4th down conversions": 0,
      "4th down attempts": 1
    }
  },
  "Rutgers vs Maryland": {
    "stadium": "CapitalOneFieldatMarylandStadium-CollegePark-MD",
    "Rutgers": {
      "points": 27,
      "1st downs": 24,
      "rushing 1st downs": 12,
      "passing 1st downs": 7,
      "penalty 1st downs": 5,
      "rushing yards": 231,
      "rushing attempts": 50,
      "passing yards": 148,
      "passing attempts": 38,
      "passing completions": 21,
      "passing interceptions": 0,
      "total yards": 379,
      "total plays": 88,
      "fumbles": 4,
      "fumbles lost": 0,
      "penalties": 6,
      "penalty yards": 60,
      "punts": 9,
      "punt yards": 402,
      "punt returns": 3,
      "punt return yards": 17,
      "kickoff returns": 5,
      "kickoff return yards": 101,
      "interception returns": 2,
      "interception return yards": 0,
      "3rd down conversions": 7,
      "3rd down attempts": 21,
      "4th down conversions": 1,
      "4th down attempts": 2
    },
    "Maryland": {
      "points": 24,
      "1st downs": 18,
      "rushing 1st downs": 8,
      "passing 1st downs": 9,
      "penalty 1st downs": 1,
      "rushing yards": 205,
      "rushing attempts": 40,
      "passing yards": 266,
      "passing attempts": 34,
      "passing completions": 20,
      "passing interceptions": 2,
      "total yards": 471,
      "total plays": 74,
      "fumbles": 0,
      "fumbles lost": 0,
      "penalties": 12,
      "penalty yards": 144,
      "punts": 9,
      "punt yards": 372,
      "punt returns": 1,
      "punt return yards": 0,
      "kickoff returns": 1,
      "kickoff return yards": 12,
      "interception returns": 0,
      "interception return yards": 0,
      "3rd down conversions": 5,
      "3rd down attempts": 16,
      "4th down conversions": 0,
      "4th down attempts": 0
    }
  },
  "Illinois vs Northwestern": {
    "stadium": "RyanField-Evanston-IL",
    "Illinois": {
      "points": 10,
      "1st downs": 14,
      "rushing 1st downs": 9,
      "passing 1st downs": 5,
      "penalty 1st downs": 0,
      "rushing yards": 155,
      "rushing attempts": 35,
      "passing yards": 107,
      "passing attempts": 22,
      "passing completions": 7,
      "passing interceptions": 0,
      "total yards": 262,
      "total plays": 57,
      "fumbles": 1,
      "fumbles lost": 0,
      "penalties": 4,
      "penalty yards": 35,
      "punts": 4,
      "punt yards": 220,
      "punt returns": 0,
      "punt return yards": 0,
      "kickoff returns": 4,
      "kickoff return yards": 65,
      "interception returns": 0,
      "interception return yards": 0,
      "3rd down conversions": 3,
      "3rd down attempts": 12,
      "4th down conversions": 1,
      "4th down attempts": 2
    },
    "Northwestern": {
      "points": 28,
      "1st downs": 23,
      "rushing 1st downs": 16,
      "passing 1st downs": 5,
      "penalty 1st downs": 2,
      "rushing yards": 411,
      "rushing attempts": 58,
      "passing yards": 82,
      "passing attempts": 12,
      "passing completions": 7,
      "passing interceptions": 0,
      "total yards": 493,
      "total plays": 70,
      "fumbles": 2,
      "fumbles lost": 1,
      "penalties": 6,
      "penalty yards": 40,
      "punts": 2,
      "punt yards": 92,
      "punt returns": 2,
      "punt return yards": 15,
      "kickoff returns": 1,
      "kickoff return yards": 0,
      "interception returns": 0,
      "interception return yards": 0,
      "3rd down conversions": 6,
      "3rd down attempts": 15,
      "4th down conversions": 5,
      "4th down attempts": 7
    }
  },
  "Minnesota vs Nebraska": {
    "stadium": "MemorialStadiumLincoln-NE-Lincoln",
    "Minnesota": {
      "points": 24,
      "1st downs": 19,
      "rushing 1st downs": 7,
      "passing 1st downs": 10,
      "penalty 1st downs": 2,
      "rushing yards": 206,
      "rushing attempts": 43,
      "passing yards": 181,
      "passing attempts": 30,
      "passing completions": 17,
      "passing interceptions": 0,
      "total yards": 387,
      "total plays": 73,
      "fumbles": 1,
      "fumbles lost": 0,
      "penalties": 3,
      "penalty yards": 20,
      "punts": 4,
      "punt yards": 159,
      "punt returns": 2,
      "punt return yards": -4,
      "kickoff returns": 1,
      "kickoff return yards": 9,
      "interception returns": 1,
      "interception return yards": 0,
      "3rd down conversions": 4,
      "3rd down attempts": 14,
      "4th down conversions": 2,
      "4th down attempts": 4
    },
    "Nebraska": {
      "points": 17,
      "1st downs": 17,
      "rushing 1st downs": 11,
      "passing 1st downs": 4,
      "penalty 1st downs": 2,
      "rushing yards": 197,
      "rushing attempts": 36,
      "passing yards": 111,
      "passing attempts": 29,
      "passing completions": 16,
      "passing interceptions": 1,
      "total yards": 308,
      "total plays": 65,
      "fumbles": 3,
      "fumbles lost": 1,
      "penalties": 3,
      "penalty yards": 32,
      "punts": 5,
      "punt yards": 192,
      "punt returns": 0,
      "punt return yards": 0,
      "kickoff returns": 2,
      "kickoff return yards": 43,
      "interception returns": 0,
      "interception return yards": 0,
      "3rd down conversions": 4,
      "3rd down attempts": 13,
      "4th down conversions": 0,
      "4th down attempts": 0
    }
  },
  "Utah vs Colorado": {
    "stadium": "FolsomField-Boulder-CO",
    "Utah": {
      "points": 38,
      "1st downs": 22,
      "rushing 1st downs": 9,
      "passing 1st downs": 12,
      "penalty 1st downs": 1,
      "rushing yards": 192,
      "rushing attempts": 40,
      "passing yards": 240,
      "passing attempts": 32,
      "passing completions": 20,
      "passing interceptions": 1,
      "total yards": 432,
      "total plays": 72,
      "fumbles": 3,
      "fumbles lost": 0,
      "penalties": 0,
      "penalty yards": 0,
      "punts": 5,
      "punt yards": 182,
      "punt returns": 3,
      "punt return yards": 44,
      "kickoff returns": 3,
      "kickoff return yards": 88,
      "interception returns": 1,
      "interception return yards": 11,
      "3rd down conversions": 6,
      "3rd down attempts": 15,
      "4th down conversions": 0,
      "4th down attempts": 1
    },
    "Colorado": {
      "points": 21,
      "1st downs": 15,
      "rushing 1st downs": 5,
      "passing 1st downs": 10,
      "penalty 1st downs": 0,
      "rushing yards": 110,
      "rushing attempts": 27,
      "passing yards": 267,
      "passing attempts": 39,
      "passing completions": 18,
      "passing interceptions": 1,
      "total yards": 377,
      "total plays": 66,
      "fumbles": 2,
      "fumbles lost": 2,
      "penalties": 4,
      "penalty yards": 35,
      "punts": 5,
      "punt yards": 224,
      "punt returns": 1,
      "punt return yards": 81,
      "kickoff returns": 4,
      "kickoff return yards": 96,
      "interception returns": 1,
      "interception return yards": 1,
      "3rd down conversions": 8,
      "3rd down attempts": 16,
      "4th down conversions": 0,
      "4th down attempts": 3
    }
  },
  "NorthernIllinois vs EasternMichigan": {
    "stadium": "RynearsonStadium-Ypsilanti-MI",
    "NorthernIllinois": {
      "points": 33,
      "1st downs": 25,
      "rushing 1st downs": 10,
      "passing 1st downs": 11,
      "penalty 1st downs": 4,
      "rushing yards": 199,
      "rushing attempts": 38,
      "passing yards": 221,
      "passing attempts": 37,
      "passing completions": 22,
      "passing interceptions": 0,
      "total yards": 420,
      "total plays": 75,
      "fumbles": 2,
      "fumbles lost": 1,
      "penalties": 6,
      "penalty yards": 63,
      "punts": 6,
      "punt yards": 287,
      "punt returns": 1,
      "punt return yards": 5,
      "kickoff returns": 6,
      "kickoff return yards": 127,
      "interception returns": 0,
      "interception return yards": 0,
      "3rd down conversions": 2,
      "3rd down attempts": 15,
      "4th down conversions": 3,
      "4th down attempts": 4
    },
    "EasternMichigan": {
      "points": 41,
      "1st downs": 25,
      "rushing 1st downs": 10,
      "passing 1st downs": 13,
      "penalty 1st downs": 2,
      "rushing yards": 131,
      "rushing attempts": 38,
      "passing yards": 242,
      "passing attempts": 29,
      "passing completions": 21,
      "passing interceptions": 0,
      "total yards": 373,
      "total plays": 67,
      "fumbles": 3,
      "fumbles lost": 1,
      "penalties": 5,
      "penalty yards": 41,
      "punts": 3,
      "punt yards": 130,
      "punt returns": 3,
      "punt return yards": 12,
      "kickoff returns": 2,
      "kickoff return yards": 27,
      "interception returns": 0,
      "interception return yards": 0,
      "3rd down conversions": 4,
      "3rd down attempts": 11,
      "4th down conversions": 1,
      "4th down attempts": 1
    }
  },
  "WesternMichigan vs BallState": {
    "stadium": "ScheumannStadium-Muncie-IN",
    "WesternMichigan": {
      "points": 27,
      "1st downs": 34,
      "rushing 1st downs": 15,
      "passing 1st downs": 16,
      "penalty 1st downs": 3,
      "rushing yards": 218,
      "rushing attempts": 51,
      "passing yards": 273,
      "passing attempts": 38,
      "passing completions": 24,
      "passing interceptions": 1,
      "total yards": 491,
      "total plays": 89,
      "fumbles": 3,
      "fumbles lost": 1,
      "penalties": 4,
      "penalty yards": 39,
      "punts": 2,
      "punt yards": 59,
      "punt returns": 1,
      "punt return yards": 0,
      "kickoff returns": 3,
      "kickoff return yards": 42,
      "interception returns": 0,
      "interception return yards": 0,
      "3rd down conversions": 9,
      "3rd down attempts": 17,
      "4th down conversions": 0,
      "4th down attempts": 1
    },
    "BallState": {
      "points": 30,
      "1st downs": 17,
      "rushing 1st downs": 7,
      "passing 1st downs": 9,
      "penalty 1st downs": 1,
      "rushing yards": 103,
      "rushing attempts": 33,
      "passing yards": 249,
      "passing attempts": 33,
      "passing completions": 22,
      "passing interceptions": 0,
      "total yards": 352,
      "total plays": 66,
      "fumbles": 1,
      "fumbles lost": 0,
      "penalties": 8,
      "penalty yards": 64,
      "punts": 5,
      "punt yards": 227,
      "punt returns": 0,
      "punt return yards": 0,
      "kickoff returns": 2,
      "kickoff return yards": 22,
      "interception returns": 1,
      "interception return yards": 14,
      "3rd down conversions": 6,
      "3rd down attempts": 14,
      "4th down conversions": 1,
      "4th down attempts": 2
    }
  },
  "WakeForest vs Louisville": {
    "stadium": "CardinalStadium-Louisville-KY",
    "WakeForest": {
      "points": 21,
      "1st downs": 17,
      "rushing 1st downs": 6,
      "passing 1st downs": 11,
      "penalty 1st downs": 0,
      "rushing yards": 127,
      "rushing attempts": 31,
      "passing yards": 224,
      "passing attempts": 41,
      "passing completions": 17,
      "passing interceptions": 1,
      "total yards": 351,
      "total plays": 72,
      "fumbles": 2,
      "fumbles lost": 1,
      "penalties": 5,
      "penalty yards": 39,
      "punts": 6,
      "punt yards": 249,
      "punt returns": 0,
      "punt return yards": 0,
      "kickoff returns": 7,
      "kickoff return yards": 98,
      "interception returns": 0,
      "interception return yards": 0,
      "3rd down conversions": 7,
      "3rd down attempts": 18,
      "4th down conversions": 1,
      "4th down attempts": 2
    },
    "Louisville": {
      "points": 45,
      "1st downs": 19,
      "rushing 1st downs": 10,
      "passing 1st downs": 8,
      "penalty 1st downs": 1,
      "rushing yards": 254,
      "rushing attempts": 47,
      "passing yards": 199,
      "passing attempts": 23,
      "passing completions": 17,
      "passing interceptions": 0,
      "total yards": 453,
      "total plays": 70,
      "fumbles": 0,
      "fumbles lost": 0,
      "penalties": 7,
      "penalty yards": 32,
      "punts": 4,
      "punt yards": 174,
      "punt returns": 0,
      "punt return yards": 0,
      "kickoff returns": 2,
      "kickoff return yards": 31,
      "interception returns": 1,
      "interception return yards": 21,
      "3rd down conversions": 7,
      "3rd down attempts": 14,
      "4th down conversions": 0,
      "4th down attempts": 2
    }
  },
  "Georgia vs Missouri": {
    "stadium": "FaurotFieldatMemorialStadium-Columbia-MO",
    "Georgia": {
      "points": 49,
      "1st downs": 28,
      "rushing 1st downs": 15,
      "passing 1st downs": 12,
      "penalty 1st downs": 1,
      "rushing yards": 316,
      "rushing attempts": 45,
      "passing yards": 299,
      "passing attempts": 28,
      "passing completions": 16,
      "passing interceptions": 0,
      "total yards": 615,
      "total plays": 73,
      "fumbles": 1,
      "fumbles lost": 0,
      "penalties": 1,
      "penalty yards": 9,
      "punts": 2,
      "punt yards": 98,
      "punt returns": 4,
      "punt return yards": 2,
      "kickoff returns": 1,
      "kickoff return yards": 21,
      "interception returns": 1,
      "interception return yards": 27,
      "3rd down conversions": 8,
      "3rd down attempts": 13,
      "4th down conversions": 0,
      "4th down attempts": 1
    },
    "Missouri": {
      "points": 14,
      "1st downs": 11,
      "rushing 1st downs": 3,
      "passing 1st downs": 7,
      "penalty 1st downs": 1,
      "rushing yards": 22,
      "rushing attempts": 22,
      "passing yards": 178,
      "passing attempts": 32,
      "passing completions": 20,
      "passing interceptions": 1,
      "total yards": 200,
      "total plays": 54,
      "fumbles": 0,
      "fumbles lost": 0,
      "penalties": 4,
      "penalty yards": 30,
      "punts": 8,
      "punt yards": 345,
      "punt returns": 1,
      "punt return yards": 17,
      "kickoff returns": 0,
      "kickoff return yards": 0,
      "interception returns": 0,
      "interception return yards": 0,
      "3rd down conversions": 3,
      "3rd down attempts": 11,
      "4th down conversions": 0,
      "4th down attempts": 0
    }
  },
  "Alabama vs Arkansas": {
    "stadium": "DonaldWReynoldsRazorbackStadium-Fayetteville-AR",
    "Alabama": {
      "points": 52,
      "1st downs": 24,
      "rushing 1st downs": 9,
      "passing 1st downs": 13,
      "penalty 1st downs": 2,
      "rushing yards": 216,
      "rushing attempts": 38,
      "passing yards": 227,
      "passing attempts": 33,
      "passing completions": 27,
      "passing interceptions": 0,
      "total yards": 443,
      "total plays": 71,
      "fumbles": 1,
      "fumbles lost": 1,
      "penalties": 2,
      "penalty yards": 23,
      "punts": 2,
      "punt yards": 75,
      "punt returns": 3,
      "punt return yards": 111,
      "kickoff returns": 1,
      "kickoff return yards": 10,
      "interception returns": 1,
      "interception return yards": 0,
      "3rd down conversions": 10,
      "3rd down attempts": 14,
      "4th down conversions": 0,
      "4th down attempts": 1
    },
    "Arkansas": {
      "points": 3,
      "1st downs": 13,
      "rushing 1st downs": 6,
      "passing 1st downs": 5,
      "penalty 1st downs": 2,
      "rushing yards": 80,
      "rushing attempts": 43,
      "passing yards": 108,
      "passing attempts": 17,
      "passing completions": 9,
      "passing interceptions": 1,
      "total yards": 188,
      "total plays": 60,
      "fumbles": 4,
      "fumbles lost": 3,
      "penalties": 8,
      "penalty yards": 36,
      "punts": 6,
      "punt yards": 243,
      "punt returns": 1,
      "punt return yards": 15,
      "kickoff returns": 1,
      "kickoff return yards": 18,
      "interception returns": 0,
      "interception return yards": 0,
      "3rd down conversions": 5,
      "3rd down attempts": 15,
      "4th down conversions": 0,
      "4th down attempts": 0
    }
  },
  "UAB vs Rice": {
    "stadium": "RiceStadium-Houston-TX",
    "UAB": {
      "points": 21,
      "1st downs": 13,
      "rushing 1st downs": 6,
      "passing 1st downs": 6,
      "penalty 1st downs": 1,
      "rushing yards": 137,
      "rushing attempts": 34,
      "passing yards": 217,
      "passing attempts": 18,
      "passing completions": 9,
      "passing interceptions": 0,
      "total yards": 354,
      "total plays": 52,
      "fumbles": 0,
      "fumbles lost": 0,
      "penalties": 9,
      "penalty yards": 89,
      "punts": 7,
      "punt yards": 324,
      "punt returns": 0,
      "punt return yards": 0,
      "kickoff returns": 2,
      "kickoff return yards": 34,
      "interception returns": 1,
      "interception return yards": 0,
      "3rd down conversions": 5,
      "3rd down attempts": 13,
      "4th down conversions": 0,
      "4th down attempts": 1
    },
    "Rice": {
      "points": 16,
      "1st downs": 20,
      "rushing 1st downs": 5,
      "passing 1st downs": 11,
      "penalty 1st downs": 4,
      "rushing yards": 66,
      "rushing attempts": 39,
      "passing yards": 166,
      "passing attempts": 33,
      "passing completions": 19,
      "passing interceptions": 1,
      "total yards": 232,
      "total plays": 72,
      "fumbles": 0,
      "fumbles lost": 0,
      "penalties": 4,
      "penalty yards": 24,
      "punts": 7,
      "punt yards": 304,
      "punt returns": 0,
      "punt return yards": 0,
      "kickoff returns": 1,
      "kickoff return yards": 23,
      "interception returns": 0,
      "interception return yards": 0,
      "3rd down conversions": 5,
      "3rd down attempts": 19,
      "4th down conversions": 3,
      "4th down attempts": 4
    }
  },
  "Akron vs Buffalo": {
    "stadium": "UBStadium-Buffalo-NY",
    "Akron": {
      "points": 7,
      "1st downs": 10,
      "rushing 1st downs": 3,
      "passing 1st downs": 6,
      "penalty 1st downs": 1,
      "rushing yards": 92,
      "rushing attempts": 30,
      "passing yards": 112,
      "passing attempts": 27,
      "passing completions": 12,
      "passing interceptions": 1,
      "total yards": 204,
      "total plays": 57,
      "fumbles": 0,
      "fumbles lost": 0,
      "penalties": 4,
      "penalty yards": 49,
      "punts": 8,
      "punt yards": 323,
      "punt returns": 0,
      "punt return yards": 0,
      "kickoff returns": 3,
      "kickoff return yards": 70,
      "interception returns": 1,
      "interception return yards": 0,
      "3rd down conversions": 3,
      "3rd down attempts": 15,
      "4th down conversions": 1,
      "4th down attempts": 2
    },
    "Buffalo": {
      "points": 56,
      "1st downs": 21,
      "rushing 1st downs": 17,
      "passing 1st downs": 2,
      "penalty 1st downs": 2,
      "rushing yards": 428,
      "rushing attempts": 50,
      "passing yards": 79,
      "passing attempts": 10,
      "passing completions": 6,
      "passing interceptions": 1,
      "total yards": 507,
      "total plays": 60,
      "fumbles": 0,
      "fumbles lost": 0,
      "penalties": 8,
      "penalty yards": 62,
      "punts": 3,
      "punt yards": 119,
      "punt returns": 5,
      "punt return yards": 42,
      "kickoff returns": 1,
      "kickoff return yards": 15,
      "interception returns": 1,
      "interception return yards": 34,
      "3rd down conversions": 5,
      "3rd down attempts": 11,
      "4th down conversions": 2,
      "4th down attempts": 2
    }
  },
  "Navy vs Army": {
    "stadium": "MichieStadium-WestPoint-NY",
    "Navy": {
      "points": 0,
      "1st downs": 4,
      "rushing 1st downs": 4,
      "passing 1st downs": 0,
      "penalty 1st downs": 0,
      "rushing yards": 108,
      "rushing attempts": 35,
      "passing yards": 9,
      "passing attempts": 7,
      "passing completions": 1,
      "passing interceptions": 0,
      "total yards": 117,
      "total plays": 42,
      "fumbles": 2,
      "fumbles lost": 1,
      "penalties": 6,
      "penalty yards": 53,
      "punts": 8,
      "punt yards": 298,
      "punt returns": 3,
      "punt return yards": 2,
      "kickoff returns": 0,
      "kickoff return yards": 0,
      "interception returns": 0,
      "interception return yards": 0,
      "3rd down conversions": 1,
      "3rd down attempts": 11,
      "4th down conversions": 0,
      "4th down attempts": 2
    },
    "Army": {
      "points": 15,
      "1st downs": 8,
      "rushing 1st downs": 6,
      "passing 1st downs": 1,
      "penalty 1st downs": 1,
      "rushing yards": 134,
      "rushing attempts": 53,
      "passing yards": 28,
      "passing attempts": 1,
      "passing completions": 1,
      "passing interceptions": 0,
      "total yards": 162,
      "total plays": 54,
      "fumbles": 1,
      "fumbles lost": 0,
      "penalties": 4,
      "penalty yards": 20,
      "punts": 7,
      "punt yards": 262,
      "punt returns": 2,
      "punt return yards": 11,
      "kickoff returns": 0,
      "kickoff return yards": 0,
      "interception returns": 0,
      "interception return yards": 0,
      "3rd down conversions": 4,
      "3rd down attempts": 14,
      "4th down conversions": 0,
      "4th down attempts": 0
    }
  },
  "CentralMichigan vs Toledo": {
    "stadium": "TheGlassBowl-Toledo-OH",
    "CentralMichigan": {
      "points": 23,
      "1st downs": 15,
      "rushing 1st downs": 8,
      "passing 1st downs": 7,
      "penalty 1st downs": 0,
      "rushing yards": 197,
      "rushing attempts": 42,
      "passing yards": 165,
      "passing attempts": 24,
      "passing completions": 12,
      "passing interceptions": 0,
      "total yards": 362,
      "total plays": 66,
      "fumbles": 2,
      "fumbles lost": 1,
      "penalties": 4,
      "penalty yards": 40,
      "punts": 9,
      "punt yards": 372,
      "punt returns": 4,
      "punt return yards": 16,
      "kickoff returns": 0,
      "kickoff return yards": 0,
      "interception returns": 3,
      "interception return yards": 5,
      "3rd down conversions": 3,
      "3rd down attempts": 15,
      "4th down conversions": 0,
      "4th down attempts": 0
    },
    "Toledo": {
      "points": 24,
      "1st downs": 25,
      "rushing 1st downs": 11,
      "passing 1st downs": 12,
      "penalty 1st downs": 2,
      "rushing yards": 126,
      "rushing attempts": 43,
      "passing yards": 265,
      "passing attempts": 33,
      "passing completions": 18,
      "passing interceptions": 3,
      "total yards": 391,
      "total plays": 76,
      "fumbles": 1,
      "fumbles lost": 1,
      "penalties": 4,
      "penalty yards": 17,
      "punts": 7,
      "punt yards": 263,
      "punt returns": 3,
      "punt return yards": 14,
      "kickoff returns": 4,
      "kickoff return yards": 43,
      "interception returns": 0,
      "interception return yards": 0,
      "3rd down conversions": 8,
      "3rd down attempts": 17,
      "4th down conversions": 0,
      "4th down attempts": 0
    }
  },
  "CoastalCarolina vs Troy": {
    "stadium": "VeteransMemorialStadium-Troy-AL",
    "CoastalCarolina": {
      "points": 42,
      "1st downs": 29,
      "rushing 1st downs": 9,
      "passing 1st downs": 17,
      "penalty 1st downs": 3,
      "rushing yards": 176,
      "rushing attempts": 43,
      "passing yards": 338,
      "passing attempts": 29,
      "passing completions": 24,
      "passing interceptions": 1,
      "total yards": 514,
      "total plays": 72,
      "fumbles": 0,
      "fumbles lost": 0,
      "penalties": 6,
      "penalty yards": 70,
      "punts": 2,
      "punt yards": 91,
      "punt returns": 1,
      "punt return yards": -3,
      "kickoff returns": 0,
      "kickoff return yards": 0,
      "interception returns": 2,
      "interception return yards": 55,
      "3rd down conversions": 8,
      "3rd down attempts": 13,
      "4th down conversions": 1,
      "4th down attempts": 2
    },
    "Troy": {
      "points": 38,
      "1st downs": 29,
      "rushing 1st downs": 6,
      "passing 1st downs": 21,
      "penalty 1st downs": 2,
      "rushing yards": 89,
      "rushing attempts": 26,
      "passing yards": 354,
      "passing attempts": 55,
      "passing completions": 34,
      "passing interceptions": 2,
      "total yards": 443,
      "total plays": 81,
      "fumbles": 3,
      "fumbles lost": 1,
      "penalties": 3,
      "penalty yards": 19,
      "punts": 1,
      "punt yards": 46,
      "punt returns": 1,
      "punt return yards": 0,
      "kickoff returns": 4,
      "kickoff return yards": 98,
      "interception returns": 1,
      "interception return yards": 4,
      "3rd down conversions": 8,
      "3rd down attempts": 15,
      "4th down conversions": 2,
      "4th down attempts": 2
    }
  },
  "Wisconsin vs Iowa": {
    "stadium": "KinnickStadium-IowaCity-IA",
    "Wisconsin": {
      "points": 7,
      "1st downs": 11,
      "rushing 1st downs": 4,
      "passing 1st downs": 7,
      "penalty 1st downs": 0,
      "rushing yards": 56,
      "rushing attempts": 33,
      "passing yards": 169,
      "passing attempts": 38,
      "passing completions": 20,
      "passing interceptions": 1,
      "total yards": 225,
      "total plays": 71,
      "fumbles": 2,
      "fumbles lost": 1,
      "penalties": 5,
      "penalty yards": 40,
      "punts": 9,
      "punt yards": 393,
      "punt returns": 0,
      "punt return yards": 0,
      "kickoff returns": 1,
      "kickoff return yards": 21,
      "interception returns": 0,
      "interception return yards": 0,
      "3rd down conversions": 4,
      "3rd down attempts": 18,
      "4th down conversions": 1,
      "4th down attempts": 4
    },
    "Iowa": {
      "points": 28,
      "1st downs": 13,
      "rushing 1st downs": 4,
      "passing 1st downs": 8,
      "penalty 1st downs": 1,
      "rushing yards": 127,
      "rushing attempts": 32,
      "passing yards": 211,
      "passing attempts": 25,
      "passing completions": 14,
      "passing interceptions": 0,
      "total yards": 338,
      "total plays": 57,
      "fumbles": 2,
      "fumbles lost": 1,
      "penalties": 6,
      "penalty yards": 50,
      "punts": 8,
      "punt yards": 337,
      "punt returns": 3,
      "punt return yards": 0,
      "kickoff returns": 1,
      "kickoff return yards": 29,
      "interception returns": 1,
      "interception return yards": 0,
      "3rd down conversions": 3,
      "3rd down attempts": 14,
      "4th down conversions": 0,
      "4th down attempts": 1
    }
  },
  "OklahomaState vs Baylor": {
    "stadium": "McLaneStadium-Waco-TX",
    "OklahomaState": {
      "points": 42,
      "1st downs": 27,
      "rushing 1st downs": 15,
      "passing 1st downs": 12,
      "penalty 1st downs": 0,
      "rushing yards": 261,
      "rushing attempts": 47,
      "passing yards": 347,
      "passing attempts": 30,
      "passing completions": 20,
      "passing interceptions": 2,
      "total yards": 608,
      "total plays": 77,
      "fumbles": 1,
      "fumbles lost": 0,
      "penalties": 4,
      "penalty yards": 25,
      "punts": 3,
      "punt yards": 105,
      "punt returns": 3,
      "punt return yards": 17,
      "kickoff returns": 0,
      "kickoff return yards": 0,
      "interception returns": 0,
      "interception return yards": 0,
      "3rd down conversions": 10,
      "3rd down attempts": 15,
      "4th down conversions": 0,
      "4th down attempts": 1
    },
    "Baylor": {
      "points": 3,
      "1st downs": 12,
      "rushing 1st downs": 7,
      "passing 1st downs": 4,
      "penalty 1st downs": 1,
      "rushing yards": 70,
      "rushing attempts": 31,
      "passing yards": 86,
      "passing attempts": 34,
      "passing completions": 18,
      "passing interceptions": 0,
      "total yards": 156,
      "total plays": 65,
      "fumbles": 1,
      "fumbles lost": 0,
      "penalties": 5,
      "penalty yards": 40,
      "punts": 11,
      "punt yards": 414,
      "punt returns": 0,
      "punt return yards": 0,
      "kickoff returns": 5,
      "kickoff return yards": 119,
      "interception returns": 2,
      "interception return yards": 0,
      "3rd down conversions": 4,
      "3rd down attempts": 17,
      "4th down conversions": 0,
      "4th down attempts": 0
    }
  },
  "NorthCarolina vs MiamiFL": {
    "stadium": "HardRockStadium-MiamiGardens-FL",
    "NorthCarolina": {
      "points": 62,
      "1st downs": 31,
      "rushing 1st downs": 22,
      "passing 1st downs": 7,
      "penalty 1st downs": 2,
      "rushing yards": 554,
      "rushing attempts": 55,
      "passing yards": 224,
      "passing attempts": 20,
      "passing completions": 15,
      "passing interceptions": 0,
      "total yards": 778,
      "total plays": 75,
      "fumbles": 1,
      "fumbles lost": 0,
      "penalties": 5,
      "penalty yards": 50,
      "punts": 0,
      "punt yards": 0,
      "punt returns": 2,
      "punt return yards": 2,
      "kickoff returns": 0,
      "kickoff return yards": 0,
      "interception returns": 1,
      "interception return yards": 0,
      "3rd down conversions": 6,
      "3rd down attempts": 11,
      "4th down conversions": 2,
      "4th down attempts": 2
    },
    "MiamiFL": {
      "points": 26,
      "1st downs": 15,
      "rushing 1st downs": 4,
      "passing 1st downs": 10,
      "penalty 1st downs": 1,
      "rushing yards": 75,
      "rushing attempts": 27,
      "passing yards": 239,
      "passing attempts": 32,
      "passing completions": 18,
      "passing interceptions": 1,
      "total yards": 314,
      "total plays": 59,
      "fumbles": 0,
      "fumbles lost": 0,
      "penalties": 7,
      "penalty yards": 68,
      "punts": 6,
      "punt yards": 291,
      "punt returns": 0,
      "punt return yards": 0,
      "kickoff returns": 3,
      "kickoff return yards": 72,
      "interception returns": 0,
      "interception return yards": 0,
      "3rd down conversions": 4,
      "3rd down attempts": 12,
      "4th down conversions": 0,
      "4th down attempts": 1
    }
  },
  "Houston vs Memphis": {
    "stadium": "LibertyBowlMemorialStadium-Memphis-TN",
    "Houston": {
      "points": 27,
      "1st downs": 26,
      "rushing 1st downs": 7,
      "passing 1st downs": 19,
      "penalty 1st downs": 0,
      "rushing yards": 139,
      "rushing attempts": 35,
      "passing yards": 270,
      "passing attempts": 49,
      "passing completions": 30,
      "passing interceptions": 1,
      "total yards": 409,
      "total plays": 84,
      "fumbles": 1,
      "fumbles lost": 1,
      "penalties": 7,
      "penalty yards": 75,
      "punts": 4,
      "punt yards": 159,
      "punt returns": 1,
      "punt return yards": 14,
      "kickoff returns": 4,
      "kickoff return yards": 92,
      "interception returns": 1,
      "interception return yards": 22,
      "3rd down conversions": 5,
      "3rd down attempts": 16,
      "4th down conversions": 5,
      "4th down attempts": 5
    },
    "Memphis": {
      "points": 30,
      "1st downs": 20,
      "rushing 1st downs": 5,
      "passing 1st downs": 12,
      "penalty 1st downs": 3,
      "rushing yards": 64,
      "rushing attempts": 30,
      "passing yards": 246,
      "passing attempts": 35,
      "passing completions": 22,
      "passing interceptions": 1,
      "total yards": 310,
      "total plays": 65,
      "fumbles": 1,
      "fumbles lost": 0,
      "penalties": 0,
      "penalty yards": 0,
      "punts": 5,
      "punt yards": 182,
      "punt returns": 1,
      "punt return yards": 0,
      "kickoff returns": 1,
      "kickoff return yards": 8,
      "interception returns": 1,
      "interception return yards": 0,
      "3rd down conversions": 7,
      "3rd down attempts": 16,
      "4th down conversions": 1,
      "4th down attempts": 1
    }
  },
  "Duke vs FloridaState": {
    "stadium": "BobbyBowdenFieldatDoakCampbellStadium-Tallahassee-FL",
    "Duke": {
      "points": 35,
      "1st downs": 25,
      "rushing 1st downs": 15,
      "passing 1st downs": 6,
      "penalty 1st downs": 4,
      "rushing yards": 245,
      "rushing attempts": 51,
      "passing yards": 148,
      "passing attempts": 26,
      "passing completions": 13,
      "passing interceptions": 3,
      "total yards": 393,
      "total plays": 77,
      "fumbles": 2,
      "fumbles lost": 1,
      "penalties": 9,
      "penalty yards": 70,
      "punts": 5,
      "punt yards": 204,
      "punt returns": 1,
      "punt return yards": -1,
      "kickoff returns": 8,
      "kickoff return yards": 171,
      "interception returns": 1,
      "interception return yards": 0,
      "3rd down conversions": 5,
      "3rd down attempts": 15,
      "4th down conversions": 2,
      "4th down attempts": 2
    },
    "FloridaState": {
      "points": 56,
      "1st downs": 24,
      "rushing 1st downs": 16,
      "passing 1st downs": 6,
      "penalty 1st downs": 2,
      "rushing yards": 324,
      "rushing attempts": 43,
      "passing yards": 198,
      "passing attempts": 21,
      "passing completions": 14,
      "passing interceptions": 1,
      "total yards": 522,
      "total plays": 64,
      "fumbles": 1,
      "fumbles lost": 1,
      "penalties": 6,
      "penalty yards": 57,
      "punts": 3,
      "punt yards": 135,
      "punt returns": 1,
      "punt return yards": 6,
      "kickoff returns": 2,
      "kickoff return yards": 35,
      "interception returns": 3,
      "interception return yards": 25,
      "3rd down conversions": 2,
      "3rd down attempts": 9,
      "4th down conversions": 1,
      "4th down attempts": 2
    }
  },
  "Tennessee vs Vanderbilt": {
    "stadium": "VanderbiltStadium-Nashville-TN",
    "Tennessee": {
      "points": 42,
      "1st downs": 24,
      "rushing 1st downs": 13,
      "passing 1st downs": 10,
      "penalty 1st downs": 1,
      "rushing yards": 212,
      "rushing attempts": 38,
      "passing yards": 328,
      "passing attempts": 32,
      "passing completions": 21,
      "passing interceptions": 1,
      "total yards": 540,
      "total plays": 70,
      "fumbles": 1,
      "fumbles lost": 1,
      "penalties": 10,
      "penalty yards": 94,
      "punts": 5,
      "punt yards": 235,
      "punt returns": 3,
      "punt return yards": 14,
      "kickoff returns": 2,
      "kickoff return yards": 17,
      "interception returns": 1,
      "interception return yards": 18,
      "3rd down conversions": 3,
      "3rd down attempts": 10,
      "4th down conversions": 1,
      "4th down attempts": 2
    },
    "Vanderbilt": {
      "points": 17,
      "1st downs": 16,
      "rushing 1st downs": 7,
      "passing 1st downs": 8,
      "penalty 1st downs": 1,
      "rushing yards": 53,
      "rushing attempts": 31,
      "passing yards": 239,
      "passing attempts": 39,
      "passing completions": 22,
      "passing interceptions": 1,
      "total yards": 292,
      "total plays": 70,
      "fumbles": 1,
      "fumbles lost": 0,
      "penalties": 7,
      "penalty yards": 60,
      "punts": 9,
      "punt yards": 347,
      "punt returns": 0,
      "punt return yards": 0,
      "kickoff returns": 1,
      "kickoff return yards": 19,
      "interception returns": 1,
      "interception return yards": 30,
      "3rd down conversions": 3,
      "3rd down attempts": 18,
      "4th down conversions": 2,
      "4th down attempts": 3
    }
  },
  "BoiseState vs Wyoming": {
    "stadium": "JonahFieldatWarMemorialStadium-Laramie-WY",
    "BoiseState": {
      "points": 17,
      "1st downs": 17,
      "rushing 1st downs": 8,
      "passing 1st downs": 8,
      "penalty 1st downs": 1,
      "rushing yards": 111,
      "rushing attempts": 41,
      "passing yards": 181,
      "passing attempts": 29,
      "passing completions": 19,
      "passing interceptions": 1,
      "total yards": 292,
      "total plays": 70,
      "fumbles": 2,
      "fumbles lost": 1,
      "penalties": 4,
      "penalty yards": 35,
      "punts": 6,
      "punt yards": 255,
      "punt returns": 3,
      "punt return yards": 18,
      "kickoff returns": 0,
      "kickoff return yards": 0,
      "interception returns": 1,
      "interception return yards": 0,
      "3rd down conversions": 7,
      "3rd down attempts": 15,
      "4th down conversions": 0,
      "4th down attempts": 1
    },
    "Wyoming": {
      "points": 9,
      "1st downs": 9,
      "rushing 1st downs": 5,
      "passing 1st downs": 3,
      "penalty 1st downs": 1,
      "rushing yards": 82,
      "rushing attempts": 38,
      "passing yards": 64,
      "passing attempts": 21,
      "passing completions": 4,
      "passing interceptions": 1,
      "total yards": 146,
      "total plays": 59,
      "fumbles": 1,
      "fumbles lost": 0,
      "penalties": 7,
      "penalty yards": 58,
      "punts": 8,
      "punt yards": 281,
      "punt returns": 3,
      "punt return yards": 28,
      "kickoff returns": 1,
      "kickoff return yards": 19,
      "interception returns": 1,
      "interception return yards": 1,
      "3rd down conversions": 2,
      "3rd down attempts": 17,
      "4th down conversions": 1,
      "4th down attempts": 2
    }
  },
  "AppalachianState vs GeorgiaSouthern": {
    "stadium": "AllenEPaulsonStadium-Statesboro-GA",
    "AppalachianState": {
      "points": 34,
      "1st downs": 17,
      "rushing 1st downs": 8,
      "passing 1st downs": 9,
      "penalty 1st downs": 0,
      "rushing yards": 173,
      "rushing attempts": 44,
      "passing yards": 208,
      "passing attempts": 29,
      "passing completions": 18,
      "passing interceptions": 1,
      "total yards": 381,
      "total plays": 73,
      "fumbles": 2,
      "fumbles lost": 1,
      "penalties": 6,
      "penalty yards": 83,
      "punts": 6,
      "punt yards": 242,
      "punt returns": 2,
      "punt return yards": 25,
      "kickoff returns": 2,
      "kickoff return yards": 126,
      "interception returns": 3,
      "interception return yards": -3,
      "3rd down conversions": 6,
      "3rd down attempts": 17,
      "4th down conversions": 2,
      "4th down attempts": 2
    },
    "GeorgiaSouthern": {
      "points": 26,
      "1st downs": 16,
      "rushing 1st downs": 9,
      "passing 1st downs": 5,
      "penalty 1st downs": 2,
      "rushing yards": 204,
      "rushing attempts": 41,
      "passing yards": 145,
      "passing attempts": 18,
      "passing completions": 7,
      "passing interceptions": 3,
      "total yards": 349,
      "total plays": 59,
      "fumbles": 2,
      "fumbles lost": 1,
      "penalties": 1,
      "penalty yards": 5,
      "punts": 6,
      "punt yards": 272,
      "punt returns": 4,
      "punt return yards": 8,
      "kickoff returns": 4,
      "kickoff return yards": 53,
      "interception returns": 1,
      "interception return yards": 28,
      "3rd down conversions": 2,
      "3rd down attempts": 10,
      "4th down conversions": 1,
      "4th down attempts": 1
    }
  },
  "LSU vs Florida": {
    "stadium": "BenHillGriffinStadium-Gainesville-FL",
    "LSU": {
      "points": 37,
      "1st downs": 24,
      "rushing 1st downs": 13,
      "passing 1st downs": 9,
      "penalty 1st downs": 2,
      "rushing yards": 179,
      "rushing attempts": 50,
      "passing yards": 239,
      "passing attempts": 36,
      "passing completions": 21,
      "passing interceptions": 0,
      "total yards": 418,
      "total plays": 86,
      "fumbles": 0,
      "fumbles lost": 0,
      "penalties": 6,
      "penalty yards": 49,
      "punts": 8,
      "punt yards": 357,
      "punt returns": 1,
      "punt return yards": 2,
      "kickoff returns": 0,
      "kickoff return yards": 0,
      "interception returns": 2,
      "interception return yards": 68,
      "3rd down conversions": 8,
      "3rd down attempts": 19,
      "4th down conversions": 0,
      "4th down attempts": 0
    },
    "Florida": {
      "points": 34,
      "1st downs": 26,
      "rushing 1st downs": 5,
      "passing 1st downs": 19,
      "penalty 1st downs": 2,
      "rushing yards": 135,
      "rushing attempts": 26,
      "passing yards": 474,
      "passing attempts": 48,
      "passing completions": 29,
      "passing interceptions": 2,
      "total yards": 609,
      "total plays": 74,
      "fumbles": 1,
      "fumbles lost": 1,
      "penalties": 4,
      "penalty yards": 29,
      "punts": 4,
      "punt yards": 222,
      "punt returns": 1,
      "punt return yards": 11,
      "kickoff returns": 0,
      "kickoff return yards": 0,
      "interception returns": 0,
      "interception return yards": 0,
      "3rd down conversions": 5,
      "3rd down attempts": 13,
      "4th down conversions": 0,
      "4th down attempts": 1
    }
  },
  "LouisianaTech vs TCU": {
    "stadium": "AmonGCarterStadium-FortWorth-TX",
    "LouisianaTech": {
      "points": 10,
      "1st downs": 15,
      "rushing 1st downs": 5,
      "passing 1st downs": 10,
      "penalty 1st downs": 0,
      "rushing yards": 52,
      "rushing attempts": 37,
      "passing yards": 192,
      "passing attempts": 36,
      "passing completions": 20,
      "passing interceptions": 2,
      "total yards": 244,
      "total plays": 73,
      "fumbles": 2,
      "fumbles lost": 1,
      "penalties": 7,
      "penalty yards": 67,
      "punts": 5,
      "punt yards": 198,
      "punt returns": 0,
      "punt return yards": 0,
      "kickoff returns": 5,
      "kickoff return yards": 66,
      "interception returns": 0,
      "interception return yards": 0,
      "3rd down conversions": 8,
      "3rd down attempts": 20,
      "4th down conversions": 3,
      "4th down attempts": 3
    },
    "TCU": {
      "points": 52,
      "1st downs": 15,
      "rushing 1st downs": 9,
      "passing 1st downs": 5,
      "penalty 1st downs": 1,
      "rushing yards": 333,
      "rushing attempts": 35,
      "passing yards": 161,
      "passing attempts": 14,
      "passing completions": 11,
      "passing interceptions": 0,
      "total yards": 494,
      "total plays": 49,
      "fumbles": 1,
      "fumbles lost": 1,
      "penalties": 7,
      "penalty yards": 45,
      "punts": 2,
      "punt yards": 86,
      "punt returns": 4,
      "punt return yards": 10,
      "kickoff returns": 0,
      "kickoff return yards": 0,
      "interception returns": 2,
      "interception return yards": 17,
      "3rd down conversions": 4,
      "3rd down attempts": 8,
      "4th down conversions": 0,
      "4th down attempts": 1
    }
  },
  "USC vs UCLA": {
    "stadium": "RoseBowl-Pasadena-CA",
    "USC": {
      "points": 43,
      "1st downs": 24,
      "rushing 1st downs": 9,
      "passing 1st downs": 13,
      "penalty 1st downs": 2,
      "rushing yards": 100,
      "rushing attempts": 33,
      "passing yards": 344,
      "passing attempts": 47,
      "passing completions": 30,
      "passing interceptions": 2,
      "total yards": 444,
      "total plays": 80,
      "fumbles": 0,
      "fumbles lost": 0,
      "penalties": 5,
      "penalty yards": 60,
      "punts": 3,
      "punt yards": 153,
      "punt returns": 0,
      "punt return yards": 0,
      "kickoff returns": 1,
      "kickoff return yards": 56,
      "interception returns": 2,
      "interception return yards": 26,
      "3rd down conversions": 11,
      "3rd down attempts": 18,
      "4th down conversions": 0,
      "4th down attempts": 0
    },
    "UCLA": {
      "points": 38,
      "1st downs": 27,
      "rushing 1st downs": 11,
      "passing 1st downs": 15,
      "penalty 1st downs": 1,
      "rushing yards": 185,
      "rushing attempts": 43,
      "passing yards": 364,
      "passing attempts": 36,
      "passing completions": 30,
      "passing interceptions": 2,
      "total yards": 549,
      "total plays": 79,
      "fumbles": 1,
      "fumbles lost": 1,
      "penalties": 6,
      "penalty yards": 45,
      "punts": 2,
      "punt yards": 86,
      "punt returns": 2,
      "punt return yards": 40,
      "kickoff returns": 0,
      "kickoff return yards": 0,
      "interception returns": 2,
      "interception return yards": 0,
      "3rd down conversions": 6,
      "3rd down attempts": 13,
      "4th down conversions": 0,
      "4th down attempts": 3
    }
  },
  "Auburn vs MississippiState": {
    "stadium": "DavisWadeStadiumatScottField-Starkville-MS",
    "Auburn": {
      "points": 24,
      "1st downs": 19,
      "rushing 1st downs": 13,
      "passing 1st downs": 3,
      "penalty 1st downs": 3,
      "rushing yards": 218,
      "rushing attempts": 36,
      "passing yards": 125,
      "passing attempts": 32,
      "passing completions": 15,
      "passing interceptions": 0,
      "total yards": 343,
      "total plays": 68,
      "fumbles": 0,
      "fumbles lost": 0,
      "penalties": 8,
      "penalty yards": 80,
      "punts": 6,
      "punt yards": 227,
      "punt returns": 1,
      "punt return yards": 5,
      "kickoff returns": 1,
      "kickoff return yards": 47,
      "interception returns": 2,
      "interception return yards": 59,
      "3rd down conversions": 5,
      "3rd down attempts": 16,
      "4th down conversions": 1,
      "4th down attempts": 2
    },
    "MississippiState": {
      "points": 10,
      "1st downs": 17,
      "rushing 1st downs": 4,
      "passing 1st downs": 10,
      "penalty 1st downs": 3,
      "rushing yards": 19,
      "rushing attempts": 16,
      "passing yards": 221,
      "passing attempts": 51,
      "passing completions": 30,
      "passing interceptions": 2,
      "total yards": 240,
      "total plays": 67,
      "fumbles": 0,
      "fumbles lost": 0,
      "penalties": 7,
      "penalty yards": 90,
      "punts": 5,
      "punt yards": 207,
      "punt returns": 0,
      "punt return yards": 0,
      "kickoff returns": 2,
      "kickoff return yards": 91,
      "interception returns": 0,
      "interception return yards": 0,
      "3rd down conversions": 4,
      "3rd down attempts": 16,
      "4th down conversions": 0,
      "4th down attempts": 2
    }
  },
  "Virginia vs VirginiaTech": {
    "stadium": "LaneStadium-Blacksburg-VA",
    "Virginia": {
      "points": 15,
      "1st downs": 20,
      "rushing 1st downs": 4,
      "passing 1st downs": 15,
      "penalty 1st downs": 1,
      "rushing yards": 55,
      "rushing attempts": 21,
      "passing yards": 267,
      "passing attempts": 47,
      "passing completions": 26,
      "passing interceptions": 2,
      "total yards": 322,
      "total plays": 68,
      "fumbles": 1,
      "fumbles lost": 0,
      "penalties": 5,
      "penalty yards": 41,
      "punts": 5,
      "punt yards": 209,
      "punt returns": 0,
      "punt return yards": 0,
      "kickoff returns": 2,
      "kickoff return yards": 52,
      "interception returns": 0,
      "interception return yards": 0,
      "3rd down conversions": 6,
      "3rd down attempts": 14,
      "4th down conversions": 1,
      "4th down attempts": 2
    },
    "VirginiaTech": {
      "points": 33,
      "1st downs": 20,
      "rushing 1st downs": 10,
      "passing 1st downs": 9,
      "penalty 1st downs": 1,
      "rushing yards": 252,
      "rushing attempts": 45,
      "passing yards": 212,
      "passing attempts": 22,
      "passing completions": 15,
      "passing interceptions": 0,
      "total yards": 464,
      "total plays": 67,
      "fumbles": 1,
      "fumbles lost": 1,
      "penalties": 7,
      "penalty yards": 50,
      "punts": 3,
      "punt yards": 99,
      "punt returns": 3,
      "punt return yards": 11,
      "kickoff returns": 0,
      "kickoff return yards": 0,
      "interception returns": 2,
      "interception return yards": 27,
      "3rd down conversions": 9,
      "3rd down attempts": 16,
      "4th down conversions": 0,
      "4th down attempts": 0
    }
  },
  "SanDiegoState vs BrighamYoung": {
    "stadium": "LaVellEdwardsStadium-Provo-UT",
    "SanDiegoState": {
      "points": 14,
      "1st downs": 23,
      "rushing 1st downs": 11,
      "passing 1st downs": 12,
      "penalty 1st downs": 0,
      "rushing yards": 169,
      "rushing attempts": 46,
      "passing yards": 230,
      "passing attempts": 31,
      "passing completions": 21,
      "passing interceptions": 1,
      "total yards": 399,
      "total plays": 77,
      "fumbles": 2,
      "fumbles lost": 1,
      "penalties": 2,
      "penalty yards": 25,
      "punts": 2,
      "punt yards": 88,
      "punt returns": 1,
      "punt return yards": 13,
      "kickoff returns": 1,
      "kickoff return yards": 23,
      "interception returns": 0,
      "interception return yards": 0,
      "3rd down conversions": 10,
      "3rd down attempts": 17,
      "4th down conversions": 2,
      "4th down attempts": 5
    },
    "BrighamYoung": {
      "points": 28,
      "1st downs": 16,
      "rushing 1st downs": 4,
      "passing 1st downs": 12,
      "penalty 1st downs": 0,
      "rushing yards": 74,
      "rushing attempts": 19,
      "passing yards": 310,
      "passing attempts": 34,
      "passing completions": 25,
      "passing interceptions": 0,
      "total yards": 384,
      "total plays": 53,
      "fumbles": 1,
      "fumbles lost": 1,
      "penalties": 5,
      "penalty yards": 25,
      "punts": 3,
      "punt yards": 129,
      "punt returns": 1,
      "punt return yards": 1,
      "kickoff returns": 0,
      "kickoff return yards": 0,
      "interception returns": 1,
      "interception return yards": 11,
      "3rd down conversions": 5,
      "3rd down attempts": 10,
      "4th down conversions": 1,
      "4th down attempts": 1
    }
  },
  "Stanford vs OregonState": {
    "stadium": "ReserStadium-Corvallis-OR",
    "Stanford": {
      "points": 27,
      "1st downs": 22,
      "rushing 1st downs": 7,
      "passing 1st downs": 14,
      "penalty 1st downs": 1,
      "rushing yards": 116,
      "rushing attempts": 35,
      "passing yards": 292,
      "passing attempts": 29,
      "passing completions": 21,
      "passing interceptions": 0,
      "total yards": 408,
      "total plays": 64,
      "fumbles": 2,
      "fumbles lost": 0,
      "penalties": 5,
      "penalty yards": 66,
      "punts": 4,
      "punt yards": 129,
      "punt returns": 0,
      "punt return yards": 0,
      "kickoff returns": 4,
      "kickoff return yards": 97,
      "interception returns": 0,
      "interception return yards": 0,
      "3rd down conversions": 5,
      "3rd down attempts": 11,
      "4th down conversions": 0,
      "4th down attempts": 0
    },
    "OregonState": {
      "points": 24,
      "1st downs": 22,
      "rushing 1st downs": 13,
      "passing 1st downs": 9,
      "penalty 1st downs": 0,
      "rushing yards": 237,
      "rushing attempts": 39,
      "passing yards": 221,
      "passing attempts": 30,
      "passing completions": 17,
      "passing interceptions": 0,
      "total yards": 458,
      "total plays": 69,
      "fumbles": 1,
      "fumbles lost": 1,
      "penalties": 7,
      "penalty yards": 86,
      "punts": 5,
      "punt yards": 189,
      "punt returns": 0,
      "punt return yards": 0,
      "kickoff returns": 1,
      "kickoff return yards": 18,
      "interception returns": 0,
      "interception return yards": 0,
      "3rd down conversions": 6,
      "3rd down attempts": 14,
      "4th down conversions": 2,
      "4th down attempts": 2
    }
  },
  "FresnoState vs NewMexico": {
    "stadium": "DreamstyleStadium-Albuquerque-NM",
    "FresnoState": {
      "points": 39,
      "1st downs": 23,
      "rushing 1st downs": 4,
      "passing 1st downs": 15,
      "penalty 1st downs": 4,
      "rushing yards": 58,
      "rushing attempts": 23,
      "passing yards": 350,
      "passing attempts": 43,
      "passing completions": 26,
      "passing interceptions": 1,
      "total yards": 408,
      "total plays": 66,
      "fumbles": 1,
      "fumbles lost": 0,
      "penalties": 4,
      "penalty yards": 50,
      "punts": 4,
      "punt yards": 164,
      "punt returns": 1,
      "punt return yards": 9,
      "kickoff returns": 6,
      "kickoff return yards": 137,
      "interception returns": 0,
      "interception return yards": 0,
      "3rd down conversions": 4,
      "3rd down attempts": 11,
      "4th down conversions": 1,
      "4th down attempts": 1
    },
    "NewMexico": {
      "points": 49,
      "1st downs": 24,
      "rushing 1st downs": 14,
      "passing 1st downs": 7,
      "penalty 1st downs": 3,
      "rushing yards": 299,
      "rushing attempts": 48,
      "passing yards": 196,
      "passing attempts": 18,
      "passing completions": 14,
      "passing interceptions": 0,
      "total yards": 495,
      "total plays": 66,
      "fumbles": 0,
      "fumbles lost": 0,
      "penalties": 8,
      "penalty yards": 73,
      "punts": 4,
      "punt yards": 138,
      "punt returns": 1,
      "punt return yards": 9,
      "kickoff returns": 3,
      "kickoff return yards": 66,
      "interception returns": 1,
      "interception return yards": 18,
      "3rd down conversions": 11,
      "3rd down attempts": 16,
      "4th down conversions": 0,
      "4th down attempts": 0
    }
  },
  "UNLV vs Hawaii": {
    "stadium": "AlohaStadium-Honolulu-HI",
    "UNLV": {
      "points": 21,
      "1st downs": 26,
      "rushing 1st downs": 11,
      "passing 1st downs": 13,
      "penalty 1st downs": 2,
      "rushing yards": 218,
      "rushing attempts": 40,
      "passing yards": 245,
      "passing attempts": 40,
      "passing completions": 21,
      "passing interceptions": 1,
      "total yards": 463,
      "total plays": 80,
      "fumbles": 2,
      "fumbles lost": 2,
      "penalties": 7,
      "penalty yards": 63,
      "punts": 6,
      "punt yards": 228,
      "punt returns": 0,
      "punt return yards": 0,
      "kickoff returns": 0,
      "kickoff return yards": 0,
      "interception returns": 1,
      "interception return yards": 0,
      "3rd down conversions": 5,
      "3rd down attempts": 14,
      "4th down conversions": 0,
      "4th down attempts": 2
    },
    "Hawaii": {
      "points": 38,
      "1st downs": 24,
      "rushing 1st downs": 12,
      "passing 1st downs": 9,
      "penalty 1st downs": 3,
      "rushing yards": 278,
      "rushing attempts": 46,
      "passing yards": 252,
      "passing attempts": 33,
      "passing completions": 20,
      "passing interceptions": 1,
      "total yards": 530,
      "total plays": 79,
      "fumbles": 2,
      "fumbles lost": 1,
      "penalties": 10,
      "penalty yards": 72,
      "punts": 4,
      "punt yards": 171,
      "punt returns": 3,
      "punt return yards": 5,
      "kickoff returns": 2,
      "kickoff return yards": 54,
      "interception returns": 1,
      "interception return yards": 0,
      "3rd down conversions": 6,
      "3rd down attempts": 15,
      "4th down conversions": 1,
      "4th down attempts": 2
    }
  }
}