{
  "inputMD5Sum": "b983f68c7c493cab2a291650c6d9d00b",
  "updated_at": "10-07-2022 16:12:28",
  "games": [
    {"game": {
      "gameID": "410629",
      "away": {
        "score": "33",
        "names": {
          "char6": "WVU",
          "short": "West Virginia",
          "seo": "west-virginia",
          "full": "West Virginia University"
        },
        "winner": true,
        "seed": "",
        "description": "(2-2)",
        "rank": "",
        "conferences": [{
          "conferenceName": "Big 12",
          "conferenceSeo": "big-12"
        }]
      },
      "finalMessage": "FINAL",
      "bracketRound": "",
      "title": "Virginia Tech West Virginia",
      "contestName": "",
      "url": "/game/6005818",
      "network": "",
      "home": {
        "score": "10",
        "names": {
          "char6": "VT",
          "short": "Virginia Tech",
          "seo": "virginia-tech",
          "full": "Virginia Polytechnic Institute and State University"
        },
        "winner": false,
        "seed": "",
        "description": "(2-2)",
        "rank": "",
        "conferences": [{
          "conferenceName": "ACC",
          "conferenceSeo": "acc"
        }]
      },
      "liveVideoEnabled": false,
      "startTime": "07:30PM ET",
      "startTimeEpoch": "1663889400",
      "bracketId": "",
      "gameState": "final",
      "startDate": "09-22-2022",
      "currentPeriod": "FINAL",
      "videoState": "",
      "bracketRegion": "",
      "contestClock": "0:00"
    }},
    {"game": {
      "gameID": "409764",
      "away": {
        "score": "41",
        "names": {
          "char6": "CO CAR",
          "short": "Coastal Carolina",
          "seo": "coastal-caro",
          "full": "Coastal Carolina University"
        },
        "winner": true,
        "seed": "",
        "description": "(4-0)",
        "rank": "",
        "conferences": [{
          "conferenceName": "Sun Belt",
          "conferenceSeo": "sun-belt"
        }]
      },
      "finalMessage": "FINAL",
      "bracketRound": "",
      "title": "Georgia St. Coastal Carolina",
      "contestName": "",
      "url": "/game/6005819",
      "network": "",
      "home": {
        "score": "24",
        "names": {
          "char6": "GA ST",
          "short": "Georgia St.",
          "seo": "georgia-st",
          "full": "Georgia State University"
        },
        "winner": false,
        "seed": "",
        "description": "(0-4)",
        "rank": "",
        "conferences": [{
          "conferenceName": "Sun Belt",
          "conferenceSeo": "sun-belt"
        }]
      },
      "liveVideoEnabled": false,
      "startTime": "07:30PM ET",
      "startTimeEpoch": "1663889400",
      "bracketId": "",
      "gameState": "final",
      "startDate": "09-22-2022",
      "currentPeriod": "FINAL",
      "videoState": "",
      "bracketRegion": "",
      "contestClock": "0:00"
    }},
    {"game": {
      "gameID": "409820",
      "away": {
        "score": "0",
        "names": {
          "char6": "CHAT",
          "short": "Chattanooga",
          "seo": "chattanooga",
          "full": "University of Tennessee at Chattanooga"
        },
        "winner": false,
        "seed": "",
        "description": "(3-1)",
        "rank": "",
        "conferences": [{
          "conferenceName": "SoCon",
          "conferenceSeo": "socon"
        }]
      },
      "finalMessage": "FINAL",
      "bracketRound": "",
      "title": "Illinois Chattanooga",
      "contestName": "",
      "url": "/game/6005820",
      "network": "",
      "home": {
        "score": "31",
        "names": {
          "char6": "ILL",
          "short": "Illinois",
          "seo": "illinois",
          "full": "University of Illinois Urbana-Champaign"
        },
        "winner": true,
        "seed": "",
        "description": "(3-1)",
        "rank": "",
        "conferences": [{
          "conferenceName": "Big Ten",
          "conferenceSeo": "big-ten"
        }]
      },
      "liveVideoEnabled": false,
      "startTime": "08:30PM ET",
      "startTimeEpoch": "1663893000",
      "bracketId": "",
      "gameState": "final",
      "startDate": "09-22-2022",
      "currentPeriod": "FINAL",
      "videoState": "",
      "bracketRegion": "",
      "contestClock": "0:00"
    }},
    {"game": {
      "gameID": "410397",
      "away": {
        "score": "20",
        "names": {
          "char6": "UVA",
          "short": "Virginia",
          "seo": "virginia",
          "full": "University of Virginia"
        },
        "winner": false,
        "seed": "",
        "description": "(2-2)",
        "rank": "",
        "conferences": [{
          "conferenceName": "ACC",
          "conferenceSeo": "acc"
        }]
      },
      "finalMessage": "FINAL",
      "bracketRound": "",
      "title": "Syracuse Virginia",
      "contestName": "",
      "url": "/game/6005823",
      "network": "",
      "home": {
        "score": "22",
        "names": {
          "char6": "SYR",
          "short": "Syracuse",
          "seo": "syracuse",
          "full": "Syracuse University"
        },
        "winner": true,
        "seed": "",
        "description": "(4-0)",
        "rank": "",
        "conferences": [{
          "conferenceName": "ACC",
          "conferenceSeo": "acc"
        }]
      },
      "liveVideoEnabled": false,
      "startTime": "07:00PM ET",
      "startTimeEpoch": "1663974000",
      "bracketId": "",
      "gameState": "final",
      "startDate": "09-23-2022",
      "currentPeriod": "FINAL",
      "videoState": "",
      "bracketRegion": "",
      "contestClock": "0:00"
    }},
    {"game": {
      "gameID": "409396",
      "away": {
        "score": "20",
        "names": {
          "char6": "NEVADA",
          "short": "Nevada",
          "seo": "nevada",
          "full": "University of Nevada, Reno"
        },
        "winner": false,
        "seed": "",
        "description": "(2-3)",
        "rank": "",
        "conferences": [{
          "conferenceName": "Mountain West",
          "conferenceSeo": "mountain-west"
        }]
      },
      "finalMessage": "FINAL",
      "bracketRound": "",
      "title": "Air Force Nevada",
      "contestName": "",
      "url": "/game/6005821",
      "network": "",
      "home": {
        "score": "48",
        "names": {
          "char6": "AIRFOR",
          "short": "Air Force",
          "seo": "air-force",
          "full": "U.S. Air Force Academy"
        },
        "winner": true,
        "seed": "",
        "description": "(3-1)",
        "rank": "",
        "conferences": [{
          "conferenceName": "Mountain West",
          "conferenceSeo": "mountain-west"
        }]
      },
      "liveVideoEnabled": false,
      "startTime": "08:00PM ET",
      "startTimeEpoch": "1663977600",
      "bracketId": "",
      "gameState": "final",
      "startDate": "09-23-2022",
      "currentPeriod": "FINAL",
      "videoState": "",
      "bracketRegion": "",
      "contestClock": "0:00"
    }},
    {"game": {
      "gameID": "410594",
      "away": {
        "score": "10",
        "names": {
          "char6": "BOISE",
          "short": "Boise St.",
          "seo": "boise-st",
          "full": "Boise State University"
        },
        "winner": false,
        "seed": "",
        "description": "(2-2)",
        "rank": "",
        "conferences": [{
          "conferenceName": "Mountain West",
          "conferenceSeo": "mountain-west"
        }]
      },
      "finalMessage": "FINAL",
      "bracketRound": "",
      "title": "UTEP Boise St.",
      "contestName": "",
      "url": "/game/6005822",
      "network": "",
      "home": {
        "score": "27",
        "names": {
          "char6": "UTEP",
          "short": "UTEP",
          "seo": "utep",
          "full": "University of Texas at El Paso"
        },
        "winner": true,
        "seed": "",
        "description": "(2-3)",
        "rank": "",
        "conferences": [{
          "conferenceName": "C-USA",
          "conferenceSeo": "c-usa"
        }]
      },
      "liveVideoEnabled": false,
      "startTime": "09:00PM ET",
      "startTimeEpoch": "1663981200",
      "bracketId": "",
      "gameState": "final",
      "startDate": "09-23-2022",
      "currentPeriod": "FINAL",
      "videoState": "",
      "bracketRegion": "",
      "contestClock": "0:00"
    }},
    {"game": {
      "gameID": "410382",
      "away": {
        "score": "42",
        "names": {
          "char6": "TCU",
          "short": "TCU",
          "seo": "tcu",
          "full": "Texas Christian University"
        },
        "winner": true,
        "seed": "",
        "description": "(3-0)",
        "rank": "",
        "conferences": [{
          "conferenceName": "Big 12",
          "conferenceSeo": "big-12"
        }]
      },
      "finalMessage": "FINAL",
      "bracketRound": "",
      "title": "SMU TCU",
      "contestName": "",
      "url": "/game/6005824",
      "network": "",
      "home": {
        "score": "34",
        "names": {
          "char6": "SMU",
          "short": "SMU",
          "seo": "smu",
          "full": "Southern Methodist University"
        },
        "winner": false,
        "seed": "",
        "description": "(2-2)",
        "rank": "",
        "conferences": [{
          "conferenceName": "AAC",
          "conferenceSeo": "aac"
        }]
      },
      "liveVideoEnabled": false,
      "startTime": "12:00PM ET",
      "startTimeEpoch": "1664035200",
      "bracketId": "",
      "gameState": "final",
      "startDate": "09-24-2022",
      "currentPeriod": "FINAL",
      "videoState": "",
      "bracketRegion": "",
      "contestClock": "0:00"
    }},
    {"game": {
      "gameID": "409806",
      "away": {
        "score": "31",
        "names": {
          "char6": "BAYLOR",
          "short": "Baylor",
          "seo": "baylor",
          "full": "Baylor University"
        },
        "winner": true,
        "seed": "",
        "description": "(3-1)",
        "rank": "17",
        "conferences": [
          {
            "conferenceName": "Big 12",
            "conferenceSeo": "big-12"
          },
          {
            "conferenceName": "Top 25",
            "conferenceSeo": "top-25"
          }
        ]
      },
      "finalMessage": "FINAL",
      "bracketRound": "",
      "title": "Iowa St. Baylor",
      "contestName": "",
      "url": "/game/6005825",
      "network": "",
      "home": {
        "score": "24",
        "names": {
          "char6": "IOWAST",
          "short": "Iowa St.",
          "seo": "iowa-st",
          "full": "Iowa State University"
        },
        "winner": false,
        "seed": "",
        "description": "(3-1)",
        "rank": "",
        "conferences": [{
          "conferenceName": "Big 12",
          "conferenceSeo": "big-12"
        }]
      },
      "liveVideoEnabled": false,
      "startTime": "12:00PM ET",
      "startTimeEpoch": "1664035200",
      "bracketId": "",
      "gameState": "final",
      "startDate": "09-24-2022",
      "currentPeriod": "FINAL",
      "videoState": "",
      "bracketRegion": "",
      "contestClock": "0:00"
    }},
    {"game": {
      "gameID": "2277444",
      "away": {
        "score": "50",
        "names": {
          "char6": "BUFF",
          "short": "Buffalo",
          "seo": "buffalo",
          "full": "University at Buffalo, the State University of New York"
        },
        "winner": true,
        "seed": "",
        "description": "(1-3)",
        "rank": "",
        "conferences": [{
          "conferenceName": "MAC",
          "conferenceSeo": "mac"
        }]
      },
      "finalMessage": "FINAL",
      "bracketRound": "",
      "title": "Eastern Mich. Buffalo",
      "contestName": "",
      "url": "/game/6005833",
      "network": "",
      "home": {
        "score": "31",
        "names": {
          "char6": "E MICH",
          "short": "Eastern Mich.",
          "seo": "eastern-mich",
          "full": "Eastern Michigan University"
        },
        "winner": false,
        "seed": "",
        "description": "(2-2)",
        "rank": "",
        "conferences": [{
          "conferenceName": "MAC",
          "conferenceSeo": "mac"
        }]
      },
      "liveVideoEnabled": false,
      "startTime": "12:00PM ET",
      "startTimeEpoch": "1664035200",
      "bracketId": "",
      "gameState": "final",
      "startDate": "09-24-2022",
      "currentPeriod": "FINAL",
      "videoState": "",
      "bracketRegion": "",
      "contestClock": "0:00"
    }},
    {"game": {
      "gameID": "410256",
      "away": {
        "score": "14",
        "names": {
          "char6": "C MICH",
          "short": "Central Mich.",
          "seo": "central-mich",
          "full": "Central Michigan University"
        },
        "winner": false,
        "seed": "",
        "description": "(1-3)",
        "rank": "",
        "conferences": [{
          "conferenceName": "MAC",
          "conferenceSeo": "mac"
        }]
      },
      "finalMessage": "FINAL",
      "bracketRound": "",
      "title": "Penn St. Central Mich.",
      "contestName": "",
      "url": "/game/6005836",
      "network": "",
      "home": {
        "score": "33",
        "names": {
          "char6": "PENNST",
          "short": "Penn St.",
          "seo": "penn-st",
          "full": "Pennsylvania State University"
        },
        "winner": true,
        "seed": "",
        "description": "(4-0)",
        "rank": "14",
        "conferences": [
          {
            "conferenceName": "Big Ten",
            "conferenceSeo": "big-ten"
          },
          {
            "conferenceName": "Top 25",
            "conferenceSeo": "top-25"
          }
        ]
      },
      "liveVideoEnabled": false,
      "startTime": "12:00PM ET",
      "startTimeEpoch": "1664035200",
      "bracketId": "",
      "gameState": "final",
      "startDate": "09-24-2022",
      "currentPeriod": "FINAL",
      "videoState": "",
      "bracketRegion": "",
      "contestClock": "0:00"
    }},
    {"game": {
      "gameID": "409868",
      "away": {
        "score": "27",
        "names": {
          "char6": "DUKE",
          "short": "Duke",
          "seo": "duke",
          "full": "Duke University"
        },
        "winner": false,
        "seed": "",
        "description": "(3-1)",
        "rank": "",
        "conferences": [{
          "conferenceName": "ACC",
          "conferenceSeo": "acc"
        }]
      },
      "finalMessage": "FINAL",
      "bracketRound": "",
      "title": "Kansas Duke",
      "contestName": "",
      "url": "/game/6005847",
      "network": "",
      "home": {
        "score": "35",
        "names": {
          "char6": "KANSAS",
          "short": "Kansas",
          "seo": "kansas",
          "full": "University of Kansas"
        },
        "winner": true,
        "seed": "",
        "description": "(4-0)",
        "rank": "",
        "conferences": [{
          "conferenceName": "Big 12",
          "conferenceSeo": "big-12"
        }]
      },
      "liveVideoEnabled": false,
      "startTime": "12:00PM ET",
      "startTimeEpoch": "1664035200",
      "bracketId": "",
      "gameState": "final",
      "startDate": "09-24-2022",
      "currentPeriod": "FINAL",
      "videoState": "",
      "bracketRegion": "",
      "contestClock": "0:00"
    }},
    {"game": {
      "gameID": "409467",
      "away": {
        "score": "14",
        "names": {
          "char6": "MIZZOU",
          "short": "Missouri",
          "seo": "missouri",
          "full": "University of Missouri, Columbia"
        },
        "winner": false,
        "seed": "",
        "description": "(2-2)",
        "rank": "",
        "conferences": [{
          "conferenceName": "SEC",
          "conferenceSeo": "sec"
        }]
      },
      "finalMessage": "FINAL (OT)",
      "bracketRound": "",
      "title": "Auburn Missouri",
      "contestName": "",
      "url": "/game/6005848",
      "network": "",
      "home": {
        "score": "17",
        "names": {
          "char6": "AUBURN",
          "short": "Auburn",
          "seo": "auburn",
          "full": "Auburn University"
        },
        "winner": true,
        "seed": "",
        "description": "(3-1)",
        "rank": "",
        "conferences": [{
          "conferenceName": "SEC",
          "conferenceSeo": "sec"
        }]
      },
      "liveVideoEnabled": false,
      "startTime": "12:00PM ET",
      "startTimeEpoch": "1664035200",
      "bracketId": "",
      "gameState": "final",
      "startDate": "09-24-2022",
      "currentPeriod": "FINAL (OT)",
      "videoState": "",
      "bracketRegion": "",
      "contestClock": ""
    }},
    {"game": {
      "gameID": "410031",
      "away": {
        "score": "14",
        "names": {
          "char6": "BGSU",
          "short": "Bowling Green",
          "seo": "bowling-green",
          "full": "Bowling Green State University"
        },
        "winner": false,
        "seed": "",
        "description": "(1-3)",
        "rank": "",
        "conferences": [{
          "conferenceName": "MAC",
          "conferenceSeo": "mac"
        }]
      },
      "finalMessage": "FINAL",
      "bracketRound": "",
      "title": "Mississippi St. Bowling Green",
      "contestName": "",
      "url": "/game/6005857",
      "network": "",
      "home": {
        "score": "45",
        "names": {
          "char6": "MISSST",
          "short": "Mississippi St.",
          "seo": "mississippi-st",
          "full": "Mississippi State University"
        },
        "winner": true,
        "seed": "",
        "description": "(3-1)",
        "rank": "",
        "conferences": [{
          "conferenceName": "SEC",
          "conferenceSeo": "sec"
        }]
      },
      "liveVideoEnabled": false,
      "startTime": "12:00PM ET",
      "startTimeEpoch": "1664035200",
      "bracketId": "",
      "gameState": "final",
      "startDate": "09-24-2022",
      "currentPeriod": "FINAL",
      "videoState": "",
      "bracketRegion": "",
      "contestClock": "0:00"
    }},
    {"game": {
      "gameID": "410243",
      "away": {
        "score": "24",
        "names": {
          "char6": "URI",
          "short": "Rhode Island",
          "seo": "rhode-island",
          "full": "University of Rhode Island"
        },
        "winner": false,
        "seed": "",
        "description": "(2-2)",
        "rank": "",
        "conferences": [{
          "conferenceName": "CAA",
          "conferenceSeo": "caa"
        }]
      },
      "finalMessage": "FINAL",
      "bracketRound": "",
      "title": "Pittsburgh Rhode Island",
      "contestName": "",
      "url": "/game/6005861",
      "network": "",
      "home": {
        "score": "45",
        "names": {
          "char6": "PITT",
          "short": "Pittsburgh",
          "seo": "pittsburgh",
          "full": "University of Pittsburgh"
        },
        "winner": true,
        "seed": "",
        "description": "(3-1)",
        "rank": "24",
        "conferences": [
          {
            "conferenceName": "ACC",
            "conferenceSeo": "acc"
          },
          {
            "conferenceName": "Top 25",
            "conferenceSeo": "top-25"
          }
        ]
      },
      "liveVideoEnabled": false,
      "startTime": "12:00PM ET",
      "startTimeEpoch": "1664035200",
      "bracketId": "",
      "gameState": "final",
      "startDate": "09-24-2022",
      "currentPeriod": "FINAL",
      "videoState": "",
      "bracketRegion": "",
      "contestClock": "0:00"
    }},
    {"game": {
      "gameID": "409918",
      "away": {
        "score": "3",
        "names": {
          "char6": "USF",
          "short": "South Fla.",
          "seo": "south-fla",
          "full": "University of South Florida"
        },
        "winner": false,
        "seed": "",
        "description": "(1-3)",
        "rank": "",
        "conferences": [{
          "conferenceName": "AAC",
          "conferenceSeo": "aac"
        }]
      },
      "finalMessage": "FINAL",
      "bracketRound": "",
      "title": "Louisville South Fla.",
      "contestName": "",
      "url": "/game/6005863",
      "network": "",
      "home": {
        "score": "41",
        "names": {
          "char6": "LOUIS",
          "short": "Louisville",
          "seo": "louisville",
          "full": "University of Louisville"
        },
        "winner": true,
        "seed": "",
        "description": "(2-2)",
        "rank": "",
        "conferences": [{
          "conferenceName": "ACC",
          "conferenceSeo": "acc"
        }]
      },
      "liveVideoEnabled": false,
      "startTime": "12:00PM ET",
      "startTimeEpoch": "1664035200",
      "bracketId": "",
      "gameState": "final",
      "startDate": "09-24-2022",
      "currentPeriod": "FINAL",
      "videoState": "",
      "bracketRegion": "",
      "contestClock": "6:00"
    }},
    {"game": {
      "gameID": "410636",
      "away": {
        "score": "51",
        "names": {
          "char6": "CLEM",
          "short": "Clemson",
          "seo": "clemson",
          "full": "Clemson University"
        },
        "winner": true,
        "seed": "",
        "description": "(4-0)",
        "rank": "5",
        "conferences": [
          {
            "conferenceName": "ACC",
            "conferenceSeo": "acc"
          },
          {
            "conferenceName": "Top 25",
            "conferenceSeo": "top-25"
          }
        ]
      },
      "finalMessage": "FINAL (OT)",
      "bracketRound": "",
      "title": "Wake Forest Clemson",
      "contestName": "",
      "url": "/game/6005864",
      "network": "",
      "home": {
        "score": "45",
        "names": {
          "char6": "WAKE",
          "short": "Wake Forest",
          "seo": "wake-forest",
          "full": "Wake Forest University"
        },
        "winner": false,
        "seed": "",
        "description": "(3-1)",
        "rank": "21",
        "conferences": [
          {
            "conferenceName": "ACC",
            "conferenceSeo": "acc"
          },
          {
            "conferenceName": "Top 25",
            "conferenceSeo": "top-25"
          }
        ]
      },
      "liveVideoEnabled": false,
      "startTime": "12:00PM ET",
      "startTimeEpoch": "1664035200",
      "bracketId": "",
      "gameState": "final",
      "startDate": "09-24-2022",
      "currentPeriod": "FINAL (OT)",
      "videoState": "",
      "bracketRegion": "",
      "contestClock": ""
    }},
    {"game": {
      "gameID": "409969",
      "away": {
        "score": "27",
        "names": {
          "char6": "MD",
          "short": "Maryland",
          "seo": "maryland",
          "full": "University of Maryland, College Park"
        },
        "winner": false,
        "seed": "",
        "description": "(3-1)",
        "rank": "",
        "conferences": [{
          "conferenceName": "Big Ten",
          "conferenceSeo": "big-ten"
        }]
      },
      "finalMessage": "FINAL",
      "bracketRound": "",
      "title": "Michigan Maryland",
      "contestName": "",
      "url": "/game/6005871",
      "network": "",
      "home": {
        "score": "34",
        "names": {
          "char6": "MICH",
          "short": "Michigan",
          "seo": "michigan",
          "full": "University of Michigan"
        },
        "winner": true,
        "seed": "",
        "description": "(4-0)",
        "rank": "4",
        "conferences": [
          {
            "conferenceName": "Big Ten",
            "conferenceSeo": "big-ten"
          },
          {
            "conferenceName": "Top 25",
            "conferenceSeo": "top-25"
          }
        ]
      },
      "liveVideoEnabled": false,
      "startTime": "12:00PM ET",
      "startTimeEpoch": "1664035200",
      "bracketId": "",
      "gameState": "final",
      "startDate": "09-24-2022",
      "currentPeriod": "FINAL",
      "videoState": "",
      "bracketRegion": "",
      "contestClock": "0:00"
    }},
    {"game": {
      "gameID": "409742",
      "away": {
        "score": "22",
        "names": {
          "char6": "KENT",
          "short": "Kent St.",
          "seo": "kent-st",
          "full": "Kent State University"
        },
        "winner": false,
        "seed": "",
        "description": "(1-3)",
        "rank": "",
        "conferences": [{
          "conferenceName": "MAC",
          "conferenceSeo": "mac"
        }]
      },
      "finalMessage": "FINAL",
      "bracketRound": "",
      "title": "Georgia Kent St.",
      "contestName": "",
      "url": "/game/6005872",
      "network": "",
      "home": {
        "score": "39",
        "names": {
          "char6": "UGA",
          "short": "Georgia",
          "seo": "georgia",
          "full": "University of Georgia"
        },
        "winner": true,
        "seed": "",
        "description": "(4-0)",
        "rank": "1",
        "conferences": [
          {
            "conferenceName": "SEC",
            "conferenceSeo": "sec"
          },
          {
            "conferenceName": "Top 25",
            "conferenceSeo": "top-25"
          }
        ]
      },
      "liveVideoEnabled": false,
      "startTime": "12:00PM ET",
      "startTimeEpoch": "1664035200",
      "bracketId": "",
      "gameState": "final",
      "startDate": "09-24-2022",
      "currentPeriod": "FINAL",
      "videoState": "",
      "bracketRegion": "",
      "contestClock": "0:00"
    }},
    {"game": {
      "gameID": "410425",
      "away": {
        "score": "0",
        "names": {
          "char6": "UMASS",
          "short": "Massachusetts",
          "seo": "massachusetts",
          "full": "University of Massachusetts, Amherst"
        },
        "winner": false,
        "seed": "",
        "description": "(1-3)",
        "rank": "",
        "conferences": [{
          "conferenceName": "FBS Independent",
          "conferenceSeo": "fbs-independent"
        }]
      },
      "finalMessage": "FINAL",
      "bracketRound": "",
      "title": "Temple Massachusetts",
      "contestName": "",
      "url": "/game/6005828",
      "network": "",
      "home": {
        "score": "28",
        "names": {
          "char6": "TEMPLE",
          "short": "Temple",
          "seo": "temple",
          "full": "Temple University"
        },
        "winner": true,
        "seed": "",
        "description": "(2-2)",
        "rank": "",
        "conferences": [{
          "conferenceName": "AAC",
          "conferenceSeo": "aac"
        }]
      },
      "liveVideoEnabled": false,
      "startTime": "02:00PM ET",
      "startTimeEpoch": "1664042400",
      "bracketId": "",
      "gameState": "final",
      "startDate": "09-24-2022",
      "currentPeriod": "FINAL",
      "videoState": "",
      "bracketRegion": "",
      "contestClock": "0:00"
    }},
    {"game": {
      "gameID": "409586",
      "away": {
        "score": "45",
        "names": {
          "char6": "UCLA",
          "short": "UCLA",
          "seo": "ucla",
          "full": "University of California, Los Angeles"
        },
        "winner": true,
        "seed": "",
        "description": "(4-0)",
        "rank": "",
        "conferences": [{
          "conferenceName": "Pac-12",
          "conferenceSeo": "pac-12"
        }]
      },
      "finalMessage": "FINAL",
      "bracketRound": "",
      "title": "Colorado UCLA",
      "contestName": "",
      "url": "/game/6005846",
      "network": "",
      "home": {
        "score": "17",
        "names": {
          "char6": "COLO",
          "short": "Colorado",
          "seo": "colorado",
          "full": "University of Colorado, Boulder"
        },
        "winner": false,
        "seed": "",
        "description": "(0-4)",
        "rank": "",
        "conferences": [{
          "conferenceName": "Pac-12",
          "conferenceSeo": "pac-12"
        }]
      },
      "liveVideoEnabled": false,
      "startTime": "02:00PM ET",
      "startTimeEpoch": "1664042400",
      "bracketId": "",
      "gameState": "final",
      "startDate": "09-24-2022",
      "currentPeriod": "FINAL",
      "videoState": "",
      "bracketRegion": "",
      "contestClock": "0:00"
    }},
    {"game": {
      "gameID": "410164",
      "away": {
        "score": "52",
        "names": {
          "char6": "FORDHM",
          "short": "Fordham",
          "seo": "fordham",
          "full": "Fordham University"
        },
        "winner": false,
        "seed": "",
        "description": "(3-1)",
        "rank": "",
        "conferences": [{
          "conferenceName": "Patriot",
          "conferenceSeo": "patriot"
        }]
      },
      "finalMessage": "FINAL",
      "bracketRound": "",
      "title": "Ohio Fordham",
      "contestName": "",
      "url": "/game/6005855",
      "network": "",
      "home": {
        "score": "59",
        "names": {
          "char6": "OHIO",
          "short": "Ohio",
          "seo": "ohio",
          "full": "Ohio University"
        },
        "winner": true,
        "seed": "",
        "description": "(2-2)",
        "rank": "",
        "conferences": [{
          "conferenceName": "MAC",
          "conferenceSeo": "mac"
        }]
      },
      "liveVideoEnabled": false,
      "startTime": "02:00PM ET",
      "startTimeEpoch": "1664042400",
      "bracketId": "",
      "gameState": "final",
      "startDate": "09-24-2022",
      "currentPeriod": "FINAL",
      "videoState": "",
      "bracketRegion": "",
      "contestClock": "0:00"
    }},
    {"game": {
      "gameID": "409983",
      "away": {
        "score": "45",
        "names": {
          "char6": "MIDTEN",
          "short": "Middle Tenn.",
          "seo": "middle-tenn",
          "full": "Middle Tennessee State University"
        },
        "winner": true,
        "seed": "",
        "description": "(3-1)",
        "rank": "",
        "conferences": [{
          "conferenceName": "C-USA",
          "conferenceSeo": "c-usa"
        }]
      },
      "finalMessage": "FINAL",
      "bracketRound": "",
      "title": "Miami (FL) Middle Tenn.",
      "contestName": "",
      "url": "/game/6005826",
      "network": "",
      "home": {
        "score": "31",
        "names": {
          "char6": "MIAMI",
          "short": "Miami (FL)",
          "seo": "miami-fl",
          "full": "University of Miami (Florida)"
        },
        "winner": false,
        "seed": "",
        "description": "(2-2)",
        "rank": "25",
        "conferences": [
          {
            "conferenceName": "ACC",
            "conferenceSeo": "acc"
          },
          {
            "conferenceName": "Top 25",
            "conferenceSeo": "top-25"
          }
        ]
      },
      "liveVideoEnabled": false,
      "startTime": "03:30PM ET",
      "startTimeEpoch": "1664047800",
      "bracketId": "",
      "gameState": "final",
      "startDate": "09-24-2022",
      "currentPeriod": "FINAL",
      "videoState": "",
      "bracketRegion": "",
      "contestClock": "0:00"
    }},
    {"game": {
      "gameID": "410446",
      "away": {
        "score": "34",
        "names": {
          "char6": "TEXAS",
          "short": "Texas",
          "seo": "texas",
          "full": "University of Texas at Austin"
        },
        "winner": false,
        "seed": "",
        "description": "(2-2)",
        "rank": "22",
        "conferences": [
          {
            "conferenceName": "Big 12",
            "conferenceSeo": "big-12"
          },
          {
            "conferenceName": "Top 25",
            "conferenceSeo": "top-25"
          }
        ]
      },
      "finalMessage": "FINAL (OT)",
      "bracketRound": "",
      "title": "Texas Tech Texas",
      "contestName": "",
      "url": "/game/6005827",
      "network": "",
      "home": {
        "score": "37",
        "names": {
          "char6": "TXTECH",
          "short": "Texas Tech",
          "seo": "texas-tech",
          "full": "Texas Tech University"
        },
        "winner": true,
        "seed": "",
        "description": "(3-1)",
        "rank": "",
        "conferences": [{
          "conferenceName": "Big 12",
          "conferenceSeo": "big-12"
        }]
      },
      "liveVideoEnabled": false,
      "startTime": "03:30PM ET",
      "startTimeEpoch": "1664047800",
      "bracketId": "",
      "gameState": "final",
      "startDate": "09-24-2022",
      "currentPeriod": "FINAL (OT)",
      "videoState": "",
      "bracketRegion": "",
      "contestClock": ""
    }},
    {"game": {
      "gameID": "410558",
      "away": {
        "score": "45",
        "names": {
          "char6": "N DAME",
          "short": "Notre Dame",
          "seo": "notre-dame",
          "full": "University of Notre Dame"
        },
        "winner": true,
        "seed": "",
        "description": "(2-2)",
        "rank": "",
        "conferences": [{
          "conferenceName": "FBS Independent",
          "conferenceSeo": "fbs-independent"
        }]
      },
      "finalMessage": "FINAL",
      "bracketRound": "",
      "title": "North Carolina Notre Dame",
      "contestName": "",
      "url": "/game/6005835",
      "network": "",
      "home": {
        "score": "32",
        "names": {
          "char6": "UNC",
          "short": "North Carolina",
          "seo": "north-carolina",
          "full": "University of North Carolina, Chapel Hill"
        },
        "winner": false,
        "seed": "",
        "description": "(3-1)",
        "rank": "",
        "conferences": [{
          "conferenceName": "ACC",
          "conferenceSeo": "acc"
        }]
      },
      "liveVideoEnabled": false,
      "startTime": "03:30PM ET",
      "startTimeEpoch": "1664047800",
      "bracketId": "",
      "gameState": "final",
      "startDate": "09-24-2022",
      "currentPeriod": "FINAL",
      "videoState": "",
      "bracketRegion": "",
      "contestClock": "0:00"
    }},
    {"game": {
      "gameID": "423346",
      "away": {
        "score": "32",
        "names": {
          "char6": "JMU",
          "short": "James Madison",
          "seo": "james-madison",
          "full": "James Madison University"
        },
        "winner": true,
        "seed": "",
        "description": "(3-0)",
        "rank": "",
        "conferences": [{
          "conferenceName": "Sun Belt",
          "conferenceSeo": "sun-belt"
        }]
      },
      "finalMessage": "FINAL",
      "bracketRound": "",
      "title": "App State James Madison",
      "contestName": "",
      "url": "/game/6005838",
      "network": "",
      "home": {
        "score": "28",
        "names": {
          "char6": "APP ST",
          "short": "App State",
          "seo": "appalachian-st",
          "full": "Appalachian State University"
        },
        "winner": false,
        "seed": "",
        "description": "(2-2)",
        "rank": "",
        "conferences": [{
          "conferenceName": "Sun Belt",
          "conferenceSeo": "sun-belt"
        }]
      },
      "liveVideoEnabled": false,
      "startTime": "03:30PM ET",
      "startTimeEpoch": "1664047800",
      "bracketId": "",
      "gameState": "final",
      "startDate": "09-24-2022",
      "currentPeriod": "FINAL",
      "videoState": "",
      "bracketRegion": "",
      "contestClock": "0:00"
    }},
    {"game": {
      "gameID": "410432",
      "away": {
        "score": "33",
        "names": {
          "char6": "FLA",
          "short": "Florida",
          "seo": "florida",
          "full": "University of Florida"
        },
        "winner": false,
        "seed": "",
        "description": "(2-2)",
        "rank": "20",
        "conferences": [
          {
            "conferenceName": "SEC",
            "conferenceSeo": "sec"
          },
          {
            "conferenceName": "Top 25",
            "conferenceSeo": "top-25"
          }
        ]
      },
      "finalMessage": "FINAL",
      "bracketRound": "",
      "title": "Tennessee Florida",
      "contestName": "",
      "url": "/game/6005839",
      "network": "",
      "home": {
        "score": "38",
        "names": {
          "char6": "TENN",
          "short": "Tennessee",
          "seo": "tennessee",
          "full": "University of Tennessee, Knoxville"
        },
        "winner": true,
        "seed": "",
        "description": "(4-0)",
        "rank": "11",
        "conferences": [
          {
            "conferenceName": "SEC",
            "conferenceSeo": "sec"
          },
          {
            "conferenceName": "Top 25",
            "conferenceSeo": "top-25"
          }
        ]
      },
      "liveVideoEnabled": false,
      "startTime": "03:30PM ET",
      "startTimeEpoch": "1664047800",
      "bracketId": "",
      "gameState": "final",
      "startDate": "09-24-2022",
      "currentPeriod": "FINAL",
      "videoState": "",
      "bracketRegion": "",
      "contestClock": "0:00"
    }},
    {"game": {
      "gameID": "409953",
      "away": {
        "score": "34",
        "names": {
          "char6": "NO TEX",
          "short": "North Texas",
          "seo": "north-texas",
          "full": "University of North Texas"
        },
        "winner": false,
        "seed": "",
        "description": "(2-3)",
        "rank": "",
        "conferences": [{
          "conferenceName": "C-USA",
          "conferenceSeo": "c-usa"
        }]
      },
      "finalMessage": "FINAL",
      "bracketRound": "",
      "title": "Memphis North Texas",
      "contestName": "",
      "url": "/game/6005845",
      "network": "",
      "home": {
        "score": "44",
        "names": {
          "char6": "MEM",
          "short": "Memphis",
          "seo": "memphis",
          "full": "University of Memphis"
        },
        "winner": true,
        "seed": "",
        "description": "(3-1)",
        "rank": "",
        "conferences": [{
          "conferenceName": "AAC",
          "conferenceSeo": "aac"
        }]
      },
      "liveVideoEnabled": false,
      "startTime": "03:30PM ET",
      "startTimeEpoch": "1664047800",
      "bracketId": "",
      "gameState": "final",
      "startDate": "09-24-2022",
      "currentPeriod": "FINAL",
      "videoState": "",
      "bracketRegion": "",
      "contestClock": "0:00"
    }},
    {"game": {
      "gameID": "410039",
      "away": {
        "score": "34",
        "names": {
          "char6": "MINN",
          "short": "Minnesota",
          "seo": "minnesota",
          "full": "University of Minnesota, Twin Cities"
        },
        "winner": true,
        "seed": "",
        "description": "(4-0)",
        "rank": "",
        "conferences": [{
          "conferenceName": "Big Ten",
          "conferenceSeo": "big-ten"
        }]
      },
      "finalMessage": "FINAL",
      "bracketRound": "",
      "title": "Michigan St. Minnesota",
      "contestName": "",
      "url": "/game/6005859",
      "network": "",
      "home": {
        "score": "7",
        "names": {
          "char6": "MICHST",
          "short": "Michigan St.",
          "seo": "michigan-st",
          "full": "Michigan State University"
        },
        "winner": false,
        "seed": "",
        "description": "(2-2)",
        "rank": "",
        "conferences": [{
          "conferenceName": "Big Ten",
          "conferenceSeo": "big-ten"
        }]
      },
      "liveVideoEnabled": false,
      "startTime": "03:30PM ET",
      "startTimeEpoch": "1664047800",
      "bracketId": "",
      "gameState": "final",
      "startDate": "09-24-2022",
      "currentPeriod": "FINAL",
      "videoState": "",
      "bracketRegion": "",
      "contestClock": "0:00"
    }},
    {"game": {
      "gameID": "409544",
      "away": {
        "score": "24",
        "names": {
          "char6": "IND",
          "short": "Indiana",
          "seo": "indiana",
          "full": "Indiana University, Bloomington"
        },
        "winner": false,
        "seed": "",
        "description": "(3-1)",
        "rank": "",
        "conferences": [{
          "conferenceName": "Big Ten",
          "conferenceSeo": "big-ten"
        }]
      },
      "finalMessage": "FINAL",
      "bracketRound": "",
      "title": "Cincinnati Indiana",
      "contestName": "",
      "url": "/game/6005865",
      "network": "",
      "home": {
        "score": "45",
        "names": {
          "char6": "CINCY",
          "short": "Cincinnati",
          "seo": "cincinnati",
          "full": "University of Cincinnati"
        },
        "winner": true,
        "seed": "",
        "description": "(3-1)",
        "rank": "",
        "conferences": [{
          "conferenceName": "AAC",
          "conferenceSeo": "aac"
        }]
      },
      "liveVideoEnabled": false,
      "startTime": "03:30PM ET",
      "startTimeEpoch": "1664047800",
      "bracketId": "",
      "gameState": "final",
      "startDate": "09-24-2022",
      "currentPeriod": "FINAL",
      "videoState": "",
      "bracketRegion": "",
      "contestClock": "0:00"
    }},
    {"game": {
      "gameID": "410341",
      "away": {
        "score": "14",
        "names": {
          "char6": "TOLEDO",
          "short": "Toledo",
          "seo": "toledo",
          "full": "University of Toledo"
        },
        "winner": false,
        "seed": "",
        "description": "(2-2)",
        "rank": "",
        "conferences": [{
          "conferenceName": "MAC",
          "conferenceSeo": "mac"
        }]
      },
      "finalMessage": "FINAL",
      "bracketRound": "",
      "title": "San Diego St. Toledo",
      "contestName": "",
      "url": "/game/6005867",
      "network": "",
      "home": {
        "score": "17",
        "names": {
          "char6": "SDSU",
          "short": "San Diego St.",
          "seo": "san-diego-st",
          "full": "San Diego State University"
        },
        "winner": true,
        "seed": "",
        "description": "(2-2)",
        "rank": "",
        "conferences": [{
          "conferenceName": "Mountain West",
          "conferenceSeo": "mountain-west"
        }]
      },
      "liveVideoEnabled": false,
      "startTime": "03:30PM ET",
      "startTimeEpoch": "1664047800",
      "bracketId": "",
      "gameState": "final",
      "startDate": "09-24-2022",
      "currentPeriod": "FINAL",
      "videoState": "",
      "bracketRegion": "",
      "contestClock": "0:00"
    }},
    {"game": {
      "gameID": "410677",
      "away": {
        "score": "0",
        "names": {
          "char6": "FIU",
          "short": "FIU",
          "seo": "fiu",
          "full": "Florida International University"
        },
        "winner": false,
        "seed": "",
        "description": "(1-2)",
        "rank": "",
        "conferences": [{
          "conferenceName": "C-USA",
          "conferenceSeo": "c-usa"
        }]
      },
      "finalMessage": "FINAL",
      "bracketRound": "",
      "title": "Western Ky. FIU",
      "contestName": "",
      "url": "/game/6005874",
      "network": "",
      "home": {
        "score": "73",
        "names": {
          "char6": "W KY",
          "short": "Western Ky.",
          "seo": "western-ky",
          "full": "Western Kentucky University"
        },
        "winner": true,
        "seed": "",
        "description": "(3-1)",
        "rank": "",
        "conferences": [{
          "conferenceName": "C-USA",
          "conferenceSeo": "c-usa"
        }]
      },
      "liveVideoEnabled": false,
      "startTime": "03:30PM ET",
      "startTimeEpoch": "1664047800",
      "bracketId": "",
      "gameState": "final",
      "startDate": "09-24-2022",
      "currentPeriod": "FINAL",
      "videoState": "",
      "bracketRegion": "",
      "contestClock": "0:00"
    }},
    {"game": {
      "gameID": "410508",
      "away": {
        "score": "24",
        "names": {
          "char6": "TX SOU",
          "short": "Texas Southern",
          "seo": "texas-southern",
          "full": "Texas Southern University"
        },
        "winner": false,
        "seed": "",
        "description": "(1-3)",
        "rank": "",
        "conferences": [{
          "conferenceName": "SWAC",
          "conferenceSeo": "swac"
        }]
      },
      "finalMessage": "FINAL",
      "bracketRound": "",
      "title": "UTSA Texas Southern",
      "contestName": "",
      "url": "/game/6005875",
      "network": "",
      "home": {
        "score": "52",
        "names": {
          "char6": "UTSA",
          "short": "UTSA",
          "seo": "utsa",
          "full": "University of Texas at San Antonio"
        },
        "winner": true,
        "seed": "",
        "description": "(2-2)",
        "rank": "",
        "conferences": [{
          "conferenceName": "C-USA",
          "conferenceSeo": "c-usa"
        }]
      },
      "liveVideoEnabled": false,
      "startTime": "03:30PM ET",
      "startTimeEpoch": "1664047800",
      "bracketId": "",
      "gameState": "final",
      "startDate": "09-24-2022",
      "currentPeriod": "FINAL",
      "videoState": "",
      "bracketRegion": "",
      "contestClock": "0:00"
    }},
    {"game": {
      "gameID": "410530",
      "away": {
        "score": "10",
        "names": {
          "char6": "GATECH",
          "short": "Georgia Tech",
          "seo": "georgia-tech",
          "full": "Georgia Institute of Technology"
        },
        "winner": false,
        "seed": "",
        "description": "(1-3)",
        "rank": "",
        "conferences": [{
          "conferenceName": "ACC",
          "conferenceSeo": "acc"
        }]
      },
      "finalMessage": "FINAL",
      "bracketRound": "",
      "title": "UCF Georgia Tech",
      "contestName": "",
      "url": "/game/6005841",
      "network": "",
      "home": {
        "score": "27",
        "names": {
          "char6": "UCF",
          "short": "UCF",
          "seo": "ucf",
          "full": "University of Central Florida"
        },
        "winner": true,
        "seed": "",
        "description": "(3-1)",
        "rank": "",
        "conferences": [{
          "conferenceName": "AAC",
          "conferenceSeo": "aac"
        }]
      },
      "liveVideoEnabled": false,
      "startTime": "04:00PM ET",
      "startTimeEpoch": "1664049600",
      "bracketId": "",
      "gameState": "final",
      "startDate": "09-24-2022",
      "currentPeriod": "FINAL",
      "videoState": "",
      "bracketRegion": "",
      "contestClock": "0:00"
    }},
    {"game": {
      "gameID": "410650",
      "away": {
        "score": "44",
        "names": {
          "char6": "OREGN",
          "short": "Oregon",
          "seo": "oregon",
          "full": "University of Oregon"
        },
        "winner": true,
        "seed": "",
        "description": "(3-1)",
        "rank": "15",
        "conferences": [
          {
            "conferenceName": "Pac-12",
            "conferenceSeo": "pac-12"
          },
          {
            "conferenceName": "Top 25",
            "conferenceSeo": "top-25"
          }
        ]
      },
      "finalMessage": "FINAL",
      "bracketRound": "",
      "title": "Washington St. Oregon",
      "contestName": "",
      "url": "/game/6005862",
      "network": "",
      "home": {
        "score": "41",
        "names": {
          "char6": "WASHST",
          "short": "Washington St.",
          "seo": "washington-st",
          "full": "Washington State University"
        },
        "winner": false,
        "seed": "",
        "description": "(3-1)",
        "rank": "",
        "conferences": [{
          "conferenceName": "Pac-12",
          "conferenceSeo": "pac-12"
        }]
      },
      "liveVideoEnabled": false,
      "startTime": "04:00PM ET",
      "startTimeEpoch": "1664049600",
      "bracketId": "",
      "gameState": "final",
      "startDate": "09-24-2022",
      "currentPeriod": "FINAL",
      "videoState": "",
      "bracketRegion": "",
      "contestClock": "1:33"
    }},
    {"game": {
      "gameID": "410193",
      "away": {
        "score": "27",
        "names": {
          "char6": "TULSA",
          "short": "Tulsa",
          "seo": "tulsa",
          "full": "The University of Tulsa"
        },
        "winner": false,
        "seed": "",
        "description": "(2-2)",
        "rank": "",
        "conferences": [{
          "conferenceName": "AAC",
          "conferenceSeo": "aac"
        }]
      },
      "finalMessage": "FINAL",
      "bracketRound": "",
      "title": "Ole Miss Tulsa",
      "contestName": "",
      "url": "/game/6005868",
      "network": "",
      "home": {
        "score": "35",
        "names": {
          "char6": "MISS",
          "short": "Ole Miss",
          "seo": "ole-miss",
          "full": "University of Mississippi"
        },
        "winner": true,
        "seed": "",
        "description": "(4-0)",
        "rank": "16",
        "conferences": [
          {
            "conferenceName": "SEC",
            "conferenceSeo": "sec"
          },
          {
            "conferenceName": "Top 25",
            "conferenceSeo": "top-25"
          }
        ]
      },
      "liveVideoEnabled": false,
      "startTime": "04:00PM ET",
      "startTimeEpoch": "1664049600",
      "bracketId": "",
      "gameState": "final",
      "startDate": "09-24-2022",
      "currentPeriod": "FINAL",
      "videoState": "",
      "bracketRegion": "",
      "contestClock": "0:00"
    }},
    {"game": {
      "gameID": "409614",
      "away": {
        "score": "41",
        "names": {
          "char6": "SAC ST",
          "short": "Sacramento St.",
          "seo": "sacramento-st",
          "full": "California State University, Sacramento"
        },
        "winner": true,
        "seed": "",
        "description": "(3-0)",
        "rank": "",
        "conferences": [{
          "conferenceName": "Big Sky",
          "conferenceSeo": "big-sky"
        }]
      },
      "finalMessage": "FINAL",
      "bracketRound": "",
      "title": "Colorado St. Sacramento St.",
      "contestName": "",
      "url": "/game/6005873",
      "network": "",
      "home": {
        "score": "10",
        "names": {
          "char6": "CO ST",
          "short": "Colorado St.",
          "seo": "colorado-st",
          "full": "Colorado State University"
        },
        "winner": false,
        "seed": "",
        "description": "(0-4)",
        "rank": "",
        "conferences": [{
          "conferenceName": "Mountain West",
          "conferenceSeo": "mountain-west"
        }]
      },
      "liveVideoEnabled": false,
      "startTime": "04:00PM ET",
      "startTimeEpoch": "1664049600",
      "bracketId": "",
      "gameState": "final",
      "startDate": "09-24-2022",
      "currentPeriod": "FINAL",
      "videoState": "",
      "bracketRegion": "",
      "contestClock": "0:00"
    }},
    {"game": {
      "gameID": "409524",
      "away": {
        "score": "31",
        "names": {
          "char6": "ARIZ",
          "short": "Arizona",
          "seo": "arizona",
          "full": "University of Arizona"
        },
        "winner": false,
        "seed": "",
        "description": "(2-2)",
        "rank": "",
        "conferences": [{
          "conferenceName": "Pac-12",
          "conferenceSeo": "pac-12"
        }]
      },
      "finalMessage": "FINAL",
      "bracketRound": "",
      "title": "California Arizona",
      "contestName": "",
      "url": "/game/6005856",
      "network": "",
      "home": {
        "score": "49",
        "names": {
          "char6": "CAL",
          "short": "California",
          "seo": "california",
          "full": "University of California, Berkeley"
        },
        "winner": true,
        "seed": "",
        "description": "(3-1)",
        "rank": "",
        "conferences": [{
          "conferenceName": "Pac-12",
          "conferenceSeo": "pac-12"
        }]
      },
      "liveVideoEnabled": false,
      "startTime": "05:30PM ET",
      "startTimeEpoch": "1664055000",
      "bracketId": "",
      "gameState": "final",
      "startDate": "09-24-2022",
      "currentPeriod": "FINAL",
      "videoState": "",
      "bracketRegion": "",
      "contestClock": "0:00"
    }},
    {"game": {
      "gameID": "409911",
      "away": {
        "score": "12",
        "names": {
          "char6": "AKRON",
          "short": "Akron",
          "seo": "akron",
          "full": "University of Akron"
        },
        "winner": false,
        "seed": "",
        "description": "(1-3)",
        "rank": "",
        "conferences": [{
          "conferenceName": "MAC",
          "conferenceSeo": "mac"
        }]
      },
      "finalMessage": "FINAL",
      "bracketRound": "",
      "title": "Liberty Akron",
      "contestName": "",
      "url": "/game/6005832",
      "network": "",
      "home": {
        "score": "21",
        "names": {
          "char6": "LIBRTY",
          "short": "Liberty",
          "seo": "liberty",
          "full": "Liberty University"
        },
        "winner": true,
        "seed": "",
        "description": "(3-1)",
        "rank": "",
        "conferences": [{
          "conferenceName": "FBS Independent",
          "conferenceSeo": "fbs-independent"
        }]
      },
      "liveVideoEnabled": false,
      "startTime": "06:00PM ET",
      "startTimeEpoch": "1664056800",
      "bracketId": "",
      "gameState": "final",
      "startDate": "09-24-2022",
      "currentPeriod": "FINAL",
      "videoState": "",
      "bracketRegion": "",
      "contestClock": "0:00"
    }},
    {"game": {
      "gameID": "410185",
      "away": {
        "score": "26",
        "names": {
          "char6": "ARK ST",
          "short": "Arkansas St.",
          "seo": "arkansas-st",
          "full": "Arkansas State University"
        },
        "winner": false,
        "seed": "",
        "description": "(1-3)",
        "rank": "",
        "conferences": [{
          "conferenceName": "Sun Belt",
          "conferenceSeo": "sun-belt"
        }]
      },
      "finalMessage": "FINAL",
      "bracketRound": "",
      "title": "Old Dominion Arkansas St.",
      "contestName": "",
      "url": "/game/6005834",
      "network": "",
      "home": {
        "score": "29",
        "names": {
          "char6": "ODU",
          "short": "Old Dominion",
          "seo": "old-dominion",
          "full": "Old Dominion University"
        },
        "winner": true,
        "seed": "",
        "description": "(2-2)",
        "rank": "",
        "conferences": [{
          "conferenceName": "Sun Belt",
          "conferenceSeo": "sun-belt"
        }]
      },
      "liveVideoEnabled": false,
      "startTime": "06:00PM ET",
      "startTimeEpoch": "1664056800",
      "bracketId": "",
      "gameState": "final",
      "startDate": "09-24-2022",
      "currentPeriod": "FINAL",
      "videoState": "",
      "bracketRegion": "",
      "contestClock": "0:00"
    }},
    {"game": {
      "gameID": "409798",
      "away": {
        "score": "27",
        "names": {
          "char6": "RICE",
          "short": "Rice",
          "seo": "rice",
          "full": "Rice University"
        },
        "winner": false,
        "seed": "",
        "description": "(2-2)",
        "rank": "",
        "conferences": [{
          "conferenceName": "C-USA",
          "conferenceSeo": "c-usa"
        }]
      },
      "finalMessage": "FINAL",
      "bracketRound": "",
      "title": "Houston Rice",
      "contestName": "",
      "url": "/game/6005850",
      "network": "",
      "home": {
        "score": "34",
        "names": {
          "char6": "HOU",
          "short": "Houston",
          "seo": "houston",
          "full": "University of Houston"
        },
        "winner": true,
        "seed": "",
        "description": "(2-2)",
        "rank": "",
        "conferences": [{
          "conferenceName": "AAC",
          "conferenceSeo": "aac"
        }]
      },
      "liveVideoEnabled": false,
      "startTime": "06:00PM ET",
      "startTimeEpoch": "1664056800",
      "bracketId": "",
      "gameState": "final",
      "startDate": "09-24-2022",
      "currentPeriod": "FINAL",
      "videoState": "",
      "bracketRegion": "",
      "contestClock": "0:00"
    }},
    {"game": {
      "gameID": "409660",
      "away": {
        "score": "23",
        "names": {
          "char6": "NAVY",
          "short": "Navy",
          "seo": "navy",
          "full": "U.S. Naval Academy"
        },
        "winner": true,
        "seed": "",
        "description": "(1-2)",
        "rank": "",
        "conferences": [{
          "conferenceName": "AAC",
          "conferenceSeo": "aac"
        }]
      },
      "finalMessage": "FINAL (OT)",
      "bracketRound": "",
      "title": "East Carolina Navy",
      "contestName": "",
      "url": "/game/6005854",
      "network": "",
      "home": {
        "score": "20",
        "names": {
          "char6": "E CAR",
          "short": "East Carolina",
          "seo": "east-carolina",
          "full": "East Carolina University"
        },
        "winner": false,
        "seed": "",
        "description": "(2-2)",
        "rank": "",
        "conferences": [{
          "conferenceName": "AAC",
          "conferenceSeo": "aac"
        }]
      },
      "liveVideoEnabled": false,
      "startTime": "06:00PM ET",
      "startTimeEpoch": "1664056800",
      "bracketId": "",
      "gameState": "final",
      "startDate": "09-24-2022",
      "currentPeriod": "FINAL (OT)",
      "videoState": "",
      "bracketRegion": "",
      "contestClock": ""
    }},
    {"game": {
      "gameID": "409749",
      "away": {
        "score": "23",
        "names": {
          "char6": "BALLST",
          "short": "Ball St.",
          "seo": "ball-st",
          "full": "Ball State University"
        },
        "winner": false,
        "seed": "",
        "description": "(1-3)",
        "rank": "",
        "conferences": [{
          "conferenceName": "MAC",
          "conferenceSeo": "mac"
        }]
      },
      "finalMessage": "FINAL",
      "bracketRound": "",
      "title": "Ga. Southern Ball St.",
      "contestName": "",
      "url": "/game/6005878",
      "network": "",
      "home": {
        "score": "34",
        "names": {
          "char6": "GA SOU",
          "short": "Ga. Southern",
          "seo": "ga-southern",
          "full": "Georgia Southern University"
        },
        "winner": true,
        "seed": "",
        "description": "(3-1)",
        "rank": "",
        "conferences": [{
          "conferenceName": "Sun Belt",
          "conferenceSeo": "sun-belt"
        }]
      },
      "liveVideoEnabled": false,
      "startTime": "06:00PM ET",
      "startTimeEpoch": "1664056800",
      "bracketId": "",
      "gameState": "final",
      "startDate": "09-24-2022",
      "currentPeriod": "FINAL",
      "videoState": "",
      "bracketRegion": "",
      "contestClock": "0:00"
    }},
    {"game": {
      "gameID": "410488",
      "away": {
        "score": "27",
        "names": {
          "char6": "S MISS",
          "short": "Southern Miss.",
          "seo": "southern-miss",
          "full": "The University of Southern Mississippi"
        },
        "winner": true,
        "seed": "",
        "description": "(2-2)",
        "rank": "",
        "conferences": [{
          "conferenceName": "Sun Belt",
          "conferenceSeo": "sun-belt"
        }]
      },
      "finalMessage": "FINAL",
      "bracketRound": "",
      "title": "Tulane Southern Miss.",
      "contestName": "",
      "url": "/game/6005840",
      "network": "",
      "home": {
        "score": "24",
        "names": {
          "char6": "TULANE",
          "short": "Tulane",
          "seo": "tulane",
          "full": "Tulane University"
        },
        "winner": false,
        "seed": "",
        "description": "(3-1)",
        "rank": "",
        "conferences": [{
          "conferenceName": "AAC",
          "conferenceSeo": "aac"
        }]
      },
      "liveVideoEnabled": false,
      "startTime": "07:00PM ET",
      "startTimeEpoch": "1664060400",
      "bracketId": "",
      "gameState": "final",
      "startDate": "09-24-2022",
      "currentPeriod": "FINAL",
      "videoState": "",
      "bracketRegion": "",
      "contestClock": "0:00"
    }},
    {"game": {
      "gameID": "410298",
      "away": {
        "score": "27",
        "names": {
          "char6": "IOWA",
          "short": "Iowa",
          "seo": "iowa",
          "full": "University of Iowa"
        },
        "winner": true,
        "seed": "",
        "description": "(3-1)",
        "rank": "",
        "conferences": [{
          "conferenceName": "Big Ten",
          "conferenceSeo": "big-ten"
        }]
      },
      "finalMessage": "FINAL",
      "bracketRound": "",
      "title": "Rutgers Iowa",
      "contestName": "",
      "url": "/game/6005842",
      "network": "",
      "home": {
        "score": "10",
        "names": {
          "char6": "RUTGER",
          "short": "Rutgers",
          "seo": "rutgers",
          "full": "Rutgers, The State University of New Jersey, New Brunswick"
        },
        "winner": false,
        "seed": "",
        "description": "(3-1)",
        "rank": "",
        "conferences": [{
          "conferenceName": "Big Ten",
          "conferenceSeo": "big-ten"
        }]
      },
      "liveVideoEnabled": false,
      "startTime": "07:00PM ET",
      "startTimeEpoch": "1664060400",
      "bracketId": "",
      "gameState": "final",
      "startDate": "09-24-2022",
      "currentPeriod": "FINAL",
      "videoState": "",
      "bracketRegion": "",
      "contestClock": "0:00"
    }},
    {"game": {
      "gameID": "409890",
      "away": {
        "score": "23",
        "names": {
          "char6": "NIU",
          "short": "NIU",
          "seo": "northern-ill",
          "full": "Northern Illinois University"
        },
        "winner": false,
        "seed": "",
        "description": "(1-3)",
        "rank": "",
        "conferences": [{
          "conferenceName": "MAC",
          "conferenceSeo": "mac"
        }]
      },
      "finalMessage": "FINAL",
      "bracketRound": "",
      "title": "Kentucky NIU",
      "contestName": "",
      "url": "/game/6005851",
      "network": "",
      "home": {
        "score": "31",
        "names": {
          "char6": "UK",
          "short": "Kentucky",
          "seo": "kentucky",
          "full": "University of Kentucky"
        },
        "winner": true,
        "seed": "",
        "description": "(4-0)",
        "rank": "8",
        "conferences": [
          {
            "conferenceName": "SEC",
            "conferenceSeo": "sec"
          },
          {
            "conferenceName": "Top 25",
            "conferenceSeo": "top-25"
          }
        ]
      },
      "liveVideoEnabled": false,
      "startTime": "07:00PM ET",
      "startTimeEpoch": "1664060400",
      "bracketId": "",
      "gameState": "final",
      "startDate": "09-24-2022",
      "currentPeriod": "FINAL",
      "videoState": "",
      "bracketRegion": "",
      "contestClock": "0:00"
    }},
    {"game": {
      "gameID": "410305",
      "away": {
        "score": "14",
        "names": {
          "char6": "LATECH",
          "short": "Louisiana Tech",
          "seo": "louisiana-tech",
          "full": "Louisiana Tech University"
        },
        "winner": false,
        "seed": "",
        "description": "(1-3)",
        "rank": "",
        "conferences": [{
          "conferenceName": "C-USA",
          "conferenceSeo": "c-usa"
        }]
      },
      "finalMessage": "FINAL",
      "bracketRound": "",
      "title": "South Alabama Louisiana Tech",
      "contestName": "",
      "url": "/game/6005853",
      "network": "",
      "home": {
        "score": "38",
        "names": {
          "char6": "S ALA",
          "short": "South Alabama",
          "seo": "south-ala",
          "full": "University of South Alabama"
        },
        "winner": true,
        "seed": "",
        "description": "(3-1)",
        "rank": "",
        "conferences": [{
          "conferenceName": "Sun Belt",
          "conferenceSeo": "sun-belt"
        }]
      },
      "liveVideoEnabled": false,
      "startTime": "07:00PM ET",
      "startTimeEpoch": "1664060400",
      "bracketId": "",
      "gameState": "final",
      "startDate": "09-24-2022",
      "currentPeriod": "FINAL",
      "videoState": "",
      "bracketRegion": "",
      "contestClock": "0:00"
    }},
    {"game": {
      "gameID": "423342",
      "away": {
        "score": "21",
        "names": {
          "char6": "ARK",
          "short": "Arkansas",
          "seo": "arkansas",
          "full": "University of Arkansas, Fayetteville"
        },
        "winner": false,
        "seed": "",
        "description": "(3-1)",
        "rank": "10",
        "conferences": [
          {
            "conferenceName": "SEC",
            "conferenceSeo": "sec"
          },
          {
            "conferenceName": "Top 25",
            "conferenceSeo": "top-25"
          }
        ]
      },
      "finalMessage": "FINAL",
      "bracketRound": "",
      "title": "Texas A&M Arkansas",
      "contestName": "",
      "url": "/game/6005870",
      "network": "",
      "home": {
        "score": "23",
        "names": {
          "char6": "TX A&M",
          "short": "Texas A&M",
          "seo": "texas-am",
          "full": "Texas A&M University, College Station"
        },
        "winner": true,
        "seed": "",
        "description": "(3-1)",
        "rank": "23",
        "conferences": [
          {
            "conferenceName": "SEC",
            "conferenceSeo": "sec"
          },
          {
            "conferenceName": "Top 25",
            "conferenceSeo": "top-25"
          }
        ]
      },
      "liveVideoEnabled": false,
      "startTime": "07:00PM ET",
      "startTimeEpoch": "1664060400",
      "bracketId": "",
      "gameState": "final",
      "startDate": "09-24-2022",
      "currentPeriod": "FINAL",
      "videoState": "",
      "bracketRegion": "",
      "contestClock": "0:00"
    }},
    {"game": {
      "gameID": "410580",
      "away": {
        "score": "34",
        "names": {
          "char6": "UNLV",
          "short": "UNLV",
          "seo": "unlv",
          "full": "University of Nevada, Las Vegas"
        },
        "winner": true,
        "seed": "",
        "description": "(3-1)",
        "rank": "",
        "conferences": [{
          "conferenceName": "Mountain West",
          "conferenceSeo": "mountain-west"
        }]
      },
      "finalMessage": "FINAL",
      "bracketRound": "",
      "title": "Utah St. UNLV",
      "contestName": "",
      "url": "/game/6005877",
      "network": "",
      "home": {
        "score": "24",
        "names": {
          "char6": "UT ST",
          "short": "Utah St.",
          "seo": "utah-st",
          "full": "Utah State University"
        },
        "winner": false,
        "seed": "",
        "description": "(1-3)",
        "rank": "",
        "conferences": [{
          "conferenceName": "Mountain West",
          "conferenceSeo": "mountain-west"
        }]
      },
      "liveVideoEnabled": false,
      "startTime": "07:00PM ET",
      "startTimeEpoch": "1664060400",
      "bracketId": "",
      "gameState": "final",
      "startDate": "09-24-2022",
      "currentPeriod": "FINAL",
      "videoState": "",
      "bracketRegion": "",
      "contestClock": "0:00"
    }},
    {"game": {
      "gameID": "410515",
      "away": {
        "score": "0",
        "names": {
          "char6": "HOUBAP",
          "short": "Houston Christian",
          "seo": "houston-baptist",
          "full": "Houston Christian University"
        },
        "winner": false,
        "seed": "",
        "description": "(1-2)",
        "rank": "",
        "conferences": [{
          "conferenceName": "Southland",
          "conferenceSeo": "southland"
        }]
      },
      "finalMessage": "FINAL",
      "bracketRound": "",
      "title": "Texas St. Houston Christian",
      "contestName": "",
      "url": "/game/6005879",
      "network": "",
      "home": {
        "score": "34",
        "names": {
          "char6": "TX ST",
          "short": "Texas St.",
          "seo": "texas-st",
          "full": "Texas State University"
        },
        "winner": true,
        "seed": "",
        "description": "(2-2)",
        "rank": "",
        "conferences": [{
          "conferenceName": "Sun Belt",
          "conferenceSeo": "sun-belt"
        }]
      },
      "liveVideoEnabled": false,
      "startTime": "07:00PM ET",
      "startTimeEpoch": "1664060400",
      "bracketId": "",
      "gameState": "final",
      "startDate": "09-24-2022",
      "currentPeriod": "FINAL",
      "videoState": "",
      "bracketRegion": "",
      "contestClock": "0:00"
    }},
    {"game": {
      "gameID": "410473",
      "away": {
        "score": "7",
        "names": {
          "char6": "MARSH",
          "short": "Marshall",
          "seo": "marshall",
          "full": "Marshall University"
        },
        "winner": false,
        "seed": "",
        "description": "(2-2)",
        "rank": "",
        "conferences": [{
          "conferenceName": "Sun Belt",
          "conferenceSeo": "sun-belt"
        }]
      },
      "finalMessage": "FINAL",
      "bracketRound": "",
      "title": "Troy Marshall",
      "contestName": "",
      "url": "/game/6005880",
      "network": "",
      "home": {
        "score": "16",
        "names": {
          "char6": "TROY",
          "short": "Troy",
          "seo": "troy",
          "full": "Troy University"
        },
        "winner": true,
        "seed": "",
        "description": "(2-2)",
        "rank": "",
        "conferences": [{
          "conferenceName": "Sun Belt",
          "conferenceSeo": "sun-belt"
        }]
      },
      "liveVideoEnabled": false,
      "startTime": "07:00PM ET",
      "startTimeEpoch": "1664060400",
      "bracketId": "",
      "gameState": "final",
      "startDate": "09-24-2022",
      "currentPeriod": "FINAL",
      "videoState": "",
      "bracketRegion": "",
      "contestClock": "0:00"
    }},
    {"game": {
      "gameID": "410327",
      "away": {
        "score": "20",
        "names": {
          "char6": "CHAR",
          "short": "Charlotte",
          "seo": "charlotte",
          "full": "The University of North Carolina at Charlotte"
        },
        "winner": false,
        "seed": "",
        "description": "(1-4)",
        "rank": "",
        "conferences": [{
          "conferenceName": "C-USA",
          "conferenceSeo": "c-usa"
        }]
      },
      "finalMessage": "FINAL",
      "bracketRound": "",
      "title": "South Carolina Charlotte",
      "contestName": "",
      "url": "/game/6005829",
      "network": "",
      "home": {
        "score": "56",
        "names": {
          "char6": "S CAR",
          "short": "South Carolina",
          "seo": "south-carolina",
          "full": "University of South Carolina, Columbia"
        },
        "winner": true,
        "seed": "",
        "description": "(2-2)",
        "rank": "",
        "conferences": [{
          "conferenceName": "SEC",
          "conferenceSeo": "sec"
        }]
      },
      "liveVideoEnabled": false,
      "startTime": "07:30PM ET",
      "startTimeEpoch": "1664062200",
      "bracketId": "",
      "gameState": "final",
      "startDate": "09-24-2022",
      "currentPeriod": "FINAL",
      "videoState": "",
      "bracketRegion": "",
      "contestClock": "0:00"
    }},
    {"game": {
      "gameID": "410215",
      "away": {
        "score": "21",
        "names": {
          "char6": "WISC",
          "short": "Wisconsin",
          "seo": "wisconsin",
          "full": "University of Wisconsin-Madison"
        },
        "winner": false,
        "seed": "",
        "description": "(2-2)",
        "rank": "",
        "conferences": [{
          "conferenceName": "Big Ten",
          "conferenceSeo": "big-ten"
        }]
      },
      "finalMessage": "FINAL",
      "bracketRound": "",
      "title": "Ohio St. Wisconsin",
      "contestName": "",
      "url": "/game/6005830",
      "network": "",
      "home": {
        "score": "52",
        "names": {
          "char6": "OHIOST",
          "short": "Ohio St.",
          "seo": "ohio-st",
          "full": "The Ohio State University"
        },
        "winner": true,
        "seed": "",
        "description": "(4-0)",
        "rank": "3",
        "conferences": [
          {
            "conferenceName": "Big Ten",
            "conferenceSeo": "big-ten"
          },
          {
            "conferenceName": "Top 25",
            "conferenceSeo": "top-25"
          }
        ]
      },
      "liveVideoEnabled": false,
      "startTime": "07:30PM ET",
      "startTimeEpoch": "1664062200",
      "bracketId": "",
      "gameState": "final",
      "startDate": "09-24-2022",
      "currentPeriod": "FINAL",
      "videoState": "",
      "bracketRegion": "",
      "contestClock": "0:00"
    }},
    {"game": {
      "gameID": "410088",
      "away": {
        "score": "10",
        "names": {
          "char6": "UCONN",
          "short": "UConn",
          "seo": "uconn",
          "full": "University of Connecticut"
        },
        "winner": false,
        "seed": "",
        "description": "(1-4)",
        "rank": "",
        "conferences": [{
          "conferenceName": "FBS Independent",
          "conferenceSeo": "fbs-independent"
        }]
      },
      "finalMessage": "FINAL",
      "bracketRound": "",
      "title": "NC State UConn",
      "contestName": "",
      "url": "/game/6005843",
      "network": "",
      "home": {
        "score": "41",
        "names": {
          "char6": "NC ST",
          "short": "NC State",
          "seo": "north-carolina-st",
          "full": "North Carolina State University"
        },
        "winner": true,
        "seed": "",
        "description": "(4-0)",
        "rank": "12",
        "conferences": [
          {
            "conferenceName": "ACC",
            "conferenceSeo": "acc"
          },
          {
            "conferenceName": "Top 25",
            "conferenceSeo": "top-25"
          }
        ]
      },
      "liveVideoEnabled": false,
      "startTime": "07:30PM ET",
      "startTimeEpoch": "1664062200",
      "bracketId": "",
      "gameState": "final",
      "startDate": "09-24-2022",
      "currentPeriod": "FINAL",
      "videoState": "",
      "bracketRegion": "",
      "contestClock": "0:00"
    }},
    {"game": {
      "gameID": "410151",
      "away": {
        "score": "17",
        "names": {
          "char6": "MIA OH",
          "short": "Miami (OH)",
          "seo": "miami-oh",
          "full": "Miami University (Ohio)"
        },
        "winner": true,
        "seed": "",
        "description": "(2-2)",
        "rank": "",
        "conferences": [{
          "conferenceName": "MAC",
          "conferenceSeo": "mac"
        }]
      },
      "finalMessage": "FINAL",
      "bracketRound": "",
      "title": "Northwestern Miami (OH)",
      "contestName": "",
      "url": "/game/6005860",
      "network": "",
      "home": {
        "score": "14",
        "names": {
          "char6": "NWSTRN",
          "short": "Northwestern",
          "seo": "northwestern",
          "full": "Northwestern University"
        },
        "winner": false,
        "seed": "",
        "description": "(1-3)",
        "rank": "",
        "conferences": [{
          "conferenceName": "Big Ten",
          "conferenceSeo": "big-ten"
        }]
      },
      "liveVideoEnabled": false,
      "startTime": "07:30PM ET",
      "startTimeEpoch": "1664062200",
      "bracketId": "",
      "gameState": "final",
      "startDate": "09-24-2022",
      "currentPeriod": "FINAL",
      "videoState": "",
      "bracketRegion": "",
      "contestClock": "0:00"
    }},
    {"game": {
      "gameID": "409403",
      "away": {
        "score": "3",
        "names": {
          "char6": "VANDY",
          "short": "Vanderbilt",
          "seo": "vanderbilt",
          "full": "Vanderbilt University"
        },
        "winner": false,
        "seed": "",
        "description": "(3-2)",
        "rank": "",
        "conferences": [{
          "conferenceName": "SEC",
          "conferenceSeo": "sec"
        }]
      },
      "finalMessage": "FINAL",
      "bracketRound": "",
      "title": "Alabama Vanderbilt",
      "contestName": "",
      "url": "/game/6005869",
      "network": "",
      "home": {
        "score": "55",
        "names": {
          "char6": "ALA",
          "short": "Alabama",
          "seo": "alabama",
          "full": "University of Alabama"
        },
        "winner": true,
        "seed": "",
        "description": "(4-0)",
        "rank": "2",
        "conferences": [
          {
            "conferenceName": "SEC",
            "conferenceSeo": "sec"
          },
          {
            "conferenceName": "Top 25",
            "conferenceSeo": "top-25"
          }
        ]
      },
      "liveVideoEnabled": false,
      "startTime": "07:30PM ET",
      "startTimeEpoch": "1664062200",
      "bracketId": "",
      "gameState": "final",
      "startDate": "09-24-2022",
      "currentPeriod": "FINAL",
      "videoState": "",
      "bracketRegion": "",
      "contestClock": "0:00"
    }},
    {"game": {
      "gameID": "409926",
      "away": {
        "score": "0",
        "names": {
          "char6": "N MEX",
          "short": "New Mexico",
          "seo": "new-mexico",
          "full": "University of New Mexico"
        },
        "winner": false,
        "seed": "",
        "description": "(2-2)",
        "rank": "",
        "conferences": [{
          "conferenceName": "Mountain West",
          "conferenceSeo": "mountain-west"
        }]
      },
      "finalMessage": "FINAL",
      "bracketRound": "",
      "title": "LSU New Mexico",
      "contestName": "",
      "url": "/game/6005881",
      "network": "",
      "home": {
        "score": "38",
        "names": {
          "char6": "LSU",
          "short": "LSU",
          "seo": "lsu",
          "full": "Louisiana State University"
        },
        "winner": true,
        "seed": "",
        "description": "(3-1)",
        "rank": "",
        "conferences": [{
          "conferenceName": "SEC",
          "conferenceSeo": "sec"
        }]
      },
      "liveVideoEnabled": false,
      "startTime": "07:30PM ET",
      "startTimeEpoch": "1664062200",
      "bracketId": "",
      "gameState": "final",
      "startDate": "09-24-2022",
      "currentPeriod": "FINAL",
      "videoState": "",
      "bracketRegion": "",
      "contestClock": "0:00"
    }},
    {"game": {
      "gameID": "410271",
      "away": {
        "score": "26",
        "names": {
          "char6": "FAU",
          "short": "Fla. Atlantic",
          "seo": "fla-atlantic",
          "full": "Florida Atlantic University"
        },
        "winner": false,
        "seed": "",
        "description": "(2-3)",
        "rank": "",
        "conferences": [{
          "conferenceName": "C-USA",
          "conferenceSeo": "c-usa"
        }]
      },
      "finalMessage": "FINAL",
      "bracketRound": "",
      "title": "Purdue Fla. Atlantic",
      "contestName": "",
      "url": "/game/6005884",
      "network": "",
      "home": {
        "score": "28",
        "names": {
          "char6": "PURDUE",
          "short": "Purdue",
          "seo": "purdue",
          "full": "Purdue University"
        },
        "winner": true,
        "seed": "",
        "description": "(2-2)",
        "rank": "",
        "conferences": [{
          "conferenceName": "Big Ten",
          "conferenceSeo": "big-ten"
        }]
      },
      "liveVideoEnabled": false,
      "startTime": "07:30PM ET",
      "startTimeEpoch": "1664062200",
      "bracketId": "",
      "gameState": "final",
      "startDate": "09-24-2022",
      "currentPeriod": "FINAL",
      "videoState": "",
      "bracketRegion": "",
      "contestClock": "0:00"
    }},
    {"game": {
      "gameID": "409721",
      "away": {
        "score": "14",
        "names": {
          "char6": "BC",
          "short": "Boston College",
          "seo": "boston-college",
          "full": "Boston College"
        },
        "winner": false,
        "seed": "",
        "description": "(1-3)",
        "rank": "",
        "conferences": [{
          "conferenceName": "ACC",
          "conferenceSeo": "acc"
        }]
      },
      "finalMessage": "FINAL",
      "bracketRound": "",
      "title": "Florida St. Boston College",
      "contestName": "",
      "url": "/game/6005831",
      "network": "",
      "home": {
        "score": "44",
        "names": {
          "char6": "FSU",
          "short": "Florida St.",
          "seo": "florida-st",
          "full": "Florida State University"
        },
        "winner": true,
        "seed": "",
        "description": "(4-0)",
        "rank": "",
        "conferences": [{
          "conferenceName": "ACC",
          "conferenceSeo": "acc"
        }]
      },
      "liveVideoEnabled": false,
      "startTime": "08:00PM ET",
      "startTimeEpoch": "1664064000",
      "bracketId": "",
      "gameState": "final",
      "startDate": "09-24-2022",
      "currentPeriod": "FINAL",
      "videoState": "",
      "bracketRegion": "",
      "contestClock": "0:00"
    }},
    {"game": {
      "gameID": "410122",
      "away": {
        "score": "26",
        "names": {
          "char6": "HAWAII",
          "short": "Hawaii",
          "seo": "hawaii",
          "full": "University of Hawaii, Manoa"
        },
        "winner": false,
        "seed": "",
        "description": "(1-4)",
        "rank": "",
        "conferences": [{
          "conferenceName": "Mountain West",
          "conferenceSeo": "mountain-west"
        }]
      },
      "finalMessage": "FINAL",
      "bracketRound": "",
      "title": "New Mexico St. Hawaii",
      "contestName": "",
      "url": "/game/6005844",
      "network": "",
      "home": {
        "score": "45",
        "names": {
          "char6": "NM ST",
          "short": "New Mexico St.",
          "seo": "new-mexico-st",
          "full": "New Mexico State University"
        },
        "winner": true,
        "seed": "",
        "description": "(1-4)",
        "rank": "",
        "conferences": [{
          "conferenceName": "FBS Independent",
          "conferenceSeo": "fbs-independent"
        }]
      },
      "liveVideoEnabled": false,
      "startTime": "08:00PM ET",
      "startTimeEpoch": "1664064000",
      "bracketId": "",
      "gameState": "final",
      "startDate": "09-24-2022",
      "currentPeriod": "FINAL",
      "videoState": "",
      "bracketRegion": "",
      "contestClock": "0:00"
    }},
    {"game": {
      "gameID": "410172",
      "away": {
        "score": "41",
        "names": {
          "char6": "KAN ST",
          "short": "Kansas St.",
          "seo": "kansas-st",
          "full": "Kansas State University"
        },
        "winner": true,
        "seed": "",
        "description": "(3-1)",
        "rank": "",
        "conferences": [{
          "conferenceName": "Big 12",
          "conferenceSeo": "big-12"
        }]
      },
      "finalMessage": "FINAL",
      "bracketRound": "",
      "title": "Oklahoma Kansas St.",
      "contestName": "",
      "url": "/game/6005852",
      "network": "",
      "home": {
        "score": "34",
        "names": {
          "char6": "OKLA",
          "short": "Oklahoma",
          "seo": "oklahoma",
          "full": "University of Oklahoma"
        },
        "winner": false,
        "seed": "",
        "description": "(3-1)",
        "rank": "6",
        "conferences": [
          {
            "conferenceName": "Big 12",
            "conferenceSeo": "big-12"
          },
          {
            "conferenceName": "Top 25",
            "conferenceSeo": "top-25"
          }
        ]
      },
      "liveVideoEnabled": false,
      "startTime": "08:00PM ET",
      "startTimeEpoch": "1664064000",
      "bracketId": "",
      "gameState": "final",
      "startDate": "09-24-2022",
      "currentPeriod": "FINAL",
      "videoState": "",
      "bracketRegion": "",
      "contestClock": "0:00"
    }},
    {"game": {
      "gameID": "410551",
      "away": {
        "score": "17",
        "names": {
          "char6": "LA",
          "short": "Louisiana",
          "seo": "la-lafayette",
          "full": "University of Louisiana at Lafayette"
        },
        "winner": false,
        "seed": "",
        "description": "(2-2)",
        "rank": "",
        "conferences": [{
          "conferenceName": "Sun Belt",
          "conferenceSeo": "sun-belt"
        }]
      },
      "finalMessage": "FINAL",
      "bracketRound": "",
      "title": "ULM Louisiana",
      "contestName": "",
      "url": "/game/6005882",
      "network": "",
      "home": {
        "score": "21",
        "names": {
          "char6": "LA MON",
          "short": "ULM",
          "seo": "la-monroe",
          "full": "University of Louisiana Monroe"
        },
        "winner": true,
        "seed": "",
        "description": "(2-2)",
        "rank": "",
        "conferences": [{
          "conferenceName": "Sun Belt",
          "conferenceSeo": "sun-belt"
        }]
      },
      "liveVideoEnabled": false,
      "startTime": "08:00PM ET",
      "startTimeEpoch": "1664064000",
      "bracketId": "",
      "gameState": "final",
      "startDate": "09-24-2022",
      "currentPeriod": "FINAL",
      "videoState": "",
      "bracketRegion": "",
      "contestClock": "0:00"
    }},
    {"game": {
      "gameID": "410206",
      "away": {
        "score": "17",
        "names": {
          "char6": "USC",
          "short": "Southern California",
          "seo": "southern-california",
          "full": "University of Southern California"
        },
        "winner": true,
        "seed": "",
        "description": "(4-0)",
        "rank": "7",
        "conferences": [
          {
            "conferenceName": "Pac-12",
            "conferenceSeo": "pac-12"
          },
          {
            "conferenceName": "Top 25",
            "conferenceSeo": "top-25"
          }
        ]
      },
      "finalMessage": "FINAL",
      "bracketRound": "",
      "title": "Oregon St. Southern California",
      "contestName": "",
      "url": "/game/6005837",
      "network": "",
      "home": {
        "score": "14",
        "names": {
          "char6": "ORE ST",
          "short": "Oregon St.",
          "seo": "oregon-st",
          "full": "Oregon State University"
        },
        "winner": false,
        "seed": "",
        "description": "(3-1)",
        "rank": "",
        "conferences": [{
          "conferenceName": "Pac-12",
          "conferenceSeo": "pac-12"
        }]
      },
      "liveVideoEnabled": false,
      "startTime": "09:30PM ET",
      "startTimeEpoch": "1664069400",
      "bracketId": "",
      "gameState": "final",
      "startDate": "09-24-2022",
      "currentPeriod": "FINAL",
      "videoState": "",
      "bracketRegion": "",
      "contestClock": "0:00"
    }},
    {"game": {
      "gameID": "409516",
      "away": {
        "score": "24",
        "names": {
          "char6": "WYO",
          "short": "Wyoming",
          "seo": "wyoming",
          "full": "University of Wyoming"
        },
        "winner": false,
        "seed": "",
        "description": "(3-2)",
        "rank": "",
        "conferences": [{
          "conferenceName": "Mountain West",
          "conferenceSeo": "mountain-west"
        }]
      },
      "finalMessage": "FINAL",
      "bracketRound": "",
      "title": "BYU Wyoming",
      "contestName": "",
      "url": "/game/6005866",
      "network": "",
      "home": {
        "score": "38",
        "names": {
          "char6": "BYU",
          "short": "BYU",
          "seo": "byu",
          "full": "Brigham Young University"
        },
        "winner": true,
        "seed": "",
        "description": "(3-1)",
        "rank": "19",
        "conferences": [
          {
            "conferenceName": "FBS Independent",
            "conferenceSeo": "fbs-independent"
          },
          {
            "conferenceName": "Top 25",
            "conferenceSeo": "top-25"
          }
        ]
      },
      "liveVideoEnabled": false,
      "startTime": "10:15PM ET",
      "startTimeEpoch": "1664072100",
      "bracketId": "",
      "gameState": "final",
      "startDate": "09-24-2022",
      "currentPeriod": "FINAL",
      "videoState": "",
      "bracketRegion": "",
      "contestClock": "0:00"
    }},
    {"game": {
      "gameID": "410644",
      "away": {
        "score": "22",
        "names": {
          "char6": "STAN",
          "short": "Stanford",
          "seo": "stanford",
          "full": "Stanford University"
        },
        "winner": false,
        "seed": "",
        "description": "(1-2)",
        "rank": "",
        "conferences": [{
          "conferenceName": "Pac-12",
          "conferenceSeo": "pac-12"
        }]
      },
      "finalMessage": "FINAL",
      "bracketRound": "",
      "title": "Washington Stanford",
      "contestName": "",
      "url": "/game/6005849",
      "network": "",
      "home": {
        "score": "40",
        "names": {
          "char6": "WASH",
          "short": "Washington",
          "seo": "washington",
          "full": "University of Washington"
        },
        "winner": true,
        "seed": "",
        "description": "(4-0)",
        "rank": "18",
        "conferences": [
          {
            "conferenceName": "Pac-12",
            "conferenceSeo": "pac-12"
          },
          {
            "conferenceName": "Top 25",
            "conferenceSeo": "top-25"
          }
        ]
      },
      "liveVideoEnabled": false,
      "startTime": "10:30PM ET",
      "startTimeEpoch": "1664073000",
      "bracketId": "",
      "gameState": "final",
      "startDate": "09-24-2022",
      "currentPeriod": "FINAL",
      "videoState": "",
      "bracketRegion": "",
      "contestClock": "0:00"
    }},
    {"game": {
      "gameID": "409459",
      "away": {
        "score": "34",
        "names": {
          "char6": "UTAH",
          "short": "Utah",
          "seo": "utah",
          "full": "University of Utah"
        },
        "winner": true,
        "seed": "",
        "description": "(3-1)",
        "rank": "13",
        "conferences": [
          {
            "conferenceName": "Pac-12",
            "conferenceSeo": "pac-12"
          },
          {
            "conferenceName": "Top 25",
            "conferenceSeo": "top-25"
          }
        ]
      },
      "finalMessage": "FINAL",
      "bracketRound": "",
      "title": "Arizona St. Utah",
      "contestName": "",
      "url": "/game/6005858",
      "network": "",
      "home": {
        "score": "13",
        "names": {
          "char6": "AZ ST",
          "short": "Arizona St.",
          "seo": "arizona-st",
          "full": "Arizona State University"
        },
        "winner": false,
        "seed": "",
        "description": "(1-3)",
        "rank": "",
        "conferences": [{
          "conferenceName": "Pac-12",
          "conferenceSeo": "pac-12"
        }]
      },
      "liveVideoEnabled": false,
      "startTime": "10:30PM ET",
      "startTimeEpoch": "1664073000",
      "bracketId": "",
      "gameState": "final",
      "startDate": "09-24-2022",
      "currentPeriod": "FINAL",
      "videoState": "",
      "bracketRegion": "",
      "contestClock": "0:00"
    }},
    {"game": {
      "gameID": "410368",
      "away": {
        "score": "6",
        "names": {
          "char6": "W MICH",
          "short": "Western Mich.",
          "seo": "western-mich",
          "full": "Western Michigan University"
        },
        "winner": false,
        "seed": "",
        "description": "(1-3)",
        "rank": "",
        "conferences": [{
          "conferenceName": "MAC",
          "conferenceSeo": "mac"
        }]
      },
      "finalMessage": "FINAL",
      "bracketRound": "",
      "title": "San Jose St. Western Mich.",
      "contestName": "",
      "url": "/game/6005883",
      "network": "",
      "home": {
        "score": "34",
        "names": {
          "char6": "SJSU",
          "short": "San Jose St.",
          "seo": "san-jose-st",
          "full": "San Jose State University"
        },
        "winner": true,
        "seed": "",
        "description": "(2-1)",
        "rank": "",
        "conferences": [{
          "conferenceName": "Mountain West",
          "conferenceSeo": "mountain-west"
        }]
      },
      "liveVideoEnabled": false,
      "startTime": "10:30PM ET",
      "startTimeEpoch": "1664073000",
      "bracketId": "",
      "gameState": "final",
      "startDate": "09-24-2022",
      "currentPeriod": "FINAL",
      "videoState": "",
      "bracketRegion": "",
      "contestClock": "0:00"
    }}
  ]
}