{
  "UCF vs EastCarolina": {
    "stadium": "DowdyFicklenStadium-Greenville-NC",
    "UCF": {
      "points": 32,
      "1st downs": 23,
      "rushing 1st downs": 7,
      "passing 1st downs": 10,
      "penalty 1st downs": 6,
      "rushing yards": 148,
      "rushing attempts": 40,
      "passing yards": 274,
      "passing attempts": 33,
      "passing completions": 20,
      "passing interceptions": 0,
      "total yards": 422,
      "total plays": 73,
      "fumbles": 2,
      "fumbles lost": 1,
      "penalties": 6,
      "penalty yards": 40,
      "punts": 4,
      "punt yards": 169,
      "punt returns": 3,
      "punt return yards": 21,
      "kickoff returns": 2,
      "kickoff return yards": 39,
      "interception returns": 2,
      "interception return yards": 23,
      "3rd down conversions": 4,
      "3rd down attempts": 15,
      "4th down conversions": 0,
      "4th down attempts": 1
    },
    "EastCarolina": {
      "points": 30,
      "1st downs": 26,
      "rushing 1st downs": 5,
      "passing 1st downs": 20,
      "penalty 1st downs": 1,
      "rushing yards": 14,
      "rushing attempts": 27,
      "passing yards": 397,
      "passing attempts": 49,
      "passing completions": 36,
      "passing interceptions": 2,
      "total yards": 411,
      "total plays": 76,
      "fumbles": 2,
      "fumbles lost": 1,
      "penalties": 12,
      "penalty yards": 127,
      "punts": 6,
      "punt yards": 228,
      "punt returns": 3,
      "punt return yards": 21,
      "kickoff returns": 5,
      "kickoff return yards": 86,
      "interception returns": 0,
      "interception return yards": 0,
      "3rd down conversions": 7,
      "3rd down attempts": 15,
      "4th down conversions": 1,
      "4th down attempts": 2
    }
  },
  "NorthernIllinois vs BowlingGreen": {
    "stadium": "FordField-Detroit-MI",
    "NorthernIllinois": {
      "points": 51,
      "1st downs": 30,
      "rushing 1st downs": 18,
      "passing 1st downs": 12,
      "penalty 1st downs": 0,
      "rushing yards": 334,
      "rushing attempts": 51,
      "passing yards": 218,
      "passing attempts": 49,
      "passing completions": 29,
      "passing interceptions": 1,
      "total yards": 552,
      "total plays": 100,
      "fumbles": 1,
      "fumbles lost": 1,
      "penalties": 5,
      "penalty yards": 40,
      "punts": 5,
      "punt yards": 231,
      "punt returns": 3,
      "punt return yards": 17,
      "kickoff returns": 3,
      "kickoff return yards": 78,
      "interception returns": 3,
      "interception return yards": 32,
      "3rd down conversions": 10,
      "3rd down attempts": 19,
      "4th down conversions": 1,
      "4th down attempts": 1
    },
    "BowlingGreen": {
      "points": 17,
      "1st downs": 13,
      "rushing 1st downs": 4,
      "passing 1st downs": 8,
      "penalty 1st downs": 1,
      "rushing yards": 124,
      "rushing attempts": 35,
      "passing yards": 163,
      "passing attempts": 25,
      "passing completions": 13,
      "passing interceptions": 3,
      "total yards": 287,
      "total plays": 60,
      "fumbles": 1,
      "fumbles lost": 1,
      "penalties": 2,
      "penalty yards": 5,
      "punts": 6,
      "punt yards": 292,
      "punt returns": 1,
      "punt return yards": 10,
      "kickoff returns": 10,
      "kickoff return yards": 208,
      "interception returns": 1,
      "interception return yards": 0,
      "3rd down conversions": 4,
      "3rd down attempts": 13,
      "4th down conversions": 0,
      "4th down attempts": 3
    }
  },
  "Arizona vs Oregon": {
    "stadium": "LevisStadium-SantaClara-CA",
    "Arizona": {
      "points": 13,
      "1st downs": 11,
      "rushing 1st downs": 7,
      "passing 1st downs": 3,
      "penalty 1st downs": 1,
      "rushing yards": 111,
      "rushing attempts": 35,
      "passing yards": 113,
      "passing attempts": 26,
      "passing completions": 9,
      "passing interceptions": 1,
      "total yards": 224,
      "total plays": 61,
      "fumbles": 1,
      "fumbles lost": 1,
      "penalties": 8,
      "penalty yards": 67,
      "punts": 10,
      "punt yards": 445,
      "punt returns": 0,
      "punt return yards": 0,
      "kickoff returns": 8,
      "kickoff return yards": 211,
      "interception returns": 0,
      "interception return yards": 0,
      "3rd down conversions": 3,
      "3rd down attempts": 15,
      "4th down conversions": 0,
      "4th down attempts": 2
    },
    "Oregon": {
      "points": 51,
      "1st downs": 31,
      "rushing 1st downs": 13,
      "passing 1st downs": 15,
      "penalty 1st downs": 3,
      "rushing yards": 301,
      "rushing attempts": 54,
      "passing yards": 326,
      "passing attempts": 40,
      "passing completions": 27,
      "passing interceptions": 0,
      "total yards": 627,
      "total plays": 94,
      "fumbles": 1,
      "fumbles lost": 0,
      "penalties": 13,
      "penalty yards": 84,
      "punts": 5,
      "punt yards": 185,
      "punt returns": 5,
      "punt return yards": 65,
      "kickoff returns": 2,
      "kickoff return yards": 51,
      "interception returns": 1,
      "interception return yards": 24,
      "3rd down conversions": 9,
      "3rd down attempts": 17,
      "4th down conversions": 0,
      "4th down attempts": 1
    }
  },
  "IowaState vs TCU": {
    "stadium": "AmonGCarterStadium-FortWorth-TX",
    "IowaState": {
      "points": 3,
      "1st downs": 14,
      "rushing 1st downs": 5,
      "passing 1st downs": 8,
      "penalty 1st downs": 1,
      "rushing yards": 84,
      "rushing attempts": 32,
      "passing yards": 152,
      "passing attempts": 41,
      "passing completions": 16,
      "passing interceptions": 2,
      "total yards": 236,
      "total plays": 73,
      "fumbles": 0,
      "fumbles lost": 0,
      "penalties": 2,
      "penalty yards": 19,
      "punts": 10,
      "punt yards": 365,
      "punt returns": 1,
      "punt return yards": 0,
      "kickoff returns": 3,
      "kickoff return yards": 64,
      "interception returns": 1,
      "interception return yards": 0,
      "3rd down conversions": 3,
      "3rd down attempts": 18,
      "4th down conversions": 0,
      "4th down attempts": 2
    },
    "TCU": {
      "points": 55,
      "1st downs": 33,
      "rushing 1st downs": 12,
      "passing 1st downs": 20,
      "penalty 1st downs": 1,
      "rushing yards": 197,
      "rushing attempts": 38,
      "passing yards": 525,
      "passing attempts": 45,
      "passing completions": 33,
      "passing interceptions": 1,
      "total yards": 722,
      "total plays": 83,
      "fumbles": 2,
      "fumbles lost": 1,
      "penalties": 5,
      "penalty yards": 50,
      "punts": 3,
      "punt yards": 125,
      "punt returns": 3,
      "punt return yards": 2,
      "kickoff returns": 0,
      "kickoff return yards": 0,
      "interception returns": 2,
      "interception return yards": 42,
      "3rd down conversions": 5,
      "3rd down attempts": 13,
      "4th down conversions": 1,
      "4th down attempts": 2
    }
  },
  "SouthernMethodist vs Connecticut": {
    "stadium": "RentschlerField-EastHartford-CT",
    "SouthernMethodist": {
      "points": 27,
      "1st downs": 21,
      "rushing 1st downs": 14,
      "passing 1st downs": 6,
      "penalty 1st downs": 1,
      "rushing yards": 277,
      "rushing attempts": 47,
      "passing yards": 145,
      "passing attempts": 33,
      "passing completions": 15,
      "passing interceptions": 1,
      "total yards": 422,
      "total plays": 80,
      "fumbles": 4,
      "fumbles lost": 2,
      "penalties": 6,
      "penalty yards": 50,
      "punts": 6,
      "punt yards": 176,
      "punt returns": 3,
      "punt return yards": 36,
      "kickoff returns": 4,
      "kickoff return yards": 71,
      "interception returns": 1,
      "interception return yards": 0,
      "3rd down conversions": 10,
      "3rd down attempts": 19,
      "4th down conversions": 0,
      "4th down attempts": 0
    },
    "Connecticut": {
      "points": 20,
      "1st downs": 11,
      "rushing 1st downs": 8,
      "passing 1st downs": 3,
      "penalty 1st downs": 0,
      "rushing yards": 243,
      "rushing attempts": 41,
      "passing yards": 67,
      "passing attempts": 14,
      "passing completions": 5,
      "passing interceptions": 1,
      "total yards": 310,
      "total plays": 55,
      "fumbles": 4,
      "fumbles lost": 4,
      "penalties": 4,
      "penalty yards": 44,
      "punts": 6,
      "punt yards": 222,
      "punt returns": 3,
      "punt return yards": -6,
      "kickoff returns": 6,
      "kickoff return yards": 85,
      "interception returns": 1,
      "interception return yards": 0,
      "3rd down conversions": 5,
      "3rd down attempts": 14,
      "4th down conversions": 1,
      "4th down attempts": 1
    }
  },
  "LouisianaTech vs Marshall": {
    "stadium": "JoanCEdwardsStadium-Huntington-WV",
    "LouisianaTech": {
      "points": 23,
      "1st downs": 15,
      "rushing 1st downs": 10,
      "passing 1st downs": 2,
      "penalty 1st downs": 3,
      "rushing yards": 196,
      "rushing attempts": 45,
      "passing yards": 72,
      "passing attempts": 20,
      "passing completions": 7,
      "passing interceptions": 1,
      "total yards": 268,
      "total plays": 65,
      "fumbles": 2,
      "fumbles lost": 1,
      "penalties": 4,
      "penalty yards": 26,
      "punts": 10,
      "punt yards": 301,
      "punt returns": 1,
      "punt return yards": 11,
      "kickoff returns": 5,
      "kickoff return yards": 105,
      "interception returns": 1,
      "interception return yards": 0,
      "3rd down conversions": 4,
      "3rd down attempts": 17,
      "4th down conversions": 0,
      "4th down attempts": 0
    },
    "Marshall": {
      "points": 26,
      "1st downs": 20,
      "rushing 1st downs": 4,
      "passing 1st downs": 16,
      "penalty 1st downs": 0,
      "rushing yards": 121,
      "rushing attempts": 35,
      "passing yards": 308,
      "passing attempts": 46,
      "passing completions": 25,
      "passing interceptions": 1,
      "total yards": 429,
      "total plays": 81,
      "fumbles": 4,
      "fumbles lost": 3,
      "penalties": 8,
      "penalty yards": 60,
      "punts": 5,
      "punt yards": 193,
      "punt returns": 4,
      "punt return yards": 17,
      "kickoff returns": 3,
      "kickoff return yards": 88,
      "interception returns": 1,
      "interception return yards": 2,
      "3rd down conversions": 4,
      "3rd down attempts": 15,
      "4th down conversions": 0,
      "4th down attempts": 1
    }
  },
  "Houston vs Cincinnati": {
    "stadium": "PaulBrownStadium-Cincinnati-OH",
    "Houston": {
      "points": 31,
      "1st downs": 27,
      "rushing 1st downs": 14,
      "passing 1st downs": 12,
      "penalty 1st downs": 1,
      "rushing yards": 234,
      "rushing attempts": 35,
      "passing yards": 360,
      "passing attempts": 45,
      "passing completions": 27,
      "passing interceptions": 1,
      "total yards": 594,
      "total plays": 80,
      "fumbles": 0,
      "fumbles lost": 0,
      "penalties": 4,
      "penalty yards": 37,
      "punts": 3,
      "punt yards": 98,
      "punt returns": 0,
      "punt return yards": 0,
      "kickoff returns": 3,
      "kickoff return yards": 53,
      "interception returns": 0,
      "interception return yards": 0,
      "3rd down conversions": 8,
      "3rd down attempts": 15,
      "4th down conversions": 1,
      "4th down attempts": 3
    },
    "Cincinnati": {
      "points": 38,
      "1st downs": 33,
      "rushing 1st downs": 11,
      "passing 1st downs": 20,
      "penalty 1st downs": 2,
      "rushing yards": 152,
      "rushing attempts": 43,
      "passing yards": 348,
      "passing attempts": 38,
      "passing completions": 25,
      "passing interceptions": 0,
      "total yards": 500,
      "total plays": 81,
      "fumbles": 0,
      "fumbles lost": 0,
      "penalties": 1,
      "penalty yards": 10,
      "punts": 4,
      "punt yards": 159,
      "punt returns": 0,
      "punt return yards": 0,
      "kickoff returns": 4,
      "kickoff return yards": 62,
      "interception returns": 1,
      "interception return yards": 0,
      "3rd down conversions": 5,
      "3rd down attempts": 11,
      "4th down conversions": 0,
      "4th down attempts": 0
    }
  },
  "OklahomaState vs Oklahoma": {
    "stadium": "GaylordFamilyOklahomaMemorialStadium-Norman-OK",
    "OklahomaState": {
      "points": 38,
      "1st downs": 18,
      "rushing 1st downs": 6,
      "passing 1st downs": 11,
      "penalty 1st downs": 1,
      "rushing yards": 112,
      "rushing attempts": 26,
      "passing yards": 273,
      "passing attempts": 35,
      "passing completions": 19,
      "passing interceptions": 1,
      "total yards": 385,
      "total plays": 61,
      "fumbles": 0,
      "fumbles lost": 0,
      "penalties": 9,
      "penalty yards": 55,
      "punts": 7,
      "punt yards": 244,
      "punt returns": 3,
      "punt return yards": 95,
      "kickoff returns": 2,
      "kickoff return yards": 46,
      "interception returns": 0,
      "interception return yards": 0,
      "3rd down conversions": 3,
      "3rd down attempts": 11,
      "4th down conversions": 0,
      "4th down attempts": 0
    },
    "Oklahoma": {
      "points": 35,
      "1st downs": 21,
      "rushing 1st downs": 11,
      "passing 1st downs": 7,
      "penalty 1st downs": 3,
      "rushing yards": 304,
      "rushing attempts": 63,
      "passing yards": 120,
      "passing attempts": 17,
      "passing completions": 10,
      "passing interceptions": 0,
      "total yards": 424,
      "total plays": 80,
      "fumbles": 2,
      "fumbles lost": 1,
      "penalties": 3,
      "penalty yards": 28,
      "punts": 6,
      "punt yards": 225,
      "punt returns": 0,
      "punt return yards": 0,
      "kickoff returns": 4,
      "kickoff return yards": 110,
      "interception returns": 1,
      "interception return yards": 0,
      "3rd down conversions": 8,
      "3rd down attempts": 17,
      "4th down conversions": 0,
      "4th down attempts": 0
    }
  },
  "Alabama vs Missouri": {
    "stadium": "GeorgiaDome-Atlanta-GA",
    "Alabama": {
      "points": 42,
      "1st downs": 28,
      "rushing 1st downs": 14,
      "passing 1st downs": 13,
      "penalty 1st downs": 1,
      "rushing yards": 242,
      "rushing attempts": 49,
      "passing yards": 262,
      "passing attempts": 27,
      "passing completions": 23,
      "passing interceptions": 0,
      "total yards": 504,
      "total plays": 76,
      "fumbles": 2,
      "fumbles lost": 0,
      "penalties": 2,
      "penalty yards": 10,
      "punts": 3,
      "punt yards": 130,
      "punt returns": 1,
      "punt return yards": 1,
      "kickoff returns": 3,
      "kickoff return yards": 85,
      "interception returns": 0,
      "interception return yards": 0,
      "3rd down conversions": 9,
      "3rd down attempts": 13,
      "4th down conversions": 0,
      "4th down attempts": 0
    },
    "Missouri": {
      "points": 13,
      "1st downs": 10,
      "rushing 1st downs": 1,
      "passing 1st downs": 9,
      "penalty 1st downs": 0,
      "rushing yards": 41,
      "rushing attempts": 23,
      "passing yards": 272,
      "passing attempts": 34,
      "passing completions": 16,
      "passing interceptions": 0,
      "total yards": 313,
      "total plays": 57,
      "fumbles": 1,
      "fumbles lost": 1,
      "penalties": 6,
      "penalty yards": 60,
      "punts": 7,
      "punt yards": 304,
      "punt returns": 0,
      "punt return yards": 0,
      "kickoff returns": 4,
      "kickoff return yards": 89,
      "interception returns": 0,
      "interception return yards": 0,
      "3rd down conversions": 6,
      "3rd down attempts": 16,
      "4th down conversions": 1,
      "4th down attempts": 1
    }
  },
  "Temple vs Tulane": {
    "stadium": "YulmanStadium-NewOrleans-LA",
    "Temple": {
      "points": 10,
      "1st downs": 17,
      "rushing 1st downs": 6,
      "passing 1st downs": 11,
      "penalty 1st downs": 0,
      "rushing yards": 92,
      "rushing attempts": 30,
      "passing yards": 255,
      "passing attempts": 38,
      "passing completions": 20,
      "passing interceptions": 1,
      "total yards": 347,
      "total plays": 68,
      "fumbles": 1,
      "fumbles lost": 0,
      "penalties": 8,
      "penalty yards": 67,
      "punts": 7,
      "punt yards": 260,
      "punt returns": 3,
      "punt return yards": 14,
      "kickoff returns": 0,
      "kickoff return yards": 0,
      "interception returns": 1,
      "interception return yards": 0,
      "3rd down conversions": 1,
      "3rd down attempts": 13,
      "4th down conversions": 1,
      "4th down attempts": 2
    },
    "Tulane": {
      "points": 3,
      "1st downs": 13,
      "rushing 1st downs": 6,
      "passing 1st downs": 5,
      "penalty 1st downs": 2,
      "rushing yards": 115,
      "rushing attempts": 31,
      "passing yards": 151,
      "passing attempts": 40,
      "passing completions": 19,
      "passing interceptions": 1,
      "total yards": 266,
      "total plays": 71,
      "fumbles": 0,
      "fumbles lost": 0,
      "penalties": 4,
      "penalty yards": 35,
      "punts": 8,
      "punt yards": 293,
      "punt returns": 2,
      "punt return yards": 5,
      "kickoff returns": 2,
      "kickoff return yards": 32,
      "interception returns": 1,
      "interception return yards": 0,
      "3rd down conversions": 2,
      "3rd down attempts": 17,
      "4th down conversions": 2,
      "4th down attempts": 4
    }
  },
  "KansasState vs Baylor": {
    "stadium": "McLaneStadium-Waco-TX",
    "KansasState": {
      "points": 27,
      "1st downs": 27,
      "rushing 1st downs": 10,
      "passing 1st downs": 14,
      "penalty 1st downs": 3,
      "rushing yards": 103,
      "rushing attempts": 40,
      "passing yards": 300,
      "passing attempts": 27,
      "passing completions": 22,
      "passing interceptions": 1,
      "total yards": 403,
      "total plays": 67,
      "fumbles": 0,
      "fumbles lost": 0,
      "penalties": 3,
      "penalty yards": 30,
      "punts": 3,
      "punt yards": 130,
      "punt returns": 1,
      "punt return yards": 4,
      "kickoff returns": 3,
      "kickoff return yards": 35,
      "interception returns": 1,
      "interception return yards": 0,
      "3rd down conversions": 6,
      "3rd down attempts": 12,
      "4th down conversions": 1,
      "4th down attempts": 1
    },
    "Baylor": {
      "points": 38,
      "1st downs": 34,
      "rushing 1st downs": 10,
      "passing 1st downs": 24,
      "penalty 1st downs": 0,
      "rushing yards": 172,
      "rushing attempts": 37,
      "passing yards": 412,
      "passing attempts": 41,
      "passing completions": 34,
      "passing interceptions": 1,
      "total yards": 584,
      "total plays": 78,
      "fumbles": 1,
      "fumbles lost": 0,
      "penalties": 7,
      "penalty yards": 70,
      "punts": 2,
      "punt yards": 93,
      "punt returns": 0,
      "punt return yards": 0,
      "kickoff returns": 6,
      "kickoff return yards": 128,
      "interception returns": 1,
      "interception return yards": 0,
      "3rd down conversions": 8,
      "3rd down attempts": 10,
      "4th down conversions": 0,
      "4th down attempts": 0
    }
  },
  "FloridaState vs GeorgiaTech": {
    "stadium": "BankofAmericaStadium-Charlotte-NC",
    "FloridaState": {
      "points": 37,
      "1st downs": 24,
      "rushing 1st downs": 12,
      "passing 1st downs": 11,
      "penalty 1st downs": 1,
      "rushing yards": 179,
      "rushing attempts": 33,
      "passing yards": 309,
      "passing attempts": 30,
      "passing completions": 21,
      "passing interceptions": 0,
      "total yards": 488,
      "total plays": 63,
      "fumbles": 0,
      "fumbles lost": 0,
      "penalties": 5,
      "penalty yards": 45,
      "punts": 2,
      "punt yards": 84,
      "punt returns": 0,
      "punt return yards": 0,
      "kickoff returns": 3,
      "kickoff return yards": 79,
      "interception returns": 1,
      "interception return yards": 4,
      "3rd down conversions": 7,
      "3rd down attempts": 12,
      "4th down conversions": 0,
      "4th down attempts": 0
    },
    "GeorgiaTech": {
      "points": 35,
      "1st downs": 28,
      "rushing 1st downs": 19,
      "passing 1st downs": 8,
      "penalty 1st downs": 1,
      "rushing yards": 331,
      "rushing attempts": 59,
      "passing yards": 134,
      "passing attempts": 14,
      "passing completions": 8,
      "passing interceptions": 1,
      "total yards": 465,
      "total plays": 73,
      "fumbles": 0,
      "fumbles lost": 0,
      "penalties": 3,
      "penalty yards": 20,
      "punts": 2,
      "punt yards": 69,
      "punt returns": 1,
      "punt return yards": 1,
      "kickoff returns": 3,
      "kickoff return yards": 45,
      "interception returns": 0,
      "interception return yards": 0,
      "3rd down conversions": 5,
      "3rd down attempts": 10,
      "4th down conversions": 1,
      "4th down attempts": 2
    }
  },
  "Wisconsin vs OhioState": {
    "stadium": "LucasOilStadium-Indianapolis-IN",
    "Wisconsin": {
      "points": 0,
      "1st downs": 18,
      "rushing 1st downs": 6,
      "passing 1st downs": 11,
      "penalty 1st downs": 1,
      "rushing yards": 71,
      "rushing attempts": 37,
      "passing yards": 187,
      "passing attempts": 43,
      "passing completions": 17,
      "passing interceptions": 3,
      "total yards": 258,
      "total plays": 80,
      "fumbles": 3,
      "fumbles lost": 1,
      "penalties": 3,
      "penalty yards": 23,
      "punts": 8,
      "punt yards": 329,
      "punt returns": 0,
      "punt return yards": 0,
      "kickoff returns": 7,
      "kickoff return yards": 122,
      "interception returns": 0,
      "interception return yards": 0,
      "3rd down conversions": 5,
      "3rd down attempts": 18,
      "4th down conversions": 3,
      "4th down attempts": 5
    },
    "OhioState": {
      "points": 59,
      "1st downs": 24,
      "rushing 1st downs": 12,
      "passing 1st downs": 10,
      "penalty 1st downs": 2,
      "rushing yards": 301,
      "rushing attempts": 38,
      "passing yards": 257,
      "passing attempts": 18,
      "passing completions": 12,
      "passing interceptions": 0,
      "total yards": 558,
      "total plays": 56,
      "fumbles": 1,
      "fumbles lost": 0,
      "penalties": 5,
      "penalty yards": 44,
      "punts": 4,
      "punt yards": 212,
      "punt returns": 2,
      "punt return yards": 1,
      "kickoff returns": 1,
      "kickoff return yards": 23,
      "interception returns": 3,
      "interception return yards": 67,
      "3rd down conversions": 2,
      "3rd down attempts": 8,
      "4th down conversions": 0,
      "4th down attempts": 0
    }
  },
  "FresnoState vs BoiseState": {
    "stadium": "AlbertsonsStadium-Boise-ID",
    "FresnoState": {
      "points": 14,
      "1st downs": 21,
      "rushing 1st downs": 3,
      "passing 1st downs": 17,
      "penalty 1st downs": 1,
      "rushing yards": 70,
      "rushing attempts": 41,
      "passing yards": 332,
      "passing attempts": 46,
      "passing completions": 30,
      "passing interceptions": 3,
      "total yards": 402,
      "total plays": 87,
      "fumbles": 0,
      "fumbles lost": 0,
      "penalties": 4,
      "penalty yards": 43,
      "punts": 4,
      "punt yards": 172,
      "punt returns": 2,
      "punt return yards": 13,
      "kickoff returns": 2,
      "kickoff return yards": 25,
      "interception returns": 0,
      "interception return yards": 0,
      "3rd down conversions": 11,
      "3rd down attempts": 23,
      "4th down conversions": 2,
      "4th down attempts": 4
    },
    "BoiseState": {
      "points": 28,
      "1st downs": 11,
      "rushing 1st downs": 7,
      "passing 1st downs": 4,
      "penalty 1st downs": 0,
      "rushing yards": 149,
      "rushing attempts": 33,
      "passing yards": 155,
      "passing attempts": 16,
      "passing completions": 9,
      "passing interceptions": 0,
      "total yards": 304,
      "total plays": 49,
      "fumbles": 1,
      "fumbles lost": 0,
      "penalties": 7,
      "penalty yards": 47,
      "punts": 7,
      "punt yards": 281,
      "punt returns": 0,
      "punt return yards": 0,
      "kickoff returns": 2,
      "kickoff return yards": 33,
      "interception returns": 3,
      "interception return yards": 83,
      "3rd down conversions": 5,
      "3rd down attempts": 12,
      "4th down conversions": 0,
      "4th down attempts": 0
    }
  }
}