{
  "games": [
    {"game": {
      "away": {
        "conferences": [{
          "conferenceName": "Sun Belt",
          "conferenceSeo": "sun-belt"
        }],
        "description": "(4-1)",
        "names": {
          "char6": "APP ST",
          "full": "Appalachian State University",
          "seo": "appalachian-st",
          "short": "Appalachian St."
        },
        "rank": "",
        "score": "35",
        "seed": "",
        "winner": true
      },
      "bracketId": "",
      "bracketRegion": "",
      "bracketRound": "",
      "contestClock": "0:00",
      "currentPeriod": "FINAL",
      "finalMessage": "FINAL",
      "gameID": "932f72b4-7b2e-4fc1-a687-b2b9ca531f60",
      "gameState": "final",
      "home": {
        "conferences": [{
          "conferenceName": "Sun Belt",
          "conferenceSeo": "sun-belt"
        }],
        "description": "(3-3)",
        "names": {
          "char6": "ARK ST",
          "full": "Arkansas State University",
          "seo": "arkansas-st",
          "short": "Arkansas State"
        },
        "rank": "",
        "score": "9",
        "seed": "",
        "winner": false
      },
      "liveVideoEnabled": false,
      "network": "",
      "startDate": "10-09-2018",
      "startTime": "08:00PM ET",
      "startTimeEpoch": "1539129600",
      "title": "Arkansas St. Appalachian St.",
      "url": "/game/football/fbs/2018/10/09/appalachian-st-arkansas-st",
      "videoState": ""
    }},
    {"game": {
      "away": {
        "conferences": [{
          "conferenceName": "Big 12",
          "conferenceSeo": "big-12"
        }],
        "description": "(4-2)",
        "names": {
          "char6": "TXTECH",
          "full": "Texas Tech University",
          "seo": "texas-tech",
          "short": "Texas Tech"
        },
        "rank": "",
        "score": "17",
        "seed": "",
        "winner": true
      },
      "bracketId": "",
      "bracketRegion": "",
      "bracketRound": "",
      "contestClock": "0:00",
      "currentPeriod": "FINAL",
      "finalMessage": "FINAL",
      "gameID": "177042d1-e809-4e41-b775-4eae5fb198ff",
      "gameState": "final",
      "home": {
        "conferences": [{
          "conferenceName": "Big 12",
          "conferenceSeo": "big-12"
        }],
        "description": "(3-3)",
        "names": {
          "char6": "TCU",
          "full": "Texas Christian University",
          "seo": "tcu",
          "short": "TCU"
        },
        "rank": "",
        "score": "14",
        "seed": "",
        "winner": false
      },
      "liveVideoEnabled": false,
      "network": "",
      "startDate": "10-11-2018",
      "startTime": "07:30PM ET",
      "startTimeEpoch": "1539300600",
      "title": "TCU Texas Tech",
      "url": "/game/football/fbs/2018/10/11/texas-tech-tcu",
      "videoState": ""
    }},
    {"game": {
      "away": {
        "conferences": [{
          "conferenceName": "Sun Belt",
          "conferenceSeo": "sun-belt"
        }],
        "description": "(5-1)",
        "names": {
          "char6": "GA SOU",
          "full": "Georgia Southern University",
          "seo": "ga-southern",
          "short": "Ga. Southern"
        },
        "rank": "",
        "score": "15",
        "seed": "",
        "winner": true
      },
      "bracketId": "",
      "bracketRegion": "",
      "bracketRound": "",
      "contestClock": "0:00",
      "currentPeriod": "FINAL",
      "finalMessage": "FINAL",
      "gameID": "12e71aac-fd9a-49a5-919b-046e86d4da33",
      "gameState": "final",
      "home": {
        "conferences": [{
          "conferenceName": "Sun Belt",
          "conferenceSeo": "sun-belt"
        }],
        "description": "(1-5)",
        "names": {
          "char6": "TX ST",
          "full": "Texas State University",
          "seo": "texas-st",
          "short": "Texas State"
        },
        "rank": "",
        "score": "13",
        "seed": "",
        "winner": false
      },
      "liveVideoEnabled": false,
      "network": "",
      "startDate": "10-11-2018",
      "startTime": "07:30PM ET",
      "startTimeEpoch": "1539300600",
      "title": "Texas St. Ga. Southern",
      "url": "/game/football/fbs/2018/10/11/ga-southern-texas-st",
      "videoState": ""
    }},
    {"game": {
      "away": {
        "conferences": [
          {
            "conferenceName": "AAC",
            "conferenceSeo": "aac"
          },
          {
            "conferenceName": "Top 25",
            "conferenceSeo": "top-25"
          }
        ],
        "description": "(6-0)",
        "names": {
          "char6": "USF",
          "full": "University of South Florida",
          "seo": "south-fla",
          "short": "South Florida"
        },
        "rank": "23",
        "score": "25",
        "seed": "",
        "winner": true
      },
      "bracketId": "",
      "bracketRegion": "",
      "bracketRound": "",
      "contestClock": "0:00",
      "currentPeriod": "FINAL",
      "finalMessage": "FINAL",
      "gameID": "6cbc3440-3079-41d7-87da-1f6309809a28",
      "gameState": "final",
      "home": {
        "conferences": [{
          "conferenceName": "AAC",
          "conferenceSeo": "aac"
        }],
        "description": "(1-5)",
        "names": {
          "char6": "TULSA",
          "full": "The University of Tulsa",
          "seo": "tulsa",
          "short": "Tulsa"
        },
        "rank": "",
        "score": "24",
        "seed": "",
        "winner": false
      },
      "liveVideoEnabled": false,
      "network": "",
      "startDate": "10-12-2018",
      "startTime": "07:00PM ET",
      "startTimeEpoch": "1539385200",
      "title": "Tulsa South Fla.",
      "url": "/game/football/fbs/2018/10/12/south-fla-tulsa",
      "videoState": ""
    }},
    {"game": {
      "away": {
        "conferences": [{
          "conferenceName": "MWC",
          "conferenceSeo": "mwc"
        }],
        "description": "(2-4)",
        "names": {
          "char6": "AIRFOR",
          "full": "U.S. Air Force Academy",
          "seo": "air-force",
          "short": "Air Force"
        },
        "rank": "",
        "score": "17",
        "seed": "",
        "winner": false
      },
      "bracketId": "",
      "bracketRegion": "",
      "bracketRound": "",
      "contestClock": "0:00",
      "currentPeriod": "FINAL",
      "finalMessage": "FINAL",
      "gameID": "5469710e-b8d1-479e-9b56-d5c88387108f",
      "gameState": "final",
      "home": {
        "conferences": [{
          "conferenceName": "MWC",
          "conferenceSeo": "mwc"
        }],
        "description": "(5-1)",
        "names": {
          "char6": "SDSU",
          "full": "San Diego State University",
          "seo": "san-diego-st",
          "short": "San Diego State"
        },
        "rank": "",
        "score": "21",
        "seed": "",
        "winner": true
      },
      "liveVideoEnabled": false,
      "network": "",
      "startDate": "10-12-2018",
      "startTime": "09:00PM ET",
      "startTimeEpoch": "1539392400",
      "title": "San Diego St. Air Force",
      "url": "/game/football/fbs/2018/10/12/air-force-san-diego-st",
      "videoState": ""
    }},
    {"game": {
      "away": {
        "conferences": [{
          "conferenceName": "Pac-12",
          "conferenceSeo": "pac-12"
        }],
        "description": "(3-4)",
        "names": {
          "char6": "ARIZ",
          "full": "University of Arizona",
          "seo": "arizona",
          "short": "Arizona"
        },
        "rank": "",
        "score": "10",
        "seed": "",
        "winner": false
      },
      "bracketId": "",
      "bracketRegion": "",
      "bracketRound": "",
      "contestClock": "0:00",
      "currentPeriod": "FINAL",
      "finalMessage": "FINAL",
      "gameID": "55994ba8-cec9-47cf-87a8-7a99a7e9067c",
      "gameState": "final",
      "home": {
        "conferences": [{
          "conferenceName": "Pac-12",
          "conferenceSeo": "pac-12"
        }],
        "description": "(4-2)",
        "names": {
          "char6": "UTAH",
          "full": "University of Utah",
          "seo": "utah",
          "short": "Utah"
        },
        "rank": "",
        "score": "42",
        "seed": "",
        "winner": true
      },
      "liveVideoEnabled": false,
      "network": "",
      "startDate": "10-12-2018",
      "startTime": "10:00PM ET",
      "startTimeEpoch": "1539396000",
      "title": "Utah Arizona",
      "url": "/game/football/fbs/2018/10/12/arizona-utah",
      "videoState": ""
    }},
    {"game": {
      "away": {
        "conferences": [{
          "conferenceName": "SEC",
          "conferenceSeo": "sec"
        }],
        "description": "(3-3)",
        "names": {
          "char6": "TENN",
          "full": "University of Tennessee, Knoxville",
          "seo": "tennessee",
          "short": "Tennessee"
        },
        "rank": "",
        "score": "30",
        "seed": "",
        "winner": true
      },
      "bracketId": "",
      "bracketRegion": "",
      "bracketRound": "",
      "contestClock": "0:00",
      "currentPeriod": "FINAL",
      "finalMessage": "FINAL",
      "gameID": "24d543ca-e30b-40fd-aafd-2c65697e0b97",
      "gameState": "final",
      "home": {
        "conferences": [
          {
            "conferenceName": "SEC",
            "conferenceSeo": "sec"
          },
          {
            "conferenceName": "Top 25",
            "conferenceSeo": "top-25"
          }
        ],
        "description": "(4-3)",
        "names": {
          "char6": "AUBURN",
          "full": "Auburn University",
          "seo": "auburn",
          "short": "Auburn"
        },
        "rank": "21",
        "score": "24",
        "seed": "",
        "winner": false
      },
      "liveVideoEnabled": false,
      "network": "",
      "startDate": "10-13-2018",
      "startTime": "12:00PM ET",
      "startTimeEpoch": "1539446400",
      "title": "Auburn Tennessee",
      "url": "/game/football/fbs/2018/10/13/tennessee-auburn",
      "videoState": ""
    }},
    {"game": {
      "away": {
        "conferences": [{
          "conferenceName": "Big Ten",
          "conferenceSeo": "big-ten"
        }],
        "description": "(0-6)",
        "names": {
          "char6": "NEB",
          "full": "University of Nebraska, Lincoln",
          "seo": "nebraska",
          "short": "Nebraska"
        },
        "rank": "",
        "score": "31",
        "seed": "",
        "winner": false
      },
      "bracketId": "",
      "bracketRegion": "",
      "bracketRound": "",
      "contestClock": "",
      "currentPeriod": "FINAL (OT)",
      "finalMessage": "FINAL (OT)",
      "gameID": "35ce05ee-09fa-436e-8b91-18e51a230f92",
      "gameState": "final",
      "home": {
        "conferences": [{
          "conferenceName": "Big Ten",
          "conferenceSeo": "big-ten"
        }],
        "description": "(3-3)",
        "names": {
          "char6": "NWSTRN",
          "full": "Northwestern University",
          "seo": "northwestern",
          "short": "Northwestern"
        },
        "rank": "",
        "score": "34",
        "seed": "",
        "winner": true
      },
      "liveVideoEnabled": false,
      "network": "",
      "startDate": "10-13-2018",
      "startTime": "12:00PM ET",
      "startTimeEpoch": "1539446400",
      "title": "Northwestern Nebraska",
      "url": "/game/football/fbs/2018/10/13/nebraska-northwestern",
      "videoState": ""
    }},
    {"game": {
      "away": {
        "conferences": [{
          "conferenceName": "Big Ten",
          "conferenceSeo": "big-ten"
        }],
        "description": "(3-3)",
        "names": {
          "char6": "MINN",
          "full": "University of Minnesota, Twin Cities",
          "seo": "minnesota",
          "short": "Minnesota"
        },
        "rank": "",
        "score": "14",
        "seed": "",
        "winner": false
      },
      "bracketId": "",
      "bracketRegion": "",
      "bracketRound": "",
      "contestClock": "0:00",
      "currentPeriod": "FINAL",
      "finalMessage": "FINAL",
      "gameID": "08f97f85-ef9a-4a3b-bc10-dbcee77576a1",
      "gameState": "final",
      "home": {
        "conferences": [
          {
            "conferenceName": "Big Ten",
            "conferenceSeo": "big-ten"
          },
          {
            "conferenceName": "Top 25",
            "conferenceSeo": "top-25"
          }
        ],
        "description": "(7-0)",
        "names": {
          "char6": "OHIOST",
          "full": "The Ohio State University",
          "seo": "ohio-st",
          "short": "Ohio St. "
        },
        "rank": "3",
        "score": "30",
        "seed": "",
        "winner": true
      },
      "liveVideoEnabled": false,
      "network": "",
      "startDate": "10-13-2018",
      "startTime": "12:00PM ET",
      "startTimeEpoch": "1539446400",
      "title": "Ohio St. Minnesota",
      "url": "/game/football/fbs/2018/10/13/minnesota-ohio-st",
      "videoState": ""
    }},
    {"game": {
      "away": {
        "conferences": [{
          "conferenceName": "MAC",
          "conferenceSeo": "mac"
        }],
        "description": "(2-3)",
        "names": {
          "char6": "AKRON",
          "full": "University of Akron",
          "seo": "akron",
          "short": "Akron"
        },
        "rank": "",
        "score": "6",
        "seed": "",
        "winner": false
      },
      "bracketId": "",
      "bracketRegion": "",
      "bracketRound": "",
      "contestClock": "0:00",
      "currentPeriod": "FINAL",
      "finalMessage": "FINAL",
      "gameID": "4fbd2610-8c5b-44f1-8c16-e07b1938062d",
      "gameState": "final",
      "home": {
        "conferences": [{
          "conferenceName": "MAC",
          "conferenceSeo": "mac"
        }],
        "description": "(6-1)",
        "names": {
          "char6": "BUFF",
          "full": "University at Buffalo, the State University of New York",
          "seo": "buffalo",
          "short": "Buffalo"
        },
        "rank": "",
        "score": "24",
        "seed": "",
        "winner": true
      },
      "liveVideoEnabled": false,
      "network": "",
      "startDate": "10-13-2018",
      "startTime": "12:00PM ET",
      "startTimeEpoch": "1539446400",
      "title": "Buffalo Akron",
      "url": "/game/football/fbs/2018/10/13/akron-buffalo",
      "videoState": ""
    }},
    {"game": {
      "away": {
        "conferences": [{
          "conferenceName": "Big 12",
          "conferenceSeo": "big-12"
        }],
        "description": "(4-3)",
        "names": {
          "char6": "OKLAST",
          "full": "Oklahoma State University",
          "seo": "oklahoma-st",
          "short": "Oklahoma State"
        },
        "rank": "",
        "score": "12",
        "seed": "",
        "winner": false
      },
      "bracketId": "",
      "bracketRegion": "",
      "bracketRound": "",
      "contestClock": "0:00",
      "currentPeriod": "FINAL",
      "finalMessage": "FINAL",
      "gameID": "982405a1-659f-4bbb-8772-b5cb4fbb2dee",
      "gameState": "final",
      "home": {
        "conferences": [{
          "conferenceName": "Big 12",
          "conferenceSeo": "big-12"
        }],
        "description": "(3-4)",
        "names": {
          "char6": "KAN ST",
          "full": "Kansas State University",
          "seo": "kansas-st",
          "short": "Kansas St."
        },
        "rank": "",
        "score": "31",
        "seed": "",
        "winner": true
      },
      "liveVideoEnabled": false,
      "network": "",
      "startDate": "10-13-2018",
      "startTime": "12:00PM ET",
      "startTimeEpoch": "1539446400",
      "title": "Kansas St. Oklahoma St.",
      "url": "/game/football/fbs/2018/10/13/oklahoma-st-kansas-st",
      "videoState": ""
    }},
    {"game": {
      "away": {
        "conferences": [
          {
            "conferenceName": "SEC",
            "conferenceSeo": "sec"
          },
          {
            "conferenceName": "Top 25",
            "conferenceSeo": "top-25"
          }
        ],
        "description": "(6-1)",
        "names": {
          "char6": "FLA",
          "full": "University of Florida",
          "seo": "florida",
          "short": "Florida"
        },
        "rank": "14",
        "score": "37",
        "seed": "",
        "winner": true
      },
      "bracketId": "",
      "bracketRegion": "",
      "bracketRound": "",
      "contestClock": "0:00",
      "currentPeriod": "FINAL",
      "finalMessage": "FINAL",
      "gameID": "49b334a9-05ff-402f-8de8-a5cb099e4a34",
      "gameState": "final",
      "home": {
        "conferences": [{
          "conferenceName": "SEC",
          "conferenceSeo": "sec"
        }],
        "description": "(3-4)",
        "names": {
          "char6": "VANDY",
          "full": "Vanderbilt University",
          "seo": "vanderbilt",
          "short": "Vanderbilt"
        },
        "rank": "",
        "score": "27",
        "seed": "",
        "winner": false
      },
      "liveVideoEnabled": false,
      "network": "",
      "startDate": "10-13-2018",
      "startTime": "12:00PM ET",
      "startTimeEpoch": "1539446400",
      "title": "Vanderbilt Florida",
      "url": "/game/football/fbs/2018/10/13/florida-vanderbilt",
      "videoState": ""
    }},
    {"game": {
      "away": {
        "conferences": [{
          "conferenceName": "Big Ten",
          "conferenceSeo": "big-ten"
        }],
        "description": "(5-1)",
        "names": {
          "char6": "IOWA",
          "full": "University of Iowa",
          "seo": "iowa",
          "short": "Iowa"
        },
        "rank": "",
        "score": "42",
        "seed": "",
        "winner": true
      },
      "bracketId": "",
      "bracketRegion": "",
      "bracketRound": "",
      "contestClock": "0:00",
      "currentPeriod": "FINAL",
      "finalMessage": "FINAL",
      "gameID": "cebef83b-a423-4138-9e20-23dcaa13ccfe",
      "gameState": "final",
      "home": {
        "conferences": [{
          "conferenceName": "Big Ten",
          "conferenceSeo": "big-ten"
        }],
        "description": "(4-3)",
        "names": {
          "char6": "IND",
          "full": "Indiana University, Bloomington",
          "seo": "indiana",
          "short": "Indiana"
        },
        "rank": "",
        "score": "16",
        "seed": "",
        "winner": false
      },
      "liveVideoEnabled": false,
      "network": "",
      "startDate": "10-13-2018",
      "startTime": "12:00PM ET",
      "startTimeEpoch": "1539446400",
      "title": "Indiana Iowa",
      "url": "/game/football/fbs/2018/10/13/iowa-indiana",
      "videoState": ""
    }},
    {"game": {
      "away": {
        "conferences": [{
          "conferenceName": "MAC",
          "conferenceSeo": "mac"
        }],
        "description": "(3-3)",
        "names": {
          "char6": "TOLEDO",
          "full": "University of Toledo",
          "seo": "toledo",
          "short": "Toledo"
        },
        "rank": "",
        "score": "26",
        "seed": "",
        "winner": false
      },
      "bracketId": "",
      "bracketRegion": "",
      "bracketRound": "",
      "contestClock": "0:00",
      "currentPeriod": "FINAL",
      "finalMessage": "FINAL",
      "gameID": "60b646e3-d3c4-48f9-a255-db7a972702c2",
      "gameState": "final",
      "home": {
        "conferences": [{
          "conferenceName": "MAC",
          "conferenceSeo": "mac"
        }],
        "description": "(3-4)",
        "names": {
          "char6": "E MICH",
          "full": "Eastern Michigan University",
          "seo": "eastern-mich",
          "short": "Eastern Mich."
        },
        "rank": "",
        "score": "28",
        "seed": "",
        "winner": true
      },
      "liveVideoEnabled": false,
      "network": "",
      "startDate": "10-13-2018",
      "startTime": "12:00PM ET",
      "startTimeEpoch": "1539446400",
      "title": "Eastern Mich. Toledo",
      "url": "/game/football/fbs/2018/10/13/toledo-eastern-mich",
      "videoState": ""
    }},
    {"game": {
      "away": {
        "conferences": [{
          "conferenceName": "Big Ten",
          "conferenceSeo": "big-ten"
        }],
        "description": "(1-6)",
        "names": {
          "char6": "RUTGER",
          "full": "Rutgers, The State University of New Jersey, New Brunswick",
          "seo": "rutgers",
          "short": "Rutgers"
        },
        "rank": "",
        "score": "7",
        "seed": "",
        "winner": false
      },
      "bracketId": "",
      "bracketRegion": "",
      "bracketRound": "",
      "contestClock": "0:00",
      "currentPeriod": "FINAL",
      "finalMessage": "FINAL",
      "gameID": "5f0f975e-d2f1-4d10-87c4-6ec6ec179388",
      "gameState": "final",
      "home": {
        "conferences": [{
          "conferenceName": "Big Ten",
          "conferenceSeo": "big-ten"
        }],
        "description": "(4-2)",
        "names": {
          "char6": "MD",
          "full": "University of Maryland, College Park",
          "seo": "maryland",
          "short": "Maryland"
        },
        "rank": "",
        "score": "34",
        "seed": "",
        "winner": true
      },
      "liveVideoEnabled": false,
      "network": "",
      "startDate": "10-13-2018",
      "startTime": "12:00PM ET",
      "startTimeEpoch": "1539446400",
      "title": "Maryland Rutgers",
      "url": "/game/football/fbs/2018/10/13/rutgers-maryland",
      "videoState": ""
    }},
    {"game": {
      "away": {
        "conferences": [{
          "conferenceName": "ACC",
          "conferenceSeo": "acc"
        }],
        "description": "(5-1)",
        "names": {
          "char6": "DUKE",
          "full": "Duke University",
          "seo": "duke",
          "short": "Duke"
        },
        "rank": "",
        "score": "28",
        "seed": "",
        "winner": true
      },
      "bracketId": "",
      "bracketRegion": "",
      "bracketRound": "",
      "contestClock": "0:00",
      "currentPeriod": "FINAL",
      "finalMessage": "FINAL",
      "gameID": "8ed2c33a-7319-4323-885e-b8d01ba6f53f",
      "gameState": "final",
      "home": {
        "conferences": [{
          "conferenceName": "ACC",
          "conferenceSeo": "acc"
        }],
        "description": "(3-4)",
        "names": {
          "char6": "GATECH",
          "full": "Georgia Institute of Technology",
          "seo": "georgia-tech",
          "short": "Georgia Tech"
        },
        "rank": "",
        "score": "14",
        "seed": "",
        "winner": false
      },
      "liveVideoEnabled": false,
      "network": "",
      "startDate": "10-13-2018",
      "startTime": "12:20PM ET",
      "startTimeEpoch": "1539447600",
      "title": "Georgia Tech Duke",
      "url": "/game/football/fbs/2018/10/13/duke-georgia-tech",
      "videoState": ""
    }},
    {"game": {
      "away": {
        "conferences": [{
          "conferenceName": "ACC",
          "conferenceSeo": "acc"
        }],
        "description": "(2-5)",
        "names": {
          "char6": "LOUIS",
          "full": "University of Louisville",
          "seo": "louisville",
          "short": "Louisville"
        },
        "rank": "",
        "score": "20",
        "seed": "",
        "winner": false
      },
      "bracketId": "",
      "bracketRegion": "",
      "bracketRound": "",
      "contestClock": "0:00",
      "currentPeriod": "FINAL",
      "finalMessage": "FINAL",
      "gameID": "8759a157-0c84-46ba-9dd8-92d1e9aefe2a",
      "gameState": "final",
      "home": {
        "conferences": [{
          "conferenceName": "ACC",
          "conferenceSeo": "acc"
        }],
        "description": "(5-2)",
        "names": {
          "char6": "BC",
          "full": "Boston College",
          "seo": "boston-college",
          "short": "Boston College"
        },
        "rank": "",
        "score": "38",
        "seed": "",
        "winner": true
      },
      "liveVideoEnabled": false,
      "network": "",
      "startDate": "10-13-2018",
      "startTime": "12:30PM ET",
      "startTimeEpoch": "1539448200",
      "title": "Boston College Louisville",
      "url": "/game/football/fbs/2018/10/13/louisville-boston-college",
      "videoState": ""
    }},
    {"game": {
      "away": {
        "conferences": [{
          "conferenceName": "C-USA",
          "conferenceSeo": "c-usa"
        }],
        "description": "(5-1)",
        "names": {
          "char6": "UAB",
          "full": "University of Alabama at Birmingham",
          "seo": "uab",
          "short": "UAB"
        },
        "rank": "",
        "score": "42",
        "seed": "",
        "winner": true
      },
      "bracketId": "",
      "bracketRegion": "",
      "bracketRound": "",
      "contestClock": "0:00",
      "currentPeriod": "FINAL",
      "finalMessage": "FINAL",
      "gameID": "8ac1421e-490b-4538-b6cd-84202e6e0f6f",
      "gameState": "final",
      "home": {
        "conferences": [{
          "conferenceName": "C-USA",
          "conferenceSeo": "c-usa"
        }],
        "description": "(1-6)",
        "names": {
          "char6": "RICE",
          "full": "Rice University",
          "seo": "rice",
          "short": "Rice"
        },
        "rank": "",
        "score": "0",
        "seed": "",
        "winner": false
      },
      "liveVideoEnabled": false,
      "network": "",
      "startDate": "10-13-2018",
      "startTime": "01:00PM ET",
      "startTimeEpoch": "1539450000",
      "title": "Rice UAB",
      "url": "/game/football/fbs/2018/10/13/uab-rice",
      "videoState": ""
    }},
    {"game": {
      "away": {
        "conferences": [{
          "conferenceName": "C-USA",
          "conferenceSeo": "c-usa"
        }],
        "description": "(2-3)",
        "names": {
          "char6": "S MISS",
          "full": "The University of Southern Mississippi",
          "seo": "southern-miss",
          "short": "Southern Miss"
        },
        "rank": "",
        "score": "7",
        "seed": "",
        "winner": false
      },
      "bracketId": "",
      "bracketRegion": "",
      "bracketRound": "",
      "contestClock": "0:00",
      "currentPeriod": "FINAL",
      "finalMessage": "FINAL",
      "gameID": "b5a2926f-b505-4441-8127-754891361ed6",
      "gameState": "final",
      "home": {
        "conferences": [{
          "conferenceName": "C-USA",
          "conferenceSeo": "c-usa"
        }],
        "description": "(6-1)",
        "names": {
          "char6": "NO TEX",
          "full": "University of North Texas",
          "seo": "north-texas",
          "short": "North Texas"
        },
        "rank": "",
        "score": "30",
        "seed": "",
        "winner": true
      },
      "liveVideoEnabled": false,
      "network": "",
      "startDate": "10-13-2018",
      "startTime": "02:00PM ET",
      "startTimeEpoch": "1539453600",
      "title": "North Texas Southern Miss.",
      "url": "/game/football/fbs/2018/10/13/southern-miss-north-texas",
      "videoState": ""
    }},
    {"game": {
      "away": {
        "conferences": [{
          "conferenceName": "Sun Belt",
          "conferenceSeo": "sun-belt"
        }],
        "description": "(5-2)",
        "names": {
          "char6": "TROY",
          "full": "Troy University",
          "seo": "troy",
          "short": "Troy"
        },
        "rank": "",
        "score": "16",
        "seed": "",
        "winner": false
      },
      "bracketId": "",
      "bracketRegion": "",
      "bracketRound": "",
      "contestClock": "0:00",
      "currentPeriod": "FINAL",
      "finalMessage": "FINAL",
      "gameID": "8317c078-4e99-45ec-b879-91d91acdab05",
      "gameState": "final",
      "home": {
        "conferences": [{
          "conferenceName": "FBS Independent",
          "conferenceSeo": "fbs-independent"
        }],
        "description": "(3-3)",
        "names": {
          "char6": "LIBRTY",
          "full": "Liberty University",
          "seo": "liberty",
          "short": "Liberty"
        },
        "rank": "",
        "score": "22",
        "seed": "",
        "winner": true
      },
      "liveVideoEnabled": false,
      "network": "",
      "startDate": "10-13-2018",
      "startTime": "02:00PM ET",
      "startTimeEpoch": "1539453600",
      "title": "Liberty Troy",
      "url": "/game/football/fbs/2018/10/13/troy-liberty",
      "videoState": ""
    }},
    {"game": {
      "away": {
        "conferences": [{
          "conferenceName": "MAC",
          "conferenceSeo": "mac"
        }],
        "description": "(1-6)",
        "names": {
          "char6": "KENT",
          "full": "Kent State University",
          "seo": "kent-st",
          "short": "Kent State"
        },
        "rank": "",
        "score": "6",
        "seed": "",
        "winner": false
      },
      "bracketId": "",
      "bracketRegion": "",
      "bracketRound": "",
      "contestClock": "0:00",
      "currentPeriod": "FINAL",
      "finalMessage": "FINAL",
      "gameID": "2abdfd06-3bfd-40d5-8ab0-e4b7a572076d",
      "gameState": "final",
      "home": {
        "conferences": [{
          "conferenceName": "MAC",
          "conferenceSeo": "mac"
        }],
        "description": "(3-4)",
        "names": {
          "char6": "MIA OH",
          "full": "Miami University (Ohio)",
          "seo": "miami-oh",
          "short": "Miami (Ohio)"
        },
        "rank": "",
        "score": "31",
        "seed": "",
        "winner": true
      },
      "liveVideoEnabled": false,
      "network": "",
      "startDate": "10-13-2018",
      "startTime": "02:30PM ET",
      "startTimeEpoch": "1539455400",
      "title": "Miami (OH) Kent St.",
      "url": "/game/football/fbs/2018/10/13/kent-st-miami-oh",
      "videoState": ""
    }},
    {"game": {
      "away": {
        "conferences": [{
          "conferenceName": "ACC",
          "conferenceSeo": "acc"
        }],
        "description": "(3-4)",
        "names": {
          "char6": "PITT",
          "full": "University of Pittsburgh",
          "seo": "pittsburgh",
          "short": "Pittsburgh"
        },
        "rank": "",
        "score": "14",
        "seed": "",
        "winner": false
      },
      "bracketId": "",
      "bracketRegion": "",
      "bracketRound": "",
      "contestClock": "0:00",
      "currentPeriod": "FINAL",
      "finalMessage": "FINAL",
      "gameID": "88d2c81c-a1dc-4ffe-a1b2-0c5059cf8cc1",
      "gameState": "final",
      "home": {
        "conferences": [
          {
            "conferenceName": "FBS Independent",
            "conferenceSeo": "fbs-independent"
          },
          {
            "conferenceName": "Top 25",
            "conferenceSeo": "top-25"
          }
        ],
        "description": "(7-0)",
        "names": {
          "char6": "N DAME",
          "full": "University of Notre Dame",
          "seo": "notre-dame",
          "short": "Notre Dame"
        },
        "rank": "5",
        "score": "19",
        "seed": "",
        "winner": true
      },
      "liveVideoEnabled": false,
      "network": "",
      "startDate": "10-13-2018",
      "startTime": "02:30PM ET",
      "startTimeEpoch": "1539455400",
      "title": "Notre Dame Pittsburgh",
      "url": "/game/football/fbs/2018/10/13/pittsburgh-notre-dame",
      "videoState": ""
    }},
    {"game": {
      "away": {
        "conferences": [{
          "conferenceName": "MAC",
          "conferenceSeo": "mac"
        }],
        "description": "(5-2)",
        "names": {
          "char6": "W MICH",
          "full": "Western Michigan University",
          "seo": "western-mich",
          "short": "Western Mich."
        },
        "rank": "",
        "score": "42",
        "seed": "",
        "winner": true
      },
      "bracketId": "",
      "bracketRegion": "",
      "bracketRound": "",
      "contestClock": "0:00",
      "currentPeriod": "FINAL",
      "finalMessage": "FINAL",
      "gameID": "6c72a14d-e2ab-4300-b74f-0b76a6614c11",
      "gameState": "final",
      "home": {
        "conferences": [{
          "conferenceName": "MAC",
          "conferenceSeo": "mac"
        }],
        "description": "(1-6)",
        "names": {
          "char6": "BGSU",
          "full": "Bowling Green State University",
          "seo": "bowling-green",
          "short": "Bowling Green"
        },
        "rank": "",
        "score": "35",
        "seed": "",
        "winner": false
      },
      "liveVideoEnabled": false,
      "network": "",
      "startDate": "10-13-2018",
      "startTime": "03:00PM ET",
      "startTimeEpoch": "1539457200",
      "title": "Bowling Green Western Mich.",
      "url": "/game/football/fbs/2018/10/13/western-mich-bowling-green",
      "videoState": ""
    }},
    {"game": {
      "away": {
        "conferences": [{
          "conferenceName": "MAC",
          "conferenceSeo": "mac"
        }],
        "description": "(3-4)",
        "names": {
          "char6": "BALLST",
          "full": "Ball State University",
          "seo": "ball-st",
          "short": "Ball State"
        },
        "rank": "",
        "score": "24",
        "seed": "",
        "winner": true
      },
      "bracketId": "",
      "bracketRegion": "",
      "bracketRound": "",
      "contestClock": "0:00",
      "currentPeriod": "FINAL",
      "finalMessage": "FINAL",
      "gameID": "f967fc6d-a66d-409d-b39d-8a95919bf8a6",
      "gameState": "final",
      "home": {
        "conferences": [{
          "conferenceName": "MAC",
          "conferenceSeo": "mac"
        }],
        "description": "(1-6)",
        "names": {
          "char6": "C MICH",
          "full": "Central Michigan University",
          "seo": "central-mich",
          "short": "Central Mich."
        },
        "rank": "",
        "score": "23",
        "seed": "",
        "winner": false
      },
      "liveVideoEnabled": false,
      "network": "",
      "startDate": "10-13-2018",
      "startTime": "03:00PM ET",
      "startTimeEpoch": "1539457200",
      "title": "Central Mich. Ball St.",
      "url": "/game/football/fbs/2018/10/13/ball-st-central-mich",
      "videoState": ""
    }},
    {"game": {
      "away": {
        "conferences": [{
          "conferenceName": "Big Ten",
          "conferenceSeo": "big-ten"
        }],
        "description": "(4-2)",
        "names": {
          "char6": "MICHST",
          "full": "Michigan State University",
          "seo": "michigan-st",
          "short": "Mich. St. "
        },
        "rank": "",
        "score": "21",
        "seed": "",
        "winner": true
      },
      "bracketId": "",
      "bracketRegion": "",
      "bracketRound": "",
      "contestClock": "0:00",
      "currentPeriod": "FINAL",
      "finalMessage": "FINAL",
      "gameID": "f11525e6-418a-4589-9f8c-a3f86597db2c",
      "gameState": "final",
      "home": {
        "conferences": [
          {
            "conferenceName": "Big Ten",
            "conferenceSeo": "big-ten"
          },
          {
            "conferenceName": "Top 25",
            "conferenceSeo": "top-25"
          }
        ],
        "description": "(4-2)",
        "names": {
          "char6": "PENNST",
          "full": "Pennsylvania State University",
          "seo": "penn-st",
          "short": "Penn St."
        },
        "rank": "8",
        "score": "17",
        "seed": "",
        "winner": false
      },
      "liveVideoEnabled": false,
      "network": "",
      "startDate": "10-13-2018",
      "startTime": "03:30PM ET",
      "startTimeEpoch": "1539459000",
      "title": "Penn St. Michigan St.",
      "url": "/game/football/fbs/2018/10/13/michigan-st-penn-st",
      "videoState": ""
    }},
    {"game": {
      "away": {
        "conferences": [{
          "conferenceName": "C-USA",
          "conferenceSeo": "c-usa"
        }],
        "description": "(1-5)",
        "names": {
          "char6": "W KY",
          "full": "Western Kentucky University",
          "seo": "western-ky",
          "short": "Western Ky."
        },
        "rank": "",
        "score": "14",
        "seed": "",
        "winner": false
      },
      "bracketId": "",
      "bracketRegion": "",
      "bracketRound": "",
      "contestClock": "0:00",
      "currentPeriod": "FINAL",
      "finalMessage": "FINAL",
      "gameID": "419e9eec-9731-4a28-953a-d6fc3e4f7b82",
      "gameState": "final",
      "home": {
        "conferences": [{
          "conferenceName": "C-USA",
          "conferenceSeo": "c-usa"
        }],
        "description": "(3-3)",
        "names": {
          "char6": "CHAR",
          "full": "The University of North Carolina at Charlotte",
          "seo": "charlotte",
          "short": "Charlotte"
        },
        "rank": "",
        "score": "40",
        "seed": "",
        "winner": true
      },
      "liveVideoEnabled": false,
      "network": "",
      "startDate": "10-13-2018",
      "startTime": "03:30PM ET",
      "startTimeEpoch": "1539459000",
      "title": "Charlotte Western Ky.",
      "url": "/game/football/fbs/2018/10/13/western-ky-charlotte",
      "videoState": ""
    }},
    {"game": {
      "away": {
        "conferences": [
          {
            "conferenceName": "Pac-12",
            "conferenceSeo": "pac-12"
          },
          {
            "conferenceName": "Top 25",
            "conferenceSeo": "top-25"
          }
        ],
        "description": "(5-2)",
        "names": {
          "char6": "WASH",
          "full": "University of Washington",
          "seo": "washington",
          "short": "Washington"
        },
        "rank": "7",
        "score": "27",
        "seed": "",
        "winner": false
      },
      "bracketId": "",
      "bracketRegion": "",
      "bracketRound": "",
      "contestClock": "",
      "currentPeriod": "FINAL (OT)",
      "finalMessage": "FINAL (OT)",
      "gameID": "2dd2e9e5-6d5c-4428-b419-fe63f32cbe90",
      "gameState": "final",
      "home": {
        "conferences": [
          {
            "conferenceName": "Pac-12",
            "conferenceSeo": "pac-12"
          },
          {
            "conferenceName": "Top 25",
            "conferenceSeo": "top-25"
          }
        ],
        "description": "(5-1)",
        "names": {
          "char6": "OREGN",
          "full": "University of Oregon",
          "seo": "oregon",
          "short": "Oregon"
        },
        "rank": "17",
        "score": "30",
        "seed": "",
        "winner": true
      },
      "liveVideoEnabled": false,
      "network": "",
      "startDate": "10-13-2018",
      "startTime": "03:30PM ET",
      "startTimeEpoch": "1539459000",
      "title": "Oregon Washington",
      "url": "/game/football/fbs/2018/10/13/washington-oregon",
      "videoState": ""
    }},
    {"game": {
      "away": {
        "conferences": [
          {
            "conferenceName": "SEC",
            "conferenceSeo": "sec"
          },
          {
            "conferenceName": "Top 25",
            "conferenceSeo": "top-25"
          }
        ],
        "description": "(6-1)",
        "names": {
          "char6": "UGA",
          "full": "University of Georgia",
          "seo": "georgia",
          "short": "Georgia"
        },
        "rank": "2",
        "score": "16",
        "seed": "",
        "winner": false
      },
      "bracketId": "",
      "bracketRegion": "",
      "bracketRound": "",
      "contestClock": "0:00",
      "currentPeriod": "FINAL",
      "finalMessage": "FINAL",
      "gameID": "3913ca68-a4b3-4a85-9561-f178d86b4493",
      "gameState": "final",
      "home": {
        "conferences": [
          {
            "conferenceName": "SEC",
            "conferenceSeo": "sec"
          },
          {
            "conferenceName": "Top 25",
            "conferenceSeo": "top-25"
          }
        ],
        "description": "(6-1)",
        "names": {
          "char6": "LSU",
          "full": "Louisiana State University",
          "seo": "lsu",
          "short": "LSU"
        },
        "rank": "13",
        "score": "36",
        "seed": "",
        "winner": true
      },
      "liveVideoEnabled": false,
      "network": "",
      "startDate": "10-13-2018",
      "startTime": "03:30PM ET",
      "startTimeEpoch": "1539459000",
      "title": "LSU Georgia",
      "url": "/game/football/fbs/2018/10/13/georgia-lsu",
      "videoState": ""
    }},
    {"game": {
      "away": {
        "conferences": [{
          "conferenceName": "AAC",
          "conferenceSeo": "aac"
        }],
        "description": "(4-3)",
        "names": {
          "char6": "TEMPLE",
          "full": "Temple University",
          "seo": "temple",
          "short": "Temple"
        },
        "rank": "",
        "score": "24",
        "seed": "",
        "winner": true
      },
      "bracketId": "",
      "bracketRegion": "",
      "bracketRound": "",
      "contestClock": "0:00",
      "currentPeriod": "FINAL",
      "finalMessage": "FINAL",
      "gameID": "695dc650-4e25-4822-a06f-ec9b791be2c2",
      "gameState": "final",
      "home": {
        "conferences": [{
          "conferenceName": "AAC",
          "conferenceSeo": "aac"
        }],
        "description": "(2-4)",
        "names": {
          "char6": "NAVY",
          "full": "U.S. Naval Academy",
          "seo": "navy",
          "short": "Navy"
        },
        "rank": "",
        "score": "17",
        "seed": "",
        "winner": false
      },
      "liveVideoEnabled": false,
      "network": "",
      "startDate": "10-13-2018",
      "startTime": "03:30PM ET",
      "startTimeEpoch": "1539459000",
      "title": "Navy Temple",
      "url": "/game/football/fbs/2018/10/13/temple-navy",
      "videoState": ""
    }},
    {"game": {
      "away": {
        "conferences": [{
          "conferenceName": "Big Ten",
          "conferenceSeo": "big-ten"
        }],
        "description": "(3-3)",
        "names": {
          "char6": "PURDUE",
          "full": "Purdue University",
          "seo": "purdue",
          "short": "Purdue"
        },
        "rank": "",
        "score": "46",
        "seed": "",
        "winner": true
      },
      "bracketId": "",
      "bracketRegion": "",
      "bracketRound": "",
      "contestClock": "0:00",
      "currentPeriod": "FINAL",
      "finalMessage": "FINAL",
      "gameID": "64dcec74-22e8-4463-87f1-4ef9a56f1e1e",
      "gameState": "final",
      "home": {
        "conferences": [{
          "conferenceName": "Big Ten",
          "conferenceSeo": "big-ten"
        }],
        "description": "(3-3)",
        "names": {
          "char6": "ILL",
          "full": "University of Illinois Urbana-Champaign",
          "seo": "illinois",
          "short": "Illinois"
        },
        "rank": "",
        "score": "7",
        "seed": "",
        "winner": false
      },
      "liveVideoEnabled": false,
      "network": "",
      "startDate": "10-13-2018",
      "startTime": "03:30PM ET",
      "startTimeEpoch": "1539459000",
      "title": "Illinois Purdue",
      "url": "/game/football/fbs/2018/10/13/purdue-illinois",
      "videoState": ""
    }},
    {"game": {
      "away": {
        "conferences": [
          {
            "conferenceName": "AAC",
            "conferenceSeo": "aac"
          },
          {
            "conferenceName": "Top 25",
            "conferenceSeo": "top-25"
          }
        ],
        "description": "(6-0)",
        "names": {
          "char6": "UCF",
          "full": "University of Central Florida",
          "seo": "ucf",
          "short": "UCF"
        },
        "rank": "10",
        "score": "31",
        "seed": "",
        "winner": true
      },
      "bracketId": "",
      "bracketRegion": "",
      "bracketRound": "",
      "contestClock": "0:00",
      "currentPeriod": "FINAL",
      "finalMessage": "FINAL",
      "gameID": "35e198c2-f717-44f9-9062-fbdd8c5a0779",
      "gameState": "final",
      "home": {
        "conferences": [{
          "conferenceName": "AAC",
          "conferenceSeo": "aac"
        }],
        "description": "(4-3)",
        "names": {
          "char6": "MEM",
          "full": "University of Memphis",
          "seo": "memphis",
          "short": "Memphis"
        },
        "rank": "",
        "score": "30",
        "seed": "",
        "winner": false
      },
      "liveVideoEnabled": false,
      "network": "",
      "startDate": "10-13-2018",
      "startTime": "03:30PM ET",
      "startTimeEpoch": "1539459000",
      "title": "Memphis UCF",
      "url": "/game/football/fbs/2018/10/13/ucf-memphis",
      "videoState": ""
    }},
    {"game": {
      "away": {
        "conferences": [{
          "conferenceName": "MAC",
          "conferenceSeo": "mac"
        }],
        "description": "(3-3)",
        "names": {
          "char6": "OHIO",
          "full": "Ohio University",
          "seo": "ohio",
          "short": "Ohio"
        },
        "rank": "",
        "score": "21",
        "seed": "",
        "winner": false
      },
      "bracketId": "",
      "bracketRegion": "",
      "bracketRound": "",
      "contestClock": "0:00",
      "currentPeriod": "FINAL",
      "finalMessage": "FINAL",
      "gameID": "fae185ea-4a53-418d-95b3-f1c10b5c5676",
      "gameState": "final",
      "home": {
        "conferences": [{
          "conferenceName": "MAC",
          "conferenceSeo": "mac"
        }],
        "description": "(4-3)",
        "names": {
          "char6": "NIU",
          "full": "Northern Illinois University",
          "seo": "northern-ill",
          "short": "Northern Ill."
        },
        "rank": "",
        "score": "24",
        "seed": "",
        "winner": true
      },
      "liveVideoEnabled": false,
      "network": "",
      "startDate": "10-13-2018",
      "startTime": "03:30PM ET",
      "startTimeEpoch": "1539459000",
      "title": "Northern Ill. Ohio",
      "url": "/game/football/fbs/2018/10/13/ohio-northern-ill",
      "videoState": ""
    }},
    {"game": {
      "away": {
        "conferences": [{
          "conferenceName": "C-USA",
          "conferenceSeo": "c-usa"
        }],
        "description": "(4-2)",
        "names": {
          "char6": "MARSH",
          "full": "Marshall University",
          "seo": "marshall",
          "short": "Marshall"
        },
        "rank": "",
        "score": "42",
        "seed": "",
        "winner": true
      },
      "bracketId": "",
      "bracketRegion": "",
      "bracketRound": "",
      "contestClock": "0:00",
      "currentPeriod": "FINAL",
      "finalMessage": "FINAL",
      "gameID": "9540d81a-aa6d-4e78-8fb6-75a2be9f194b",
      "gameState": "final",
      "home": {
        "conferences": [{
          "conferenceName": "C-USA",
          "conferenceSeo": "c-usa"
        }],
        "description": "(1-6)",
        "names": {
          "char6": "ODU",
          "full": "Old Dominion University",
          "seo": "old-dominion",
          "short": "Old Dominion"
        },
        "rank": "",
        "score": "20",
        "seed": "",
        "winner": false
      },
      "liveVideoEnabled": false,
      "network": "",
      "startDate": "10-13-2018",
      "startTime": "03:30PM ET",
      "startTimeEpoch": "1539459000",
      "title": "Old Dominion Marshall",
      "url": "/game/football/fbs/2018/10/13/marshall-old-dominion",
      "videoState": ""
    }},
    {"game": {
      "away": {
        "conferences": [{
          "conferenceName": "Big 12",
          "conferenceSeo": "big-12"
        }],
        "description": "(4-3)",
        "names": {
          "char6": "BAYLOR",
          "full": "Baylor University",
          "seo": "baylor",
          "short": "Baylor"
        },
        "rank": "",
        "score": "17",
        "seed": "",
        "winner": false
      },
      "bracketId": "",
      "bracketRegion": "",
      "bracketRound": "",
      "contestClock": "0:00",
      "currentPeriod": "FINAL",
      "finalMessage": "FINAL",
      "gameID": "3213aee8-d389-4a48-8592-68f260e6db35",
      "gameState": "final",
      "home": {
        "conferences": [
          {
            "conferenceName": "Big 12",
            "conferenceSeo": "big-12"
          },
          {
            "conferenceName": "Top 25",
            "conferenceSeo": "top-25"
          }
        ],
        "description": "(6-1)",
        "names": {
          "char6": "TEXAS",
          "full": "University of Texas at Austin",
          "seo": "texas",
          "short": "Texas"
        },
        "rank": "9",
        "score": "23",
        "seed": "",
        "winner": true
      },
      "liveVideoEnabled": false,
      "network": "",
      "startDate": "10-13-2018",
      "startTime": "03:30PM ET",
      "startTimeEpoch": "1539459000",
      "title": "Texas Baylor",
      "url": "/game/football/fbs/2018/10/13/baylor-texas",
      "videoState": ""
    }},
    {"game": {
      "away": {
        "conferences": [
          {
            "conferenceName": "SEC",
            "conferenceSeo": "sec"
          },
          {
            "conferenceName": "Top 25",
            "conferenceSeo": "top-25"
          }
        ],
        "description": "(5-2)",
        "names": {
          "char6": "TX A&M",
          "full": "Texas A&M University, College Station",
          "seo": "texas-am",
          "short": "Texas A&M"
        },
        "rank": "22",
        "score": "26",
        "seed": "",
        "winner": true
      },
      "bracketId": "",
      "bracketRegion": "",
      "bracketRound": "",
      "contestClock": "0:00",
      "currentPeriod": "FINAL",
      "finalMessage": "FINAL",
      "gameID": "16f79b33-1fb5-463e-95a7-4e8745eee47d",
      "gameState": "final",
      "home": {
        "conferences": [{
          "conferenceName": "SEC",
          "conferenceSeo": "sec"
        }],
        "description": "(3-3)",
        "names": {
          "char6": "S CAR",
          "full": "University of South Carolina, Columbia",
          "seo": "south-carolina",
          "short": "South Carolina"
        },
        "rank": "",
        "score": "23",
        "seed": "",
        "winner": false
      },
      "liveVideoEnabled": false,
      "network": "",
      "startDate": "10-13-2018",
      "startTime": "03:30PM ET",
      "startTimeEpoch": "1539459000",
      "title": "South Carolina Texas A&M",
      "url": "/game/football/fbs/2018/10/13/texas-am-south-carolina",
      "videoState": ""
    }},
    {"game": {
      "away": {
        "conferences": [{
          "conferenceName": "FBS Independent",
          "conferenceSeo": "fbs-independent"
        }],
        "description": "(4-2)",
        "names": {
          "char6": "ARMY",
          "full": "U.S. Military Academy",
          "seo": "army",
          "short": "Army West Point"
        },
        "rank": "",
        "score": "52",
        "seed": "",
        "winner": true
      },
      "bracketId": "",
      "bracketRegion": "",
      "bracketRound": "",
      "contestClock": "0:00",
      "currentPeriod": "FINAL",
      "finalMessage": "FINAL",
      "gameID": "c3bba356-b06b-41e4-94c7-4b4179e49a9d",
      "gameState": "final",
      "home": {
        "conferences": [{
          "conferenceName": "MWC",
          "conferenceSeo": "mwc"
        }],
        "description": "(0-6)",
        "names": {
          "char6": "SJSU",
          "full": "San Jose State University",
          "seo": "san-jose-st",
          "short": "San Jose State"
        },
        "rank": "",
        "score": "3",
        "seed": "",
        "winner": false
      },
      "liveVideoEnabled": false,
      "network": "",
      "startDate": "10-13-2018",
      "startTime": "03:30PM ET",
      "startTimeEpoch": "1539459000",
      "title": "San Jose St. Army West Point",
      "url": "/game/football/fbs/2018/10/13/army-san-jose-st",
      "videoState": ""
    }},
    {"game": {
      "away": {
        "conferences": [{
          "conferenceName": "MWC",
          "conferenceSeo": "mwc"
        }],
        "description": "(2-4)",
        "names": {
          "char6": "UNLV",
          "full": "University of Nevada, Las Vegas",
          "seo": "unlv",
          "short": "UNLV"
        },
        "rank": "",
        "score": "28",
        "seed": "",
        "winner": false
      },
      "bracketId": "",
      "bracketRegion": "",
      "bracketRound": "",
      "contestClock": "0:00",
      "currentPeriod": "FINAL",
      "finalMessage": "FINAL",
      "gameID": "24800f76-29f5-45e0-bbf9-709f7086964d",
      "gameState": "final",
      "home": {
        "conferences": [{
          "conferenceName": "MWC",
          "conferenceSeo": "mwc"
        }],
        "description": "(5-1)",
        "names": {
          "char6": "UT ST",
          "full": "Utah State University",
          "seo": "utah-st",
          "short": "Utah State"
        },
        "rank": "",
        "score": "59",
        "seed": "",
        "winner": true
      },
      "liveVideoEnabled": false,
      "network": "",
      "startDate": "10-13-2018",
      "startTime": "04:00PM ET",
      "startTimeEpoch": "1539460800",
      "title": "Utah St. UNLV",
      "url": "/game/football/fbs/2018/10/13/unlv-utah-st",
      "videoState": ""
    }},
    {"game": {
      "away": {
        "conferences": [{
          "conferenceName": "MWC",
          "conferenceSeo": "mwc"
        }],
        "description": "(3-3)",
        "names": {
          "char6": "N MEX",
          "full": "University of New Mexico",
          "seo": "new-mexico",
          "short": "New Mexico"
        },
        "rank": "",
        "score": "18",
        "seed": "",
        "winner": false
      },
      "bracketId": "",
      "bracketRegion": "",
      "bracketRound": "",
      "contestClock": "0:00",
      "currentPeriod": "FINAL",
      "finalMessage": "FINAL",
      "gameID": "2b758f9a-89e2-494e-8621-2b71c263aa80",
      "gameState": "final",
      "home": {
        "conferences": [{
          "conferenceName": "MWC",
          "conferenceSeo": "mwc"
        }],
        "description": "(3-4)",
        "names": {
          "char6": "CO ST",
          "full": "Colorado State University",
          "seo": "colorado-st",
          "short": "Colorado State"
        },
        "rank": "",
        "score": "20",
        "seed": "",
        "winner": true
      },
      "liveVideoEnabled": false,
      "network": "",
      "startDate": "10-13-2018",
      "startTime": "04:00PM ET",
      "startTimeEpoch": "1539460800",
      "title": "Colorado St. New Mexico",
      "url": "/game/football/fbs/2018/10/13/new-mexico-colorado-st",
      "videoState": ""
    }},
    {"game": {
      "away": {
        "conferences": [{
          "conferenceName": "SWAC",
          "conferenceSeo": "swac"
        }],
        "description": "(2-4)",
        "names": {
          "char6": "ALA ST",
          "full": "Alabama State University",
          "seo": "alabama-st",
          "short": "Alabama State"
        },
        "rank": "",
        "score": "7",
        "seed": "",
        "winner": false
      },
      "bracketId": "",
      "bracketRegion": "",
      "bracketRound": "",
      "contestClock": "0:00",
      "currentPeriod": "FINAL",
      "finalMessage": "FINAL",
      "gameID": "6577f448-49e8-499c-a934-cade39d391c7",
      "gameState": "final",
      "home": {
        "conferences": [{
          "conferenceName": "Sun Belt",
          "conferenceSeo": "sun-belt"
        }],
        "description": "(2-5)",
        "names": {
          "char6": "S ALA",
          "full": "University of South Alabama",
          "seo": "south-ala",
          "short": "South Alabama"
        },
        "rank": "",
        "score": "45",
        "seed": "",
        "winner": true
      },
      "liveVideoEnabled": false,
      "network": "",
      "startDate": "10-13-2018",
      "startTime": "05:00PM ET",
      "startTimeEpoch": "1539464400",
      "title": "South Alabama Alabama St.",
      "url": "/game/football/fbs/2018/10/13/alabama-st-south-ala",
      "videoState": ""
    }},
    {"game": {
      "away": {
        "conferences": [{
          "conferenceName": "FBS Independent",
          "conferenceSeo": "fbs-independent"
        }],
        "description": "(2-5)",
        "names": {
          "char6": "NM ST",
          "full": "New Mexico State University",
          "seo": "new-mexico-st",
          "short": "New Mexico St."
        },
        "rank": "",
        "score": "38",
        "seed": "",
        "winner": false
      },
      "bracketId": "",
      "bracketRegion": "",
      "bracketRound": "",
      "contestClock": "0:00",
      "currentPeriod": "FINAL",
      "finalMessage": "FINAL",
      "gameID": "4286c62a-b33b-4cda-ac54-46c1b5604922",
      "gameState": "final",
      "home": {
        "conferences": [{
          "conferenceName": "Sun Belt",
          "conferenceSeo": "sun-belt"
        }],
        "description": "(3-3)",
        "names": {
          "char6": "ULL",
          "full": "University of Louisiana at Lafayette",
          "seo": "la-lafayette",
          "short": "Louisiana"
        },
        "rank": "",
        "score": "66",
        "seed": "",
        "winner": true
      },
      "liveVideoEnabled": false,
      "network": "",
      "startDate": "10-13-2018",
      "startTime": "05:00PM ET",
      "startTimeEpoch": "1539464400",
      "title": "Louisiana New Mexico St.",
      "url": "/game/football/fbs/2018/10/13/new-mexico-st-la-lafayette",
      "videoState": ""
    }},
    {"game": {
      "away": {
        "conferences": [{
          "conferenceName": "Sun Belt",
          "conferenceSeo": "sun-belt"
        }],
        "description": "(3-4)",
        "names": {
          "char6": "LA MON",
          "full": "University of Louisiana at Monroe",
          "seo": "la-monroe",
          "short": "La.-Monroe"
        },
        "rank": "",
        "score": "45",
        "seed": "",
        "winner": true
      },
      "bracketId": "",
      "bracketRegion": "",
      "bracketRound": "",
      "contestClock": "0:00",
      "currentPeriod": "FINAL",
      "finalMessage": "FINAL",
      "gameID": "473d883f-1d5a-4278-a431-852c5a5851e7",
      "gameState": "final",
      "home": {
        "conferences": [{
          "conferenceName": "Sun Belt",
          "conferenceSeo": "sun-belt"
        }],
        "description": "(3-3)",
        "names": {
          "char6": "CO CAR",
          "full": "Coastal Carolina University",
          "seo": "coastal-caro",
          "short": "Coastal Caro."
        },
        "rank": "",
        "score": "20",
        "seed": "",
        "winner": false
      },
      "liveVideoEnabled": false,
      "network": "",
      "startDate": "10-13-2018",
      "startTime": "06:00PM ET",
      "startTimeEpoch": "1539468000",
      "title": "Coastal Caro. La.-Monroe",
      "url": "/game/football/fbs/2018/10/13/la-monroe-coastal-caro",
      "videoState": ""
    }},
    {"game": {
      "away": {
        "conferences": [{
          "conferenceName": "Pac-12",
          "conferenceSeo": "pac-12"
        }],
        "description": "(1-5)",
        "names": {
          "char6": "UCLA",
          "full": "University of California, Los Angeles",
          "seo": "ucla",
          "short": "UCLA"
        },
        "rank": "",
        "score": "37",
        "seed": "",
        "winner": true
      },
      "bracketId": "",
      "bracketRegion": "",
      "bracketRound": "",
      "contestClock": "0:00",
      "currentPeriod": "FINAL",
      "finalMessage": "FINAL",
      "gameID": "ef4ce013-eccb-4287-92d9-61d0086bffc1",
      "gameState": "final",
      "home": {
        "conferences": [{
          "conferenceName": "Pac-12",
          "conferenceSeo": "pac-12"
        }],
        "description": "(3-3)",
        "names": {
          "char6": "CAL",
          "full": "University of California, Berkeley",
          "seo": "california",
          "short": "California"
        },
        "rank": "",
        "score": "7",
        "seed": "",
        "winner": false
      },
      "liveVideoEnabled": false,
      "network": "",
      "startDate": "10-13-2018",
      "startTime": "07:00PM ET",
      "startTimeEpoch": "1539471600",
      "title": "California UCLA",
      "url": "/game/football/fbs/2018/10/13/ucla-california",
      "videoState": ""
    }},
    {"game": {
      "away": {
        "conferences": [
          {
            "conferenceName": "Big 12",
            "conferenceSeo": "big-12"
          },
          {
            "conferenceName": "Top 25",
            "conferenceSeo": "top-25"
          }
        ],
        "description": "(5-1)",
        "names": {
          "char6": "WVU",
          "full": "West Virginia University",
          "seo": "west-virginia",
          "short": "West Virginia"
        },
        "rank": "6",
        "score": "14",
        "seed": "",
        "winner": false
      },
      "bracketId": "",
      "bracketRegion": "",
      "bracketRound": "",
      "contestClock": "0:00",
      "currentPeriod": "FINAL",
      "finalMessage": "FINAL",
      "gameID": "085b92b5-2cab-4749-ade8-c8b0001921ef",
      "gameState": "final",
      "home": {
        "conferences": [{
          "conferenceName": "Big 12",
          "conferenceSeo": "big-12"
        }],
        "description": "(3-3)",
        "names": {
          "char6": "IOWAST",
          "full": "Iowa State University",
          "seo": "iowa-st",
          "short": "Iowa State"
        },
        "rank": "",
        "score": "30",
        "seed": "",
        "winner": true
      },
      "liveVideoEnabled": false,
      "network": "",
      "startDate": "10-13-2018",
      "startTime": "07:00PM ET",
      "startTimeEpoch": "1539471600",
      "title": "Iowa St. West Virginia",
      "url": "/game/football/fbs/2018/10/13/west-virginia-iowa-st",
      "videoState": ""
    }},
    {"game": {
      "away": {
        "conferences": [{
          "conferenceName": "AAC",
          "conferenceSeo": "aac"
        }],
        "description": "(5-1)",
        "names": {
          "char6": "HOU",
          "full": "University of Houston",
          "seo": "houston",
          "short": "Houston"
        },
        "rank": "",
        "score": "42",
        "seed": "",
        "winner": true
      },
      "bracketId": "",
      "bracketRegion": "",
      "bracketRound": "",
      "contestClock": "0:00",
      "currentPeriod": "FINAL",
      "finalMessage": "FINAL",
      "gameID": "3fcf433a-62d5-4ddd-beac-5169e3974c17",
      "gameState": "final",
      "home": {
        "conferences": [{
          "conferenceName": "AAC",
          "conferenceSeo": "aac"
        }],
        "description": "(2-4)",
        "names": {
          "char6": "E CAR",
          "full": "East Carolina University",
          "seo": "east-carolina",
          "short": "East Carolina"
        },
        "rank": "",
        "score": "20",
        "seed": "",
        "winner": false
      },
      "liveVideoEnabled": false,
      "network": "",
      "startDate": "10-13-2018",
      "startTime": "07:00PM ET",
      "startTimeEpoch": "1539471600",
      "title": "East Carolina Houston",
      "url": "/game/football/fbs/2018/10/13/houston-east-carolina",
      "videoState": ""
    }},
    {"game": {
      "away": {
        "conferences": [{
          "conferenceName": "C-USA",
          "conferenceSeo": "c-usa"
        }],
        "description": "(4-2)",
        "names": {
          "char6": "LATECH",
          "full": "Louisiana Tech University",
          "seo": "louisiana-tech",
          "short": "Louisiana Tech"
        },
        "rank": "",
        "score": "31",
        "seed": "",
        "winner": true
      },
      "bracketId": "",
      "bracketRegion": "",
      "bracketRound": "",
      "contestClock": "0:00",
      "currentPeriod": "FINAL",
      "finalMessage": "FINAL",
      "gameID": "962f6257-5029-4a50-8630-272ffad3e52e",
      "gameState": "final",
      "home": {
        "conferences": [{
          "conferenceName": "C-USA",
          "conferenceSeo": "c-usa"
        }],
        "description": "(3-4)",
        "names": {
          "char6": "UTSA",
          "full": "University of Texas at San Antonio",
          "seo": "utsa",
          "short": "UTSA"
        },
        "rank": "",
        "score": "3",
        "seed": "",
        "winner": false
      },
      "liveVideoEnabled": false,
      "network": "",
      "startDate": "10-13-2018",
      "startTime": "07:00PM ET",
      "startTimeEpoch": "1539471600",
      "title": "UTSA Louisiana Tech",
      "url": "/game/football/fbs/2018/10/13/louisiana-tech-utsa",
      "videoState": ""
    }},
    {"game": {
      "away": {
        "conferences": [{
          "conferenceName": "ACC",
          "conferenceSeo": "acc"
        }],
        "description": "(4-2)",
        "names": {
          "char6": "VT",
          "full": "Virginia Polytechnic Institute and State University",
          "seo": "virginia-tech",
          "short": "Virginia Tech"
        },
        "rank": "",
        "score": "22",
        "seed": "",
        "winner": true
      },
      "bracketId": "",
      "bracketRegion": "",
      "bracketRound": "",
      "contestClock": "0:00",
      "currentPeriod": "FINAL",
      "finalMessage": "FINAL",
      "gameID": "ee57b190-6995-41c9-9490-489a43e907a0",
      "gameState": "final",
      "home": {
        "conferences": [{
          "conferenceName": "ACC",
          "conferenceSeo": "acc"
        }],
        "description": "(1-4)",
        "names": {
          "char6": "UNC",
          "full": "University of North Carolina, Chapel Hill",
          "seo": "north-carolina",
          "short": "North Carolina"
        },
        "rank": "",
        "score": "19",
        "seed": "",
        "winner": false
      },
      "liveVideoEnabled": false,
      "network": "",
      "startDate": "10-13-2018",
      "startTime": "07:00PM ET",
      "startTimeEpoch": "1539471600",
      "title": "North Carolina Virginia Tech",
      "url": "/game/football/fbs/2018/10/13/virginia-tech-north-carolina",
      "videoState": ""
    }},
    {"game": {
      "away": {
        "conferences": [
          {
            "conferenceName": "ACC",
            "conferenceSeo": "acc"
          },
          {
            "conferenceName": "Top 25",
            "conferenceSeo": "top-25"
          }
        ],
        "description": "(5-2)",
        "names": {
          "char6": "MIAMI",
          "full": "University of Miami (Florida)",
          "seo": "miami-fl",
          "short": "Miami (Fla.)"
        },
        "rank": "16",
        "score": "13",
        "seed": "",
        "winner": false
      },
      "bracketId": "",
      "bracketRegion": "",
      "bracketRound": "",
      "contestClock": "0:00",
      "currentPeriod": "FINAL",
      "finalMessage": "FINAL",
      "gameID": "2be9400f-2a38-42ed-90ce-62972130fad4",
      "gameState": "final",
      "home": {
        "conferences": [{
          "conferenceName": "ACC",
          "conferenceSeo": "acc"
        }],
        "description": "(4-2)",
        "names": {
          "char6": "UVA",
          "full": "University of Virginia",
          "seo": "virginia",
          "short": "Virginia"
        },
        "rank": "",
        "score": "16",
        "seed": "",
        "winner": true
      },
      "liveVideoEnabled": false,
      "network": "",
      "startDate": "10-13-2018",
      "startTime": "07:00PM ET",
      "startTimeEpoch": "1539471600",
      "title": "Virginia Miami (FL)",
      "url": "/game/football/fbs/2018/10/13/miami-fl-virginia",
      "videoState": ""
    }},
    {"game": {
      "away": {
        "conferences": [{
          "conferenceName": "SEC",
          "conferenceSeo": "sec"
        }],
        "description": "(3-3)",
        "names": {
          "char6": "MIZZOU",
          "full": "University of Missouri, Columbia",
          "seo": "missouri",
          "short": "Missouri"
        },
        "rank": "",
        "score": "10",
        "seed": "",
        "winner": false
      },
      "bracketId": "",
      "bracketRegion": "",
      "bracketRound": "",
      "contestClock": "0:00",
      "currentPeriod": "FINAL",
      "finalMessage": "FINAL",
      "gameID": "187d3a8c-de37-4ab2-bf32-72ba0042ac4f",
      "gameState": "final",
      "home": {
        "conferences": [
          {
            "conferenceName": "SEC",
            "conferenceSeo": "sec"
          },
          {
            "conferenceName": "Top 25",
            "conferenceSeo": "top-25"
          }
        ],
        "description": "(7-0)",
        "names": {
          "char6": "ALA",
          "full": "University of Alabama",
          "seo": "alabama",
          "short": "Alabama"
        },
        "rank": "1",
        "score": "39",
        "seed": "",
        "winner": true
      },
      "liveVideoEnabled": false,
      "network": "",
      "startDate": "10-13-2018",
      "startTime": "07:00PM ET",
      "startTimeEpoch": "1539471600",
      "title": "Alabama Missouri",
      "url": "/game/football/fbs/2018/10/13/missouri-alabama",
      "videoState": ""
    }},
    {"game": {
      "away": {
        "conferences": [{
          "conferenceName": "SEC",
          "conferenceSeo": "sec"
        }],
        "description": "(5-2)",
        "names": {
          "char6": "MISS",
          "full": "University of Mississippi",
          "seo": "ole-miss",
          "short": "Ole Miss"
        },
        "rank": "",
        "score": "37",
        "seed": "",
        "winner": true
      },
      "bracketId": "",
      "bracketRegion": "",
      "bracketRound": "",
      "contestClock": "0:00",
      "currentPeriod": "FINAL",
      "finalMessage": "FINAL",
      "gameID": "0dd943ec-9918-4161-b126-151dca1b7f0d",
      "gameState": "final",
      "home": {
        "conferences": [{
          "conferenceName": "SEC",
          "conferenceSeo": "sec"
        }],
        "description": "(1-6)",
        "names": {
          "char6": "ARK",
          "full": "University of Arkansas, Fayetteville",
          "seo": "arkansas",
          "short": "Arkansas"
        },
        "rank": "",
        "score": "33",
        "seed": "",
        "winner": false
      },
      "liveVideoEnabled": false,
      "network": "",
      "startDate": "10-13-2018",
      "startTime": "07:30PM ET",
      "startTimeEpoch": "1539473400",
      "title": "Arkansas Ole Miss",
      "url": "/game/football/fbs/2018/10/13/ole-miss-arkansas",
      "videoState": ""
    }},
    {"game": {
      "away": {
        "conferences": [
          {
            "conferenceName": "Big Ten",
            "conferenceSeo": "big-ten"
          },
          {
            "conferenceName": "Top 25",
            "conferenceSeo": "top-25"
          }
        ],
        "description": "(4-2)",
        "names": {
          "char6": "WISC",
          "full": "University of Wisconsin-Madison",
          "seo": "wisconsin",
          "short": "Wisconsin"
        },
        "rank": "15",
        "score": "13",
        "seed": "",
        "winner": false
      },
      "bracketId": "",
      "bracketRegion": "",
      "bracketRound": "",
      "contestClock": "0:00",
      "currentPeriod": "FINAL",
      "finalMessage": "FINAL",
      "gameID": "4e9ff859-d04c-48ca-86d7-f55098cd0b67",
      "gameState": "final",
      "home": {
        "conferences": [
          {
            "conferenceName": "Big Ten",
            "conferenceSeo": "big-ten"
          },
          {
            "conferenceName": "Top 25",
            "conferenceSeo": "top-25"
          }
        ],
        "description": "(6-1)",
        "names": {
          "char6": "MICH",
          "full": "University of Michigan",
          "seo": "michigan",
          "short": "Michigan"
        },
        "rank": "12",
        "score": "38",
        "seed": "",
        "winner": true
      },
      "liveVideoEnabled": false,
      "network": "",
      "startDate": "10-13-2018",
      "startTime": "07:30PM ET",
      "startTimeEpoch": "1539473400",
      "title": "Michigan Wisconsin",
      "url": "/game/football/fbs/2018/10/13/wisconsin-michigan",
      "videoState": ""
    }},
    {"game": {
      "away": {
        "conferences": [{
          "conferenceName": "C-USA",
          "conferenceSeo": "c-usa"
        }],
        "description": "(3-3)",
        "names": {
          "char6": "MIDTEN",
          "full": "Middle Tennessee State University",
          "seo": "middle-tenn",
          "short": "Middle Tenn."
        },
        "rank": "",
        "score": "21",
        "seed": "",
        "winner": false
      },
      "bracketId": "",
      "bracketRegion": "",
      "bracketRound": "",
      "contestClock": "0:00",
      "currentPeriod": "FINAL",
      "finalMessage": "FINAL",
      "gameID": "ef420552-611f-4b5e-a5bd-1b00608e1a26",
      "gameState": "final",
      "home": {
        "conferences": [{
          "conferenceName": "C-USA",
          "conferenceSeo": "c-usa"
        }],
        "description": "(4-2)",
        "names": {
          "char6": "FIU",
          "full": "Florida International University",
          "seo": "fiu",
          "short": "FIU"
        },
        "rank": "",
        "score": "24",
        "seed": "",
        "winner": true
      },
      "liveVideoEnabled": false,
      "network": "",
      "startDate": "10-13-2018",
      "startTime": "07:30PM ET",
      "startTimeEpoch": "1539473400",
      "title": "FIU Middle Tenn.",
      "url": "/game/football/fbs/2018/10/13/middle-tenn-fiu",
      "videoState": ""
    }},
    {"game": {
      "away": {
        "conferences": [{
          "conferenceName": "MWC",
          "conferenceSeo": "mwc"
        }],
        "description": "(6-2)",
        "names": {
          "char6": "HAWAII",
          "full": "University of Hawaii, Manoa",
          "seo": "hawaii",
          "short": "Hawaii"
        },
        "rank": "",
        "score": "23",
        "seed": "",
        "winner": false
      },
      "bracketId": "",
      "bracketRegion": "",
      "bracketRound": "",
      "contestClock": "0:00",
      "currentPeriod": "FINAL",
      "finalMessage": "FINAL",
      "gameID": "6ab3fe86-501b-48e5-bf1f-392f0ef0ce84",
      "gameState": "final",
      "home": {
        "conferences": [{
          "conferenceName": "FBS Independent",
          "conferenceSeo": "fbs-independent"
        }],
        "description": "(4-3)",
        "names": {
          "char6": "BYU",
          "full": "Brigham Young University",
          "seo": "byu",
          "short": "BYU"
        },
        "rank": "",
        "score": "49",
        "seed": "",
        "winner": true
      },
      "liveVideoEnabled": false,
      "network": "",
      "startDate": "10-13-2018",
      "startTime": "10:15PM ET",
      "startTimeEpoch": "1539483300",
      "title": "BYU Hawaii",
      "url": "/game/football/fbs/2018/10/13/hawaii-byu",
      "videoState": ""
    }},
    {"game": {
      "away": {
        "conferences": [{
          "conferenceName": "MWC",
          "conferenceSeo": "mwc"
        }],
        "description": "(4-2)",
        "names": {
          "char6": "BOISE",
          "full": "Boise State University",
          "seo": "boise-st",
          "short": "Boise State"
        },
        "rank": "",
        "score": "31",
        "seed": "",
        "winner": true
      },
      "bracketId": "",
      "bracketRegion": "",
      "bracketRound": "",
      "contestClock": "0:00",
      "currentPeriod": "FINAL",
      "finalMessage": "FINAL",
      "gameID": "130abdf6-ca00-4b7e-92e7-2a0a152df41f",
      "gameState": "final",
      "home": {
        "conferences": [{
          "conferenceName": "MWC",
          "conferenceSeo": "mwc"
        }],
        "description": "(3-4)",
        "names": {
          "char6": "NEVADA",
          "full": "University of Nevada, Reno",
          "seo": "nevada",
          "short": "Nevada"
        },
        "rank": "",
        "score": "27",
        "seed": "",
        "winner": false
      },
      "liveVideoEnabled": false,
      "network": "",
      "startDate": "10-13-2018",
      "startTime": "10:30PM ET",
      "startTimeEpoch": "1539484200",
      "title": "Nevada Boise St.",
      "url": "/game/football/fbs/2018/10/13/boise-st-nevada",
      "videoState": ""
    }},
    {"game": {
      "away": {
        "conferences": [{
          "conferenceName": "MWC",
          "conferenceSeo": "mwc"
        }],
        "description": "(2-5)",
        "names": {
          "char6": "WYO",
          "full": "University of Wyoming",
          "seo": "wyoming",
          "short": "Wyoming"
        },
        "rank": "",
        "score": "3",
        "seed": "",
        "winner": false
      },
      "bracketId": "",
      "bracketRegion": "",
      "bracketRound": "",
      "contestClock": "0:00",
      "currentPeriod": "FINAL",
      "finalMessage": "FINAL",
      "gameID": "fe3040d9-b3c4-48af-8e47-5ba33c5013f9",
      "gameState": "final",
      "home": {
        "conferences": [{
          "conferenceName": "MWC",
          "conferenceSeo": "mwc"
        }],
        "description": "(5-1)",
        "names": {
          "char6": "FRESNO",
          "full": "California State University, Fresno",
          "seo": "fresno-st",
          "short": "Fresno State"
        },
        "rank": "",
        "score": "27",
        "seed": "",
        "winner": true
      },
      "liveVideoEnabled": false,
      "network": "",
      "startDate": "10-13-2018",
      "startTime": "10:30PM ET",
      "startTimeEpoch": "1539484200",
      "title": "Fresno St. Wyoming",
      "url": "/game/football/fbs/2018/10/13/wyoming-fresno-st",
      "videoState": ""
    }},
    {"game": {
      "away": {
        "conferences": [
          {
            "conferenceName": "Pac-12",
            "conferenceSeo": "pac-12"
          },
          {
            "conferenceName": "Top 25",
            "conferenceSeo": "top-25"
          }
        ],
        "description": "(5-1)",
        "names": {
          "char6": "COLO",
          "full": "University of Colorado, Boulder",
          "seo": "colorado",
          "short": "Colorado"
        },
        "rank": "19",
        "score": "20",
        "seed": "",
        "winner": false
      },
      "bracketId": "",
      "bracketRegion": "",
      "bracketRound": "",
      "contestClock": "0:00",
      "currentPeriod": "FINAL",
      "finalMessage": "FINAL",
      "gameID": "6d9d0c7e-d551-4709-a8d4-979044215ac0",
      "gameState": "final",
      "home": {
        "conferences": [{
          "conferenceName": "Pac-12",
          "conferenceSeo": "pac-12"
        }],
        "description": "(4-2)",
        "names": {
          "char6": "USC",
          "full": "University of Southern California",
          "seo": "southern-california",
          "short": "USC"
        },
        "rank": "",
        "score": "31",
        "seed": "",
        "winner": true
      },
      "liveVideoEnabled": false,
      "network": "",
      "startDate": "10-13-2018",
      "startTime": "10:30PM ET",
      "startTimeEpoch": "1539484200",
      "title": "Southern California Colorado",
      "url": "/game/football/fbs/2018/10/13/colorado-southern-california",
      "videoState": ""
    }}
  ],
  "inputMD5Sum": "b2a8136ce5c183786421fabb6bd839fc",
  "updated_at": "08-06-2019 13:12:07"
}