{
  "Army vs Navy": {
    "stadium": "LincolnFinancialField-Philadelphia-PA",
    "Army": {
      "points": 17,
      "1st downs": 16,
      "rushing 1st downs": 8,
      "passing 1st downs": 7,
      "penalty 1st downs": 1,
      "rushing yards": 137,
      "rushing attempts": 44,
      "passing yards": 208,
      "passing attempts": 18,
      "passing completions": 9,
      "passing interceptions": 2,
      "total yards": 345,
      "total plays": 62,
      "fumbles": 3,
      "fumbles lost": 1,
      "penalties": 2,
      "penalty yards": 28,
      "punts": 6,
      "punt yards": 258,
      "punt returns": 3,
      "punt return yards": 53,
      "kickoff returns": 2,
      "kickoff return yards": 36,
      "interception returns": 0,
      "interception return yards": 0,
      "3rd down conversions": 6,
      "3rd down attempts": 14,
      "4th down conversions": 0,
      "4th down attempts": 0
    },
    "Navy": {
      "points": 21,
      "1st downs": 11,
      "rushing 1st downs": 8,
      "passing 1st downs": 3,
      "penalty 1st downs": 0,
      "rushing yards": 199,
      "rushing attempts": 41,
      "passing yards": 113,
      "passing attempts": 14,
      "passing completions": 6,
      "passing interceptions": 0,
      "total yards": 312,
      "total plays": 55,
      "fumbles": 0,
      "fumbles lost": 0,
      "penalties": 3,
      "penalty yards": 25,
      "punts": 11,
      "punt yards": 469,
      "punt returns": 0,
      "punt return yards": 0,
      "kickoff returns": 1,
      "kickoff return yards": 42,
      "interception returns": 2,
      "interception return yards": 1,
      "3rd down conversions": 3,
      "3rd down attempts": 15,
      "4th down conversions": 1,
      "4th down attempts": 1
    }
  }
}