{
  "Navy vs Memphis": {
    "stadium": "LibertyBowlMemorialStadium-Memphis-TN",
    "Navy": {
      "points": 23,
      "1st downs": 20,
      "rushing 1st downs": 15,
      "passing 1st downs": 4,
      "penalty 1st downs": 1,
      "rushing yards": 291,
      "rushing attempts": 66,
      "passing yards": 82,
      "passing attempts": 13,
      "passing completions": 6,
      "passing interceptions": 1,
      "total yards": 373,
      "total plays": 79,
      "fumbles": 2,
      "fumbles lost": 1,
      "penalties": 6,
      "penalty yards": 55,
      "punts": 4,
      "punt yards": 181,
      "punt returns": 3,
      "punt return yards": 28,
      "kickoff returns": 1,
      "kickoff return yards": 15,
      "interception returns": 0,
      "interception return yards": 0,
      "3rd down conversions": 7,
      "3rd down attempts": 17,
      "4th down conversions": 3,
      "4th down attempts": 5
    },
    "Memphis": {
      "points": 35,
      "1st downs": 12,
      "rushing 1st downs": 4,
      "passing 1st downs": 7,
      "penalty 1st downs": 1,
      "rushing yards": 105,
      "rushing attempts": 25,
      "passing yards": 196,
      "passing attempts": 18,
      "passing completions": 14,
      "passing interceptions": 0,
      "total yards": 301,
      "total plays": 43,
      "fumbles": 2,
      "fumbles lost": 1,
      "penalties": 5,
      "penalty yards": 39,
      "punts": 4,
      "punt yards": 176,
      "punt returns": 2,
      "punt return yards": 5,
      "kickoff returns": 4,
      "kickoff return yards": 187,
      "interception returns": 1,
      "interception return yards": 0,
      "3rd down conversions": 4,
      "3rd down attempts": 10,
      "4th down conversions": 0,
      "4th down attempts": 0
    }
  },
  "Duke vs VirginiaTech": {
    "stadium": "LaneStadium-Blacksburg-VA",
    "Duke": {
      "points": 45,
      "1st downs": 24,
      "rushing 1st downs": 9,
      "passing 1st downs": 12,
      "penalty 1st downs": 3,
      "rushing yards": 234,
      "rushing attempts": 41,
      "passing yards": 188,
      "passing attempts": 28,
      "passing completions": 21,
      "passing interceptions": 0,
      "total yards": 422,
      "total plays": 69,
      "fumbles": 0,
      "fumbles lost": 0,
      "penalties": 8,
      "penalty yards": 62,
      "punts": 4,
      "punt yards": 169,
      "punt returns": 1,
      "punt return yards": 20,
      "kickoff returns": 0,
      "kickoff return yards": 0,
      "interception returns": 1,
      "interception return yards": 0,
      "3rd down conversions": 7,
      "3rd down attempts": 14,
      "4th down conversions": 2,
      "4th down attempts": 2
    },
    "VirginiaTech": {
      "points": 10,
      "1st downs": 14,
      "rushing 1st downs": 7,
      "passing 1st downs": 3,
      "penalty 1st downs": 4,
      "rushing yards": 139,
      "rushing attempts": 43,
      "passing yards": 120,
      "passing attempts": 20,
      "passing completions": 8,
      "passing interceptions": 1,
      "total yards": 259,
      "total plays": 63,
      "fumbles": 1,
      "fumbles lost": 1,
      "penalties": 5,
      "penalty yards": 52,
      "punts": 5,
      "punt yards": 206,
      "punt returns": 1,
      "punt return yards": 25,
      "kickoff returns": 6,
      "kickoff return yards": 97,
      "interception returns": 0,
      "interception return yards": 0,
      "3rd down conversions": 4,
      "3rd down attempts": 13,
      "4th down conversions": 0,
      "4th down attempts": 1
    }
  },
  "PennState vs Maryland": {
    "stadium": "CapitalOneFieldatMarylandStadium-CollegePark-MD",
    "PennState": {
      "points": 59,
      "1st downs": 30,
      "rushing 1st downs": 10,
      "passing 1st downs": 18,
      "penalty 1st downs": 2,
      "rushing yards": 198,
      "rushing attempts": 41,
      "passing yards": 421,
      "passing attempts": 40,
      "passing completions": 29,
      "passing interceptions": 1,
      "total yards": 619,
      "total plays": 81,
      "fumbles": 1,
      "fumbles lost": 0,
      "penalties": 7,
      "penalty yards": 81,
      "punts": 3,
      "punt yards": 123,
      "punt returns": 4,
      "punt return yards": 30,
      "kickoff returns": 0,
      "kickoff return yards": 0,
      "interception returns": 2,
      "interception return yards": 22,
      "3rd down conversions": 9,
      "3rd down attempts": 14,
      "4th down conversions": 0,
      "4th down attempts": 0
    },
    "Maryland": {
      "points": 0,
      "1st downs": 10,
      "rushing 1st downs": 4,
      "passing 1st downs": 3,
      "penalty 1st downs": 3,
      "rushing yards": 60,
      "rushing attempts": 34,
      "passing yards": 68,
      "passing attempts": 24,
      "passing completions": 11,
      "passing interceptions": 2,
      "total yards": 128,
      "total plays": 58,
      "fumbles": 2,
      "fumbles lost": 1,
      "penalties": 9,
      "penalty yards": 85,
      "punts": 9,
      "punt yards": 385,
      "punt returns": 0,
      "punt return yards": 0,
      "kickoff returns": 3,
      "kickoff return yards": 54,
      "interception returns": 1,
      "interception return yards": 0,
      "3rd down conversions": 4,
      "3rd down attempts": 15,
      "4th down conversions": 1,
      "4th down attempts": 2
    }
  },
  "SanJoseState vs AirForce": {
    "stadium": "FalconStadium-USAirForceAcademy-CO",
    "SanJoseState": {
      "points": 24,
      "1st downs": 26,
      "rushing 1st downs": 6,
      "passing 1st downs": 17,
      "penalty 1st downs": 3,
      "rushing yards": 98,
      "rushing attempts": 31,
      "passing yards": 280,
      "passing attempts": 42,
      "passing completions": 24,
      "passing interceptions": 0,
      "total yards": 378,
      "total plays": 73,
      "fumbles": 1,
      "fumbles lost": 0,
      "penalties": 4,
      "penalty yards": 20,
      "punts": 1,
      "punt yards": 24,
      "punt returns": 0,
      "punt return yards": 0,
      "kickoff returns": 0,
      "kickoff return yards": 0,
      "interception returns": 0,
      "interception return yards": 0,
      "3rd down conversions": 7,
      "3rd down attempts": 13,
      "4th down conversions": 0,
      "4th down attempts": 4
    },
    "AirForce": {
      "points": 41,
      "1st downs": 24,
      "rushing 1st downs": 19,
      "passing 1st downs": 5,
      "penalty 1st downs": 0,
      "rushing yards": 382,
      "rushing attempts": 69,
      "passing yards": 131,
      "passing attempts": 10,
      "passing completions": 5,
      "passing interceptions": 0,
      "total yards": 513,
      "total plays": 79,
      "fumbles": 2,
      "fumbles lost": 2,
      "penalties": 8,
      "penalty yards": 76,
      "punts": 1,
      "punt yards": 42,
      "punt returns": 0,
      "punt return yards": 0,
      "kickoff returns": 1,
      "kickoff return yards": 11,
      "interception returns": 0,
      "interception return yards": 0,
      "3rd down conversions": 10,
      "3rd down attempts": 13,
      "4th down conversions": 1,
      "4th down attempts": 2
    }
  },
  "ArizonaState vs California": {
    "stadium": "CaliforniaMemorialStadium-Berkeley-CA",
    "ArizonaState": {
      "points": 24,
      "1st downs": 19,
      "rushing 1st downs": 11,
      "passing 1st downs": 8,
      "penalty 1st downs": 0,
      "rushing yards": 191,
      "rushing attempts": 48,
      "passing yards": 174,
      "passing attempts": 24,
      "passing completions": 14,
      "passing interceptions": 0,
      "total yards": 365,
      "total plays": 72,
      "fumbles": 1,
      "fumbles lost": 1,
      "penalties": 5,
      "penalty yards": 65,
      "punts": 3,
      "punt yards": 103,
      "punt returns": 3,
      "punt return yards": 30,
      "kickoff returns": 2,
      "kickoff return yards": 59,
      "interception returns": 1,
      "interception return yards": 0,
      "3rd down conversions": 8,
      "3rd down attempts": 17,
      "4th down conversions": 1,
      "4th down attempts": 1
    },
    "California": {
      "points": 17,
      "1st downs": 13,
      "rushing 1st downs": 6,
      "passing 1st downs": 6,
      "penalty 1st downs": 1,
      "rushing yards": 105,
      "rushing attempts": 37,
      "passing yards": 140,
      "passing attempts": 26,
      "passing completions": 14,
      "passing interceptions": 1,
      "total yards": 245,
      "total plays": 63,
      "fumbles": 1,
      "fumbles lost": 0,
      "penalties": 2,
      "penalty yards": 15,
      "punts": 4,
      "punt yards": 163,
      "punt returns": 0,
      "punt return yards": 0,
      "kickoff returns": 4,
      "kickoff return yards": 69,
      "interception returns": 0,
      "interception return yards": 0,
      "3rd down conversions": 7,
      "3rd down attempts": 16,
      "4th down conversions": 0,
      "4th down attempts": 2
    }
  },
  "Northwestern vs Wisconsin": {
    "stadium": "CampRandallStadium-Madison-WI",
    "Northwestern": {
      "points": 15,
      "1st downs": 21,
      "rushing 1st downs": 6,
      "passing 1st downs": 11,
      "penalty 1st downs": 4,
      "rushing yards": 97,
      "rushing attempts": 41,
      "passing yards": 158,
      "passing attempts": 41,
      "passing completions": 18,
      "passing interceptions": 1,
      "total yards": 255,
      "total plays": 82,
      "fumbles": 2,
      "fumbles lost": 2,
      "penalties": 4,
      "penalty yards": 23,
      "punts": 10,
      "punt yards": 396,
      "punt returns": 5,
      "punt return yards": 35,
      "kickoff returns": 1,
      "kickoff return yards": 18,
      "interception returns": 1,
      "interception return yards": 0,
      "3rd down conversions": 5,
      "3rd down attempts": 20,
      "4th down conversions": 1,
      "4th down attempts": 2
    },
    "Wisconsin": {
      "points": 24,
      "1st downs": 13,
      "rushing 1st downs": 8,
      "passing 1st downs": 5,
      "penalty 1st downs": 0,
      "rushing yards": 130,
      "rushing attempts": 36,
      "passing yards": 113,
      "passing attempts": 24,
      "passing completions": 15,
      "passing interceptions": 1,
      "total yards": 243,
      "total plays": 60,
      "fumbles": 2,
      "fumbles lost": 1,
      "penalties": 7,
      "penalty yards": 79,
      "punts": 9,
      "punt yards": 359,
      "punt returns": 3,
      "punt return yards": 3,
      "kickoff returns": 3,
      "kickoff return yards": 69,
      "interception returns": 1,
      "interception return yards": 68,
      "3rd down conversions": 4,
      "3rd down attempts": 16,
      "4th down conversions": 1,
      "4th down attempts": 1
    }
  },
  "Rutgers vs Michigan": {
    "stadium": "MichiganStadium-AnnArbor-MI",
    "Rutgers": {
      "points": 0,
      "1st downs": 10,
      "rushing 1st downs": 3,
      "passing 1st downs": 5,
      "penalty 1st downs": 2,
      "rushing yards": 46,
      "rushing attempts": 29,
      "passing yards": 106,
      "passing attempts": 24,
      "passing completions": 17,
      "passing interceptions": 0,
      "total yards": 152,
      "total plays": 53,
      "fumbles": 1,
      "fumbles lost": 1,
      "penalties": 9,
      "penalty yards": 70,
      "punts": 7,
      "punt yards": 303,
      "punt returns": 1,
      "punt return yards": 0,
      "kickoff returns": 5,
      "kickoff return yards": 74,
      "interception returns": 1,
      "interception return yards": 0,
      "3rd down conversions": 5,
      "3rd down attempts": 14,
      "4th down conversions": 0,
      "4th down attempts": 2
    },
    "Michigan": {
      "points": 52,
      "1st downs": 28,
      "rushing 1st downs": 8,
      "passing 1st downs": 17,
      "penalty 1st downs": 3,
      "rushing yards": 141,
      "rushing attempts": 41,
      "passing yards": 335,
      "passing attempts": 27,
      "passing completions": 20,
      "passing interceptions": 1,
      "total yards": 476,
      "total plays": 68,
      "fumbles": 1,
      "fumbles lost": 0,
      "penalties": 6,
      "penalty yards": 35,
      "punts": 2,
      "punt yards": 95,
      "punt returns": 5,
      "punt return yards": 29,
      "kickoff returns": 1,
      "kickoff return yards": 13,
      "interception returns": 0,
      "interception return yards": 0,
      "3rd down conversions": 6,
      "3rd down attempts": 11,
      "4th down conversions": 1,
      "4th down attempts": 1
    }
  },
  "TexasAM vs Arkansas": {
    "stadium": "ATTStadium-Arlington-TX",
    "TexasAM": {
      "points": 31,
      "1st downs": 24,
      "rushing 1st downs": 8,
      "passing 1st downs": 14,
      "penalty 1st downs": 2,
      "rushing yards": 89,
      "rushing attempts": 33,
      "passing yards": 251,
      "passing attempts": 35,
      "passing completions": 23,
      "passing interceptions": 1,
      "total yards": 340,
      "total plays": 68,
      "fumbles": 3,
      "fumbles lost": 1,
      "penalties": 6,
      "penalty yards": 55,
      "punts": 4,
      "punt yards": 198,
      "punt returns": 1,
      "punt return yards": 9,
      "kickoff returns": 1,
      "kickoff return yards": 31,
      "interception returns": 1,
      "interception return yards": 18,
      "3rd down conversions": 5,
      "3rd down attempts": 10,
      "4th down conversions": 0,
      "4th down attempts": 0
    },
    "Arkansas": {
      "points": 27,
      "1st downs": 26,
      "rushing 1st downs": 5,
      "passing 1st downs": 18,
      "penalty 1st downs": 3,
      "rushing yards": 98,
      "rushing attempts": 26,
      "passing yards": 297,
      "passing attempts": 44,
      "passing completions": 27,
      "passing interceptions": 1,
      "total yards": 395,
      "total plays": 70,
      "fumbles": 0,
      "fumbles lost": 0,
      "penalties": 8,
      "penalty yards": 48,
      "punts": 3,
      "punt yards": 116,
      "punt returns": 2,
      "punt return yards": 35,
      "kickoff returns": 0,
      "kickoff return yards": 0,
      "interception returns": 1,
      "interception return yards": 12,
      "3rd down conversions": 5,
      "3rd down attempts": 13,
      "4th down conversions": 1,
      "4th down attempts": 2
    }
  },
  "Kansas vs TCU": {
    "stadium": "AmonGCarterStadium-FortWorth-TX",
    "Kansas": {
      "points": 14,
      "1st downs": 8,
      "rushing 1st downs": 3,
      "passing 1st downs": 3,
      "penalty 1st downs": 2,
      "rushing yards": 75,
      "rushing attempts": 18,
      "passing yards": 84,
      "passing attempts": 29,
      "passing completions": 12,
      "passing interceptions": 0,
      "total yards": 159,
      "total plays": 47,
      "fumbles": 1,
      "fumbles lost": 0,
      "penalties": 2,
      "penalty yards": 10,
      "punts": 9,
      "punt yards": 437,
      "punt returns": 0,
      "punt return yards": 0,
      "kickoff returns": 5,
      "kickoff return yards": 101,
      "interception returns": 0,
      "interception return yards": 0,
      "3rd down conversions": 1,
      "3rd down attempts": 11,
      "4th down conversions": 0,
      "4th down attempts": 0
    },
    "TCU": {
      "points": 51,
      "1st downs": 29,
      "rushing 1st downs": 15,
      "passing 1st downs": 14,
      "penalty 1st downs": 0,
      "rushing yards": 319,
      "rushing attempts": 61,
      "passing yards": 306,
      "passing attempts": 27,
      "passing completions": 19,
      "passing interceptions": 0,
      "total yards": 625,
      "total plays": 88,
      "fumbles": 1,
      "fumbles lost": 0,
      "penalties": 10,
      "penalty yards": 95,
      "punts": 4,
      "punt yards": 155,
      "punt returns": 4,
      "punt return yards": 139,
      "kickoff returns": 0,
      "kickoff return yards": 0,
      "interception returns": 0,
      "interception return yards": 0,
      "3rd down conversions": 14,
      "3rd down attempts": 19,
      "4th down conversions": 0,
      "4th down attempts": 0
    }
  },
  "CentralMichigan vs WesternMichigan": {
    "stadium": "WaldoStadium-Kalamazoo-MI",
    "CentralMichigan": {
      "points": 15,
      "1st downs": 31,
      "rushing 1st downs": 7,
      "passing 1st downs": 20,
      "penalty 1st downs": 4,
      "rushing yards": 31,
      "rushing attempts": 32,
      "passing yards": 330,
      "passing attempts": 48,
      "passing completions": 33,
      "passing interceptions": 2,
      "total yards": 361,
      "total plays": 80,
      "fumbles": 2,
      "fumbles lost": 1,
      "penalties": 15,
      "penalty yards": 95,
      "punts": 2,
      "punt yards": 71,
      "punt returns": 3,
      "punt return yards": 35,
      "kickoff returns": 2,
      "kickoff return yards": 44,
      "interception returns": 1,
      "interception return yards": 0,
      "3rd down conversions": 6,
      "3rd down attempts": 14,
      "4th down conversions": 1,
      "4th down attempts": 4
    },
    "WesternMichigan": {
      "points": 31,
      "1st downs": 22,
      "rushing 1st downs": 8,
      "passing 1st downs": 11,
      "penalty 1st downs": 3,
      "rushing yards": 188,
      "rushing attempts": 37,
      "passing yards": 244,
      "passing attempts": 29,
      "passing completions": 18,
      "passing interceptions": 1,
      "total yards": 432,
      "total plays": 66,
      "fumbles": 0,
      "fumbles lost": 0,
      "penalties": 15,
      "penalty yards": 167,
      "punts": 3,
      "punt yards": 135,
      "punt returns": 0,
      "punt return yards": 0,
      "kickoff returns": 1,
      "kickoff return yards": 22,
      "interception returns": 2,
      "interception return yards": 0,
      "3rd down conversions": 6,
      "3rd down attempts": 13,
      "4th down conversions": 1,
      "4th down attempts": 2
    }
  },
  "NorthernIllinois vs Vanderbilt": {
    "stadium": "VanderbiltStadium-Nashville-TN",
    "NorthernIllinois": {
      "points": 18,
      "1st downs": 20,
      "rushing 1st downs": 9,
      "passing 1st downs": 8,
      "penalty 1st downs": 3,
      "rushing yards": 108,
      "rushing attempts": 31,
      "passing yards": 280,
      "passing attempts": 32,
      "passing completions": 17,
      "passing interceptions": 0,
      "total yards": 388,
      "total plays": 63,
      "fumbles": 1,
      "fumbles lost": 0,
      "penalties": 9,
      "penalty yards": 74,
      "punts": 8,
      "punt yards": 305,
      "punt returns": 2,
      "punt return yards": -6,
      "kickoff returns": 1,
      "kickoff return yards": 22,
      "interception returns": 0,
      "interception return yards": 0,
      "3rd down conversions": 4,
      "3rd down attempts": 14,
      "4th down conversions": 0,
      "4th down attempts": 0
    },
    "Vanderbilt": {
      "points": 24,
      "1st downs": 16,
      "rushing 1st downs": 10,
      "passing 1st downs": 5,
      "penalty 1st downs": 1,
      "rushing yards": 184,
      "rushing attempts": 26,
      "passing yards": 189,
      "passing attempts": 28,
      "passing completions": 21,
      "passing interceptions": 0,
      "total yards": 373,
      "total plays": 54,
      "fumbles": 1,
      "fumbles lost": 0,
      "penalties": 9,
      "penalty yards": 97,
      "punts": 6,
      "punt yards": 280,
      "punt returns": 2,
      "punt return yards": 24,
      "kickoff returns": 2,
      "kickoff return yards": 20,
      "interception returns": 0,
      "interception return yards": 0,
      "3rd down conversions": 3,
      "3rd down attempts": 11,
      "4th down conversions": 0,
      "4th down attempts": 0
    }
  },
  "FCS vs Syracuse": {
    "stadium": "CarrierDome-Syracuse-NY",
    "FCS": {
      "points": 3,
      "1st downs": 10,
      "rushing 1st downs": 1,
      "passing 1st downs": 6,
      "penalty 1st downs": 3,
      "rushing yards": 18,
      "rushing attempts": 32,
      "passing yards": 120,
      "passing attempts": 35,
      "passing completions": 15,
      "passing interceptions": 0,
      "total yards": 138,
      "total plays": 67,
      "fumbles": 2,
      "fumbles lost": 1,
      "penalties": 5,
      "penalty yards": 23,
      "punts": 10,
      "punt yards": 436,
      "punt returns": 1,
      "punt return yards": 5,
      "kickoff returns": 1,
      "kickoff return yards": 29,
      "interception returns": 1,
      "interception return yards": 0,
      "3rd down conversions": 4,
      "3rd down attempts": 18,
      "4th down conversions": 0,
      "4th down attempts": 3
    },
    "Syracuse": {
      "points": 41,
      "1st downs": 19,
      "rushing 1st downs": 6,
      "passing 1st downs": 13,
      "penalty 1st downs": 0,
      "rushing yards": 143,
      "rushing attempts": 36,
      "passing yards": 286,
      "passing attempts": 36,
      "passing completions": 23,
      "passing interceptions": 1,
      "total yards": 429,
      "total plays": 72,
      "fumbles": 2,
      "fumbles lost": 2,
      "penalties": 7,
      "penalty yards": 74,
      "punts": 5,
      "punt yards": 215,
      "punt returns": 4,
      "punt return yards": 35,
      "kickoff returns": 2,
      "kickoff return yards": 52,
      "interception returns": 0,
      "interception return yards": 0,
      "3rd down conversions": 5,
      "3rd down attempts": 16,
      "4th down conversions": 1,
      "4th down attempts": 3
    }
  },
  "Buffalo vs MiamiOH": {
    "stadium": "FredCYagerStadium-Oxford-OH",
    "Buffalo": {
      "points": 20,
      "1st downs": 20,
      "rushing 1st downs": 14,
      "passing 1st downs": 6,
      "penalty 1st downs": 0,
      "rushing yards": 309,
      "rushing attempts": 49,
      "passing yards": 89,
      "passing attempts": 20,
      "passing completions": 7,
      "passing interceptions": 2,
      "total yards": 398,
      "total plays": 69,
      "fumbles": 3,
      "fumbles lost": 2,
      "penalties": 10,
      "penalty yards": 103,
      "punts": 5,
      "punt yards": 186,
      "punt returns": 2,
      "punt return yards": 20,
      "kickoff returns": 0,
      "kickoff return yards": 0,
      "interception returns": 0,
      "interception return yards": 0,
      "3rd down conversions": 5,
      "3rd down attempts": 14,
      "4th down conversions": 0,
      "4th down attempts": 2
    },
    "MiamiOH": {
      "points": 34,
      "1st downs": 16,
      "rushing 1st downs": 9,
      "passing 1st downs": 4,
      "penalty 1st downs": 3,
      "rushing yards": 145,
      "rushing attempts": 55,
      "passing yards": 120,
      "passing attempts": 18,
      "passing completions": 8,
      "passing interceptions": 0,
      "total yards": 265,
      "total plays": 73,
      "fumbles": 0,
      "fumbles lost": 0,
      "penalties": 2,
      "penalty yards": 20,
      "punts": 7,
      "punt yards": 335,
      "punt returns": 3,
      "punt return yards": 68,
      "kickoff returns": 4,
      "kickoff return yards": 75,
      "interception returns": 2,
      "interception return yards": 25,
      "3rd down conversions": 5,
      "3rd down attempts": 19,
      "4th down conversions": 1,
      "4th down attempts": 3
    }
  },
  "TexasTech vs Oklahoma": {
    "stadium": "GaylordFamilyOklahomaMemorialStadium-Norman-OK",
    "TexasTech": {
      "points": 16,
      "1st downs": 16,
      "rushing 1st downs": 6,
      "passing 1st downs": 5,
      "penalty 1st downs": 5,
      "rushing yards": 192,
      "rushing attempts": 37,
      "passing yards": 122,
      "passing attempts": 26,
      "passing completions": 12,
      "passing interceptions": 0,
      "total yards": 314,
      "total plays": 63,
      "fumbles": 1,
      "fumbles lost": 1,
      "penalties": 8,
      "penalty yards": 65,
      "punts": 6,
      "punt yards": 291,
      "punt returns": 1,
      "punt return yards": 27,
      "kickoff returns": 2,
      "kickoff return yards": 46,
      "interception returns": 1,
      "interception return yards": 40,
      "3rd down conversions": 1,
      "3rd down attempts": 14,
      "4th down conversions": 1,
      "4th down attempts": 3
    },
    "Oklahoma": {
      "points": 55,
      "1st downs": 24,
      "rushing 1st downs": 8,
      "passing 1st downs": 14,
      "penalty 1st downs": 2,
      "rushing yards": 201,
      "rushing attempts": 30,
      "passing yards": 441,
      "passing attempts": 33,
      "passing completions": 22,
      "passing interceptions": 1,
      "total yards": 642,
      "total plays": 63,
      "fumbles": 0,
      "fumbles lost": 0,
      "penalties": 9,
      "penalty yards": 112,
      "punts": 3,
      "punt yards": 170,
      "punt returns": 2,
      "punt return yards": 9,
      "kickoff returns": 1,
      "kickoff return yards": 29,
      "interception returns": 0,
      "interception return yards": 0,
      "3rd down conversions": 3,
      "3rd down attempts": 9,
      "4th down conversions": 1,
      "4th down attempts": 1
    }
  },
  "MiddleTennessee vs Iowa": {
    "stadium": "KinnickStadium-IowaCity-IA",
    "MiddleTennessee": {
      "points": 3,
      "1st downs": 12,
      "rushing 1st downs": 6,
      "passing 1st downs": 6,
      "penalty 1st downs": 0,
      "rushing yards": 80,
      "rushing attempts": 24,
      "passing yards": 136,
      "passing attempts": 27,
      "passing completions": 17,
      "passing interceptions": 0,
      "total yards": 216,
      "total plays": 51,
      "fumbles": 0,
      "fumbles lost": 0,
      "penalties": 8,
      "penalty yards": 72,
      "punts": 8,
      "punt yards": 335,
      "punt returns": 0,
      "punt return yards": 0,
      "kickoff returns": 0,
      "kickoff return yards": 0,
      "interception returns": 0,
      "interception return yards": 0,
      "3rd down conversions": 3,
      "3rd down attempts": 12,
      "4th down conversions": 0,
      "4th down attempts": 0
    },
    "Iowa": {
      "points": 48,
      "1st downs": 30,
      "rushing 1st downs": 17,
      "passing 1st downs": 13,
      "penalty 1st downs": 0,
      "rushing yards": 351,
      "rushing attempts": 51,
      "passing yards": 293,
      "passing attempts": 29,
      "passing completions": 20,
      "passing interceptions": 0,
      "total yards": 644,
      "total plays": 80,
      "fumbles": 0,
      "fumbles lost": 0,
      "penalties": 3,
      "penalty yards": 20,
      "punts": 1,
      "punt yards": 34,
      "punt returns": 0,
      "punt return yards": 0,
      "kickoff returns": 1,
      "kickoff return yards": 20,
      "interception returns": 0,
      "interception return yards": 0,
      "3rd down conversions": 10,
      "3rd down attempts": 16,
      "4th down conversions": 3,
      "4th down attempts": 3
    }
  },
  "BrighamYoung vs Toledo": {
    "stadium": "TheGlassBowl-Toledo-OH",
    "BrighamYoung": {
      "points": 21,
      "1st downs": 19,
      "rushing 1st downs": 3,
      "passing 1st downs": 15,
      "penalty 1st downs": 1,
      "rushing yards": 101,
      "rushing attempts": 26,
      "passing yards": 354,
      "passing attempts": 44,
      "passing completions": 25,
      "passing interceptions": 1,
      "total yards": 455,
      "total plays": 70,
      "fumbles": 0,
      "fumbles lost": 0,
      "penalties": 6,
      "penalty yards": 52,
      "punts": 5,
      "punt yards": 210,
      "punt returns": 2,
      "punt return yards": 70,
      "kickoff returns": 2,
      "kickoff return yards": 41,
      "interception returns": 1,
      "interception return yards": 9,
      "3rd down conversions": 5,
      "3rd down attempts": 15,
      "4th down conversions": 0,
      "4th down attempts": 2
    },
    "Toledo": {
      "points": 28,
      "1st downs": 27,
      "rushing 1st downs": 12,
      "passing 1st downs": 12,
      "penalty 1st downs": 3,
      "rushing yards": 242,
      "rushing attempts": 56,
      "passing yards": 206,
      "passing attempts": 28,
      "passing completions": 17,
      "passing interceptions": 1,
      "total yards": 448,
      "total plays": 84,
      "fumbles": 2,
      "fumbles lost": 2,
      "penalties": 3,
      "penalty yards": 33,
      "punts": 5,
      "punt yards": 236,
      "punt returns": 2,
      "punt return yards": 12,
      "kickoff returns": 2,
      "kickoff return yards": 43,
      "interception returns": 1,
      "interception return yards": 40,
      "3rd down conversions": 6,
      "3rd down attempts": 15,
      "4th down conversions": 2,
      "4th down attempts": 2
    }
  },
  "FCS vs Pittsburgh": {
    "stadium": "HeinzField-Pittsburgh-PA",
    "FCS": {
      "points": 14,
      "1st downs": 15,
      "rushing 1st downs": 4,
      "passing 1st downs": 6,
      "penalty 1st downs": 5,
      "rushing yards": 43,
      "rushing attempts": 31,
      "passing yards": 127,
      "passing attempts": 31,
      "passing completions": 14,
      "passing interceptions": 0,
      "total yards": 170,
      "total plays": 62,
      "fumbles": 0,
      "fumbles lost": 0,
      "penalties": 3,
      "penalty yards": 26,
      "punts": 8,
      "punt yards": 341,
      "punt returns": 2,
      "punt return yards": 17,
      "kickoff returns": 2,
      "kickoff return yards": 34,
      "interception returns": 1,
      "interception return yards": 4,
      "3rd down conversions": 3,
      "3rd down attempts": 15,
      "4th down conversions": 0,
      "4th down attempts": 0
    },
    "Pittsburgh": {
      "points": 17,
      "1st downs": 21,
      "rushing 1st downs": 10,
      "passing 1st downs": 10,
      "penalty 1st downs": 1,
      "rushing yards": 172,
      "rushing attempts": 39,
      "passing yards": 271,
      "passing attempts": 37,
      "passing completions": 23,
      "passing interceptions": 1,
      "total yards": 443,
      "total plays": 76,
      "fumbles": 1,
      "fumbles lost": 1,
      "penalties": 13,
      "penalty yards": 115,
      "punts": 5,
      "punt yards": 209,
      "punt returns": 2,
      "punt return yards": 7,
      "kickoff returns": 1,
      "kickoff return yards": 20,
      "interception returns": 0,
      "interception return yards": 0,
      "3rd down conversions": 7,
      "3rd down attempts": 18,
      "4th down conversions": 1,
      "4th down attempts": 2
    }
  },
  "CoastalCarolina vs AppalachianState": {
    "stadium": "KiddBrewerStadium-Boone-NC",
    "CoastalCarolina": {
      "points": 37,
      "1st downs": 21,
      "rushing 1st downs": 7,
      "passing 1st downs": 13,
      "penalty 1st downs": 1,
      "rushing yards": 153,
      "rushing attempts": 35,
      "passing yards": 240,
      "passing attempts": 31,
      "passing completions": 20,
      "passing interceptions": 1,
      "total yards": 393,
      "total plays": 66,
      "fumbles": 2,
      "fumbles lost": 0,
      "penalties": 10,
      "penalty yards": 75,
      "punts": 4,
      "punt yards": 142,
      "punt returns": 0,
      "punt return yards": 0,
      "kickoff returns": 1,
      "kickoff return yards": -4,
      "interception returns": 1,
      "interception return yards": 35,
      "3rd down conversions": 5,
      "3rd down attempts": 13,
      "4th down conversions": 1,
      "4th down attempts": 1
    },
    "AppalachianState": {
      "points": 56,
      "1st downs": 21,
      "rushing 1st downs": 9,
      "passing 1st downs": 10,
      "penalty 1st downs": 2,
      "rushing yards": 184,
      "rushing attempts": 40,
      "passing yards": 246,
      "passing attempts": 24,
      "passing completions": 19,
      "passing interceptions": 1,
      "total yards": 430,
      "total plays": 64,
      "fumbles": 0,
      "fumbles lost": 0,
      "penalties": 7,
      "penalty yards": 74,
      "punts": 3,
      "punt yards": 115,
      "punt returns": 2,
      "punt return yards": 37,
      "kickoff returns": 5,
      "kickoff return yards": 149,
      "interception returns": 1,
      "interception return yards": 24,
      "3rd down conversions": 7,
      "3rd down attempts": 12,
      "4th down conversions": 2,
      "4th down attempts": 2
    }
  },
  "USC vs Washington": {
    "stadium": "AlaskaAirlinesFieldatHuskyStadium-Seattle-WA",
    "USC": {
      "points": 14,
      "1st downs": 18,
      "rushing 1st downs": 8,
      "passing 1st downs": 9,
      "penalty 1st downs": 1,
      "rushing yards": 212,
      "rushing attempts": 33,
      "passing yards": 163,
      "passing attempts": 32,
      "passing completions": 19,
      "passing interceptions": 3,
      "total yards": 375,
      "total plays": 65,
      "fumbles": 0,
      "fumbles lost": 0,
      "penalties": 8,
      "penalty yards": 80,
      "punts": 6,
      "punt yards": 246,
      "punt returns": 2,
      "punt return yards": 6,
      "kickoff returns": 4,
      "kickoff return yards": 78,
      "interception returns": 0,
      "interception return yards": 0,
      "3rd down conversions": 4,
      "3rd down attempts": 13,
      "4th down conversions": 1,
      "4th down attempts": 2
    },
    "Washington": {
      "points": 28,
      "1st downs": 16,
      "rushing 1st downs": 8,
      "passing 1st downs": 7,
      "penalty 1st downs": 1,
      "rushing yards": 193,
      "rushing attempts": 35,
      "passing yards": 180,
      "passing attempts": 26,
      "passing completions": 16,
      "passing interceptions": 0,
      "total yards": 373,
      "total plays": 61,
      "fumbles": 2,
      "fumbles lost": 1,
      "penalties": 7,
      "penalty yards": 44,
      "punts": 6,
      "punt yards": 266,
      "punt returns": 3,
      "punt return yards": 26,
      "kickoff returns": 2,
      "kickoff return yards": 49,
      "interception returns": 3,
      "interception return yards": 18,
      "3rd down conversions": 3,
      "3rd down attempts": 12,
      "4th down conversions": 1,
      "4th down attempts": 1
    }
  },
  "Clemson vs NorthCarolina": {
    "stadium": "KenanMemorialStadium-ChapelHill-NC",
    "Clemson": {
      "points": 21,
      "1st downs": 14,
      "rushing 1st downs": 3,
      "passing 1st downs": 11,
      "penalty 1st downs": 0,
      "rushing yards": 125,
      "rushing attempts": 31,
      "passing yards": 206,
      "passing attempts": 30,
      "passing completions": 18,
      "passing interceptions": 0,
      "total yards": 331,
      "total plays": 61,
      "fumbles": 1,
      "fumbles lost": 1,
      "penalties": 6,
      "penalty yards": 30,
      "punts": 5,
      "punt yards": 229,
      "punt returns": 0,
      "punt return yards": 0,
      "kickoff returns": 2,
      "kickoff return yards": 67,
      "interception returns": 0,
      "interception return yards": 0,
      "3rd down conversions": 8,
      "3rd down attempts": 15,
      "4th down conversions": 0,
      "4th down attempts": 1
    },
    "NorthCarolina": {
      "points": 20,
      "1st downs": 14,
      "rushing 1st downs": 6,
      "passing 1st downs": 8,
      "penalty 1st downs": 0,
      "rushing yards": 146,
      "rushing attempts": 36,
      "passing yards": 144,
      "passing attempts": 27,
      "passing completions": 15,
      "passing interceptions": 0,
      "total yards": 290,
      "total plays": 63,
      "fumbles": 0,
      "fumbles lost": 0,
      "penalties": 3,
      "penalty yards": 20,
      "punts": 7,
      "punt yards": 315,
      "punt returns": 0,
      "punt return yards": 0,
      "kickoff returns": 1,
      "kickoff return yards": 25,
      "interception returns": 0,
      "interception return yards": 0,
      "3rd down conversions": 7,
      "3rd down attempts": 17,
      "4th down conversions": 2,
      "4th down attempts": 3
    }
  },
  "WakeForest vs BostonCollege": {
    "stadium": "AlumniStadium-ChestnutHill-MA",
    "WakeForest": {
      "points": 27,
      "1st downs": 22,
      "rushing 1st downs": 10,
      "passing 1st downs": 12,
      "penalty 1st downs": 0,
      "rushing yards": 197,
      "rushing attempts": 54,
      "passing yards": 243,
      "passing attempts": 33,
      "passing completions": 21,
      "passing interceptions": 1,
      "total yards": 440,
      "total plays": 87,
      "fumbles": 0,
      "fumbles lost": 0,
      "penalties": 3,
      "penalty yards": 15,
      "punts": 5,
      "punt yards": 231,
      "punt returns": 2,
      "punt return yards": 17,
      "kickoff returns": 0,
      "kickoff return yards": 0,
      "interception returns": 2,
      "interception return yards": 3,
      "3rd down conversions": 17,
      "3rd down attempts": 24,
      "4th down conversions": 0,
      "4th down attempts": 0
    },
    "BostonCollege": {
      "points": 24,
      "1st downs": 25,
      "rushing 1st downs": 13,
      "passing 1st downs": 12,
      "penalty 1st downs": 0,
      "rushing yards": 252,
      "rushing attempts": 44,
      "passing yards": 281,
      "passing attempts": 31,
      "passing completions": 22,
      "passing interceptions": 2,
      "total yards": 533,
      "total plays": 75,
      "fumbles": 1,
      "fumbles lost": 1,
      "penalties": 6,
      "penalty yards": 40,
      "punts": 4,
      "punt yards": 154,
      "punt returns": 2,
      "punt return yards": 29,
      "kickoff returns": 3,
      "kickoff return yards": 78,
      "interception returns": 1,
      "interception return yards": 0,
      "3rd down conversions": 2,
      "3rd down attempts": 12,
      "4th down conversions": 3,
      "4th down attempts": 5
    }
  },
  "OleMiss vs Alabama": {
    "stadium": "BryantDennyStadium-Tuscaloosa-AL",
    "OleMiss": {
      "points": 31,
      "1st downs": 25,
      "rushing 1st downs": 14,
      "passing 1st downs": 8,
      "penalty 1st downs": 3,
      "rushing yards": 279,
      "rushing attempts": 58,
      "passing yards": 197,
      "passing attempts": 30,
      "passing completions": 12,
      "passing interceptions": 1,
      "total yards": 476,
      "total plays": 88,
      "fumbles": 1,
      "fumbles lost": 0,
      "penalties": 9,
      "penalty yards": 97,
      "punts": 6,
      "punt yards": 237,
      "punt returns": 0,
      "punt return yards": 0,
      "kickoff returns": 1,
      "kickoff return yards": 15,
      "interception returns": 0,
      "interception return yards": 0,
      "3rd down conversions": 8,
      "3rd down attempts": 20,
      "4th down conversions": 2,
      "4th down attempts": 4
    },
    "Alabama": {
      "points": 59,
      "1st downs": 28,
      "rushing 1st downs": 11,
      "passing 1st downs": 15,
      "penalty 1st downs": 2,
      "rushing yards": 155,
      "rushing attempts": 30,
      "passing yards": 418,
      "passing attempts": 37,
      "passing completions": 26,
      "passing interceptions": 0,
      "total yards": 573,
      "total plays": 67,
      "fumbles": 1,
      "fumbles lost": 1,
      "penalties": 10,
      "penalty yards": 76,
      "punts": 2,
      "punt yards": 60,
      "punt returns": 4,
      "punt return yards": 72,
      "kickoff returns": 3,
      "kickoff return yards": 57,
      "interception returns": 1,
      "interception return yards": 36,
      "3rd down conversions": 6,
      "3rd down attempts": 12,
      "4th down conversions": 1,
      "4th down attempts": 2
    }
  },
  "Virginia vs NotreDame": {
    "stadium": "NotreDameStadium-SouthBend-IN",
    "Virginia": {
      "points": 20,
      "1st downs": 19,
      "rushing 1st downs": 5,
      "passing 1st downs": 13,
      "penalty 1st downs": 1,
      "rushing yards": 4,
      "rushing attempts": 29,
      "passing yards": 334,
      "passing attempts": 43,
      "passing completions": 30,
      "passing interceptions": 2,
      "total yards": 338,
      "total plays": 72,
      "fumbles": 4,
      "fumbles lost": 3,
      "penalties": 6,
      "penalty yards": 52,
      "punts": 4,
      "punt yards": 162,
      "punt returns": 2,
      "punt return yards": 17,
      "kickoff returns": 2,
      "kickoff return yards": 39,
      "interception returns": 0,
      "interception return yards": 0,
      "3rd down conversions": 4,
      "3rd down attempts": 14,
      "4th down conversions": 1,
      "4th down attempts": 2
    },
    "NotreDame": {
      "points": 35,
      "1st downs": 19,
      "rushing 1st downs": 9,
      "passing 1st downs": 7,
      "penalty 1st downs": 3,
      "rushing yards": 178,
      "rushing attempts": 35,
      "passing yards": 165,
      "passing attempts": 25,
      "passing completions": 17,
      "passing interceptions": 0,
      "total yards": 343,
      "total plays": 60,
      "fumbles": 1,
      "fumbles lost": 1,
      "penalties": 9,
      "penalty yards": 71,
      "punts": 6,
      "punt yards": 234,
      "punt returns": 1,
      "punt return yards": 1,
      "kickoff returns": 1,
      "kickoff return yards": 16,
      "interception returns": 2,
      "interception return yards": 0,
      "3rd down conversions": 6,
      "3rd down attempts": 15,
      "4th down conversions": 2,
      "4th down attempts": 2
    }
  },
  "IowaState vs Baylor": {
    "stadium": "McLaneStadium-Waco-TX",
    "IowaState": {
      "points": 21,
      "1st downs": 23,
      "rushing 1st downs": 2,
      "passing 1st downs": 18,
      "penalty 1st downs": 3,
      "rushing yards": 63,
      "rushing attempts": 28,
      "passing yards": 342,
      "passing attempts": 45,
      "passing completions": 27,
      "passing interceptions": 1,
      "total yards": 405,
      "total plays": 73,
      "fumbles": 1,
      "fumbles lost": 1,
      "penalties": 2,
      "penalty yards": 25,
      "punts": 5,
      "punt yards": 197,
      "punt returns": 1,
      "punt return yards": 9,
      "kickoff returns": 1,
      "kickoff return yards": 23,
      "interception returns": 0,
      "interception return yards": 0,
      "3rd down conversions": 7,
      "3rd down attempts": 15,
      "4th down conversions": 0,
      "4th down attempts": 1
    },
    "Baylor": {
      "points": 23,
      "1st downs": 24,
      "rushing 1st downs": 8,
      "passing 1st downs": 16,
      "penalty 1st downs": 0,
      "rushing yards": 104,
      "rushing attempts": 34,
      "passing yards": 307,
      "passing attempts": 45,
      "passing completions": 26,
      "passing interceptions": 0,
      "total yards": 411,
      "total plays": 79,
      "fumbles": 1,
      "fumbles lost": 0,
      "penalties": 7,
      "penalty yards": 75,
      "punts": 6,
      "punt yards": 261,
      "punt returns": 2,
      "punt return yards": 3,
      "kickoff returns": 1,
      "kickoff return yards": 25,
      "interception returns": 1,
      "interception return yards": 0,
      "3rd down conversions": 6,
      "3rd down attempts": 17,
      "4th down conversions": 2,
      "4th down attempts": 3
    }
  },
  "Minnesota vs Purdue": {
    "stadium": "RossAdeStadium-WestLafayette-IN",
    "Minnesota": {
      "points": 38,
      "1st downs": 21,
      "rushing 1st downs": 7,
      "passing 1st downs": 13,
      "penalty 1st downs": 1,
      "rushing yards": 92,
      "rushing attempts": 34,
      "passing yards": 396,
      "passing attempts": 22,
      "passing completions": 21,
      "passing interceptions": 0,
      "total yards": 488,
      "total plays": 56,
      "fumbles": 0,
      "fumbles lost": 0,
      "penalties": 5,
      "penalty yards": 37,
      "punts": 4,
      "punt yards": 165,
      "punt returns": 0,
      "punt return yards": 0,
      "kickoff returns": 0,
      "kickoff return yards": 0,
      "interception returns": 2,
      "interception return yards": 14,
      "3rd down conversions": 3,
      "3rd down attempts": 8,
      "4th down conversions": 0,
      "4th down attempts": 0
    },
    "Purdue": {
      "points": 31,
      "1st downs": 28,
      "rushing 1st downs": 8,
      "passing 1st downs": 18,
      "penalty 1st downs": 2,
      "rushing yards": 123,
      "rushing attempts": 33,
      "passing yards": 291,
      "passing attempts": 49,
      "passing completions": 27,
      "passing interceptions": 2,
      "total yards": 414,
      "total plays": 82,
      "fumbles": 0,
      "fumbles lost": 0,
      "penalties": 3,
      "penalty yards": 29,
      "punts": 5,
      "punt yards": 226,
      "punt returns": 0,
      "punt return yards": 0,
      "kickoff returns": 3,
      "kickoff return yards": 50,
      "interception returns": 0,
      "interception return yards": 0,
      "3rd down conversions": 7,
      "3rd down attempts": 16,
      "4th down conversions": 2,
      "4th down attempts": 2
    }
  },
  "Indiana vs MichiganState": {
    "stadium": "SpartanStadium-EastLansing-MI",
    "Indiana": {
      "points": 31,
      "1st downs": 26,
      "rushing 1st downs": 5,
      "passing 1st downs": 16,
      "penalty 1st downs": 5,
      "rushing yards": 70,
      "rushing attempts": 28,
      "passing yards": 286,
      "passing attempts": 42,
      "passing completions": 33,
      "passing interceptions": 0,
      "total yards": 356,
      "total plays": 70,
      "fumbles": 1,
      "fumbles lost": 1,
      "penalties": 9,
      "penalty yards": 85,
      "punts": 5,
      "punt yards": 229,
      "punt returns": 2,
      "punt return yards": 12,
      "kickoff returns": 6,
      "kickoff return yards": 113,
      "interception returns": 0,
      "interception return yards": 0,
      "3rd down conversions": 6,
      "3rd down attempts": 13,
      "4th down conversions": 0,
      "4th down attempts": 1
    },
    "MichiganState": {
      "points": 40,
      "1st downs": 23,
      "rushing 1st downs": 9,
      "passing 1st downs": 12,
      "penalty 1st downs": 2,
      "rushing yards": 142,
      "rushing attempts": 34,
      "passing yards": 300,
      "passing attempts": 36,
      "passing completions": 18,
      "passing interceptions": 0,
      "total yards": 442,
      "total plays": 70,
      "fumbles": 0,
      "fumbles lost": 0,
      "penalties": 6,
      "penalty yards": 61,
      "punts": 4,
      "punt yards": 217,
      "punt returns": 1,
      "punt return yards": 22,
      "kickoff returns": 2,
      "kickoff return yards": 42,
      "interception returns": 0,
      "interception return yards": 0,
      "3rd down conversions": 5,
      "3rd down attempts": 13,
      "4th down conversions": 1,
      "4th down attempts": 2
    }
  },
  "FloridaAtlantic vs Charlotte": {
    "stadium": "JerryRichardsonStadium-Charlotte-NC",
    "FloridaAtlantic": {
      "points": 45,
      "1st downs": 22,
      "rushing 1st downs": 9,
      "passing 1st downs": 12,
      "penalty 1st downs": 1,
      "rushing yards": 236,
      "rushing attempts": 51,
      "passing yards": 321,
      "passing attempts": 28,
      "passing completions": 21,
      "passing interceptions": 1,
      "total yards": 557,
      "total plays": 79,
      "fumbles": 0,
      "fumbles lost": 0,
      "penalties": 9,
      "penalty yards": 80,
      "punts": 5,
      "punt yards": 194,
      "punt returns": 1,
      "punt return yards": 1,
      "kickoff returns": 1,
      "kickoff return yards": 2,
      "interception returns": 3,
      "interception return yards": -2,
      "3rd down conversions": 8,
      "3rd down attempts": 16,
      "4th down conversions": 0,
      "4th down attempts": 0
    },
    "Charlotte": {
      "points": 27,
      "1st downs": 17,
      "rushing 1st downs": 3,
      "passing 1st downs": 12,
      "penalty 1st downs": 2,
      "rushing yards": 52,
      "rushing attempts": 27,
      "passing yards": 284,
      "passing attempts": 38,
      "passing completions": 19,
      "passing interceptions": 3,
      "total yards": 336,
      "total plays": 65,
      "fumbles": 1,
      "fumbles lost": 0,
      "penalties": 6,
      "penalty yards": 45,
      "punts": 8,
      "punt yards": 332,
      "punt returns": 1,
      "punt return yards": 7,
      "kickoff returns": 5,
      "kickoff return yards": 69,
      "interception returns": 1,
      "interception return yards": 0,
      "3rd down conversions": 4,
      "3rd down attempts": 14,
      "4th down conversions": 1,
      "4th down attempts": 1
    }
  },
  "GeorgiaTech vs Temple": {
    "stadium": "LincolnFinancialField-Philadelphia-PA",
    "GeorgiaTech": {
      "points": 2,
      "1st downs": 18,
      "rushing 1st downs": 5,
      "passing 1st downs": 11,
      "penalty 1st downs": 2,
      "rushing yards": 131,
      "rushing attempts": 35,
      "passing yards": 174,
      "passing attempts": 35,
      "passing completions": 14,
      "passing interceptions": 1,
      "total yards": 305,
      "total plays": 70,
      "fumbles": 2,
      "fumbles lost": 2,
      "penalties": 4,
      "penalty yards": 38,
      "punts": 6,
      "punt yards": 260,
      "punt returns": 0,
      "punt return yards": 0,
      "kickoff returns": 3,
      "kickoff return yards": 50,
      "interception returns": 1,
      "interception return yards": 0,
      "3rd down conversions": 2,
      "3rd down attempts": 14,
      "4th down conversions": 2,
      "4th down attempts": 4
    },
    "Temple": {
      "points": 24,
      "1st downs": 17,
      "rushing 1st downs": 9,
      "passing 1st downs": 6,
      "penalty 1st downs": 2,
      "rushing yards": 195,
      "rushing attempts": 49,
      "passing yards": 127,
      "passing attempts": 22,
      "passing completions": 9,
      "passing interceptions": 1,
      "total yards": 322,
      "total plays": 71,
      "fumbles": 0,
      "fumbles lost": 0,
      "penalties": 10,
      "penalty yards": 70,
      "punts": 4,
      "punt yards": 148,
      "punt returns": 2,
      "punt return yards": 16,
      "kickoff returns": 0,
      "kickoff return yards": 0,
      "interception returns": 1,
      "interception return yards": 65,
      "3rd down conversions": 7,
      "3rd down attempts": 16,
      "4th down conversions": 2,
      "4th down attempts": 3
    }
  },
  "Akron vs Massachusetts": {
    "stadium": "WarrenMcGuirkAlumniStadium-Amherst-MA",
    "Akron": {
      "points": 29,
      "1st downs": 22,
      "rushing 1st downs": 8,
      "passing 1st downs": 13,
      "penalty 1st downs": 1,
      "rushing yards": 71,
      "rushing attempts": 27,
      "passing yards": 335,
      "passing attempts": 42,
      "passing completions": 28,
      "passing interceptions": 2,
      "total yards": 406,
      "total plays": 69,
      "fumbles": 1,
      "fumbles lost": 1,
      "penalties": 5,
      "penalty yards": 41,
      "punts": 4,
      "punt yards": 144,
      "punt returns": 0,
      "punt return yards": 0,
      "kickoff returns": 4,
      "kickoff return yards": 63,
      "interception returns": 1,
      "interception return yards": 1,
      "3rd down conversions": 8,
      "3rd down attempts": 14,
      "4th down conversions": 1,
      "4th down attempts": 2
    },
    "Massachusetts": {
      "points": 37,
      "1st downs": 24,
      "rushing 1st downs": 11,
      "passing 1st downs": 10,
      "penalty 1st downs": 3,
      "rushing yards": 220,
      "rushing attempts": 42,
      "passing yards": 213,
      "passing attempts": 33,
      "passing completions": 19,
      "passing interceptions": 1,
      "total yards": 433,
      "total plays": 75,
      "fumbles": 0,
      "fumbles lost": 0,
      "penalties": 9,
      "penalty yards": 62,
      "punts": 4,
      "punt yards": 162,
      "punt returns": 2,
      "punt return yards": 10,
      "kickoff returns": 2,
      "kickoff return yards": 26,
      "interception returns": 2,
      "interception return yards": 103,
      "3rd down conversions": 10,
      "3rd down attempts": 17,
      "4th down conversions": 1,
      "4th down attempts": 1
    }
  },
  "FCS vs Florida": {
    "stadium": "BenHillGriffinStadium-Gainesville-FL",
    "FCS": {
      "points": 0,
      "1st downs": 17,
      "rushing 1st downs": 8,
      "passing 1st downs": 8,
      "penalty 1st downs": 1,
      "rushing yards": 65,
      "rushing attempts": 29,
      "passing yards": 183,
      "passing attempts": 32,
      "passing completions": 18,
      "passing interceptions": 2,
      "total yards": 248,
      "total plays": 61,
      "fumbles": 2,
      "fumbles lost": 1,
      "penalties": 7,
      "penalty yards": 40,
      "punts": 3,
      "punt yards": 135,
      "punt returns": 0,
      "punt return yards": 0,
      "kickoff returns": 3,
      "kickoff return yards": 38,
      "interception returns": 0,
      "interception return yards": 0,
      "3rd down conversions": 8,
      "3rd down attempts": 15,
      "4th down conversions": 0,
      "4th down attempts": 0
    },
    "Florida": {
      "points": 38,
      "1st downs": 23,
      "rushing 1st downs": 7,
      "passing 1st downs": 14,
      "penalty 1st downs": 2,
      "rushing yards": 160,
      "rushing attempts": 32,
      "passing yards": 262,
      "passing attempts": 28,
      "passing completions": 24,
      "passing interceptions": 0,
      "total yards": 422,
      "total plays": 60,
      "fumbles": 1,
      "fumbles lost": 0,
      "penalties": 4,
      "penalty yards": 28,
      "punts": 1,
      "punt yards": 36,
      "punt returns": 0,
      "punt return yards": 0,
      "kickoff returns": 1,
      "kickoff return yards": 11,
      "interception returns": 2,
      "interception return yards": 18,
      "3rd down conversions": 6,
      "3rd down attempts": 9,
      "4th down conversions": 0,
      "4th down attempts": 1
    }
  },
  "SouthernMethodist vs SouthFlorida": {
    "stadium": "RaymondJamesStadium-Tampa-FL",
    "SouthernMethodist": {
      "points": 48,
      "1st downs": 31,
      "rushing 1st downs": 14,
      "passing 1st downs": 10,
      "penalty 1st downs": 7,
      "rushing yards": 245,
      "rushing attempts": 48,
      "passing yards": 252,
      "passing attempts": 29,
      "passing completions": 24,
      "passing interceptions": 2,
      "total yards": 497,
      "total plays": 77,
      "fumbles": 0,
      "fumbles lost": 0,
      "penalties": 12,
      "penalty yards": 123,
      "punts": 5,
      "punt yards": 177,
      "punt returns": 6,
      "punt return yards": 51,
      "kickoff returns": 2,
      "kickoff return yards": 25,
      "interception returns": 2,
      "interception return yards": 0,
      "3rd down conversions": 9,
      "3rd down attempts": 17,
      "4th down conversions": 1,
      "4th down attempts": 1
    },
    "SouthFlorida": {
      "points": 21,
      "1st downs": 22,
      "rushing 1st downs": 5,
      "passing 1st downs": 13,
      "penalty 1st downs": 4,
      "rushing yards": 54,
      "rushing attempts": 33,
      "passing yards": 288,
      "passing attempts": 40,
      "passing completions": 21,
      "passing interceptions": 2,
      "total yards": 342,
      "total plays": 73,
      "fumbles": 1,
      "fumbles lost": 0,
      "penalties": 12,
      "penalty yards": 134,
      "punts": 8,
      "punt yards": 312,
      "punt returns": 1,
      "punt return yards": 5,
      "kickoff returns": 6,
      "kickoff return yards": 105,
      "interception returns": 2,
      "interception return yards": 43,
      "3rd down conversions": 4,
      "3rd down attempts": 16,
      "4th down conversions": 2,
      "4th down attempts": 3
    }
  },
  "Cincinnati vs Marshall": {
    "stadium": "JoanCEdwardsStadium-Huntington-WV",
    "Cincinnati": {
      "points": 52,
      "1st downs": 29,
      "rushing 1st downs": 14,
      "passing 1st downs": 12,
      "penalty 1st downs": 3,
      "rushing yards": 230,
      "rushing attempts": 51,
      "passing yards": 295,
      "passing attempts": 26,
      "passing completions": 21,
      "passing interceptions": 0,
      "total yards": 525,
      "total plays": 77,
      "fumbles": 2,
      "fumbles lost": 1,
      "penalties": 9,
      "penalty yards": 75,
      "punts": 3,
      "punt yards": 151,
      "punt returns": 2,
      "punt return yards": 14,
      "kickoff returns": 1,
      "kickoff return yards": 32,
      "interception returns": 0,
      "interception return yards": 0,
      "3rd down conversions": 7,
      "3rd down attempts": 14,
      "4th down conversions": 2,
      "4th down attempts": 2
    },
    "Marshall": {
      "points": 14,
      "1st downs": 14,
      "rushing 1st downs": 6,
      "passing 1st downs": 5,
      "penalty 1st downs": 3,
      "rushing yards": 125,
      "rushing attempts": 29,
      "passing yards": 131,
      "passing attempts": 30,
      "passing completions": 11,
      "passing interceptions": 0,
      "total yards": 256,
      "total plays": 59,
      "fumbles": 0,
      "fumbles lost": 0,
      "penalties": 7,
      "penalty yards": 65,
      "punts": 8,
      "punt yards": 329,
      "punt returns": 1,
      "punt return yards": 5,
      "kickoff returns": 6,
      "kickoff return yards": 104,
      "interception returns": 0,
      "interception return yards": 0,
      "3rd down conversions": 4,
      "3rd down attempts": 15,
      "4th down conversions": 1,
      "4th down attempts": 2
    }
  },
  "ArkansasState vs Troy": {
    "stadium": "VeteransMemorialStadium-Troy-AL",
    "ArkansasState": {
      "points": 50,
      "1st downs": 24,
      "rushing 1st downs": 6,
      "passing 1st downs": 15,
      "penalty 1st downs": 3,
      "rushing yards": 103,
      "rushing attempts": 34,
      "passing yards": 455,
      "passing attempts": 36,
      "passing completions": 26,
      "passing interceptions": 2,
      "total yards": 558,
      "total plays": 70,
      "fumbles": 2,
      "fumbles lost": 2,
      "penalties": 13,
      "penalty yards": 138,
      "punts": 5,
      "punt yards": 247,
      "punt returns": 0,
      "punt return yards": 0,
      "kickoff returns": 5,
      "kickoff return yards": 64,
      "interception returns": 1,
      "interception return yards": 0,
      "3rd down conversions": 4,
      "3rd down attempts": 14,
      "4th down conversions": 2,
      "4th down attempts": 2
    },
    "Troy": {
      "points": 43,
      "1st downs": 28,
      "rushing 1st downs": 7,
      "passing 1st downs": 15,
      "penalty 1st downs": 6,
      "rushing yards": 143,
      "rushing attempts": 34,
      "passing yards": 367,
      "passing attempts": 58,
      "passing completions": 34,
      "passing interceptions": 1,
      "total yards": 510,
      "total plays": 92,
      "fumbles": 1,
      "fumbles lost": 1,
      "penalties": 5,
      "penalty yards": 77,
      "punts": 4,
      "punt yards": 166,
      "punt returns": 0,
      "punt return yards": 0,
      "kickoff returns": 7,
      "kickoff return yards": 130,
      "interception returns": 2,
      "interception return yards": 14,
      "3rd down conversions": 8,
      "3rd down attempts": 19,
      "4th down conversions": 2,
      "4th down attempts": 2
    }
  },
  "NewMexico vs Liberty": {
    "stadium": "WilliamsStadium-Lynchburg-VA",
    "NewMexico": {
      "points": 10,
      "1st downs": 18,
      "rushing 1st downs": 8,
      "passing 1st downs": 9,
      "penalty 1st downs": 1,
      "rushing yards": 223,
      "rushing attempts": 43,
      "passing yards": 139,
      "passing attempts": 26,
      "passing completions": 12,
      "passing interceptions": 2,
      "total yards": 362,
      "total plays": 69,
      "fumbles": 0,
      "fumbles lost": 0,
      "penalties": 6,
      "penalty yards": 40,
      "punts": 5,
      "punt yards": 239,
      "punt returns": 1,
      "punt return yards": 2,
      "kickoff returns": 0,
      "kickoff return yards": 0,
      "interception returns": 0,
      "interception return yards": 0,
      "3rd down conversions": 9,
      "3rd down attempts": 17,
      "4th down conversions": 0,
      "4th down attempts": 1
    },
    "Liberty": {
      "points": 17,
      "1st downs": 19,
      "rushing 1st downs": 7,
      "passing 1st downs": 11,
      "penalty 1st downs": 1,
      "rushing yards": 160,
      "rushing attempts": 31,
      "passing yards": 306,
      "passing attempts": 36,
      "passing completions": 24,
      "passing interceptions": 0,
      "total yards": 466,
      "total plays": 67,
      "fumbles": 1,
      "fumbles lost": 1,
      "penalties": 3,
      "penalty yards": 30,
      "punts": 4,
      "punt yards": 173,
      "punt returns": 2,
      "punt return yards": 14,
      "kickoff returns": 1,
      "kickoff return yards": 45,
      "interception returns": 2,
      "interception return yards": 23,
      "3rd down conversions": 4,
      "3rd down attempts": 12,
      "4th down conversions": 0,
      "4th down attempts": 1
    }
  },
  "LouisianaLafayette vs GeorgiaSouthern": {
    "stadium": "AllenEPaulsonStadium-Statesboro-GA",
    "LouisianaLafayette": {
      "points": 37,
      "1st downs": 23,
      "rushing 1st downs": 15,
      "passing 1st downs": 7,
      "penalty 1st downs": 1,
      "rushing yards": 275,
      "rushing attempts": 42,
      "passing yards": 165,
      "passing attempts": 18,
      "passing completions": 11,
      "passing interceptions": 0,
      "total yards": 440,
      "total plays": 60,
      "fumbles": 2,
      "fumbles lost": 2,
      "penalties": 3,
      "penalty yards": 32,
      "punts": 1,
      "punt yards": 34,
      "punt returns": 3,
      "punt return yards": 11,
      "kickoff returns": 0,
      "kickoff return yards": 0,
      "interception returns": 0,
      "interception return yards": 0,
      "3rd down conversions": 4,
      "3rd down attempts": 7,
      "4th down conversions": 2,
      "4th down attempts": 2
    },
    "GeorgiaSouthern": {
      "points": 24,
      "1st downs": 18,
      "rushing 1st downs": 13,
      "passing 1st downs": 3,
      "penalty 1st downs": 2,
      "rushing yards": 215,
      "rushing attempts": 56,
      "passing yards": 37,
      "passing attempts": 12,
      "passing completions": 6,
      "passing interceptions": 0,
      "total yards": 252,
      "total plays": 68,
      "fumbles": 1,
      "fumbles lost": 0,
      "penalties": 3,
      "penalty yards": 35,
      "punts": 3,
      "punt yards": 146,
      "punt returns": 0,
      "punt return yards": 0,
      "kickoff returns": 2,
      "kickoff return yards": 29,
      "interception returns": 0,
      "interception return yards": 0,
      "3rd down conversions": 5,
      "3rd down attempts": 13,
      "4th down conversions": 0,
      "4th down attempts": 1
    }
  },
  "EastCarolina vs OldDominion": {
    "stadium": "ForemanFieldatSBBallardStadium-Norfolk-VA",
    "EastCarolina": {
      "points": 24,
      "1st downs": 12,
      "rushing 1st downs": 5,
      "passing 1st downs": 5,
      "penalty 1st downs": 2,
      "rushing yards": 107,
      "rushing attempts": 36,
      "passing yards": 202,
      "passing attempts": 21,
      "passing completions": 8,
      "passing interceptions": 2,
      "total yards": 309,
      "total plays": 57,
      "fumbles": 3,
      "fumbles lost": 1,
      "penalties": 6,
      "penalty yards": 46,
      "punts": 6,
      "punt yards": 262,
      "punt returns": 3,
      "punt return yards": 22,
      "kickoff returns": 2,
      "kickoff return yards": 16,
      "interception returns": 2,
      "interception return yards": 10,
      "3rd down conversions": 4,
      "3rd down attempts": 16,
      "4th down conversions": 0,
      "4th down attempts": 1
    },
    "OldDominion": {
      "points": 21,
      "1st downs": 16,
      "rushing 1st downs": 4,
      "passing 1st downs": 11,
      "penalty 1st downs": 1,
      "rushing yards": 90,
      "rushing attempts": 42,
      "passing yards": 203,
      "passing attempts": 30,
      "passing completions": 20,
      "passing interceptions": 2,
      "total yards": 293,
      "total plays": 72,
      "fumbles": 3,
      "fumbles lost": 1,
      "penalties": 7,
      "penalty yards": 75,
      "punts": 6,
      "punt yards": 252,
      "punt returns": 1,
      "punt return yards": 20,
      "kickoff returns": 1,
      "kickoff return yards": 20,
      "interception returns": 2,
      "interception return yards": 37,
      "3rd down conversions": 8,
      "3rd down attempts": 19,
      "4th down conversions": 0,
      "4th down attempts": 0
    }
  },
  "MississippiState vs Auburn": {
    "stadium": "JordanHareStadium-Auburn-AL",
    "MississippiState": {
      "points": 23,
      "1st downs": 21,
      "rushing 1st downs": 8,
      "passing 1st downs": 10,
      "penalty 1st downs": 3,
      "rushing yards": 118,
      "rushing attempts": 38,
      "passing yards": 216,
      "passing attempts": 26,
      "passing completions": 13,
      "passing interceptions": 0,
      "total yards": 334,
      "total plays": 64,
      "fumbles": 3,
      "fumbles lost": 2,
      "penalties": 9,
      "penalty yards": 70,
      "punts": 6,
      "punt yards": 250,
      "punt returns": 0,
      "punt return yards": 0,
      "kickoff returns": 1,
      "kickoff return yards": 16,
      "interception returns": 0,
      "interception return yards": 0,
      "3rd down conversions": 3,
      "3rd down attempts": 12,
      "4th down conversions": 1,
      "4th down attempts": 2
    },
    "Auburn": {
      "points": 56,
      "1st downs": 25,
      "rushing 1st downs": 9,
      "passing 1st downs": 13,
      "penalty 1st downs": 3,
      "rushing yards": 217,
      "rushing attempts": 45,
      "passing yards": 361,
      "passing attempts": 24,
      "passing completions": 18,
      "passing interceptions": 0,
      "total yards": 578,
      "total plays": 69,
      "fumbles": 4,
      "fumbles lost": 3,
      "penalties": 5,
      "penalty yards": 37,
      "punts": 1,
      "punt yards": 43,
      "punt returns": 3,
      "punt return yards": 34,
      "kickoff returns": 1,
      "kickoff return yards": 21,
      "interception returns": 0,
      "interception return yards": 0,
      "3rd down conversions": 6,
      "3rd down attempts": 10,
      "4th down conversions": 0,
      "4th down attempts": 1
    }
  },
  "SouthAlabama vs LouisianaMonroe": {
    "stadium": "JPSFieldatMaloneStadium-Monroe-LA",
    "SouthAlabama": {
      "points": 17,
      "1st downs": 24,
      "rushing 1st downs": 14,
      "passing 1st downs": 7,
      "penalty 1st downs": 3,
      "rushing yards": 263,
      "rushing attempts": 52,
      "passing yards": 114,
      "passing attempts": 26,
      "passing completions": 14,
      "passing interceptions": 1,
      "total yards": 377,
      "total plays": 78,
      "fumbles": 0,
      "fumbles lost": 0,
      "penalties": 6,
      "penalty yards": 46,
      "punts": 6,
      "punt yards": 235,
      "punt returns": 2,
      "punt return yards": -7,
      "kickoff returns": 1,
      "kickoff return yards": 22,
      "interception returns": 0,
      "interception return yards": 0,
      "3rd down conversions": 4,
      "3rd down attempts": 16,
      "4th down conversions": 3,
      "4th down attempts": 4
    },
    "LouisianaMonroe": {
      "points": 30,
      "1st downs": 18,
      "rushing 1st downs": 6,
      "passing 1st downs": 11,
      "penalty 1st downs": 1,
      "rushing yards": 142,
      "rushing attempts": 32,
      "passing yards": 286,
      "passing attempts": 25,
      "passing completions": 17,
      "passing interceptions": 0,
      "total yards": 428,
      "total plays": 57,
      "fumbles": 0,
      "fumbles lost": 0,
      "penalties": 12,
      "penalty yards": 108,
      "punts": 5,
      "punt yards": 211,
      "punt returns": 1,
      "punt return yards": 7,
      "kickoff returns": 1,
      "kickoff return yards": 22,
      "interception returns": 1,
      "interception return yards": 0,
      "3rd down conversions": 3,
      "3rd down attempts": 11,
      "4th down conversions": 2,
      "4th down attempts": 2
    }
  },
  "Stanford vs OregonState": {
    "stadium": "ReserStadium-Corvallis-OR",
    "Stanford": {
      "points": 31,
      "1st downs": 18,
      "rushing 1st downs": 5,
      "passing 1st downs": 10,
      "penalty 1st downs": 3,
      "rushing yards": 100,
      "rushing attempts": 31,
      "passing yards": 253,
      "passing attempts": 27,
      "passing completions": 19,
      "passing interceptions": 0,
      "total yards": 353,
      "total plays": 58,
      "fumbles": 0,
      "fumbles lost": 0,
      "penalties": 7,
      "penalty yards": 38,
      "punts": 3,
      "punt yards": 151,
      "punt returns": 1,
      "punt return yards": 27,
      "kickoff returns": 5,
      "kickoff return yards": 147,
      "interception returns": 0,
      "interception return yards": 0,
      "3rd down conversions": 7,
      "3rd down attempts": 14,
      "4th down conversions": 1,
      "4th down attempts": 1
    },
    "OregonState": {
      "points": 28,
      "1st downs": 28,
      "rushing 1st downs": 8,
      "passing 1st downs": 19,
      "penalty 1st downs": 1,
      "rushing yards": 164,
      "rushing attempts": 33,
      "passing yards": 337,
      "passing attempts": 39,
      "passing completions": 27,
      "passing interceptions": 0,
      "total yards": 501,
      "total plays": 72,
      "fumbles": 0,
      "fumbles lost": 0,
      "penalties": 7,
      "penalty yards": 56,
      "punts": 2,
      "punt yards": 90,
      "punt returns": 0,
      "punt return yards": 0,
      "kickoff returns": 4,
      "kickoff return yards": 45,
      "interception returns": 0,
      "interception return yards": 0,
      "3rd down conversions": 9,
      "3rd down attempts": 13,
      "4th down conversions": 0,
      "4th down attempts": 0
    }
  },
  "UAB vs WesternKentucky": {
    "stadium": "HouchensIndustriesLTSmithStadium-BowlingGreen-KY",
    "UAB": {
      "points": 13,
      "1st downs": 20,
      "rushing 1st downs": 10,
      "passing 1st downs": 9,
      "penalty 1st downs": 1,
      "rushing yards": 117,
      "rushing attempts": 39,
      "passing yards": 181,
      "passing attempts": 31,
      "passing completions": 18,
      "passing interceptions": 4,
      "total yards": 298,
      "total plays": 70,
      "fumbles": 0,
      "fumbles lost": 0,
      "penalties": 7,
      "penalty yards": 67,
      "punts": 2,
      "punt yards": 84,
      "punt returns": 0,
      "punt return yards": 0,
      "kickoff returns": 3,
      "kickoff return yards": 61,
      "interception returns": 0,
      "interception return yards": 0,
      "3rd down conversions": 5,
      "3rd down attempts": 13,
      "4th down conversions": 1,
      "4th down attempts": 3
    },
    "WesternKentucky": {
      "points": 20,
      "1st downs": 14,
      "rushing 1st downs": 4,
      "passing 1st downs": 7,
      "penalty 1st downs": 3,
      "rushing yards": 33,
      "rushing attempts": 29,
      "passing yards": 189,
      "passing attempts": 24,
      "passing completions": 15,
      "passing interceptions": 0,
      "total yards": 222,
      "total plays": 53,
      "fumbles": 2,
      "fumbles lost": 1,
      "penalties": 7,
      "penalty yards": 71,
      "punts": 4,
      "punt yards": 185,
      "punt returns": 1,
      "punt return yards": 4,
      "kickoff returns": 1,
      "kickoff return yards": 31,
      "interception returns": 4,
      "interception return yards": 19,
      "3rd down conversions": 6,
      "3rd down attempts": 13,
      "4th down conversions": 0,
      "4th down attempts": 0
    }
  },
  "LouisianaTech vs Rice": {
    "stadium": "RiceStadium-Houston-TX",
    "LouisianaTech": {
      "points": 23,
      "1st downs": 19,
      "rushing 1st downs": 7,
      "passing 1st downs": 11,
      "penalty 1st downs": 1,
      "rushing yards": 84,
      "rushing attempts": 22,
      "passing yards": 210,
      "passing attempts": 39,
      "passing completions": 21,
      "passing interceptions": 0,
      "total yards": 294,
      "total plays": 61,
      "fumbles": 1,
      "fumbles lost": 0,
      "penalties": 3,
      "penalty yards": 11,
      "punts": 8,
      "punt yards": 286,
      "punt returns": 1,
      "punt return yards": 2,
      "kickoff returns": 3,
      "kickoff return yards": 65,
      "interception returns": 1,
      "interception return yards": 0,
      "3rd down conversions": 3,
      "3rd down attempts": 13,
      "4th down conversions": 0,
      "4th down attempts": 0
    },
    "Rice": {
      "points": 20,
      "1st downs": 19,
      "rushing 1st downs": 8,
      "passing 1st downs": 10,
      "penalty 1st downs": 1,
      "rushing yards": 190,
      "rushing attempts": 48,
      "passing yards": 148,
      "passing attempts": 26,
      "passing completions": 16,
      "passing interceptions": 1,
      "total yards": 338,
      "total plays": 74,
      "fumbles": 4,
      "fumbles lost": 0,
      "penalties": 5,
      "penalty yards": 40,
      "punts": 6,
      "punt yards": 249,
      "punt returns": 3,
      "punt return yards": 31,
      "kickoff returns": 2,
      "kickoff return yards": 36,
      "interception returns": 0,
      "interception return yards": 0,
      "3rd down conversions": 4,
      "3rd down attempts": 16,
      "4th down conversions": 2,
      "4th down attempts": 2
    }
  },
  "FCS vs TexasState": {
    "stadium": "JimWackerFieldatBobcatStadium-SanMarcos-TX",
    "FCS": {
      "points": 3,
      "1st downs": 12,
      "rushing 1st downs": 3,
      "passing 1st downs": 9,
      "penalty 1st downs": 0,
      "rushing yards": 75,
      "rushing attempts": 28,
      "passing yards": 145,
      "passing attempts": 27,
      "passing completions": 15,
      "passing interceptions": 1,
      "total yards": 220,
      "total plays": 55,
      "fumbles": 1,
      "fumbles lost": 1,
      "penalties": 3,
      "penalty yards": 30,
      "punts": 7,
      "punt yards": 267,
      "punt returns": 0,
      "punt return yards": 0,
      "kickoff returns": 1,
      "kickoff return yards": 22,
      "interception returns": 1,
      "interception return yards": 3,
      "3rd down conversions": 2,
      "3rd down attempts": 12,
      "4th down conversions": 1,
      "4th down attempts": 1
    },
    "TexasState": {
      "points": 24,
      "1st downs": 16,
      "rushing 1st downs": 6,
      "passing 1st downs": 9,
      "penalty 1st downs": 1,
      "rushing yards": 109,
      "rushing attempts": 34,
      "passing yards": 253,
      "passing attempts": 29,
      "passing completions": 22,
      "passing interceptions": 1,
      "total yards": 362,
      "total plays": 63,
      "fumbles": 0,
      "fumbles lost": 0,
      "penalties": 6,
      "penalty yards": 70,
      "punts": 4,
      "punt yards": 154,
      "punt returns": 0,
      "punt return yards": 0,
      "kickoff returns": 2,
      "kickoff return yards": 61,
      "interception returns": 1,
      "interception return yards": 12,
      "3rd down conversions": 5,
      "3rd down attempts": 14,
      "4th down conversions": 1,
      "4th down attempts": 1
    }
  },
  "KansasState vs OklahomaState": {
    "stadium": "BoonePickensStadium-Stillwater-OK",
    "KansasState": {
      "points": 13,
      "1st downs": 8,
      "rushing 1st downs": 4,
      "passing 1st downs": 3,
      "penalty 1st downs": 1,
      "rushing yards": 126,
      "rushing attempts": 32,
      "passing yards": 118,
      "passing attempts": 23,
      "passing completions": 11,
      "passing interceptions": 0,
      "total yards": 244,
      "total plays": 55,
      "fumbles": 1,
      "fumbles lost": 1,
      "penalties": 8,
      "penalty yards": 65,
      "punts": 7,
      "punt yards": 321,
      "punt returns": 0,
      "punt return yards": 0,
      "kickoff returns": 4,
      "kickoff return yards": 76,
      "interception returns": 2,
      "interception return yards": 26,
      "3rd down conversions": 1,
      "3rd down attempts": 13,
      "4th down conversions": 1,
      "4th down attempts": 2
    },
    "OklahomaState": {
      "points": 26,
      "1st downs": 21,
      "rushing 1st downs": 12,
      "passing 1st downs": 7,
      "penalty 1st downs": 2,
      "rushing yards": 373,
      "rushing attempts": 44,
      "passing yards": 153,
      "passing attempts": 25,
      "passing completions": 16,
      "passing interceptions": 2,
      "total yards": 526,
      "total plays": 69,
      "fumbles": 1,
      "fumbles lost": 0,
      "penalties": 6,
      "penalty yards": 60,
      "punts": 4,
      "punt yards": 154,
      "punt returns": 2,
      "punt return yards": 5,
      "kickoff returns": 0,
      "kickoff return yards": 0,
      "interception returns": 0,
      "interception return yards": 0,
      "3rd down conversions": 4,
      "3rd down attempts": 13,
      "4th down conversions": 0,
      "4th down attempts": 1
    }
  },
  "Connecticut vs UCF": {
    "stadium": "SpectrumStadium-Orlando-FL",
    "Connecticut": {
      "points": 21,
      "1st downs": 24,
      "rushing 1st downs": 9,
      "passing 1st downs": 13,
      "penalty 1st downs": 2,
      "rushing yards": 145,
      "rushing attempts": 40,
      "passing yards": 281,
      "passing attempts": 36,
      "passing completions": 23,
      "passing interceptions": 2,
      "total yards": 426,
      "total plays": 76,
      "fumbles": 4,
      "fumbles lost": 2,
      "penalties": 7,
      "penalty yards": 60,
      "punts": 5,
      "punt yards": 201,
      "punt returns": 0,
      "punt return yards": 0,
      "kickoff returns": 3,
      "kickoff return yards": 84,
      "interception returns": 0,
      "interception return yards": 0,
      "3rd down conversions": 4,
      "3rd down attempts": 14,
      "4th down conversions": 1,
      "4th down attempts": 2
    },
    "UCF": {
      "points": 56,
      "1st downs": 27,
      "rushing 1st downs": 12,
      "passing 1st downs": 13,
      "penalty 1st downs": 2,
      "rushing yards": 230,
      "rushing attempts": 37,
      "passing yards": 377,
      "passing attempts": 30,
      "passing completions": 21,
      "passing interceptions": 0,
      "total yards": 607,
      "total plays": 67,
      "fumbles": 1,
      "fumbles lost": 1,
      "penalties": 11,
      "penalty yards": 90,
      "punts": 2,
      "punt yards": 68,
      "punt returns": 0,
      "punt return yards": 0,
      "kickoff returns": 1,
      "kickoff return yards": 22,
      "interception returns": 2,
      "interception return yards": 67,
      "3rd down conversions": 4,
      "3rd down attempts": 9,
      "4th down conversions": 0,
      "4th down attempts": 3
    }
  },
  "UTEP vs SouthernMiss": {
    "stadium": "MMRobertsStadium-Hattiesburg-MS",
    "UTEP": {
      "points": 13,
      "1st downs": 14,
      "rushing 1st downs": 6,
      "passing 1st downs": 8,
      "penalty 1st downs": 0,
      "rushing yards": 126,
      "rushing attempts": 25,
      "passing yards": 168,
      "passing attempts": 28,
      "passing completions": 14,
      "passing interceptions": 0,
      "total yards": 294,
      "total plays": 53,
      "fumbles": 0,
      "fumbles lost": 0,
      "penalties": 7,
      "penalty yards": 60,
      "punts": 6,
      "punt yards": 228,
      "punt returns": 3,
      "punt return yards": 8,
      "kickoff returns": 4,
      "kickoff return yards": 91,
      "interception returns": 0,
      "interception return yards": 0,
      "3rd down conversions": 4,
      "3rd down attempts": 14,
      "4th down conversions": 1,
      "4th down attempts": 1
    },
    "SouthernMiss": {
      "points": 31,
      "1st downs": 21,
      "rushing 1st downs": 6,
      "passing 1st downs": 13,
      "penalty 1st downs": 2,
      "rushing yards": 168,
      "rushing attempts": 37,
      "passing yards": 351,
      "passing attempts": 28,
      "passing completions": 19,
      "passing interceptions": 0,
      "total yards": 519,
      "total plays": 65,
      "fumbles": 3,
      "fumbles lost": 1,
      "penalties": 8,
      "penalty yards": 70,
      "punts": 3,
      "punt yards": 120,
      "punt returns": 3,
      "punt return yards": 26,
      "kickoff returns": 2,
      "kickoff return yards": 49,
      "interception returns": 0,
      "interception return yards": 0,
      "3rd down conversions": 9,
      "3rd down attempts": 14,
      "4th down conversions": 0,
      "4th down attempts": 0
    }
  },
  "OhioState vs Nebraska": {
    "stadium": "MemorialStadiumLincoln-NE-Lincoln",
    "OhioState": {
      "points": 48,
      "1st downs": 31,
      "rushing 1st downs": 20,
      "passing 1st downs": 10,
      "penalty 1st downs": 1,
      "rushing yards": 368,
      "rushing attempts": 53,
      "passing yards": 212,
      "passing attempts": 22,
      "passing completions": 15,
      "passing interceptions": 0,
      "total yards": 580,
      "total plays": 75,
      "fumbles": 0,
      "fumbles lost": 0,
      "penalties": 2,
      "penalty yards": 25,
      "punts": 1,
      "punt yards": 59,
      "punt returns": 2,
      "punt return yards": 3,
      "kickoff returns": 2,
      "kickoff return yards": 46,
      "interception returns": 3,
      "interception return yards": 0,
      "3rd down conversions": 10,
      "3rd down attempts": 13,
      "4th down conversions": 0,
      "4th down attempts": 0
    },
    "Nebraska": {
      "points": 7,
      "1st downs": 15,
      "rushing 1st downs": 12,
      "passing 1st downs": 2,
      "penalty 1st downs": 1,
      "rushing yards": 184,
      "rushing attempts": 39,
      "passing yards": 47,
      "passing attempts": 17,
      "passing completions": 8,
      "passing interceptions": 3,
      "total yards": 231,
      "total plays": 56,
      "fumbles": 1,
      "fumbles lost": 0,
      "penalties": 6,
      "penalty yards": 57,
      "punts": 5,
      "punt yards": 176,
      "punt returns": 0,
      "punt return yards": 0,
      "kickoff returns": 3,
      "kickoff return yards": 51,
      "interception returns": 0,
      "interception return yards": 0,
      "3rd down conversions": 4,
      "3rd down attempts": 12,
      "4th down conversions": 1,
      "4th down attempts": 2
    }
  },
  "Kentucky vs SouthCarolina": {
    "stadium": "WilliamsBriceStadium-Columbia-SC",
    "Kentucky": {
      "points": 7,
      "1st downs": 9,
      "rushing 1st downs": 4,
      "passing 1st downs": 4,
      "penalty 1st downs": 1,
      "rushing yards": 115,
      "rushing attempts": 28,
      "passing yards": 97,
      "passing attempts": 34,
      "passing completions": 13,
      "passing interceptions": 1,
      "total yards": 212,
      "total plays": 62,
      "fumbles": 2,
      "fumbles lost": 1,
      "penalties": 4,
      "penalty yards": 20,
      "punts": 9,
      "punt yards": 460,
      "punt returns": 1,
      "punt return yards": 9,
      "kickoff returns": 3,
      "kickoff return yards": 84,
      "interception returns": 0,
      "interception return yards": 0,
      "3rd down conversions": 2,
      "3rd down attempts": 15,
      "4th down conversions": 0,
      "4th down attempts": 2
    },
    "SouthCarolina": {
      "points": 24,
      "1st downs": 21,
      "rushing 1st downs": 14,
      "passing 1st downs": 7,
      "penalty 1st downs": 0,
      "rushing yards": 247,
      "rushing attempts": 46,
      "passing yards": 140,
      "passing attempts": 27,
      "passing completions": 15,
      "passing interceptions": 0,
      "total yards": 387,
      "total plays": 73,
      "fumbles": 2,
      "fumbles lost": 1,
      "penalties": 5,
      "penalty yards": 40,
      "punts": 9,
      "punt yards": 461,
      "punt returns": 1,
      "punt return yards": -2,
      "kickoff returns": 0,
      "kickoff return yards": 0,
      "interception returns": 1,
      "interception return yards": 0,
      "3rd down conversions": 5,
      "3rd down attempts": 15,
      "4th down conversions": 0,
      "4th down attempts": 0
    }
  },
  "ColoradoState vs UtahState": {
    "stadium": "MerlinOlsenFieldatMaverikStadium-Logan-UT",
    "ColoradoState": {
      "points": 24,
      "1st downs": 11,
      "rushing 1st downs": 3,
      "passing 1st downs": 6,
      "penalty 1st downs": 2,
      "rushing yards": 79,
      "rushing attempts": 35,
      "passing yards": 217,
      "passing attempts": 30,
      "passing completions": 14,
      "passing interceptions": 0,
      "total yards": 296,
      "total plays": 65,
      "fumbles": 3,
      "fumbles lost": 3,
      "penalties": 6,
      "penalty yards": 41,
      "punts": 8,
      "punt yards": 351,
      "punt returns": 2,
      "punt return yards": 15,
      "kickoff returns": 1,
      "kickoff return yards": 23,
      "interception returns": 2,
      "interception return yards": 44,
      "3rd down conversions": 4,
      "3rd down attempts": 16,
      "4th down conversions": 0,
      "4th down attempts": 2
    },
    "UtahState": {
      "points": 34,
      "1st downs": 25,
      "rushing 1st downs": 18,
      "passing 1st downs": 6,
      "penalty 1st downs": 1,
      "rushing yards": 240,
      "rushing attempts": 56,
      "passing yards": 204,
      "passing attempts": 33,
      "passing completions": 17,
      "passing interceptions": 2,
      "total yards": 444,
      "total plays": 89,
      "fumbles": 2,
      "fumbles lost": 2,
      "penalties": 6,
      "penalty yards": 30,
      "punts": 6,
      "punt yards": 220,
      "punt returns": 1,
      "punt return yards": -2,
      "kickoff returns": 1,
      "kickoff return yards": 100,
      "interception returns": 0,
      "interception return yards": 0,
      "3rd down conversions": 8,
      "3rd down attempts": 18,
      "4th down conversions": 1,
      "4th down attempts": 1
    }
  },
  "NorthCarolinaState vs FloridaState": {
    "stadium": "BobbyBowdenFieldatDoakCampbellStadium-Tallahassee-FL",
    "NorthCarolinaState": {
      "points": 13,
      "1st downs": 24,
      "rushing 1st downs": 4,
      "passing 1st downs": 15,
      "penalty 1st downs": 5,
      "rushing yards": 88,
      "rushing attempts": 28,
      "passing yards": 282,
      "passing attempts": 52,
      "passing completions": 28,
      "passing interceptions": 0,
      "total yards": 370,
      "total plays": 80,
      "fumbles": 3,
      "fumbles lost": 2,
      "penalties": 8,
      "penalty yards": 57,
      "punts": 6,
      "punt yards": 285,
      "punt returns": 2,
      "punt return yards": 10,
      "kickoff returns": 0,
      "kickoff return yards": 0,
      "interception returns": 0,
      "interception return yards": 0,
      "3rd down conversions": 4,
      "3rd down attempts": 16,
      "4th down conversions": 1,
      "4th down attempts": 3
    },
    "FloridaState": {
      "points": 31,
      "1st downs": 22,
      "rushing 1st downs": 4,
      "passing 1st downs": 15,
      "penalty 1st downs": 3,
      "rushing yards": 53,
      "rushing attempts": 32,
      "passing yards": 316,
      "passing attempts": 40,
      "passing completions": 29,
      "passing interceptions": 0,
      "total yards": 369,
      "total plays": 72,
      "fumbles": 1,
      "fumbles lost": 0,
      "penalties": 13,
      "penalty yards": 99,
      "punts": 7,
      "punt yards": 280,
      "punt returns": 4,
      "punt return yards": 24,
      "kickoff returns": 1,
      "kickoff return yards": 58,
      "interception returns": 0,
      "interception return yards": 0,
      "3rd down conversions": 5,
      "3rd down attempts": 15,
      "4th down conversions": 1,
      "4th down attempts": 1
    }
  },
  "FresnoState vs NewMexicoState": {
    "stadium": "AggieMemorialStadium-LasCruces-NM",
    "FresnoState": {
      "points": 30,
      "1st downs": 18,
      "rushing 1st downs": 6,
      "passing 1st downs": 12,
      "penalty 1st downs": 0,
      "rushing yards": 239,
      "rushing attempts": 38,
      "passing yards": 147,
      "passing attempts": 31,
      "passing completions": 20,
      "passing interceptions": 0,
      "total yards": 386,
      "total plays": 69,
      "fumbles": 1,
      "fumbles lost": 1,
      "penalties": 3,
      "penalty yards": 39,
      "punts": 6,
      "punt yards": 249,
      "punt returns": 1,
      "punt return yards": 14,
      "kickoff returns": 0,
      "kickoff return yards": 0,
      "interception returns": 3,
      "interception return yards": 104,
      "3rd down conversions": 5,
      "3rd down attempts": 14,
      "4th down conversions": 0,
      "4th down attempts": 0
    },
    "NewMexicoState": {
      "points": 17,
      "1st downs": 17,
      "rushing 1st downs": 10,
      "passing 1st downs": 7,
      "penalty 1st downs": 0,
      "rushing yards": 105,
      "rushing attempts": 22,
      "passing yards": 210,
      "passing attempts": 47,
      "passing completions": 26,
      "passing interceptions": 3,
      "total yards": 315,
      "total plays": 69,
      "fumbles": 1,
      "fumbles lost": 0,
      "penalties": 3,
      "penalty yards": 22,
      "punts": 6,
      "punt yards": 286,
      "punt returns": 1,
      "punt return yards": 0,
      "kickoff returns": 2,
      "kickoff return yards": 13,
      "interception returns": 0,
      "interception return yards": 0,
      "3rd down conversions": 2,
      "3rd down attempts": 14,
      "4th down conversions": 2,
      "4th down attempts": 3
    }
  },
  "Houston vs NorthTexas": {
    "stadium": "ApogeeStadium-Denton-TX",
    "Houston": {
      "points": 46,
      "1st downs": 17,
      "rushing 1st downs": 8,
      "passing 1st downs": 8,
      "penalty 1st downs": 1,
      "rushing yards": 235,
      "rushing attempts": 33,
      "passing yards": 124,
      "passing attempts": 20,
      "passing completions": 16,
      "passing interceptions": 0,
      "total yards": 359,
      "total plays": 53,
      "fumbles": 1,
      "fumbles lost": 0,
      "penalties": 3,
      "penalty yards": 30,
      "punts": 5,
      "punt yards": 231,
      "punt returns": 2,
      "punt return yards": 63,
      "kickoff returns": 3,
      "kickoff return yards": 125,
      "interception returns": 0,
      "interception return yards": 0,
      "3rd down conversions": 4,
      "3rd down attempts": 11,
      "4th down conversions": 0,
      "4th down attempts": 0
    },
    "NorthTexas": {
      "points": 25,
      "1st downs": 20,
      "rushing 1st downs": 7,
      "passing 1st downs": 13,
      "penalty 1st downs": 0,
      "rushing yards": 96,
      "rushing attempts": 30,
      "passing yards": 360,
      "passing attempts": 58,
      "passing completions": 36,
      "passing interceptions": 0,
      "total yards": 456,
      "total plays": 88,
      "fumbles": 2,
      "fumbles lost": 0,
      "penalties": 6,
      "penalty yards": 57,
      "punts": 5,
      "punt yards": 218,
      "punt returns": 1,
      "punt return yards": 15,
      "kickoff returns": 3,
      "kickoff return yards": 71,
      "interception returns": 0,
      "interception return yards": 0,
      "3rd down conversions": 8,
      "3rd down attempts": 22,
      "4th down conversions": 4,
      "4th down attempts": 7
    }
  },
  "UNLV vs Wyoming": {
    "stadium": "JonahFieldatWarMemorialStadium-Laramie-WY",
    "UNLV": {
      "points": 17,
      "1st downs": 19,
      "rushing 1st downs": 7,
      "passing 1st downs": 10,
      "penalty 1st downs": 2,
      "rushing yards": 77,
      "rushing attempts": 33,
      "passing yards": 263,
      "passing attempts": 44,
      "passing completions": 22,
      "passing interceptions": 3,
      "total yards": 340,
      "total plays": 77,
      "fumbles": 1,
      "fumbles lost": 0,
      "penalties": 8,
      "penalty yards": 62,
      "punts": 8,
      "punt yards": 348,
      "punt returns": 3,
      "punt return yards": -6,
      "kickoff returns": 1,
      "kickoff return yards": 12,
      "interception returns": 0,
      "interception return yards": 0,
      "3rd down conversions": 4,
      "3rd down attempts": 16,
      "4th down conversions": 2,
      "4th down attempts": 3
    },
    "Wyoming": {
      "points": 53,
      "1st downs": 18,
      "rushing 1st downs": 11,
      "passing 1st downs": 4,
      "penalty 1st downs": 3,
      "rushing yards": 374,
      "rushing attempts": 48,
      "passing yards": 124,
      "passing attempts": 12,
      "passing completions": 5,
      "passing interceptions": 0,
      "total yards": 498,
      "total plays": 60,
      "fumbles": 2,
      "fumbles lost": 0,
      "penalties": 4,
      "penalty yards": 40,
      "punts": 5,
      "punt yards": 206,
      "punt returns": 6,
      "punt return yards": 92,
      "kickoff returns": 1,
      "kickoff return yards": 1,
      "interception returns": 3,
      "interception return yards": 51,
      "3rd down conversions": 5,
      "3rd down attempts": 12,
      "4th down conversions": 0,
      "4th down attempts": 0
    }
  },
  "WashingtonState vs Utah": {
    "stadium": "RiceEcclesStadium-SaltLakeCity-UT",
    "WashingtonState": {
      "points": 13,
      "1st downs": 18,
      "rushing 1st downs": 2,
      "passing 1st downs": 14,
      "penalty 1st downs": 2,
      "rushing yards": 61,
      "rushing attempts": 14,
      "passing yards": 252,
      "passing attempts": 49,
      "passing completions": 30,
      "passing interceptions": 2,
      "total yards": 313,
      "total plays": 63,
      "fumbles": 0,
      "fumbles lost": 0,
      "penalties": 9,
      "penalty yards": 66,
      "punts": 2,
      "punt yards": 91,
      "punt returns": 0,
      "punt return yards": 0,
      "kickoff returns": 3,
      "kickoff return yards": 72,
      "interception returns": 0,
      "interception return yards": 0,
      "3rd down conversions": 3,
      "3rd down attempts": 12,
      "4th down conversions": 1,
      "4th down attempts": 2
    },
    "Utah": {
      "points": 38,
      "1st downs": 29,
      "rushing 1st downs": 13,
      "passing 1st downs": 14,
      "penalty 1st downs": 2,
      "rushing yards": 192,
      "rushing attempts": 41,
      "passing yards": 334,
      "passing attempts": 30,
      "passing completions": 21,
      "passing interceptions": 0,
      "total yards": 526,
      "total plays": 71,
      "fumbles": 0,
      "fumbles lost": 0,
      "penalties": 9,
      "penalty yards": 87,
      "punts": 1,
      "punt yards": 40,
      "punt returns": 0,
      "punt return yards": 0,
      "kickoff returns": 0,
      "kickoff return yards": 0,
      "interception returns": 2,
      "interception return yards": 22,
      "3rd down conversions": 6,
      "3rd down attempts": 12,
      "4th down conversions": 2,
      "4th down attempts": 3
    }
  },
  "Hawaii vs Nevada": {
    "stadium": "MackayStadium-Reno-NV",
    "Hawaii": {
      "points": 54,
      "1st downs": 26,
      "rushing 1st downs": 9,
      "passing 1st downs": 16,
      "penalty 1st downs": 1,
      "rushing yards": 139,
      "rushing attempts": 27,
      "passing yards": 373,
      "passing attempts": 36,
      "passing completions": 31,
      "passing interceptions": 0,
      "total yards": 512,
      "total plays": 63,
      "fumbles": 0,
      "fumbles lost": 0,
      "penalties": 6,
      "penalty yards": 70,
      "punts": 2,
      "punt yards": 92,
      "punt returns": 2,
      "punt return yards": 27,
      "kickoff returns": 2,
      "kickoff return yards": 44,
      "interception returns": 2,
      "interception return yards": 11,
      "3rd down conversions": 5,
      "3rd down attempts": 9,
      "4th down conversions": 0,
      "4th down attempts": 2
    },
    "Nevada": {
      "points": 3,
      "1st downs": 16,
      "rushing 1st downs": 8,
      "passing 1st downs": 5,
      "penalty 1st downs": 3,
      "rushing yards": 98,
      "rushing attempts": 36,
      "passing yards": 105,
      "passing attempts": 31,
      "passing completions": 18,
      "passing interceptions": 2,
      "total yards": 203,
      "total plays": 67,
      "fumbles": 2,
      "fumbles lost": 1,
      "penalties": 10,
      "penalty yards": 78,
      "punts": 4,
      "punt yards": 151,
      "punt returns": 0,
      "punt return yards": 0,
      "kickoff returns": 5,
      "kickoff return yards": 87,
      "interception returns": 0,
      "interception return yards": 0,
      "3rd down conversions": 4,
      "3rd down attempts": 14,
      "4th down conversions": 0,
      "4th down attempts": 3
    }
  },
  "UCLA vs Arizona": {
    "stadium": "ArizonaStadium-Tucson-AZ",
    "UCLA": {
      "points": 17,
      "1st downs": 25,
      "rushing 1st downs": 10,
      "passing 1st downs": 13,
      "penalty 1st downs": 2,
      "rushing yards": 217,
      "rushing attempts": 43,
      "passing yards": 228,
      "passing attempts": 42,
      "passing completions": 22,
      "passing interceptions": 1,
      "total yards": 445,
      "total plays": 85,
      "fumbles": 0,
      "fumbles lost": 0,
      "penalties": 5,
      "penalty yards": 40,
      "punts": 4,
      "punt yards": 170,
      "punt returns": 2,
      "punt return yards": 11,
      "kickoff returns": 0,
      "kickoff return yards": 0,
      "interception returns": 0,
      "interception return yards": 0,
      "3rd down conversions": 8,
      "3rd down attempts": 17,
      "4th down conversions": 1,
      "4th down attempts": 3
    },
    "Arizona": {
      "points": 20,
      "1st downs": 21,
      "rushing 1st downs": 7,
      "passing 1st downs": 14,
      "penalty 1st downs": 0,
      "rushing yards": 99,
      "rushing attempts": 30,
      "passing yards": 352,
      "passing attempts": 44,
      "passing completions": 29,
      "passing interceptions": 0,
      "total yards": 451,
      "total plays": 74,
      "fumbles": 0,
      "fumbles lost": 0,
      "penalties": 10,
      "penalty yards": 74,
      "punts": 5,
      "punt yards": 237,
      "punt returns": 0,
      "punt return yards": 0,
      "kickoff returns": 0,
      "kickoff return yards": 0,
      "interception returns": 1,
      "interception return yards": 12,
      "3rd down conversions": 6,
      "3rd down attempts": 17,
      "4th down conversions": 2,
      "4th down attempts": 2
    }
  }
}