{
  "NewMexico vs UTSA": {
    "stadium": "DreamstyleStadium-Albuquerque-NM",
    "NewMexico": {
      "points": 23,
      "1st downs": 17,
      "rushing 1st downs": 13,
      "passing 1st downs": 3,
      "penalty 1st downs": 1,
      "rushing yards": 219,
      "rushing attempts": 52,
      "passing yards": 77,
      "passing attempts": 6,
      "passing completions": 3,
      "passing interceptions": 0,
      "total yards": 296,
      "total plays": 58,
      "fumbles": 1,
      "fumbles lost": 0,
      "penalties": 2,
      "penalty yards": 30,
      "punts": 3,
      "punt yards": 117,
      "punt returns": 1,
      "punt return yards": 3,
      "kickoff returns": 0,
      "kickoff return yards": 0,
      "interception returns": 1,
      "interception return yards": 0,
      "3rd down conversions": 6,
      "3rd down attempts": 13,
      "4th down conversions": 2,
      "4th down attempts": 3
    },
    "UTSA": {
      "points": 20,
      "1st downs": 20,
      "rushing 1st downs": 13,
      "passing 1st downs": 5,
      "penalty 1st downs": 2,
      "rushing yards": 246,
      "rushing attempts": 38,
      "passing yards": 118,
      "passing attempts": 26,
      "passing completions": 10,
      "passing interceptions": 1,
      "total yards": 364,
      "total plays": 64,
      "fumbles": 0,
      "fumbles lost": 0,
      "penalties": 8,
      "penalty yards": 60,
      "punts": 2,
      "punt yards": 92,
      "punt returns": 1,
      "punt return yards": 3,
      "kickoff returns": 2,
      "kickoff return yards": 26,
      "interception returns": 0,
      "interception return yards": 0,
      "3rd down conversions": 7,
      "3rd down attempts": 14,
      "4th down conversions": 2,
      "4th down attempts": 3
    }
  },
  "Houston vs SanDiegoState": {
    "stadium": "SamBoydStadium-LasVegas-NV",
    "Houston": {
      "points": 10,
      "1st downs": 16,
      "rushing 1st downs": 7,
      "passing 1st downs": 9,
      "penalty 1st downs": 0,
      "rushing yards": 25,
      "rushing attempts": 41,
      "passing yards": 229,
      "passing attempts": 34,
      "passing completions": 25,
      "passing interceptions": 4,
      "total yards": 254,
      "total plays": 75,
      "fumbles": 0,
      "fumbles lost": 0,
      "penalties": 2,
      "penalty yards": 10,
      "punts": 4,
      "punt yards": 160,
      "punt returns": 0,
      "punt return yards": 0,
      "kickoff returns": 4,
      "kickoff return yards": 109,
      "interception returns": 0,
      "interception return yards": 0,
      "3rd down conversions": 7,
      "3rd down attempts": 17,
      "4th down conversions": 0,
      "4th down attempts": 3
    },
    "SanDiegoState": {
      "points": 34,
      "1st downs": 13,
      "rushing 1st downs": 6,
      "passing 1st downs": 6,
      "penalty 1st downs": 1,
      "rushing yards": 127,
      "rushing attempts": 37,
      "passing yards": 128,
      "passing attempts": 14,
      "passing completions": 10,
      "passing interceptions": 0,
      "total yards": 255,
      "total plays": 51,
      "fumbles": 0,
      "fumbles lost": 0,
      "penalties": 3,
      "penalty yards": 25,
      "punts": 7,
      "punt yards": 257,
      "punt returns": 3,
      "punt return yards": 16,
      "kickoff returns": 2,
      "kickoff return yards": 49,
      "interception returns": 4,
      "interception return yards": 87,
      "3rd down conversions": 2,
      "3rd down attempts": 12,
      "4th down conversions": 0,
      "4th down attempts": 0
    }
  },
  "UCF vs ArkansasState": {
    "stadium": "CampingWorldStadium-Orlando-FL",
    "UCF": {
      "points": 13,
      "1st downs": 16,
      "rushing 1st downs": 0,
      "passing 1st downs": 9,
      "penalty 1st downs": 7,
      "rushing yards": 12,
      "rushing attempts": 30,
      "passing yards": 211,
      "passing attempts": 48,
      "passing completions": 26,
      "passing interceptions": 0,
      "total yards": 223,
      "total plays": 78,
      "fumbles": 3,
      "fumbles lost": 3,
      "penalties": 11,
      "penalty yards": 82,
      "punts": 10,
      "punt yards": 440,
      "punt returns": 5,
      "punt return yards": -1,
      "kickoff returns": 5,
      "kickoff return yards": 83,
      "interception returns": 0,
      "interception return yards": 0,
      "3rd down conversions": 3,
      "3rd down attempts": 18,
      "4th down conversions": 0,
      "4th down attempts": 2
    },
    "ArkansasState": {
      "points": 31,
      "1st downs": 9,
      "rushing 1st downs": 4,
      "passing 1st downs": 5,
      "penalty 1st downs": 0,
      "rushing yards": 29,
      "rushing attempts": 38,
      "passing yards": 205,
      "passing attempts": 26,
      "passing completions": 12,
      "passing interceptions": 0,
      "total yards": 234,
      "total plays": 64,
      "fumbles": 3,
      "fumbles lost": 1,
      "penalties": 15,
      "penalty yards": 140,
      "punts": 12,
      "punt yards": 464,
      "punt returns": 6,
      "punt return yards": 61,
      "kickoff returns": 2,
      "kickoff return yards": 40,
      "interception returns": 0,
      "interception return yards": 0,
      "3rd down conversions": 3,
      "3rd down attempts": 17,
      "4th down conversions": 0,
      "4th down attempts": 1
    }
  },
  "AppalachianState vs Toledo": {
    "stadium": "CramtonBowl-Montgomery-AL",
    "AppalachianState": {
      "points": 31,
      "1st downs": 25,
      "rushing 1st downs": 14,
      "passing 1st downs": 9,
      "penalty 1st downs": 2,
      "rushing yards": 297,
      "rushing attempts": 49,
      "passing yards": 119,
      "passing attempts": 33,
      "passing completions": 14,
      "passing interceptions": 0,
      "total yards": 416,
      "total plays": 82,
      "fumbles": 0,
      "fumbles lost": 0,
      "penalties": 2,
      "penalty yards": 21,
      "punts": 6,
      "punt yards": 219,
      "punt returns": 0,
      "punt return yards": 0,
      "kickoff returns": 3,
      "kickoff return yards": 124,
      "interception returns": 0,
      "interception return yards": 0,
      "3rd down conversions": 8,
      "3rd down attempts": 19,
      "4th down conversions": 1,
      "4th down attempts": 2
    },
    "Toledo": {
      "points": 28,
      "1st downs": 14,
      "rushing 1st downs": 5,
      "passing 1st downs": 9,
      "penalty 1st downs": 0,
      "rushing yards": 127,
      "rushing attempts": 28,
      "passing yards": 247,
      "passing attempts": 26,
      "passing completions": 18,
      "passing interceptions": 0,
      "total yards": 374,
      "total plays": 54,
      "fumbles": 0,
      "fumbles lost": 0,
      "penalties": 7,
      "penalty yards": 62,
      "punts": 7,
      "punt yards": 301,
      "punt returns": 1,
      "punt return yards": 25,
      "kickoff returns": 2,
      "kickoff return yards": 52,
      "interception returns": 0,
      "interception return yards": 0,
      "3rd down conversions": 4,
      "3rd down attempts": 12,
      "4th down conversions": 0,
      "4th down attempts": 0
    }
  },
  "SouthernMiss vs LouisianaLafayette": {
    "stadium": "MercedesBenzSuperdome-NewOrleans-LA",
    "SouthernMiss": {
      "points": 28,
      "1st downs": 22,
      "rushing 1st downs": 8,
      "passing 1st downs": 12,
      "penalty 1st downs": 2,
      "rushing yards": 135,
      "rushing attempts": 32,
      "passing yards": 346,
      "passing attempts": 42,
      "passing completions": 25,
      "passing interceptions": 1,
      "total yards": 481,
      "total plays": 74,
      "fumbles": 2,
      "fumbles lost": 1,
      "penalties": 13,
      "penalty yards": 131,
      "punts": 4,
      "punt yards": 171,
      "punt returns": 1,
      "punt return yards": 3,
      "kickoff returns": 3,
      "kickoff return yards": 20,
      "interception returns": 1,
      "interception return yards": 0,
      "3rd down conversions": 7,
      "3rd down attempts": 14,
      "4th down conversions": 0,
      "4th down attempts": 0
    },
    "LouisianaLafayette": {
      "points": 21,
      "1st downs": 21,
      "rushing 1st downs": 13,
      "passing 1st downs": 5,
      "penalty 1st downs": 3,
      "rushing yards": 157,
      "rushing attempts": 47,
      "passing yards": 95,
      "passing attempts": 22,
      "passing completions": 8,
      "passing interceptions": 1,
      "total yards": 252,
      "total plays": 69,
      "fumbles": 0,
      "fumbles lost": 0,
      "penalties": 6,
      "penalty yards": 57,
      "punts": 6,
      "punt yards": 250,
      "punt returns": 2,
      "punt return yards": 26,
      "kickoff returns": 3,
      "kickoff return yards": 53,
      "interception returns": 1,
      "interception return yards": 53,
      "3rd down conversions": 3,
      "3rd down attempts": 12,
      "4th down conversions": 1,
      "4th down attempts": 3
    }
  },
  "CentralMichigan vs Tulsa": {
    "stadium": "MarlinsPark-Miami-FL",
    "CentralMichigan": {
      "points": 10,
      "1st downs": 19,
      "rushing 1st downs": 4,
      "passing 1st downs": 14,
      "penalty 1st downs": 1,
      "rushing yards": 83,
      "rushing attempts": 22,
      "passing yards": 272,
      "passing attempts": 50,
      "passing completions": 25,
      "passing interceptions": 3,
      "total yards": 355,
      "total plays": 72,
      "fumbles": 0,
      "fumbles lost": 0,
      "penalties": 5,
      "penalty yards": 40,
      "punts": 4,
      "punt yards": 156,
      "punt returns": 0,
      "punt return yards": 0,
      "kickoff returns": 9,
      "kickoff return yards": 208,
      "interception returns": 0,
      "interception return yards": 0,
      "3rd down conversions": 5,
      "3rd down attempts": 14,
      "4th down conversions": 1,
      "4th down attempts": 4
    },
    "Tulsa": {
      "points": 55,
      "1st downs": 34,
      "rushing 1st downs": 20,
      "passing 1st downs": 14,
      "penalty 1st downs": 0,
      "rushing yards": 261,
      "rushing attempts": 46,
      "passing yards": 320,
      "passing attempts": 39,
      "passing completions": 29,
      "passing interceptions": 0,
      "total yards": 581,
      "total plays": 85,
      "fumbles": 0,
      "fumbles lost": 0,
      "penalties": 3,
      "penalty yards": 25,
      "punts": 0,
      "punt yards": 0,
      "punt returns": 1,
      "punt return yards": 2,
      "kickoff returns": 2,
      "kickoff return yards": 46,
      "interception returns": 3,
      "interception return yards": 66,
      "3rd down conversions": 10,
      "3rd down attempts": 15,
      "4th down conversions": 1,
      "4th down attempts": 3
    }
  },
  "Memphis vs WesternKentucky": {
    "stadium": "FAUStadium-BocaRaton-FL",
    "Memphis": {
      "points": 31,
      "1st downs": 27,
      "rushing 1st downs": 5,
      "passing 1st downs": 18,
      "penalty 1st downs": 4,
      "rushing yards": 73,
      "rushing attempts": 32,
      "passing yards": 418,
      "passing attempts": 49,
      "passing completions": 27,
      "passing interceptions": 1,
      "total yards": 491,
      "total plays": 81,
      "fumbles": 2,
      "fumbles lost": 2,
      "penalties": 5,
      "penalty yards": 53,
      "punts": 2,
      "punt yards": 79,
      "punt returns": 1,
      "punt return yards": 2,
      "kickoff returns": 4,
      "kickoff return yards": 90,
      "interception returns": 1,
      "interception return yards": 0,
      "3rd down conversions": 4,
      "3rd down attempts": 14,
      "4th down conversions": 3,
      "4th down attempts": 6
    },
    "WesternKentucky": {
      "points": 51,
      "1st downs": 28,
      "rushing 1st downs": 14,
      "passing 1st downs": 11,
      "penalty 1st downs": 3,
      "rushing yards": 262,
      "rushing attempts": 48,
      "passing yards": 336,
      "passing attempts": 30,
      "passing completions": 20,
      "passing interceptions": 1,
      "total yards": 598,
      "total plays": 78,
      "fumbles": 1,
      "fumbles lost": 0,
      "penalties": 8,
      "penalty yards": 84,
      "punts": 3,
      "punt yards": 123,
      "punt returns": 0,
      "punt return yards": 0,
      "kickoff returns": 2,
      "kickoff return yards": 47,
      "interception returns": 1,
      "interception return yards": 8,
      "3rd down conversions": 4,
      "3rd down attempts": 10,
      "4th down conversions": 0,
      "4th down attempts": 0
    }
  },
  "BrighamYoung vs Wyoming": {
    "stadium": "QualcommStadium-SanDiego-CA",
    "BrighamYoung": {
      "points": 24,
      "1st downs": 14,
      "rushing 1st downs": 7,
      "passing 1st downs": 5,
      "penalty 1st downs": 2,
      "rushing yards": 216,
      "rushing attempts": 35,
      "passing yards": 96,
      "passing attempts": 15,
      "passing completions": 8,
      "passing interceptions": 1,
      "total yards": 312,
      "total plays": 50,
      "fumbles": 1,
      "fumbles lost": 1,
      "penalties": 5,
      "penalty yards": 60,
      "punts": 5,
      "punt yards": 198,
      "punt returns": 3,
      "punt return yards": 12,
      "kickoff returns": 3,
      "kickoff return yards": 66,
      "interception returns": 2,
      "interception return yards": 34,
      "3rd down conversions": 4,
      "3rd down attempts": 10,
      "4th down conversions": 0,
      "4th down attempts": 0
    },
    "Wyoming": {
      "points": 21,
      "1st downs": 22,
      "rushing 1st downs": 10,
      "passing 1st downs": 9,
      "penalty 1st downs": 3,
      "rushing yards": 166,
      "rushing attempts": 46,
      "passing yards": 207,
      "passing attempts": 33,
      "passing completions": 17,
      "passing interceptions": 2,
      "total yards": 373,
      "total plays": 79,
      "fumbles": 1,
      "fumbles lost": 0,
      "penalties": 7,
      "penalty yards": 59,
      "punts": 5,
      "punt yards": 189,
      "punt returns": 3,
      "punt return yards": 6,
      "kickoff returns": 3,
      "kickoff return yards": 48,
      "interception returns": 1,
      "interception return yards": 20,
      "3rd down conversions": 8,
      "3rd down attempts": 18,
      "4th down conversions": 3,
      "4th down attempts": 5
    }
  },
  "Idaho vs ColoradoState": {
    "stadium": "AlbertsonsStadium-Boise-ID",
    "Idaho": {
      "points": 61,
      "1st downs": 30,
      "rushing 1st downs": 13,
      "passing 1st downs": 16,
      "penalty 1st downs": 1,
      "rushing yards": 225,
      "rushing attempts": 51,
      "passing yards": 381,
      "passing attempts": 31,
      "passing completions": 21,
      "passing interceptions": 0,
      "total yards": 606,
      "total plays": 82,
      "fumbles": 1,
      "fumbles lost": 0,
      "penalties": 7,
      "penalty yards": 69,
      "punts": 7,
      "punt yards": 243,
      "punt returns": 1,
      "punt return yards": 4,
      "kickoff returns": 4,
      "kickoff return yards": 90,
      "interception returns": 2,
      "interception return yards": 0,
      "3rd down conversions": 7,
      "3rd down attempts": 16,
      "4th down conversions": 2,
      "4th down attempts": 2
    },
    "ColoradoState": {
      "points": 50,
      "1st downs": 25,
      "rushing 1st downs": 7,
      "passing 1st downs": 14,
      "penalty 1st downs": 4,
      "rushing yards": 155,
      "rushing attempts": 30,
      "passing yards": 445,
      "passing attempts": 36,
      "passing completions": 21,
      "passing interceptions": 2,
      "total yards": 600,
      "total plays": 66,
      "fumbles": 2,
      "fumbles lost": 1,
      "penalties": 10,
      "penalty yards": 92,
      "punts": 6,
      "punt yards": 255,
      "punt returns": 1,
      "punt return yards": -4,
      "kickoff returns": 9,
      "kickoff return yards": 163,
      "interception returns": 0,
      "interception return yards": 0,
      "3rd down conversions": 4,
      "3rd down attempts": 11,
      "4th down conversions": 0,
      "4th down attempts": 1
    }
  },
  "EasternMichigan vs OldDominion": {
    "stadium": "ThomasRobinsonStadium-Nassau-",
    "EasternMichigan": {
      "points": 20,
      "1st downs": 28,
      "rushing 1st downs": 8,
      "passing 1st downs": 16,
      "penalty 1st downs": 4,
      "rushing yards": 170,
      "rushing attempts": 38,
      "passing yards": 300,
      "passing attempts": 47,
      "passing completions": 26,
      "passing interceptions": 1,
      "total yards": 470,
      "total plays": 85,
      "fumbles": 1,
      "fumbles lost": 0,
      "penalties": 3,
      "penalty yards": 15,
      "punts": 3,
      "punt yards": 115,
      "punt returns": 1,
      "punt return yards": 0,
      "kickoff returns": 5,
      "kickoff return yards": 89,
      "interception returns": 1,
      "interception return yards": 27,
      "3rd down conversions": 13,
      "3rd down attempts": 20,
      "4th down conversions": 0,
      "4th down attempts": 1
    },
    "OldDominion": {
      "points": 24,
      "1st downs": 20,
      "rushing 1st downs": 13,
      "passing 1st downs": 7,
      "penalty 1st downs": 0,
      "rushing yards": 206,
      "rushing attempts": 39,
      "passing yards": 188,
      "passing attempts": 20,
      "passing completions": 11,
      "passing interceptions": 1,
      "total yards": 394,
      "total plays": 59,
      "fumbles": 0,
      "fumbles lost": 0,
      "penalties": 5,
      "penalty yards": 65,
      "punts": 4,
      "punt yards": 158,
      "punt returns": 0,
      "punt return yards": 0,
      "kickoff returns": 3,
      "kickoff return yards": 78,
      "interception returns": 1,
      "interception return yards": 0,
      "3rd down conversions": 5,
      "3rd down attempts": 11,
      "4th down conversions": 1,
      "4th down attempts": 1
    }
  },
  "LouisianaTech vs Navy": {
    "stadium": "AmonGCarterStadium-FortWorth-TX",
    "LouisianaTech": {
      "points": 48,
      "1st downs": 31,
      "rushing 1st downs": 7,
      "passing 1st downs": 19,
      "penalty 1st downs": 5,
      "rushing yards": 88,
      "rushing attempts": 33,
      "passing yards": 409,
      "passing attempts": 40,
      "passing completions": 29,
      "passing interceptions": 0,
      "total yards": 497,
      "total plays": 73,
      "fumbles": 2,
      "fumbles lost": 1,
      "penalties": 4,
      "penalty yards": 50,
      "punts": 2,
      "punt yards": 94,
      "punt returns": 0,
      "punt return yards": 0,
      "kickoff returns": 6,
      "kickoff return yards": 177,
      "interception returns": 0,
      "interception return yards": 0,
      "3rd down conversions": 7,
      "3rd down attempts": 10,
      "4th down conversions": 0,
      "4th down attempts": 0
    },
    "Navy": {
      "points": 45,
      "1st downs": 25,
      "rushing 1st downs": 17,
      "passing 1st downs": 5,
      "penalty 1st downs": 3,
      "rushing yards": 300,
      "rushing attempts": 49,
      "passing yards": 159,
      "passing attempts": 12,
      "passing completions": 7,
      "passing interceptions": 0,
      "total yards": 459,
      "total plays": 61,
      "fumbles": 2,
      "fumbles lost": 1,
      "penalties": 6,
      "penalty yards": 70,
      "punts": 3,
      "punt yards": 142,
      "punt returns": 2,
      "punt return yards": 31,
      "kickoff returns": 7,
      "kickoff return yards": 155,
      "interception returns": 0,
      "interception return yards": 0,
      "3rd down conversions": 6,
      "3rd down attempts": 11,
      "4th down conversions": 1,
      "4th down attempts": 1
    }
  },
  "Ohio vs Troy": {
    "stadium": "LaddPeeblesStadium-Mobile-AL",
    "Ohio": {
      "points": 23,
      "1st downs": 23,
      "rushing 1st downs": 6,
      "passing 1st downs": 12,
      "penalty 1st downs": 5,
      "rushing yards": 78,
      "rushing attempts": 30,
      "passing yards": 315,
      "passing attempts": 47,
      "passing completions": 23,
      "passing interceptions": 4,
      "total yards": 393,
      "total plays": 77,
      "fumbles": 2,
      "fumbles lost": 1,
      "penalties": 5,
      "penalty yards": 33,
      "punts": 2,
      "punt yards": 65,
      "punt returns": 3,
      "punt return yards": 23,
      "kickoff returns": 3,
      "kickoff return yards": 61,
      "interception returns": 2,
      "interception return yards": 0,
      "3rd down conversions": 5,
      "3rd down attempts": 13,
      "4th down conversions": 0,
      "4th down attempts": 1
    },
    "Troy": {
      "points": 28,
      "1st downs": 17,
      "rushing 1st downs": 3,
      "passing 1st downs": 13,
      "penalty 1st downs": 1,
      "rushing yards": 87,
      "rushing attempts": 31,
      "passing yards": 235,
      "passing attempts": 41,
      "passing completions": 24,
      "passing interceptions": 2,
      "total yards": 322,
      "total plays": 72,
      "fumbles": 1,
      "fumbles lost": 0,
      "penalties": 6,
      "penalty yards": 90,
      "punts": 7,
      "punt yards": 293,
      "punt returns": 0,
      "punt return yards": 0,
      "kickoff returns": 3,
      "kickoff return yards": 29,
      "interception returns": 4,
      "interception return yards": 10,
      "3rd down conversions": 8,
      "3rd down attempts": 17,
      "4th down conversions": 0,
      "4th down attempts": 0
    }
  },
  "Hawaii vs MiddleTennessee": {
    "stadium": "HawaiianTelFederalCreditUnionField-Honolulu-HI",
    "Hawaii": {
      "points": 52,
      "1st downs": 18,
      "rushing 1st downs": 8,
      "passing 1st downs": 10,
      "penalty 1st downs": 0,
      "rushing yards": 205,
      "rushing attempts": 42,
      "passing yards": 295,
      "passing attempts": 31,
      "passing completions": 21,
      "passing interceptions": 0,
      "total yards": 500,
      "total plays": 73,
      "fumbles": 0,
      "fumbles lost": 0,
      "penalties": 11,
      "penalty yards": 114,
      "punts": 3,
      "punt yards": 137,
      "punt returns": 0,
      "punt return yards": 0,
      "kickoff returns": 5,
      "kickoff return yards": 125,
      "interception returns": 2,
      "interception return yards": 68,
      "3rd down conversions": 8,
      "3rd down attempts": 16,
      "4th down conversions": 2,
      "4th down attempts": 4
    },
    "MiddleTennessee": {
      "points": 35,
      "1st downs": 29,
      "rushing 1st downs": 6,
      "passing 1st downs": 18,
      "penalty 1st downs": 5,
      "rushing yards": 110,
      "rushing attempts": 23,
      "passing yards": 432,
      "passing attempts": 51,
      "passing completions": 30,
      "passing interceptions": 2,
      "total yards": 542,
      "total plays": 74,
      "fumbles": 2,
      "fumbles lost": 1,
      "penalties": 9,
      "penalty yards": 90,
      "punts": 3,
      "punt yards": 134,
      "punt returns": 1,
      "punt return yards": 5,
      "kickoff returns": 3,
      "kickoff return yards": 56,
      "interception returns": 0,
      "interception return yards": 0,
      "3rd down conversions": 4,
      "3rd down attempts": 11,
      "4th down conversions": 1,
      "4th down attempts": 3
    }
  },
  "MiamiOH vs MississippiState": {
    "stadium": "TropicanaField-StPetersburg-FL",
    "MiamiOH": {
      "points": 16,
      "1st downs": 24,
      "rushing 1st downs": 12,
      "passing 1st downs": 11,
      "penalty 1st downs": 1,
      "rushing yards": 170,
      "rushing attempts": 35,
      "passing yards": 263,
      "passing attempts": 31,
      "passing completions": 22,
      "passing interceptions": 1,
      "total yards": 433,
      "total plays": 66,
      "fumbles": 1,
      "fumbles lost": 1,
      "penalties": 3,
      "penalty yards": 30,
      "punts": 2,
      "punt yards": 79,
      "punt returns": 0,
      "punt return yards": 0,
      "kickoff returns": 1,
      "kickoff return yards": 40,
      "interception returns": 0,
      "interception return yards": 0,
      "3rd down conversions": 3,
      "3rd down attempts": 9,
      "4th down conversions": 1,
      "4th down attempts": 3
    },
    "MississippiState": {
      "points": 17,
      "1st downs": 17,
      "rushing 1st downs": 9,
      "passing 1st downs": 6,
      "penalty 1st downs": 2,
      "rushing yards": 209,
      "rushing attempts": 33,
      "passing yards": 126,
      "passing attempts": 27,
      "passing completions": 13,
      "passing interceptions": 0,
      "total yards": 335,
      "total plays": 60,
      "fumbles": 0,
      "fumbles lost": 0,
      "penalties": 2,
      "penalty yards": 25,
      "punts": 4,
      "punt yards": 170,
      "punt returns": 1,
      "punt return yards": 7,
      "kickoff returns": 3,
      "kickoff return yards": 73,
      "interception returns": 1,
      "interception return yards": 21,
      "3rd down conversions": 7,
      "3rd down attempts": 14,
      "4th down conversions": 0,
      "4th down attempts": 2
    }
  },
  "Maryland vs BostonCollege": {
    "stadium": "FordField-Detroit-MI",
    "Maryland": {
      "points": 30,
      "1st downs": 17,
      "rushing 1st downs": 7,
      "passing 1st downs": 9,
      "penalty 1st downs": 1,
      "rushing yards": 128,
      "rushing attempts": 34,
      "passing yards": 229,
      "passing attempts": 35,
      "passing completions": 15,
      "passing interceptions": 1,
      "total yards": 357,
      "total plays": 69,
      "fumbles": 5,
      "fumbles lost": 3,
      "penalties": 11,
      "penalty yards": 86,
      "punts": 7,
      "punt yards": 277,
      "punt returns": 4,
      "punt return yards": 9,
      "kickoff returns": 5,
      "kickoff return yards": 133,
      "interception returns": 1,
      "interception return yards": 30,
      "3rd down conversions": 4,
      "3rd down attempts": 15,
      "4th down conversions": 0,
      "4th down attempts": 2
    },
    "BostonCollege": {
      "points": 36,
      "1st downs": 15,
      "rushing 1st downs": 8,
      "passing 1st downs": 7,
      "penalty 1st downs": 0,
      "rushing yards": 177,
      "rushing attempts": 52,
      "passing yards": 171,
      "passing attempts": 23,
      "passing completions": 11,
      "passing interceptions": 1,
      "total yards": 348,
      "total plays": 75,
      "fumbles": 4,
      "fumbles lost": 1,
      "penalties": 6,
      "penalty yards": 46,
      "punts": 8,
      "punt yards": 311,
      "punt returns": 3,
      "punt return yards": 5,
      "kickoff returns": 3,
      "kickoff return yards": 46,
      "interception returns": 1,
      "interception return yards": 20,
      "3rd down conversions": 4,
      "3rd down attempts": 19,
      "4th down conversions": 1,
      "4th down attempts": 2
    }
  },
  "NorthCarolinaState vs Vanderbilt": {
    "stadium": "IndependenceStadium-Shreveport-LA",
    "NorthCarolinaState": {
      "points": 41,
      "1st downs": 21,
      "rushing 1st downs": 5,
      "passing 1st downs": 14,
      "penalty 1st downs": 2,
      "rushing yards": 141,
      "rushing attempts": 36,
      "passing yards": 235,
      "passing attempts": 31,
      "passing completions": 19,
      "passing interceptions": 0,
      "total yards": 376,
      "total plays": 67,
      "fumbles": 1,
      "fumbles lost": 1,
      "penalties": 1,
      "penalty yards": 5,
      "punts": 5,
      "punt yards": 189,
      "punt returns": 2,
      "punt return yards": 48,
      "kickoff returns": 2,
      "kickoff return yards": 118,
      "interception returns": 3,
      "interception return yards": 57,
      "3rd down conversions": 8,
      "3rd down attempts": 15,
      "4th down conversions": 0,
      "4th down attempts": 2
    },
    "Vanderbilt": {
      "points": 17,
      "1st downs": 18,
      "rushing 1st downs": 7,
      "passing 1st downs": 11,
      "penalty 1st downs": 0,
      "rushing yards": 156,
      "rushing attempts": 35,
      "passing yards": 158,
      "passing attempts": 46,
      "passing completions": 19,
      "passing interceptions": 3,
      "total yards": 314,
      "total plays": 81,
      "fumbles": 1,
      "fumbles lost": 0,
      "penalties": 4,
      "penalty yards": 40,
      "punts": 4,
      "punt yards": 193,
      "punt returns": 1,
      "punt return yards": 71,
      "kickoff returns": 4,
      "kickoff return yards": 82,
      "interception returns": 0,
      "interception return yards": 0,
      "3rd down conversions": 6,
      "3rd down attempts": 18,
      "4th down conversions": 2,
      "4th down attempts": 4
    }
  },
  "Army vs NorthTexas": {
    "stadium": "CottonBowl-Dallas-TX",
    "Army": {
      "points": 38,
      "1st downs": 22,
      "rushing 1st downs": 20,
      "passing 1st downs": 2,
      "penalty 1st downs": 0,
      "rushing yards": 480,
      "rushing attempts": 74,
      "passing yards": 53,
      "passing attempts": 4,
      "passing completions": 2,
      "passing interceptions": 0,
      "total yards": 533,
      "total plays": 78,
      "fumbles": 1,
      "fumbles lost": 1,
      "penalties": 4,
      "penalty yards": 40,
      "punts": 2,
      "punt yards": 70,
      "punt returns": 2,
      "punt return yards": -3,
      "kickoff returns": 4,
      "kickoff return yards": 54,
      "interception returns": 2,
      "interception return yards": 3,
      "3rd down conversions": 11,
      "3rd down attempts": 17,
      "4th down conversions": 2,
      "4th down attempts": 4
    },
    "NorthTexas": {
      "points": 31,
      "1st downs": 19,
      "rushing 1st downs": 7,
      "passing 1st downs": 11,
      "penalty 1st downs": 1,
      "rushing yards": 96,
      "rushing attempts": 27,
      "passing yards": 314,
      "passing attempts": 40,
      "passing completions": 27,
      "passing interceptions": 2,
      "total yards": 410,
      "total plays": 67,
      "fumbles": 0,
      "fumbles lost": 0,
      "penalties": 6,
      "penalty yards": 55,
      "punts": 3,
      "punt yards": 128,
      "punt returns": 0,
      "punt return yards": 0,
      "kickoff returns": 6,
      "kickoff return yards": 126,
      "interception returns": 0,
      "interception return yards": 0,
      "3rd down conversions": 5,
      "3rd down attempts": 12,
      "4th down conversions": 1,
      "4th down attempts": 3
    }
  },
  "Temple vs WakeForest": {
    "stadium": "NavyMarineCorpsMemorialStadium-Annapolis-MD",
    "Temple": {
      "points": 26,
      "1st downs": 21,
      "rushing 1st downs": 5,
      "passing 1st downs": 14,
      "penalty 1st downs": 2,
      "rushing yards": 0,
      "rushing attempts": 23,
      "passing yards": 396,
      "passing attempts": 49,
      "passing completions": 28,
      "passing interceptions": 1,
      "total yards": 376,
      "total plays": 72,
      "fumbles": 3,
      "fumbles lost": 1,
      "penalties": 4,
      "penalty yards": 35,
      "punts": 5,
      "punt yards": 161,
      "punt returns": 1,
      "punt return yards": -1,
      "kickoff returns": 6,
      "kickoff return yards": 169,
      "interception returns": 2,
      "interception return yards": 0,
      "3rd down conversions": 1,
      "3rd down attempts": 12,
      "4th down conversions": 1,
      "4th down attempts": 2
    },
    "WakeForest": {
      "points": 34,
      "1st downs": 22,
      "rushing 1st downs": 10,
      "passing 1st downs": 11,
      "penalty 1st downs": 1,
      "rushing yards": 125,
      "rushing attempts": 43,
      "passing yards": 243,
      "passing attempts": 29,
      "passing completions": 14,
      "passing interceptions": 2,
      "total yards": 368,
      "total plays": 72,
      "fumbles": 2,
      "fumbles lost": 0,
      "penalties": 7,
      "penalty yards": 68,
      "punts": 5,
      "punt yards": 173,
      "punt returns": 3,
      "punt return yards": 2,
      "kickoff returns": 5,
      "kickoff return yards": 134,
      "interception returns": 1,
      "interception return yards": 1,
      "3rd down conversions": 6,
      "3rd down attempts": 14,
      "4th down conversions": 0,
      "4th down attempts": 0
    }
  },
  "Minnesota vs WashingtonState": {
    "stadium": "QualcommStadium-SanDiego-CA",
    "Minnesota": {
      "points": 17,
      "1st downs": 17,
      "rushing 1st downs": 8,
      "passing 1st downs": 8,
      "penalty 1st downs": 1,
      "rushing yards": 150,
      "rushing attempts": 41,
      "passing yards": 129,
      "passing attempts": 20,
      "passing completions": 11,
      "passing interceptions": 0,
      "total yards": 279,
      "total plays": 61,
      "fumbles": 1,
      "fumbles lost": 1,
      "penalties": 10,
      "penalty yards": 65,
      "punts": 7,
      "punt yards": 307,
      "punt returns": 2,
      "punt return yards": 3,
      "kickoff returns": 3,
      "kickoff return yards": 77,
      "interception returns": 1,
      "interception return yards": 23,
      "3rd down conversions": 3,
      "3rd down attempts": 12,
      "4th down conversions": 0,
      "4th down attempts": 0
    },
    "WashingtonState": {
      "points": 12,
      "1st downs": 16,
      "rushing 1st downs": 4,
      "passing 1st downs": 11,
      "penalty 1st downs": 1,
      "rushing yards": 39,
      "rushing attempts": 23,
      "passing yards": 264,
      "passing attempts": 51,
      "passing completions": 30,
      "passing interceptions": 1,
      "total yards": 303,
      "total plays": 74,
      "fumbles": 0,
      "fumbles lost": 0,
      "penalties": 7,
      "penalty yards": 56,
      "punts": 8,
      "punt yards": 324,
      "punt returns": 2,
      "punt return yards": 4,
      "kickoff returns": 3,
      "kickoff return yards": 48,
      "interception returns": 0,
      "interception return yards": 0,
      "3rd down conversions": 7,
      "3rd down attempts": 19,
      "4th down conversions": 1,
      "4th down attempts": 2
    }
  },
  "BoiseState vs Baylor": {
    "stadium": "ChaseField-Phoenix-AZ",
    "BoiseState": {
      "points": 12,
      "1st downs": 25,
      "rushing 1st downs": 8,
      "passing 1st downs": 16,
      "penalty 1st downs": 1,
      "rushing yards": 83,
      "rushing attempts": 38,
      "passing yards": 305,
      "passing attempts": 51,
      "passing completions": 32,
      "passing interceptions": 2,
      "total yards": 388,
      "total plays": 89,
      "fumbles": 2,
      "fumbles lost": 1,
      "penalties": 3,
      "penalty yards": 15,
      "punts": 3,
      "punt yards": 124,
      "punt returns": 2,
      "punt return yards": 6,
      "kickoff returns": 4,
      "kickoff return yards": 70,
      "interception returns": 1,
      "interception return yards": 0,
      "3rd down conversions": 8,
      "3rd down attempts": 19,
      "4th down conversions": 3,
      "4th down attempts": 5
    },
    "Baylor": {
      "points": 31,
      "1st downs": 29,
      "rushing 1st downs": 12,
      "passing 1st downs": 16,
      "penalty 1st downs": 1,
      "rushing yards": 140,
      "rushing attempts": 43,
      "passing yards": 375,
      "passing attempts": 40,
      "passing completions": 29,
      "passing interceptions": 1,
      "total yards": 515,
      "total plays": 83,
      "fumbles": 0,
      "fumbles lost": 0,
      "penalties": 11,
      "penalty yards": 125,
      "punts": 2,
      "punt yards": 96,
      "punt returns": 1,
      "punt return yards": 14,
      "kickoff returns": 2,
      "kickoff return yards": 40,
      "interception returns": 2,
      "interception return yards": 15,
      "3rd down conversions": 8,
      "3rd down attempts": 15,
      "4th down conversions": 0,
      "4th down attempts": 2
    }
  },
  "Pittsburgh vs Northwestern": {
    "stadium": "YankeeStadium-Bronx-NY",
    "Pittsburgh": {
      "points": 24,
      "1st downs": 18,
      "rushing 1st downs": 9,
      "passing 1st downs": 8,
      "penalty 1st downs": 1,
      "rushing yards": 169,
      "rushing attempts": 32,
      "passing yards": 269,
      "passing attempts": 29,
      "passing completions": 16,
      "passing interceptions": 3,
      "total yards": 438,
      "total plays": 61,
      "fumbles": 2,
      "fumbles lost": 1,
      "penalties": 5,
      "penalty yards": 50,
      "punts": 1,
      "punt yards": 41,
      "punt returns": 2,
      "punt return yards": 2,
      "kickoff returns": 5,
      "kickoff return yards": 50,
      "interception returns": 1,
      "interception return yards": 0,
      "3rd down conversions": 6,
      "3rd down attempts": 13,
      "4th down conversions": 0,
      "4th down attempts": 2
    },
    "Northwestern": {
      "points": 31,
      "1st downs": 27,
      "rushing 1st downs": 10,
      "passing 1st downs": 15,
      "penalty 1st downs": 2,
      "rushing yards": 248,
      "rushing attempts": 50,
      "passing yards": 214,
      "passing attempts": 36,
      "passing completions": 23,
      "passing interceptions": 1,
      "total yards": 462,
      "total plays": 86,
      "fumbles": 1,
      "fumbles lost": 1,
      "penalties": 4,
      "penalty yards": 35,
      "punts": 3,
      "punt yards": 120,
      "punt returns": 1,
      "punt return yards": 0,
      "kickoff returns": 3,
      "kickoff return yards": 47,
      "interception returns": 3,
      "interception return yards": 25,
      "3rd down conversions": 9,
      "3rd down attempts": 19,
      "4th down conversions": 4,
      "4th down attempts": 4
    }
  },
  "WestVirginia vs MiamiFL": {
    "stadium": "CampingWorldStadium-Orlando-FL",
    "WestVirginia": {
      "points": 14,
      "1st downs": 11,
      "rushing 1st downs": 3,
      "passing 1st downs": 6,
      "penalty 1st downs": 2,
      "rushing yards": 95,
      "rushing attempts": 39,
      "passing yards": 134,
      "passing attempts": 26,
      "passing completions": 17,
      "passing interceptions": 0,
      "total yards": 229,
      "total plays": 65,
      "fumbles": 1,
      "fumbles lost": 1,
      "penalties": 11,
      "penalty yards": 108,
      "punts": 8,
      "punt yards": 353,
      "punt returns": 0,
      "punt return yards": 0,
      "kickoff returns": 2,
      "kickoff return yards": 27,
      "interception returns": 0,
      "interception return yards": 0,
      "3rd down conversions": 6,
      "3rd down attempts": 17,
      "4th down conversions": 0,
      "4th down attempts": 2
    },
    "MiamiFL": {
      "points": 31,
      "1st downs": 21,
      "rushing 1st downs": 4,
      "passing 1st downs": 14,
      "penalty 1st downs": 3,
      "rushing yards": 81,
      "rushing attempts": 34,
      "passing yards": 282,
      "passing attempts": 34,
      "passing completions": 24,
      "passing interceptions": 0,
      "total yards": 363,
      "total plays": 68,
      "fumbles": 1,
      "fumbles lost": 0,
      "penalties": 8,
      "penalty yards": 89,
      "punts": 7,
      "punt yards": 281,
      "punt returns": 3,
      "punt return yards": 11,
      "kickoff returns": 1,
      "kickoff return yards": 20,
      "interception returns": 0,
      "interception return yards": 0,
      "3rd down conversions": 3,
      "3rd down attempts": 12,
      "4th down conversions": 0,
      "4th down attempts": 1
    }
  },
  "Indiana vs Utah": {
    "stadium": "LevisStadium-SantaClara-CA",
    "Indiana": {
      "points": 24,
      "1st downs": 22,
      "rushing 1st downs": 8,
      "passing 1st downs": 11,
      "penalty 1st downs": 3,
      "rushing yards": 117,
      "rushing attempts": 37,
      "passing yards": 224,
      "passing attempts": 40,
      "passing completions": 15,
      "passing interceptions": 1,
      "total yards": 341,
      "total plays": 77,
      "fumbles": 2,
      "fumbles lost": 2,
      "penalties": 4,
      "penalty yards": 24,
      "punts": 6,
      "punt yards": 255,
      "punt returns": 2,
      "punt return yards": 12,
      "kickoff returns": 6,
      "kickoff return yards": 129,
      "interception returns": 1,
      "interception return yards": 0,
      "3rd down conversions": 6,
      "3rd down attempts": 15,
      "4th down conversions": 1,
      "4th down attempts": 1
    },
    "Utah": {
      "points": 26,
      "1st downs": 21,
      "rushing 1st downs": 12,
      "passing 1st downs": 8,
      "penalty 1st downs": 1,
      "rushing yards": 256,
      "rushing attempts": 52,
      "passing yards": 214,
      "passing attempts": 24,
      "passing completions": 12,
      "passing interceptions": 1,
      "total yards": 470,
      "total plays": 76,
      "fumbles": 4,
      "fumbles lost": 3,
      "penalties": 9,
      "penalty yards": 86,
      "punts": 4,
      "punt yards": 174,
      "punt returns": 5,
      "punt return yards": 35,
      "kickoff returns": 2,
      "kickoff return yards": 19,
      "interception returns": 1,
      "interception return yards": 0,
      "3rd down conversions": 7,
      "3rd down attempts": 16,
      "4th down conversions": 1,
      "4th down attempts": 1
    }
  },
  "TexasAM vs KansasState": {
    "stadium": "NRGStadium-Houston-TX",
    "TexasAM": {
      "points": 28,
      "1st downs": 26,
      "rushing 1st downs": 7,
      "passing 1st downs": 16,
      "penalty 1st downs": 3,
      "rushing yards": 144,
      "rushing attempts": 28,
      "passing yards": 310,
      "passing attempts": 48,
      "passing completions": 30,
      "passing interceptions": 1,
      "total yards": 454,
      "total plays": 76,
      "fumbles": 1,
      "fumbles lost": 1,
      "penalties": 8,
      "penalty yards": 75,
      "punts": 3,
      "punt yards": 108,
      "punt returns": 2,
      "punt return yards": 12,
      "kickoff returns": 2,
      "kickoff return yards": 33,
      "interception returns": 0,
      "interception return yards": 0,
      "3rd down conversions": 4,
      "3rd down attempts": 12,
      "4th down conversions": 1,
      "4th down attempts": 2
    },
    "KansasState": {
      "points": 33,
      "1st downs": 18,
      "rushing 1st downs": 9,
      "passing 1st downs": 6,
      "penalty 1st downs": 3,
      "rushing yards": 218,
      "rushing attempts": 41,
      "passing yards": 195,
      "passing attempts": 20,
      "passing completions": 14,
      "passing interceptions": 0,
      "total yards": 413,
      "total plays": 61,
      "fumbles": 0,
      "fumbles lost": 0,
      "penalties": 11,
      "penalty yards": 95,
      "punts": 4,
      "punt yards": 170,
      "punt returns": 0,
      "punt return yards": 0,
      "kickoff returns": 3,
      "kickoff return yards": 80,
      "interception returns": 1,
      "interception return yards": 0,
      "3rd down conversions": 4,
      "3rd down attempts": 12,
      "4th down conversions": 0,
      "4th down attempts": 1
    }
  },
  "SouthFlorida vs SouthCarolina": {
    "stadium": "LegionField-Birmingham-AL",
    "SouthFlorida": {
      "points": 46,
      "1st downs": 24,
      "rushing 1st downs": 10,
      "passing 1st downs": 13,
      "penalty 1st downs": 1,
      "rushing yards": 208,
      "rushing attempts": 48,
      "passing yards": 261,
      "passing attempts": 32,
      "passing completions": 23,
      "passing interceptions": 1,
      "total yards": 469,
      "total plays": 80,
      "fumbles": 3,
      "fumbles lost": 1,
      "penalties": 5,
      "penalty yards": 50,
      "punts": 4,
      "punt yards": 166,
      "punt returns": 1,
      "punt return yards": 2,
      "kickoff returns": 4,
      "kickoff return yards": 102,
      "interception returns": 2,
      "interception return yards": 68,
      "3rd down conversions": 7,
      "3rd down attempts": 17,
      "4th down conversions": 2,
      "4th down attempts": 3
    },
    "SouthCarolina": {
      "points": 39,
      "1st downs": 27,
      "rushing 1st downs": 4,
      "passing 1st downs": 20,
      "penalty 1st downs": 3,
      "rushing yards": 91,
      "rushing attempts": 34,
      "passing yards": 390,
      "passing attempts": 43,
      "passing completions": 32,
      "passing interceptions": 2,
      "total yards": 481,
      "total plays": 77,
      "fumbles": 4,
      "fumbles lost": 3,
      "penalties": 3,
      "penalty yards": 35,
      "punts": 2,
      "punt yards": 88,
      "punt returns": 3,
      "punt return yards": 48,
      "kickoff returns": 4,
      "kickoff return yards": 97,
      "interception returns": 1,
      "interception return yards": 0,
      "3rd down conversions": 4,
      "3rd down attempts": 13,
      "4th down conversions": 2,
      "4th down attempts": 4
    }
  },
  "Arkansas vs VirginiaTech": {
    "stadium": "BankofAmericaStadium-Charlotte-NC",
    "Arkansas": {
      "points": 24,
      "1st downs": 14,
      "rushing 1st downs": 1,
      "passing 1st downs": 12,
      "penalty 1st downs": 1,
      "rushing yards": 36,
      "rushing attempts": 34,
      "passing yards": 278,
      "passing attempts": 31,
      "passing completions": 18,
      "passing interceptions": 3,
      "total yards": 314,
      "total plays": 65,
      "fumbles": 1,
      "fumbles lost": 1,
      "penalties": 12,
      "penalty yards": 75,
      "punts": 7,
      "punt yards": 304,
      "punt returns": 1,
      "punt return yards": 21,
      "kickoff returns": 1,
      "kickoff return yards": 16,
      "interception returns": 1,
      "interception return yards": 50,
      "3rd down conversions": 2,
      "3rd down attempts": 14,
      "4th down conversions": 0,
      "4th down attempts": 0
    },
    "VirginiaTech": {
      "points": 35,
      "1st downs": 25,
      "rushing 1st downs": 9,
      "passing 1st downs": 14,
      "penalty 1st downs": 2,
      "rushing yards": 159,
      "rushing attempts": 44,
      "passing yards": 243,
      "passing attempts": 34,
      "passing completions": 21,
      "passing interceptions": 1,
      "total yards": 402,
      "total plays": 78,
      "fumbles": 2,
      "fumbles lost": 1,
      "penalties": 4,
      "penalty yards": 45,
      "punts": 6,
      "punt yards": 235,
      "punt returns": 1,
      "punt return yards": 5,
      "kickoff returns": 4,
      "kickoff return yards": 78,
      "interception returns": 3,
      "interception return yards": 18,
      "3rd down conversions": 7,
      "3rd down attempts": 15,
      "4th down conversions": 0,
      "4th down attempts": 1
    }
  },
  "OklahomaState vs Colorado": {
    "stadium": "Alamodome-SanAntonio-TX",
    "OklahomaState": {
      "points": 38,
      "1st downs": 24,
      "rushing 1st downs": 8,
      "passing 1st downs": 15,
      "penalty 1st downs": 1,
      "rushing yards": 189,
      "rushing attempts": 41,
      "passing yards": 338,
      "passing attempts": 33,
      "passing completions": 23,
      "passing interceptions": 0,
      "total yards": 527,
      "total plays": 74,
      "fumbles": 0,
      "fumbles lost": 0,
      "penalties": 5,
      "penalty yards": 42,
      "punts": 4,
      "punt yards": 191,
      "punt returns": 0,
      "punt return yards": 0,
      "kickoff returns": 1,
      "kickoff return yards": 6,
      "interception returns": 1,
      "interception return yards": 1,
      "3rd down conversions": 7,
      "3rd down attempts": 14,
      "4th down conversions": 1,
      "4th down attempts": 1
    },
    "Colorado": {
      "points": 8,
      "1st downs": 19,
      "rushing 1st downs": 6,
      "passing 1st downs": 11,
      "penalty 1st downs": 2,
      "rushing yards": 62,
      "rushing attempts": 29,
      "passing yards": 256,
      "passing attempts": 38,
      "passing completions": 22,
      "passing interceptions": 1,
      "total yards": 318,
      "total plays": 67,
      "fumbles": 3,
      "fumbles lost": 0,
      "penalties": 5,
      "penalty yards": 35,
      "punts": 6,
      "punt yards": 248,
      "punt returns": 1,
      "punt return yards": -6,
      "kickoff returns": 3,
      "kickoff return yards": 64,
      "interception returns": 0,
      "interception return yards": 0,
      "3rd down conversions": 6,
      "3rd down attempts": 16,
      "4th down conversions": 1,
      "4th down attempts": 3
    }
  },
  "Georgia vs TCU": {
    "stadium": "LibertyBowlMemorialStadium-Memphis-TN",
    "Georgia": {
      "points": 31,
      "1st downs": 17,
      "rushing 1st downs": 11,
      "passing 1st downs": 5,
      "penalty 1st downs": 1,
      "rushing yards": 248,
      "rushing attempts": 44,
      "passing yards": 164,
      "passing attempts": 21,
      "passing completions": 12,
      "passing interceptions": 0,
      "total yards": 412,
      "total plays": 65,
      "fumbles": 2,
      "fumbles lost": 1,
      "penalties": 7,
      "penalty yards": 45,
      "punts": 5,
      "punt yards": 174,
      "punt returns": 2,
      "punt return yards": 1,
      "kickoff returns": 5,
      "kickoff return yards": 76,
      "interception returns": 0,
      "interception return yards": 0,
      "3rd down conversions": 7,
      "3rd down attempts": 14,
      "4th down conversions": 1,
      "4th down attempts": 1
    },
    "TCU": {
      "points": 23,
      "1st downs": 17,
      "rushing 1st downs": 8,
      "passing 1st downs": 7,
      "penalty 1st downs": 2,
      "rushing yards": 175,
      "rushing attempts": 39,
      "passing yards": 146,
      "passing attempts": 28,
      "passing completions": 18,
      "passing interceptions": 0,
      "total yards": 321,
      "total plays": 67,
      "fumbles": 2,
      "fumbles lost": 2,
      "penalties": 2,
      "penalty yards": 10,
      "punts": 3,
      "punt yards": 121,
      "punt returns": 0,
      "punt return yards": 0,
      "kickoff returns": 5,
      "kickoff return yards": 149,
      "interception returns": 0,
      "interception return yards": 0,
      "3rd down conversions": 6,
      "3rd down attempts": 14,
      "4th down conversions": 1,
      "4th down attempts": 2
    }
  },
  "Stanford vs NorthCarolina": {
    "stadium": "SunBowlStadium-ElPaso-TX",
    "Stanford": {
      "points": 25,
      "1st downs": 16,
      "rushing 1st downs": 8,
      "passing 1st downs": 6,
      "penalty 1st downs": 2,
      "rushing yards": 129,
      "rushing attempts": 43,
      "passing yards": 154,
      "passing attempts": 18,
      "passing completions": 9,
      "passing interceptions": 0,
      "total yards": 283,
      "total plays": 61,
      "fumbles": 0,
      "fumbles lost": 0,
      "penalties": 12,
      "penalty yards": 85,
      "punts": 5,
      "punt yards": 248,
      "punt returns": 1,
      "punt return yards": -4,
      "kickoff returns": 1,
      "kickoff return yards": 26,
      "interception returns": 2,
      "interception return yards": 64,
      "3rd down conversions": 5,
      "3rd down attempts": 15,
      "4th down conversions": 0,
      "4th down attempts": 0
    },
    "NorthCarolina": {
      "points": 23,
      "1st downs": 26,
      "rushing 1st downs": 8,
      "passing 1st downs": 15,
      "penalty 1st downs": 3,
      "rushing yards": 118,
      "rushing attempts": 37,
      "passing yards": 280,
      "passing attempts": 39,
      "passing completions": 23,
      "passing interceptions": 2,
      "total yards": 398,
      "total plays": 76,
      "fumbles": 1,
      "fumbles lost": 1,
      "penalties": 7,
      "penalty yards": 50,
      "punts": 4,
      "punt yards": 180,
      "punt returns": 2,
      "punt return yards": 7,
      "kickoff returns": 1,
      "kickoff return yards": 19,
      "interception returns": 0,
      "interception return yards": 0,
      "3rd down conversions": 5,
      "3rd down attempts": 13,
      "4th down conversions": 0,
      "4th down attempts": 0
    }
  },
  "Nebraska vs Tennessee": {
    "stadium": "NissanStadium-Nashville-TN",
    "Nebraska": {
      "points": 24,
      "1st downs": 18,
      "rushing 1st downs": 5,
      "passing 1st downs": 12,
      "penalty 1st downs": 1,
      "rushing yards": 61,
      "rushing attempts": 28,
      "passing yards": 257,
      "passing attempts": 42,
      "passing completions": 19,
      "passing interceptions": 0,
      "total yards": 318,
      "total plays": 70,
      "fumbles": 3,
      "fumbles lost": 1,
      "penalties": 7,
      "penalty yards": 41,
      "punts": 7,
      "punt yards": 299,
      "punt returns": 0,
      "punt return yards": 0,
      "kickoff returns": 2,
      "kickoff return yards": 28,
      "interception returns": 0,
      "interception return yards": 0,
      "3rd down conversions": 5,
      "3rd down attempts": 16,
      "4th down conversions": 0,
      "4th down attempts": 2
    },
    "Tennessee": {
      "points": 38,
      "1st downs": 25,
      "rushing 1st downs": 12,
      "passing 1st downs": 12,
      "penalty 1st downs": 1,
      "rushing yards": 230,
      "rushing attempts": 38,
      "passing yards": 291,
      "passing attempts": 38,
      "passing completions": 23,
      "passing interceptions": 0,
      "total yards": 521,
      "total plays": 76,
      "fumbles": 1,
      "fumbles lost": 1,
      "penalties": 6,
      "penalty yards": 65,
      "punts": 6,
      "punt yards": 260,
      "punt returns": 1,
      "punt return yards": 1,
      "kickoff returns": 3,
      "kickoff return yards": 73,
      "interception returns": 0,
      "interception return yards": 0,
      "3rd down conversions": 6,
      "3rd down attempts": 14,
      "4th down conversions": 0,
      "4th down attempts": 1
    }
  },
  "SouthAlabama vs AirForce": {
    "stadium": "ArizonaStadium-Tucson-AZ",
    "SouthAlabama": {
      "points": 21,
      "1st downs": 13,
      "rushing 1st downs": 6,
      "passing 1st downs": 7,
      "penalty 1st downs": 0,
      "rushing yards": 68,
      "rushing attempts": 21,
      "passing yards": 245,
      "passing attempts": 26,
      "passing completions": 10,
      "passing interceptions": 1,
      "total yards": 313,
      "total plays": 47,
      "fumbles": 2,
      "fumbles lost": 2,
      "penalties": 9,
      "penalty yards": 71,
      "punts": 5,
      "punt yards": 185,
      "punt returns": 1,
      "punt return yards": 5,
      "kickoff returns": 4,
      "kickoff return yards": 46,
      "interception returns": 0,
      "interception return yards": 0,
      "3rd down conversions": 3,
      "3rd down attempts": 8,
      "4th down conversions": 0,
      "4th down attempts": 0
    },
    "AirForce": {
      "points": 45,
      "1st downs": 24,
      "rushing 1st downs": 14,
      "passing 1st downs": 6,
      "penalty 1st downs": 4,
      "rushing yards": 253,
      "rushing attempts": 63,
      "passing yards": 207,
      "passing attempts": 10,
      "passing completions": 7,
      "passing interceptions": 0,
      "total yards": 460,
      "total plays": 73,
      "fumbles": 1,
      "fumbles lost": 0,
      "penalties": 5,
      "penalty yards": 25,
      "punts": 2,
      "punt yards": 73,
      "punt returns": 0,
      "punt return yards": 0,
      "kickoff returns": 2,
      "kickoff return yards": 44,
      "interception returns": 1,
      "interception return yards": 0,
      "3rd down conversions": 5,
      "3rd down attempts": 13,
      "4th down conversions": 0,
      "4th down attempts": 1
    }
  },
  "Michigan vs FloridaState": {
    "stadium": "HardRockStadium-MiamiGardens-FL",
    "Michigan": {
      "points": 32,
      "1st downs": 16,
      "rushing 1st downs": 5,
      "passing 1st downs": 10,
      "penalty 1st downs": 1,
      "rushing yards": 89,
      "rushing attempts": 36,
      "passing yards": 163,
      "passing attempts": 38,
      "passing completions": 21,
      "passing interceptions": 1,
      "total yards": 252,
      "total plays": 74,
      "fumbles": 0,
      "fumbles lost": 0,
      "penalties": 4,
      "penalty yards": 37,
      "punts": 8,
      "punt yards": 379,
      "punt returns": 2,
      "punt return yards": -1,
      "kickoff returns": 2,
      "kickoff return yards": 40,
      "interception returns": 1,
      "interception return yards": 14,
      "3rd down conversions": 7,
      "3rd down attempts": 20,
      "4th down conversions": 1,
      "4th down attempts": 2
    },
    "FloridaState": {
      "points": 33,
      "1st downs": 15,
      "rushing 1st downs": 7,
      "passing 1st downs": 5,
      "penalty 1st downs": 3,
      "rushing yards": 149,
      "rushing attempts": 35,
      "passing yards": 222,
      "passing attempts": 27,
      "passing completions": 9,
      "passing interceptions": 1,
      "total yards": 371,
      "total plays": 62,
      "fumbles": 2,
      "fumbles lost": 1,
      "penalties": 7,
      "penalty yards": 65,
      "punts": 5,
      "punt yards": 190,
      "punt returns": 3,
      "punt return yards": 6,
      "kickoff returns": 1,
      "kickoff return yards": 66,
      "interception returns": 1,
      "interception return yards": 0,
      "3rd down conversions": 3,
      "3rd down attempts": 13,
      "4th down conversions": 1,
      "4th down attempts": 1
    }
  },
  "GeorgiaTech vs Kentucky": {
    "stadium": "EverBankField-Jacksonville-FL",
    "GeorgiaTech": {
      "points": 33,
      "1st downs": 22,
      "rushing 1st downs": 16,
      "passing 1st downs": 4,
      "penalty 1st downs": 2,
      "rushing yards": 266,
      "rushing attempts": 51,
      "passing yards": 105,
      "passing attempts": 14,
      "passing completions": 6,
      "passing interceptions": 0,
      "total yards": 371,
      "total plays": 65,
      "fumbles": 2,
      "fumbles lost": 0,
      "penalties": 8,
      "penalty yards": 74,
      "punts": 2,
      "punt yards": 76,
      "punt returns": 2,
      "punt return yards": 16,
      "kickoff returns": 3,
      "kickoff return yards": 74,
      "interception returns": 0,
      "interception return yards": 0,
      "3rd down conversions": 5,
      "3rd down attempts": 13,
      "4th down conversions": 2,
      "4th down attempts": 2
    },
    "Kentucky": {
      "points": 18,
      "1st downs": 19,
      "rushing 1st downs": 9,
      "passing 1st downs": 10,
      "penalty 1st downs": 0,
      "rushing yards": 149,
      "rushing attempts": 36,
      "passing yards": 175,
      "passing attempts": 34,
      "passing completions": 19,
      "passing interceptions": 0,
      "total yards": 324,
      "total plays": 70,
      "fumbles": 1,
      "fumbles lost": 1,
      "penalties": 6,
      "penalty yards": 61,
      "punts": 3,
      "punt yards": 102,
      "punt returns": 2,
      "punt return yards": 13,
      "kickoff returns": 0,
      "kickoff return yards": 0,
      "interception returns": 0,
      "interception return yards": 0,
      "3rd down conversions": 6,
      "3rd down attempts": 16,
      "4th down conversions": 2,
      "4th down attempts": 4
    }
  },
  "LSU vs Louisville": {
    "stadium": "CampingWorldStadium-Orlando-FL",
    "LSU": {
      "points": 29,
      "1st downs": 20,
      "rushing 1st downs": 5,
      "passing 1st downs": 11,
      "penalty 1st downs": 4,
      "rushing yards": 177,
      "rushing attempts": 41,
      "passing yards": 217,
      "passing attempts": 29,
      "passing completions": 16,
      "passing interceptions": 1,
      "total yards": 394,
      "total plays": 70,
      "fumbles": 0,
      "fumbles lost": 0,
      "penalties": 4,
      "penalty yards": 48,
      "punts": 6,
      "punt yards": 219,
      "punt returns": 4,
      "punt return yards": 45,
      "kickoff returns": 3,
      "kickoff return yards": 81,
      "interception returns": 0,
      "interception return yards": 0,
      "3rd down conversions": 7,
      "3rd down attempts": 17,
      "4th down conversions": 0,
      "4th down attempts": 0
    },
    "Louisville": {
      "points": 9,
      "1st downs": 11,
      "rushing 1st downs": 4,
      "passing 1st downs": 6,
      "penalty 1st downs": 1,
      "rushing yards": 67,
      "rushing attempts": 35,
      "passing yards": 153,
      "passing attempts": 27,
      "passing completions": 10,
      "passing interceptions": 0,
      "total yards": 220,
      "total plays": 62,
      "fumbles": 1,
      "fumbles lost": 1,
      "penalties": 8,
      "penalty yards": 56,
      "punts": 8,
      "punt yards": 404,
      "punt returns": 2,
      "punt return yards": -4,
      "kickoff returns": 4,
      "kickoff return yards": 64,
      "interception returns": 1,
      "interception return yards": 1,
      "3rd down conversions": 2,
      "3rd down attempts": 17,
      "4th down conversions": 1,
      "4th down attempts": 2
    }
  },
  "Washington vs Alabama": {
    "stadium": "GeorgiaDome-Atlanta-GA",
    "Washington": {
      "points": 7,
      "1st downs": 14,
      "rushing 1st downs": 6,
      "passing 1st downs": 8,
      "penalty 1st downs": 0,
      "rushing yards": 44,
      "rushing attempts": 29,
      "passing yards": 150,
      "passing attempts": 38,
      "passing completions": 20,
      "passing interceptions": 2,
      "total yards": 194,
      "total plays": 67,
      "fumbles": 1,
      "fumbles lost": 1,
      "penalties": 3,
      "penalty yards": 10,
      "punts": 9,
      "punt yards": 423,
      "punt returns": 2,
      "punt return yards": 5,
      "kickoff returns": 3,
      "kickoff return yards": 47,
      "interception returns": 0,
      "interception return yards": 0,
      "3rd down conversions": 6,
      "3rd down attempts": 17,
      "4th down conversions": 0,
      "4th down attempts": 1
    },
    "Alabama": {
      "points": 24,
      "1st downs": 16,
      "rushing 1st downs": 13,
      "passing 1st downs": 3,
      "penalty 1st downs": 0,
      "rushing yards": 269,
      "rushing attempts": 50,
      "passing yards": 57,
      "passing attempts": 14,
      "passing completions": 7,
      "passing interceptions": 0,
      "total yards": 326,
      "total plays": 64,
      "fumbles": 1,
      "fumbles lost": 0,
      "penalties": 11,
      "penalty yards": 66,
      "punts": 8,
      "punt yards": 367,
      "punt returns": 1,
      "punt return yards": 3,
      "kickoff returns": 2,
      "kickoff return yards": 45,
      "interception returns": 2,
      "interception return yards": 54,
      "3rd down conversions": 4,
      "3rd down attempts": 14,
      "4th down conversions": 0,
      "4th down attempts": 1
    }
  },
  "OhioState vs Clemson": {
    "stadium": "UniversityofPhoenixStadium-Glendale-AZ",
    "OhioState": {
      "points": 0,
      "1st downs": 9,
      "rushing 1st downs": 3,
      "passing 1st downs": 4,
      "penalty 1st downs": 2,
      "rushing yards": 88,
      "rushing attempts": 23,
      "passing yards": 127,
      "passing attempts": 33,
      "passing completions": 19,
      "passing interceptions": 2,
      "total yards": 215,
      "total plays": 56,
      "fumbles": 2,
      "fumbles lost": 1,
      "penalties": 8,
      "penalty yards": 72,
      "punts": 7,
      "punt yards": 348,
      "punt returns": 1,
      "punt return yards": -1,
      "kickoff returns": 5,
      "kickoff return yards": 128,
      "interception returns": 2,
      "interception return yards": 0,
      "3rd down conversions": 3,
      "3rd down attempts": 14,
      "4th down conversions": 0,
      "4th down attempts": 2
    },
    "Clemson": {
      "points": 31,
      "1st downs": 24,
      "rushing 1st downs": 12,
      "passing 1st downs": 11,
      "penalty 1st downs": 1,
      "rushing yards": 205,
      "rushing attempts": 48,
      "passing yards": 265,
      "passing attempts": 37,
      "passing completions": 24,
      "passing interceptions": 2,
      "total yards": 470,
      "total plays": 85,
      "fumbles": 0,
      "fumbles lost": 0,
      "penalties": 5,
      "penalty yards": 60,
      "punts": 5,
      "punt yards": 206,
      "punt returns": 2,
      "punt return yards": 16,
      "kickoff returns": 0,
      "kickoff return yards": 0,
      "interception returns": 2,
      "interception return yards": 104,
      "3rd down conversions": 8,
      "3rd down attempts": 17,
      "4th down conversions": 0,
      "4th down attempts": 1
    }
  },
  "Florida vs Iowa": {
    "stadium": "RaymondJamesStadium-Tampa-FL",
    "Florida": {
      "points": 30,
      "1st downs": 11,
      "rushing 1st downs": 6,
      "passing 1st downs": 5,
      "penalty 1st downs": 0,
      "rushing yards": 109,
      "rushing attempts": 32,
      "passing yards": 222,
      "passing attempts": 25,
      "passing completions": 14,
      "passing interceptions": 2,
      "total yards": 331,
      "total plays": 57,
      "fumbles": 1,
      "fumbles lost": 0,
      "penalties": 8,
      "penalty yards": 60,
      "punts": 4,
      "punt yards": 182,
      "punt returns": 2,
      "punt return yards": 41,
      "kickoff returns": 0,
      "kickoff return yards": 0,
      "interception returns": 3,
      "interception return yards": 111,
      "3rd down conversions": 6,
      "3rd down attempts": 15,
      "4th down conversions": 0,
      "4th down attempts": 0
    },
    "Iowa": {
      "points": 3,
      "1st downs": 14,
      "rushing 1st downs": 9,
      "passing 1st downs": 3,
      "penalty 1st downs": 2,
      "rushing yards": 171,
      "rushing attempts": 41,
      "passing yards": 55,
      "passing attempts": 24,
      "passing completions": 7,
      "passing interceptions": 3,
      "total yards": 226,
      "total plays": 65,
      "fumbles": 1,
      "fumbles lost": 0,
      "penalties": 1,
      "penalty yards": 10,
      "punts": 7,
      "punt yards": 275,
      "punt returns": 1,
      "punt return yards": 19,
      "kickoff returns": 2,
      "kickoff return yards": 70,
      "interception returns": 2,
      "interception return yards": 0,
      "3rd down conversions": 4,
      "3rd down attempts": 16,
      "4th down conversions": 0,
      "4th down attempts": 1
    }
  },
  "WesternMichigan vs Wisconsin": {
    "stadium": "ATTStadium-Arlington-TX",
    "WesternMichigan": {
      "points": 16,
      "1st downs": 18,
      "rushing 1st downs": 9,
      "passing 1st downs": 9,
      "penalty 1st downs": 0,
      "rushing yards": 123,
      "rushing attempts": 31,
      "passing yards": 157,
      "passing attempts": 28,
      "passing completions": 16,
      "passing interceptions": 1,
      "total yards": 280,
      "total plays": 59,
      "fumbles": 3,
      "fumbles lost": 0,
      "penalties": 2,
      "penalty yards": 15,
      "punts": 3,
      "punt yards": 122,
      "punt returns": 1,
      "punt return yards": 1,
      "kickoff returns": 1,
      "kickoff return yards": 15,
      "interception returns": 0,
      "interception return yards": 0,
      "3rd down conversions": 5,
      "3rd down attempts": 11,
      "4th down conversions": 2,
      "4th down attempts": 2
    },
    "Wisconsin": {
      "points": 24,
      "1st downs": 18,
      "rushing 1st downs": 9,
      "passing 1st downs": 9,
      "penalty 1st downs": 0,
      "rushing yards": 184,
      "rushing attempts": 38,
      "passing yards": 178,
      "passing attempts": 14,
      "passing completions": 13,
      "passing interceptions": 0,
      "total yards": 362,
      "total plays": 52,
      "fumbles": 0,
      "fumbles lost": 0,
      "penalties": 5,
      "penalty yards": 35,
      "punts": 3,
      "punt yards": 125,
      "punt returns": 0,
      "punt return yards": 0,
      "kickoff returns": 0,
      "kickoff return yards": 1,
      "interception returns": 1,
      "interception return yards": 0,
      "3rd down conversions": 7,
      "3rd down attempts": 11,
      "4th down conversions": 0,
      "4th down attempts": 0
    }
  },
  "USC vs PennState": {
    "stadium": "RoseBowl-Pasadena-CA",
    "USC": {
      "points": 52,
      "1st downs": 33,
      "rushing 1st downs": 6,
      "passing 1st downs": 23,
      "penalty 1st downs": 4,
      "rushing yards": 122,
      "rushing attempts": 34,
      "passing yards": 453,
      "passing attempts": 54,
      "passing completions": 33,
      "passing interceptions": 1,
      "total yards": 575,
      "total plays": 88,
      "fumbles": 0,
      "fumbles lost": 0,
      "penalties": 10,
      "penalty yards": 85,
      "punts": 4,
      "punt yards": 177,
      "punt returns": 3,
      "punt return yards": 19,
      "kickoff returns": 6,
      "kickoff return yards": 114,
      "interception returns": 3,
      "interception return yards": 53,
      "3rd down conversions": 8,
      "3rd down attempts": 15,
      "4th down conversions": 0,
      "4th down attempts": 0
    },
    "PennState": {
      "points": 49,
      "1st downs": 23,
      "rushing 1st downs": 8,
      "passing 1st downs": 12,
      "penalty 1st downs": 3,
      "rushing yards": 211,
      "rushing attempts": 33,
      "passing yards": 254,
      "passing attempts": 29,
      "passing completions": 18,
      "passing interceptions": 3,
      "total yards": 465,
      "total plays": 62,
      "fumbles": 1,
      "fumbles lost": 0,
      "penalties": 5,
      "penalty yards": 65,
      "punts": 5,
      "punt yards": 254,
      "punt returns": 1,
      "punt return yards": 18,
      "kickoff returns": 5,
      "kickoff return yards": 111,
      "interception returns": 1,
      "interception return yards": 24,
      "3rd down conversions": 4,
      "3rd down attempts": 10,
      "4th down conversions": 0,
      "4th down attempts": 0
    }
  },
  "Auburn vs Oklahoma": {
    "stadium": "MercedesBenzSuperdome-NewOrleans-LA",
    "Auburn": {
      "points": 19,
      "1st downs": 22,
      "rushing 1st downs": 14,
      "passing 1st downs": 7,
      "penalty 1st downs": 1,
      "rushing yards": 185,
      "rushing attempts": 46,
      "passing yards": 154,
      "passing attempts": 27,
      "passing completions": 13,
      "passing interceptions": 1,
      "total yards": 339,
      "total plays": 73,
      "fumbles": 0,
      "fumbles lost": 0,
      "penalties": 6,
      "penalty yards": 63,
      "punts": 5,
      "punt yards": 246,
      "punt returns": 1,
      "punt return yards": 2,
      "kickoff returns": 3,
      "kickoff return yards": 49,
      "interception returns": 0,
      "interception return yards": 0,
      "3rd down conversions": 5,
      "3rd down attempts": 15,
      "4th down conversions": 3,
      "4th down attempts": 3
    },
    "Oklahoma": {
      "points": 35,
      "1st downs": 28,
      "rushing 1st downs": 11,
      "passing 1st downs": 14,
      "penalty 1st downs": 3,
      "rushing yards": 228,
      "rushing attempts": 43,
      "passing yards": 296,
      "passing attempts": 28,
      "passing completions": 19,
      "passing interceptions": 0,
      "total yards": 524,
      "total plays": 71,
      "fumbles": 2,
      "fumbles lost": 0,
      "penalties": 10,
      "penalty yards": 100,
      "punts": 3,
      "punt yards": 137,
      "punt returns": 1,
      "punt return yards": 2,
      "kickoff returns": 1,
      "kickoff return yards": 17,
      "interception returns": 1,
      "interception return yards": 0,
      "3rd down conversions": 5,
      "3rd down attempts": 10,
      "4th down conversions": 1,
      "4th down attempts": 1
    }
  },
  "Clemson vs Alabama": {
    "stadium": "RaymondJamesStadium-Tampa-FL",
    "Clemson": {
      "points": 35,
      "1st downs": 31,
      "rushing 1st downs": 8,
      "passing 1st downs": 19,
      "penalty 1st downs": 4,
      "rushing yards": 91,
      "rushing attempts": 42,
      "passing yards": 420,
      "passing attempts": 57,
      "passing completions": 36,
      "passing interceptions": 0,
      "total yards": 511,
      "total plays": 99,
      "fumbles": 2,
      "fumbles lost": 2,
      "penalties": 3,
      "penalty yards": 35,
      "punts": 9,
      "punt yards": 345,
      "punt returns": 1,
      "punt return yards": 3,
      "kickoff returns": 6,
      "kickoff return yards": 130,
      "interception returns": 0,
      "interception return yards": 0,
      "3rd down conversions": 7,
      "3rd down attempts": 18,
      "4th down conversions": 0,
      "4th down attempts": 1
    },
    "Alabama": {
      "points": 31,
      "1st downs": 16,
      "rushing 1st downs": 10,
      "passing 1st downs": 5,
      "penalty 1st downs": 1,
      "rushing yards": 221,
      "rushing attempts": 34,
      "passing yards": 155,
      "passing attempts": 32,
      "passing completions": 14,
      "passing interceptions": 0,
      "total yards": 376,
      "total plays": 66,
      "fumbles": 1,
      "fumbles lost": 0,
      "penalties": 9,
      "penalty yards": 82,
      "punts": 10,
      "punt yards": 458,
      "punt returns": 1,
      "punt return yards": 9,
      "kickoff returns": 3,
      "kickoff return yards": 57,
      "interception returns": 0,
      "interception return yards": 0,
      "3rd down conversions": 2,
      "3rd down attempts": 15,
      "4th down conversions": 1,
      "4th down attempts": 1
    }
  }
}