{
    "AAC": {
        "AAC_East": [
            "Cincinnati",
            "EastCarolina",
            "SouthFlorida",
            "Temple",
            "UCF"
        ],
        "AAC_West": [
            "Houston",
            "Memphis",
            "Navy",
            "SouthernMethodist",
            "Tulane",
            "Tulsa"
        ]
    },
    "ACC": {
        "ACC_Atlantic": [
            "BostonCollege",
            "Clemson",
            "FloridaState",
            "Louisville",
            "NorthCarolinaState",
            "Syracuse",
            "WakeForest"
        ],
        "ACC_Coastal": [
            "Duke",
            "GeorgiaTech",
            "MiamiFL",
            "NorthCarolina",
            "Pittsburgh",
            "Virginia",
            "VirginiaTech"
        ]
    },
    "B1G": {
        "B1G_East": [
            "Indiana",
            "Maryland",
            "Michigan",
            "MichiganState",
            "OhioState",
            "PennState",
            "Rutgers"
        ],
        "B1G_West": [
            "Illinois",
            "Iowa",
            "Minnesota",
            "Nebraska",
            "Northwestern",
            "Purdue",
            "Wisconsin"
        ]
    },
    "Big12": {
        "Big12": [
            "Baylor",
            "IowaState",
            "Kansas",
            "KansasState",
            "Oklahoma",
            "OklahomaState",
            "TCU",
            "Texas",
            "TexasTech",
            "WestVirginia"
        ]
    },
    "CUSA": {
        "CUSA_East": [
            "Charlotte",
            "FloridaAtlantic",
            "FloridaInternational",
            "MiddleTennessee",
            "WesternKentucky"
        ],
        "CUSA_West": [
            "LouisianaTech",
            "NorthTexas",
            "Rice",
            "UAB",
            "UTEP",
            "UTSA"
        ]
    },
    "Independents": {
        "Independents": [
            "Army",
            "BrighamYoung",
            "Connecticut",
            "Liberty",
            "Massachusetts",
            "NewMexicoState",
            "NotreDame"
        ]
    },
    "MAC": {
        "MAC_East": [
            "Akron",
            "BowlingGreen",
            "Buffalo",
            "KentState",
            "MiamiOH",
            "Ohio"
        ],
        "MAC_West": [
            "BallState",
            "CentralMichigan",
            "EasternMichigan",
            "NorthernIllinois",
            "Toledo",
            "WesternMichigan"
        ]
    },
    "MountainWest": {
        "MountainWest_Mountain": [
            "AirForce",
            "BoiseState",
            "ColoradoState",
            "NewMexico",
            "UtahState",
            "Wyoming"
        ],
        "MountainWest_West": [
            "FresnoState",
            "Hawaii",
            "Nevada",
            "SanDiegoState",
            "SanJoseState",
            "UNLV"
        ]
    },
    "Pac12": {
        "Pac12_North": [
            "California",
            "Oregon",
            "OregonState",
            "Stanford",
            "Washington",
            "WashingtonState"
        ],
        "Pac12_South": [
            "Arizona",
            "ArizonaState",
            "Colorado",
            "UCLA",
            "USC",
            "Utah"
        ]
    },
    "SEC": {
        "SEC_East": [
            "Florida",
            "Georgia",
            "Kentucky",
            "Missouri",
            "SouthCarolina",
            "Tennessee",
            "Vanderbilt"
        ],
        "SEC_West": [
            "Alabama",
            "Arkansas",
            "Auburn",
            "LSU",
            "MississippiState",
            "OleMiss",
            "TexasAM"
        ]
    },
    "SunBelt": {
        "SunBelt_East": [
            "AppalachianState",
            "CoastalCarolina",
            "GeorgiaSouthern",
            "GeorgiaState",
            "JamesMadison",
            "Marshall",
            "OldDominion"
        ],
        "SunBelt_West": [
            "ArkansasState",
            "LouisianaLafayette",
            "LouisianaMonroe",
            "SouthAlabama",
            "SouthernMiss",
            "TexasState",
            "Troy"
        ]
    },
    "FCS": {
        "FCS": [
            "FCS"
        ]
    }
}