{
  "WesternMichigan vs Ohio": {
    "stadium": "FordField-Detroit-MI",
    "WesternMichigan": {
      "points": 29,
      "1st downs": 20,
      "rushing 1st downs": 10,
      "passing 1st downs": 10,
      "penalty 1st downs": 0,
      "rushing yards": 114,
      "rushing attempts": 44,
      "passing yards": 290,
      "passing attempts": 31,
      "passing completions": 19,
      "passing interceptions": 2,
      "total yards": 404,
      "total plays": 75,
      "fumbles": 0,
      "fumbles lost": 0,
      "penalties": 10,
      "penalty yards": 76,
      "punts": 4,
      "punt yards": 143,
      "punt returns": 2,
      "punt return yards": 53,
      "kickoff returns": 5,
      "kickoff return yards": 100,
      "interception returns": 1,
      "interception return yards": 0,
      "3rd down conversions": 4,
      "3rd down attempts": 15,
      "4th down conversions": 1,
      "4th down attempts": 1
    },
    "Ohio": {
      "points": 23,
      "1st downs": 14,
      "rushing 1st downs": 3,
      "passing 1st downs": 9,
      "penalty 1st downs": 2,
      "rushing yards": 37,
      "rushing attempts": 22,
      "passing yards": 214,
      "passing attempts": 31,
      "passing completions": 14,
      "passing interceptions": 1,
      "total yards": 251,
      "total plays": 53,
      "fumbles": 2,
      "fumbles lost": 2,
      "penalties": 2,
      "penalty yards": 16,
      "punts": 6,
      "punt yards": 275,
      "punt returns": 0,
      "punt return yards": 0,
      "kickoff returns": 5,
      "kickoff return yards": 115,
      "interception returns": 2,
      "interception return yards": 32,
      "3rd down conversions": 5,
      "3rd down attempts": 12,
      "4th down conversions": 0,
      "4th down attempts": 0
    }
  },
  "Colorado vs Washington": {
    "stadium": "LevisStadium-SantaClara-CA",
    "Colorado": {
      "points": 10,
      "1st downs": 9,
      "rushing 1st downs": 4,
      "passing 1st downs": 3,
      "penalty 1st downs": 2,
      "rushing yards": 82,
      "rushing attempts": 29,
      "passing yards": 81,
      "passing attempts": 25,
      "passing completions": 8,
      "passing interceptions": 3,
      "total yards": 163,
      "total plays": 54,
      "fumbles": 3,
      "fumbles lost": 0,
      "penalties": 3,
      "penalty yards": 35,
      "punts": 7,
      "punt yards": 232,
      "punt returns": 1,
      "punt return yards": 3,
      "kickoff returns": 4,
      "kickoff return yards": 143,
      "interception returns": 0,
      "interception return yards": 0,
      "3rd down conversions": 4,
      "3rd down attempts": 15,
      "4th down conversions": 0,
      "4th down attempts": 1
    },
    "Washington": {
      "points": 41,
      "1st downs": 22,
      "rushing 1st downs": 17,
      "passing 1st downs": 4,
      "penalty 1st downs": 1,
      "rushing yards": 265,
      "rushing attempts": 54,
      "passing yards": 118,
      "passing attempts": 24,
      "passing completions": 9,
      "passing interceptions": 0,
      "total yards": 383,
      "total plays": 78,
      "fumbles": 0,
      "fumbles lost": 0,
      "penalties": 3,
      "penalty yards": 35,
      "punts": 5,
      "punt yards": 203,
      "punt returns": 1,
      "punt return yards": 18,
      "kickoff returns": 2,
      "kickoff return yards": 43,
      "interception returns": 3,
      "interception return yards": 58,
      "3rd down conversions": 8,
      "3rd down attempts": 17,
      "4th down conversions": 0,
      "4th down attempts": 1
    }
  },
  "LouisianaTech vs WesternKentucky": {
    "stadium": "HouchensIndustriesLTSmithStadium-BowlingGreen-KY",
    "LouisianaTech": {
      "points": 44,
      "1st downs": 26,
      "rushing 1st downs": 5,
      "passing 1st downs": 20,
      "penalty 1st downs": 1,
      "rushing yards": 5,
      "rushing attempts": 22,
      "passing yards": 502,
      "passing attempts": 57,
      "passing completions": 35,
      "passing interceptions": 1,
      "total yards": 507,
      "total plays": 79,
      "fumbles": 1,
      "fumbles lost": 0,
      "penalties": 8,
      "penalty yards": 64,
      "punts": 5,
      "punt yards": 195,
      "punt returns": 0,
      "punt return yards": 0,
      "kickoff returns": 9,
      "kickoff return yards": 140,
      "interception returns": 1,
      "interception return yards": 48,
      "3rd down conversions": 5,
      "3rd down attempts": 14,
      "4th down conversions": 1,
      "4th down attempts": 1
    },
    "WesternKentucky": {
      "points": 58,
      "1st downs": 31,
      "rushing 1st downs": 13,
      "passing 1st downs": 15,
      "penalty 1st downs": 3,
      "rushing yards": 235,
      "rushing attempts": 41,
      "passing yards": 421,
      "passing attempts": 31,
      "passing completions": 21,
      "passing interceptions": 1,
      "total yards": 656,
      "total plays": 72,
      "fumbles": 2,
      "fumbles lost": 2,
      "penalties": 7,
      "penalty yards": 75,
      "punts": 0,
      "punt yards": 0,
      "punt returns": 0,
      "punt return yards": 0,
      "kickoff returns": 8,
      "kickoff return yards": 182,
      "interception returns": 1,
      "interception return yards": 0,
      "3rd down conversions": 6,
      "3rd down attempts": 11,
      "4th down conversions": 0,
      "4th down attempts": 0
    }
  },
  "KansasState vs TCU": {
    "stadium": "AmonGCarterStadium-FortWorth-TX",
    "KansasState": {
      "points": 30,
      "1st downs": 21,
      "rushing 1st downs": 15,
      "passing 1st downs": 6,
      "penalty 1st downs": 0,
      "rushing yards": 336,
      "rushing attempts": 51,
      "passing yards": 159,
      "passing attempts": 21,
      "passing completions": 9,
      "passing interceptions": 0,
      "total yards": 495,
      "total plays": 72,
      "fumbles": 1,
      "fumbles lost": 1,
      "penalties": 6,
      "penalty yards": 61,
      "punts": 6,
      "punt yards": 255,
      "punt returns": 3,
      "punt return yards": 3,
      "kickoff returns": 3,
      "kickoff return yards": 70,
      "interception returns": 1,
      "interception return yards": 11,
      "3rd down conversions": 10,
      "3rd down attempts": 17,
      "4th down conversions": 0,
      "4th down attempts": 0
    },
    "TCU": {
      "points": 6,
      "1st downs": 15,
      "rushing 1st downs": 8,
      "passing 1st downs": 5,
      "penalty 1st downs": 2,
      "rushing yards": 142,
      "rushing attempts": 37,
      "passing yards": 138,
      "passing attempts": 36,
      "passing completions": 17,
      "passing interceptions": 1,
      "total yards": 280,
      "total plays": 73,
      "fumbles": 1,
      "fumbles lost": 0,
      "penalties": 4,
      "penalty yards": 45,
      "punts": 10,
      "punt yards": 373,
      "punt returns": 4,
      "punt return yards": 18,
      "kickoff returns": 4,
      "kickoff return yards": 81,
      "interception returns": 0,
      "interception return yards": 0,
      "3rd down conversions": 7,
      "3rd down attempts": 20,
      "4th down conversions": 1,
      "4th down attempts": 1
    }
  },
  "Temple vs Navy": {
    "stadium": "NavyMarineCorpsMemorialStadium-Annapolis-MD",
    "Temple": {
      "points": 34,
      "1st downs": 18,
      "rushing 1st downs": 10,
      "passing 1st downs": 8,
      "penalty 1st downs": 0,
      "rushing yards": 189,
      "rushing attempts": 36,
      "passing yards": 199,
      "passing attempts": 25,
      "passing completions": 16,
      "passing interceptions": 0,
      "total yards": 388,
      "total plays": 61,
      "fumbles": 0,
      "fumbles lost": 0,
      "penalties": 4,
      "penalty yards": 30,
      "punts": 4,
      "punt yards": 168,
      "punt returns": 0,
      "punt return yards": 0,
      "kickoff returns": 1,
      "kickoff return yards": 14,
      "interception returns": 2,
      "interception return yards": 13,
      "3rd down conversions": 7,
      "3rd down attempts": 15,
      "4th down conversions": 1,
      "4th down attempts": 1
    },
    "Navy": {
      "points": 10,
      "1st downs": 13,
      "rushing 1st downs": 6,
      "passing 1st downs": 6,
      "penalty 1st downs": 1,
      "rushing yards": 168,
      "rushing attempts": 44,
      "passing yards": 138,
      "passing attempts": 15,
      "passing completions": 8,
      "passing interceptions": 2,
      "total yards": 306,
      "total plays": 59,
      "fumbles": 1,
      "fumbles lost": 1,
      "penalties": 0,
      "penalty yards": 0,
      "punts": 3,
      "punt yards": 142,
      "punt returns": 1,
      "punt return yards": 0,
      "kickoff returns": 4,
      "kickoff return yards": 53,
      "interception returns": 0,
      "interception return yards": 0,
      "3rd down conversions": 6,
      "3rd down attempts": 14,
      "4th down conversions": 1,
      "4th down attempts": 4
    }
  },
  "Troy vs GeorgiaSouthern": {
    "stadium": "AllenEPaulsonStadium-Statesboro-GA",
    "Troy": {
      "points": 24,
      "1st downs": 20,
      "rushing 1st downs": 6,
      "passing 1st downs": 14,
      "penalty 1st downs": 0,
      "rushing yards": 126,
      "rushing attempts": 32,
      "passing yards": 218,
      "passing attempts": 34,
      "passing completions": 27,
      "passing interceptions": 0,
      "total yards": 344,
      "total plays": 66,
      "fumbles": 1,
      "fumbles lost": 0,
      "penalties": 3,
      "penalty yards": 25,
      "punts": 5,
      "punt yards": 218,
      "punt returns": 1,
      "punt return yards": -2,
      "kickoff returns": 2,
      "kickoff return yards": 43,
      "interception returns": 0,
      "interception return yards": 0,
      "3rd down conversions": 5,
      "3rd down attempts": 14,
      "4th down conversions": 1,
      "4th down attempts": 3
    },
    "GeorgiaSouthern": {
      "points": 28,
      "1st downs": 21,
      "rushing 1st downs": 13,
      "passing 1st downs": 6,
      "penalty 1st downs": 2,
      "rushing yards": 218,
      "rushing attempts": 42,
      "passing yards": 175,
      "passing attempts": 21,
      "passing completions": 16,
      "passing interceptions": 0,
      "total yards": 393,
      "total plays": 63,
      "fumbles": 1,
      "fumbles lost": 1,
      "penalties": 5,
      "penalty yards": 45,
      "punts": 5,
      "punt yards": 211,
      "punt returns": 2,
      "punt return yards": 15,
      "kickoff returns": 2,
      "kickoff return yards": 36,
      "interception returns": 0,
      "interception return yards": 0,
      "3rd down conversions": 6,
      "3rd down attempts": 13,
      "4th down conversions": 1,
      "4th down attempts": 2
    }
  },
  "OklahomaState vs Oklahoma": {
    "stadium": "GaylordFamilyOklahomaMemorialStadium-Norman-OK",
    "OklahomaState": {
      "points": 20,
      "1st downs": 17,
      "rushing 1st downs": 10,
      "passing 1st downs": 6,
      "penalty 1st downs": 1,
      "rushing yards": 217,
      "rushing attempts": 37,
      "passing yards": 186,
      "passing attempts": 25,
      "passing completions": 11,
      "passing interceptions": 0,
      "total yards": 403,
      "total plays": 62,
      "fumbles": 1,
      "fumbles lost": 0,
      "penalties": 3,
      "penalty yards": 22,
      "punts": 6,
      "punt yards": 240,
      "punt returns": 0,
      "punt return yards": 0,
      "kickoff returns": 5,
      "kickoff return yards": 162,
      "interception returns": 0,
      "interception return yards": 0,
      "3rd down conversions": 4,
      "3rd down attempts": 15,
      "4th down conversions": 1,
      "4th down attempts": 2
    },
    "Oklahoma": {
      "points": 38,
      "1st downs": 25,
      "rushing 1st downs": 11,
      "passing 1st downs": 12,
      "penalty 1st downs": 2,
      "rushing yards": 341,
      "rushing attempts": 52,
      "passing yards": 288,
      "passing attempts": 19,
      "passing completions": 13,
      "passing interceptions": 0,
      "total yards": 629,
      "total plays": 71,
      "fumbles": 3,
      "fumbles lost": 1,
      "penalties": 4,
      "penalty yards": 54,
      "punts": 5,
      "punt yards": 196,
      "punt returns": 0,
      "punt return yards": 0,
      "kickoff returns": 5,
      "kickoff return yards": 83,
      "interception returns": 0,
      "interception return yards": 0,
      "3rd down conversions": 6,
      "3rd down attempts": 13,
      "4th down conversions": 1,
      "4th down attempts": 1
    }
  },
  "NewMexicoState vs SouthAlabama": {
    "stadium": "LaddPeeblesStadium-Mobile-AL",
    "NewMexicoState": {
      "points": 28,
      "1st downs": 21,
      "rushing 1st downs": 12,
      "passing 1st downs": 7,
      "penalty 1st downs": 2,
      "rushing yards": 353,
      "rushing attempts": 48,
      "passing yards": 110,
      "passing attempts": 25,
      "passing completions": 11,
      "passing interceptions": 2,
      "total yards": 463,
      "total plays": 73,
      "fumbles": 2,
      "fumbles lost": 1,
      "penalties": 5,
      "penalty yards": 57,
      "punts": 7,
      "punt yards": 272,
      "punt returns": 1,
      "punt return yards": 6,
      "kickoff returns": 6,
      "kickoff return yards": 122,
      "interception returns": 2,
      "interception return yards": 23,
      "3rd down conversions": 3,
      "3rd down attempts": 13,
      "4th down conversions": 3,
      "4th down attempts": 3
    },
    "SouthAlabama": {
      "points": 35,
      "1st downs": 22,
      "rushing 1st downs": 13,
      "passing 1st downs": 9,
      "penalty 1st downs": 0,
      "rushing yards": 282,
      "rushing attempts": 49,
      "passing yards": 239,
      "passing attempts": 28,
      "passing completions": 16,
      "passing interceptions": 2,
      "total yards": 521,
      "total plays": 77,
      "fumbles": 2,
      "fumbles lost": 1,
      "penalties": 4,
      "penalty yards": 50,
      "punts": 5,
      "punt yards": 190,
      "punt returns": 2,
      "punt return yards": 6,
      "kickoff returns": 4,
      "kickoff return yards": 93,
      "interception returns": 2,
      "interception return yards": 23,
      "3rd down conversions": 10,
      "3rd down attempts": 15,
      "4th down conversions": 0,
      "4th down attempts": 0
    }
  },
  "LouisianaLafayette vs LouisianaMonroe": {
    "stadium": "JPSFieldatMaloneStadium-Monroe-LA",
    "LouisianaLafayette": {
      "points": 30,
      "1st downs": 17,
      "rushing 1st downs": 16,
      "passing 1st downs": 0,
      "penalty 1st downs": 1,
      "rushing yards": 240,
      "rushing attempts": 61,
      "passing yards": 0,
      "passing attempts": 5,
      "passing completions": 2,
      "passing interceptions": 2,
      "total yards": 240,
      "total plays": 66,
      "fumbles": 1,
      "fumbles lost": 0,
      "penalties": 6,
      "penalty yards": 43,
      "punts": 1,
      "punt yards": 30,
      "punt returns": 0,
      "punt return yards": 0,
      "kickoff returns": 2,
      "kickoff return yards": 29,
      "interception returns": 2,
      "interception return yards": 2,
      "3rd down conversions": 5,
      "3rd down attempts": 14,
      "4th down conversions": 1,
      "4th down attempts": 2
    },
    "LouisianaMonroe": {
      "points": 3,
      "1st downs": 8,
      "rushing 1st downs": 6,
      "passing 1st downs": 2,
      "penalty 1st downs": 0,
      "rushing yards": 116,
      "rushing attempts": 38,
      "passing yards": 31,
      "passing attempts": 14,
      "passing completions": 3,
      "passing interceptions": 2,
      "total yards": 147,
      "total plays": 52,
      "fumbles": 4,
      "fumbles lost": 3,
      "penalties": 3,
      "penalty yards": 35,
      "punts": 4,
      "punt yards": 152,
      "punt returns": 0,
      "punt return yards": 0,
      "kickoff returns": 5,
      "kickoff return yards": 62,
      "interception returns": 2,
      "interception return yards": 18,
      "3rd down conversions": 1,
      "3rd down attempts": 12,
      "4th down conversions": 2,
      "4th down attempts": 5
    }
  },
  "Baylor vs WestVirginia": {
    "stadium": "MountaineerFieldatMilanPuskarStadium-Morgantown-WV",
    "Baylor": {
      "points": 21,
      "1st downs": 19,
      "rushing 1st downs": 7,
      "passing 1st downs": 12,
      "penalty 1st downs": 0,
      "rushing yards": 196,
      "rushing attempts": 41,
      "passing yards": 244,
      "passing attempts": 31,
      "passing completions": 15,
      "passing interceptions": 2,
      "total yards": 440,
      "total plays": 72,
      "fumbles": 2,
      "fumbles lost": 2,
      "penalties": 12,
      "penalty yards": 100,
      "punts": 6,
      "punt yards": 248,
      "punt returns": 3,
      "punt return yards": 5,
      "kickoff returns": 3,
      "kickoff return yards": 65,
      "interception returns": 0,
      "interception return yards": 0,
      "3rd down conversions": 4,
      "3rd down attempts": 13,
      "4th down conversions": 0,
      "4th down attempts": 2
    },
    "WestVirginia": {
      "points": 24,
      "1st downs": 25,
      "rushing 1st downs": 14,
      "passing 1st downs": 5,
      "penalty 1st downs": 6,
      "rushing yards": 311,
      "rushing attempts": 62,
      "passing yards": 111,
      "passing attempts": 26,
      "passing completions": 10,
      "passing interceptions": 0,
      "total yards": 422,
      "total plays": 88,
      "fumbles": 1,
      "fumbles lost": 0,
      "penalties": 6,
      "penalty yards": 62,
      "punts": 7,
      "punt yards": 237,
      "punt returns": 0,
      "punt return yards": 0,
      "kickoff returns": 3,
      "kickoff return yards": 49,
      "interception returns": 2,
      "interception return yards": 18,
      "3rd down conversions": 4,
      "3rd down attempts": 18,
      "4th down conversions": 3,
      "4th down attempts": 4
    }
  },
  "Alabama vs Florida": {
    "stadium": "GeorgiaDome-Atlanta-GA",
    "Alabama": {
      "points": 54,
      "1st downs": 18,
      "rushing 1st downs": 12,
      "passing 1st downs": 3,
      "penalty 1st downs": 3,
      "rushing yards": 234,
      "rushing attempts": 38,
      "passing yards": 138,
      "passing attempts": 20,
      "passing completions": 11,
      "passing interceptions": 0,
      "total yards": 372,
      "total plays": 58,
      "fumbles": 1,
      "fumbles lost": 0,
      "penalties": 2,
      "penalty yards": 14,
      "punts": 2,
      "punt yards": 81,
      "punt returns": 4,
      "punt return yards": 117,
      "kickoff returns": 0,
      "kickoff return yards": 0,
      "interception returns": 3,
      "interception return yards": 84,
      "3rd down conversions": 5,
      "3rd down attempts": 11,
      "4th down conversions": 0,
      "4th down attempts": 0
    },
    "Florida": {
      "points": 16,
      "1st downs": 16,
      "rushing 1st downs": 2,
      "passing 1st downs": 13,
      "penalty 1st downs": 1,
      "rushing yards": 0,
      "rushing attempts": 30,
      "passing yards": 261,
      "passing attempts": 39,
      "passing completions": 26,
      "passing interceptions": 3,
      "total yards": 261,
      "total plays": 69,
      "fumbles": 1,
      "fumbles lost": 0,
      "penalties": 7,
      "penalty yards": 53,
      "punts": 4,
      "punt yards": 218,
      "punt returns": 0,
      "punt return yards": 0,
      "kickoff returns": 6,
      "kickoff return yards": 145,
      "interception returns": 0,
      "interception return yards": 0,
      "3rd down conversions": 7,
      "3rd down attempts": 16,
      "4th down conversions": 0,
      "4th down attempts": 2
    }
  },
  "GeorgiaState vs Idaho": {
    "stadium": "KibbieDome-Moscow-ID",
    "GeorgiaState": {
      "points": 12,
      "1st downs": 19,
      "rushing 1st downs": 4,
      "passing 1st downs": 12,
      "penalty 1st downs": 3,
      "rushing yards": 92,
      "rushing attempts": 24,
      "passing yards": 266,
      "passing attempts": 37,
      "passing completions": 22,
      "passing interceptions": 4,
      "total yards": 358,
      "total plays": 61,
      "fumbles": 2,
      "fumbles lost": 2,
      "penalties": 4,
      "penalty yards": 30,
      "punts": 2,
      "punt yards": 83,
      "punt returns": 1,
      "punt return yards": 0,
      "kickoff returns": 4,
      "kickoff return yards": 79,
      "interception returns": 0,
      "interception return yards": 0,
      "3rd down conversions": 6,
      "3rd down attempts": 13,
      "4th down conversions": 1,
      "4th down attempts": 1
    },
    "Idaho": {
      "points": 37,
      "1st downs": 16,
      "rushing 1st downs": 8,
      "passing 1st downs": 7,
      "penalty 1st downs": 1,
      "rushing yards": 149,
      "rushing attempts": 45,
      "passing yards": 138,
      "passing attempts": 20,
      "passing completions": 16,
      "passing interceptions": 0,
      "total yards": 287,
      "total plays": 65,
      "fumbles": 0,
      "fumbles lost": 0,
      "penalties": 5,
      "penalty yards": 45,
      "punts": 3,
      "punt yards": 118,
      "punt returns": 3,
      "punt return yards": 73,
      "kickoff returns": 2,
      "kickoff return yards": 43,
      "interception returns": 4,
      "interception return yards": 18,
      "3rd down conversions": 8,
      "3rd down attempts": 16,
      "4th down conversions": 0,
      "4th down attempts": 1
    }
  },
  "ArkansasState vs TexasState": {
    "stadium": "JimWackerFieldatBobcatStadium-SanMarcos-TX",
    "ArkansasState": {
      "points": 36,
      "1st downs": 18,
      "rushing 1st downs": 9,
      "passing 1st downs": 7,
      "penalty 1st downs": 2,
      "rushing yards": 178,
      "rushing attempts": 44,
      "passing yards": 179,
      "passing attempts": 21,
      "passing completions": 13,
      "passing interceptions": 0,
      "total yards": 357,
      "total plays": 65,
      "fumbles": 2,
      "fumbles lost": 0,
      "penalties": 10,
      "penalty yards": 65,
      "punts": 7,
      "punt yards": 257,
      "punt returns": 5,
      "punt return yards": 50,
      "kickoff returns": 2,
      "kickoff return yards": 39,
      "interception returns": 2,
      "interception return yards": 25,
      "3rd down conversions": 6,
      "3rd down attempts": 14,
      "4th down conversions": 0,
      "4th down attempts": 0
    },
    "TexasState": {
      "points": 14,
      "1st downs": 15,
      "rushing 1st downs": 7,
      "passing 1st downs": 6,
      "penalty 1st downs": 2,
      "rushing yards": 117,
      "rushing attempts": 46,
      "passing yards": 120,
      "passing attempts": 27,
      "passing completions": 14,
      "passing interceptions": 2,
      "total yards": 237,
      "total plays": 73,
      "fumbles": 1,
      "fumbles lost": 0,
      "penalties": 9,
      "penalty yards": 61,
      "punts": 8,
      "punt yards": 338,
      "punt returns": 3,
      "punt return yards": 9,
      "kickoff returns": 4,
      "kickoff return yards": 31,
      "interception returns": 0,
      "interception return yards": 0,
      "3rd down conversions": 7,
      "3rd down attempts": 19,
      "4th down conversions": 1,
      "4th down attempts": 1
    }
  },
  "SanDiegoState vs Wyoming": {
    "stadium": "JonahFieldatWarMemorialStadium-Laramie-WY",
    "SanDiegoState": {
      "points": 27,
      "1st downs": 16,
      "rushing 1st downs": 11,
      "passing 1st downs": 4,
      "penalty 1st downs": 1,
      "rushing yards": 242,
      "rushing attempts": 53,
      "passing yards": 85,
      "passing attempts": 13,
      "passing completions": 6,
      "passing interceptions": 1,
      "total yards": 327,
      "total plays": 66,
      "fumbles": 3,
      "fumbles lost": 1,
      "penalties": 7,
      "penalty yards": 62,
      "punts": 6,
      "punt yards": 273,
      "punt returns": 3,
      "punt return yards": 5,
      "kickoff returns": 2,
      "kickoff return yards": 113,
      "interception returns": 2,
      "interception return yards": 44,
      "3rd down conversions": 5,
      "3rd down attempts": 15,
      "4th down conversions": 1,
      "4th down attempts": 2
    },
    "Wyoming": {
      "points": 24,
      "1st downs": 13,
      "rushing 1st downs": 3,
      "passing 1st downs": 10,
      "penalty 1st downs": 0,
      "rushing yards": 95,
      "rushing attempts": 31,
      "passing yards": 248,
      "passing attempts": 31,
      "passing completions": 14,
      "passing interceptions": 2,
      "total yards": 343,
      "total plays": 62,
      "fumbles": 2,
      "fumbles lost": 1,
      "penalties": 6,
      "penalty yards": 45,
      "punts": 5,
      "punt yards": 224,
      "punt returns": 2,
      "punt return yards": 10,
      "kickoff returns": 1,
      "kickoff return yards": 16,
      "interception returns": 1,
      "interception return yards": 2,
      "3rd down conversions": 2,
      "3rd down attempts": 14,
      "4th down conversions": 0,
      "4th down attempts": 3
    }
  },
  "Clemson vs VirginiaTech": {
    "stadium": "CampingWorldStadium-Orlando-FL",
    "Clemson": {
      "points": 42,
      "1st downs": 30,
      "rushing 1st downs": 11,
      "passing 1st downs": 14,
      "penalty 1st downs": 5,
      "rushing yards": 182,
      "rushing attempts": 41,
      "passing yards": 288,
      "passing attempts": 34,
      "passing completions": 23,
      "passing interceptions": 1,
      "total yards": 470,
      "total plays": 75,
      "fumbles": 0,
      "fumbles lost": 0,
      "penalties": 8,
      "penalty yards": 65,
      "punts": 5,
      "punt yards": 173,
      "punt returns": 2,
      "punt return yards": -5,
      "kickoff returns": 0,
      "kickoff return yards": 0,
      "interception returns": 2,
      "interception return yards": 0,
      "3rd down conversions": 6,
      "3rd down attempts": 11,
      "4th down conversions": 0,
      "4th down attempts": 0
    },
    "VirginiaTech": {
      "points": 35,
      "1st downs": 19,
      "rushing 1st downs": 5,
      "passing 1st downs": 12,
      "penalty 1st downs": 2,
      "rushing yards": 102,
      "rushing attempts": 35,
      "passing yards": 284,
      "passing attempts": 36,
      "passing completions": 22,
      "passing interceptions": 2,
      "total yards": 386,
      "total plays": 71,
      "fumbles": 1,
      "fumbles lost": 0,
      "penalties": 8,
      "penalty yards": 89,
      "punts": 6,
      "punt yards": 269,
      "punt returns": 1,
      "punt return yards": 2,
      "kickoff returns": 5,
      "kickoff return yards": 108,
      "interception returns": 1,
      "interception return yards": 0,
      "3rd down conversions": 7,
      "3rd down attempts": 15,
      "4th down conversions": 1,
      "4th down attempts": 2
    }
  },
  "Wisconsin vs PennState": {
    "stadium": "LucasOilStadium-Indianapolis-IN",
    "Wisconsin": {
      "points": 31,
      "1st downs": 22,
      "rushing 1st downs": 11,
      "passing 1st downs": 9,
      "penalty 1st downs": 2,
      "rushing yards": 241,
      "rushing attempts": 49,
      "passing yards": 174,
      "passing attempts": 21,
      "passing completions": 16,
      "passing interceptions": 0,
      "total yards": 415,
      "total plays": 70,
      "fumbles": 2,
      "fumbles lost": 0,
      "penalties": 4,
      "penalty yards": 40,
      "punts": 4,
      "punt yards": 139,
      "punt returns": 1,
      "punt return yards": 0,
      "kickoff returns": 3,
      "kickoff return yards": 62,
      "interception returns": 0,
      "interception return yards": 0,
      "3rd down conversions": 5,
      "3rd down attempts": 12,
      "4th down conversions": 0,
      "4th down attempts": 1
    },
    "PennState": {
      "points": 38,
      "1st downs": 21,
      "rushing 1st downs": 3,
      "passing 1st downs": 16,
      "penalty 1st downs": 2,
      "rushing yards": 51,
      "rushing attempts": 29,
      "passing yards": 384,
      "passing attempts": 31,
      "passing completions": 22,
      "passing interceptions": 0,
      "total yards": 435,
      "total plays": 60,
      "fumbles": 1,
      "fumbles lost": 1,
      "penalties": 3,
      "penalty yards": 25,
      "punts": 2,
      "punt yards": 98,
      "punt returns": 1,
      "punt return yards": 5,
      "kickoff returns": 4,
      "kickoff return yards": 83,
      "interception returns": 0,
      "interception return yards": 0,
      "3rd down conversions": 3,
      "3rd down attempts": 10,
      "4th down conversions": 0,
      "4th down attempts": 3
    }
  }
}