{
  "people":[ 

   {   "name": "Maria",
    "job": "junior developer",
    "skills": [
        {"skill":"PHP"},
        {"skill":"JS"},
        {"skill":"HTML"}

    ]
   },

  {
    "name": "Denisa",
    "job": "graphic designer",
    "skills": [
        {"skill":"Photoshop"},
        {"skill":"JS"},
        {"skill":"HTML"}

    ]
  },

  {
    "name": "Alin",
    "job": "tester",
    "skills": [
        {"skill":"PHP"},
        {"skill":"JS"},
        {"skill":"java"}

    ]
  }

]
}

