{
    "glue": {
        "layouts": {
            "autoRestore": false,
            "autoSaveWindowContext": false
        },
        "channels": false,
        "appManager": false,
        "assets": {
            "location": "/glue"
        }
    },
    "gateway": {},
    "appManager": {},
    "channels": []
}