-------------------------------------------------------------------------------
Test set: org.cursusdevops.AppTest
-------------------------------------------------------------------------------
Tests run: 1, Failures: 0, Errors: 0, Skipped: 0, Time elapsed: 0.128 s - in org.cursusdevops.AppTest
