# ADSP - from LA.UM.8.6.r1-04400-89xx.0
vendor/bin/adsprpcd|a5e878691577485c9f7ee33dfe02384a13f0a265
vendor/lib/libadsprpc.so|1cef31d6abef252028ca7fefee6add0938a32576
vendor/lib/libadsp_default_listener.so|6311c407e31742bd686e6a6fa5ab6ed4d27fb27a
vendor/lib/libfastcvadsp_stub.so|996345605e1d631151a6b4e9cd9f65b2c7e82dac
vendor/lib/libfastcvopt.so|5ddc82093d344b11c532bca2af5285de99706917
vendor/lib/libmdsprpc.so|343bd2c3de3d5977b98bc7f4f4fd95add493f8f4
vendor/lib64/libadsprpc.so|1b49735ca4ab61687f16fdad3c218f422257f806
vendor/lib64/libadsp_default_listener.so|3f69a73528c8687607da617a549ec5a449af3cc0
vendor/lib64/libfastcvadsp_stub.so|f101b66fa4a450b5af2e6aa9f7aaa28f9a876005
vendor/lib64/libfastcvopt.so|4c2f8b95479ae5416b61388d343b7dcd9b12d390
vendor/lib64/libmdsprpc.so|e6a66132a0b0c5315e61a210a745576f35607f98

# ADSP modules - from LA.UM.8.6.r1-04400-89xx.0
vendor/lib/rfsa/adsp/dirac_resource.dar|d9b3693eab8c520ef859236b8235752188b7cba0
vendor/lib/rfsa/adsp/libFastRPC_AUE_Forward_skel.so|f4d8675a46c5e52add8f8e90e35b29cd33ac582b
vendor/lib/rfsa/adsp/libapps_mem_heap.so|5c82ad9cfe3f30105d899e2a4e90cc7566f81252
vendor/lib/rfsa/adsp/libFastRPC_UTF_Forward_Qtc2_skel.so|b9f68e320d24e9c51871a2056e1f47239bd1cb40
vendor/lib/rfsa/adsp/libdirac-capiv2.so|e56031dfaee094d5267e3cc16625cfceaa07cc27
vendor/lib/rfsa/adsp/libscveBlobDescriptor_skel.so|3e9c52069ff07e50191d3b3afb33b30409241ab6
vendor/lib/rfsa/adsp/libdspCV_skel.so|628985174b0088bed21c866d7984d23855e5e150
vendor/lib/rfsa/adsp/libscveObjectSegmentation_skel.so|944169db3ac67056b92ef4f850f69346958370b5
vendor/lib/rfsa/adsp/libfastcvadsp_skel.so|1ff4a48009e88435d93fd2b9b0c5ea59cedbb4f7
vendor/lib/rfsa/adsp/libscveT2T_skel.so|91b9200dbb982abf0d6b440668252d892a616f66
vendor/lib/rfsa/adsp/libfastcvadsp.so|9818625bfa018f517e32a8f4a1e7fb4b255e5049

# Audio - from LA.UM.8.6.r1-04400-89xx.0
vendor/lib/libacdb-fts.so|6bbcdd34b8344964c54d0a072e63feec71673b7c
vendor/lib/libacdbloader.so|d4a41a817ae856c0c727d6f9360c29ee0c2f410a
vendor/lib/libacdbrtac.so|863cc396b3234bdb978b312bce7746ff1f1a6769
vendor/lib/libadiertac.so|59bd9c9c2df081580088df25274cb0a196221b80
vendor/lib/libadm.so|0bd0e69289c897a50fefe16a0d29b25289973171
vendor/lib/libaudcal.so|dda994bbd37d3c178120791a911fb219a2ccb5ca
vendor/lib/libaudioalsa.so|1c0615d720024b5bd7ac28bec13d37ab7102b57f
vendor/lib/libdrc.so|55fc13d205ce3199de2cf1f9c1dab479909c15be
vendor/lib/libqtigef.so|5630df4e52109c0602d441d5d63bd342d202faf4
vendor/lib/libsurround_3mic_proc.so|aac9411dc243dfee813be038969c5337fe36b1ca
vendor/lib/soundfx/libasphere.so|4d0ccf1c282bb70619d20bf7d79021dc3815a579
vendor/lib/soundfx/libqcbassboost.so|223896ecb679384ba4e66d0b6905ca24ae1dda4d
vendor/lib/soundfx/libqcreverb.so|62be9233cf5e259370a821ef6dc0cb0304b9416c
vendor/lib/soundfx/libqcvirt.so|b6c332827ad84fdde9b7e57ca073928a23bbd807
vendor/lib64/libacdb-fts.so|9ad8551afa5a372b19ce295b61d5d9f8f7f69700
vendor/lib64/libacdbloader.so|954efba4057678d92e915ac0c8b5c33b4173822d
vendor/lib64/libacdbrtac.so|220366b0464fe4a8cb04e17feb8bd5da41cbe297
vendor/lib64/libadiertac.so|87302b3eaa3bb2465c3823d5f9089f3030d9a7a5
vendor/lib64/libaudcal.so|6964ecc9607ae9c05ee7b37cbff66c0b37bde216
vendor/lib64/libaudioalsa.so|af924f5a37d3066a97175f1343ea5c9484689ee3
vendor/lib64/libqtigef.so|e7f0dfa3cd7252310c9a01f2bc0e4074e6e78871

# Audio ACDB - from rosy:8.1.0/OPM1.171019.026/V11.0.2.0.ODAMIXM
vendor/etc/acdbdata/adsp_avs_config.acdb|ac0616af3b2d4f070c0e54c18126a877e528621b
vendor/etc/acdbdata/MTP/MTP_Bluetooth_cal.acdb|69d97d52c5ff2a47ef13aeded96af7c5c78e3b13
vendor/etc/acdbdata/MTP/MTP_General_cal.acdb|6f6fe990add3c3d5e096a345dad151a134c437b8
vendor/etc/acdbdata/MTP/MTP_Global_cal.acdb|cd62dfc80137bee694529f3206f97d7f5c4b1978
vendor/etc/acdbdata/MTP/MTP_Handset_cal.acdb|dee549610c24d9e35012dc883278ab7a58ce99bb
vendor/etc/acdbdata/MTP/MTP_Hdmi_cal.acdb|a44c60fe0d65c73366e35c5c19d0195c77c458f0
vendor/etc/acdbdata/MTP/MTP_Headset_cal.acdb|42c1c655c3b0038208a626132dfb063ae57fef03
vendor/etc/acdbdata/MTP/MTP_Speaker_cal.acdb|ac0f6d164cec18c2fef3992a6c22aca2bcf16f08
vendor/etc/acdbdata/MTP/MTP_workspaceFile.qwsp|921ca227bc413a69c1ff0075f0a20c7f0ec86566
vendor/etc/acdbdata/MTP/msm8953-tasha-snd-card/MTP_WCD9335_Bluetooth_cal.acdb|38c6e7d42ae194d238198e33fdb1c3f525e5a326
vendor/etc/acdbdata/MTP/msm8953-tasha-snd-card/MTP_WCD9335_General_cal.acdb|aa13ec31e85bae208ab5a9723dc1aa6dff041b6d
vendor/etc/acdbdata/MTP/msm8953-tasha-snd-card/MTP_WCD9335_Global_cal.acdb|c608e52607c2389eb3f52f2053c98438ebcdff10
vendor/etc/acdbdata/MTP/msm8953-tasha-snd-card/MTP_WCD9335_Handset_cal.acdb|2bb7c0bfac4308d4c112d8e3fee55d8e995a8176
vendor/etc/acdbdata/MTP/msm8953-tasha-snd-card/MTP_WCD9335_Hdmi_cal.acdb|be7fc11d6342ccd931e7901886ca01eaa207e539
vendor/etc/acdbdata/MTP/msm8953-tasha-snd-card/MTP_WCD9335_Headset_cal.acdb|9129d83bc6363a2a67d6a7a216cc2fd95c64a84d
vendor/etc/acdbdata/MTP/msm8953-tasha-snd-card/MTP_WCD9335_Speaker_cal.acdb|0507d4aded452d3c948f588240109c77b5f91372
vendor/etc/acdbdata/MTP/msm8953-tasha-snd-card/MTP_WCD9335_workspaceFile.qwsp|90182e8da8b719099bfc1db6b6d70623307f55ff

# Bluetooth - from LA.UM.8.6.r1-04400-89xx.0
vendor/bin/hw/android.hardware.bluetooth@1.0-service-qti|063d4838548e0f3546b509ece621e5f97b51bed0
vendor/etc/init/android.hardware.bluetooth@1.0-service-qti.rc|a979981c55f3dcaf6cf2212e71b901ca4d58b959
vendor/lib64/hw/android.hardware.bluetooth@1.0-impl-qti.so|66f5b40d50e91be92d7ab3500641c9a5b3b2f367
vendor/lib64/libbtnv.so|143ba8a42154a26469b87243ae3e1cd5e9565b13
vendor/lib64/libbt-hidlclient.so|4682c8711fe78bb73448b34c30181948989400bf

# Bluetooth (Audio) - from LA.UM.8.6.r1-04400-89xx.0
vendor/lib64/hw/audio.bluetooth_qti.default.so|a17474dec03b704cc9741c85f2f6aef62c5ad71e
vendor/lib64/hw/vendor.qti.hardware.bluetooth_audio@2.0-impl.so|5728506d9ca992ceef93cec7473034a7eeee98f4
vendor/lib64/hw/vendor.qti.hardware.bluetooth_sar@1.0-impl.so|4e188cd7cc009ced6af7901f357005623dd0875a
vendor/lib64/libbluetooth_audio_session_qti.so|ac99d03635322385bedf8db2a6e318b996349203
vendor/lib64/vendor.qti.hardware.bluetooth_audio@2.0.so|995a8127aea3b2de9efe68a5e5a6a61c80f438e7
vendor/lib64/vendor.qti.hardware.bluetooth_sar@1.0.so|237a97fc3d3332b1466583178b548dd1525479ef

# Bluetooth (Shared) - from LA.UM.8.6.r1-04400-89xx.0
vendor/lib64/vendor.qti.hardware.fm@1.0.so|027c226838e80a04209e5fb6a8882ce78c3b4222

# Bluetooth (ANT+) - from LA.UM.8.6.r1-04400-89xx.0
vendor/lib64/com.qualcomm.qti.ant@1.0.so|1a7bee1627309c8eee55dab22b9f25c2302219ae

# Bluetooth (aptX) - from crosshatch:10/QQ1A.191205.008/5974827
product/lib64/libaptX_encoder.so|df1c89d7af1bb35808d5fe3496b04ba066c10cbc
product/lib64/libaptXHD_encoder.so|e13fa70c97caaa24d061678bdee608eb8850a69e

# Camera - from rosy:8.1.0/OPM1.171019.026/V11.0.2.0.ODAMIXM
lib/libmorpho_memory_allocator.so:vendor/lib/libmorpho_memory_allocator.so
lib/libmorpho_panorama.so:vendor/lib/libmorpho_panorama.so
lib/libmorpho_panorama_gp.so:vendor/lib/libmorpho_panorama_gp.so
lib/libtrueportrait.so:vendor/lib/libtrueportrait.so
vendor/bin/mm-qcamera-daemon
vendor/lib/hw/camera.msm8953.so
vendor/lib/libFaceGrade.so
vendor/lib/lib_lowlight.so
vendor/lib/libarcsoft_beauty_shot.so
vendor/lib/libarcsoft_beautyshot.so
vendor/lib/libarcsoft_beautyshot_image_algorithm.so
vendor/lib/libarcsoft_beautyshot_video_algorithm.so
vendor/lib/libchromaflash.so
vendor/lib/libflash_gpio.so
vendor/lib/libflash_pmic.so
vendor/lib/libjpegdhw.so
vendor/lib/libjpegdmahw.so
vendor/lib/libjpegehw.so
vendor/lib/libmm-qcamera.so
vendor/lib/libmmcamera2_c2d_module.so
vendor/lib/libmmcamera2_cpp_module.so
vendor/lib/libmmcamera2_dcrf.so
vendor/lib/libmmcamera2_frame_algorithm.so
vendor/lib/libmmcamera2_iface_modules.so
vendor/lib/libmmcamera2_imglib_modules.so
vendor/lib/libmmcamera2_is.so
vendor/lib/libmmcamera2_isp_modules.so
vendor/lib/libmmcamera2_mct.so
vendor/lib/libmmcamera2_mct_shimlayer.so
vendor/lib/libmmcamera2_pp_buf_mgr.so
vendor/lib/libmmcamera2_pproc_modules.so
vendor/lib/libmmcamera2_q3a_core.so
vendor/lib/libmmcamera2_sensor_modules.so
vendor/lib/libmmcamera2_stats_algorithm.so
vendor/lib/libmmcamera2_stats_modules.so
vendor/lib/libmmcamera_cac3_lib.so
vendor/lib/libmmcamera_chromaflash_lib.so
vendor/lib/libmmcamera_csidtg.so
vendor/lib/libmmcamera_dbg.so
vendor/lib/libmmcamera_dcrf_lib.so
vendor/lib/libmmcamera_dummyalgo.so
vendor/lib/libmmcamera_eebinparse.so
vendor/lib/libmmcamera_eeprom_util.so
vendor/lib/libmmcamera_eztune_module.so
vendor/lib/libmmcamera_facedetection_lib.so
vendor/lib/libmmcamera_faceproc2.so
vendor/lib/libmmcamera_faceproc.so
vendor/lib/libmmcamera_hdr_gb_lib.so
vendor/lib/libmmcamera_imglib.so
vendor/lib/libmmcamera_interface.so
vendor/lib/libmmcamera_llvd.so
vendor/lib/libmmcamera_optizoom_lib.so
vendor/lib/libmmcamera_paaf_lib.so
vendor/lib/libmmcamera_pdafcamif.so
vendor/lib/libmmcamera_pdaf.so
vendor/lib/libmmcamera_ppbase_module.so
vendor/lib/libmmcamera_quadracfa.so
vendor/lib/libmmcamera_stillmore_lib.so
vendor/lib/libmmcamera_sw2d_lib.so
vendor/lib/libmmcamera_thread_services.so
vendor/lib/libmmcamera_tintless_algo.so
vendor/lib/libmmcamera_tintless_bg_pca_algo.so
vendor/lib/libmmcamera_trueportrait_lib.so
vendor/lib/libmmcamera_ubifocus_lib.so
vendor/lib/libmmjpeg_interface.so
vendor/lib/libmmjpeg.so
vendor/lib/libmmqjpeg_codec.so
vendor/lib/libmmqjpegdma.so
vendor/lib/libmorpho_hdr_checker.so
vendor/lib/libmorpho_easy_hdr.so
vendor/lib/libmpbase.so
vendor/lib/liboptizoom.so
vendor/lib/libqomx_core.so
vendor/lib/libqomx_jpegdec.so
vendor/lib/libqomx_jpegenc_pipe.so
vendor/lib/libqomx_jpegenc.so
vendor/lib/libremosaic_daemon.so
vendor/lib/libscveBlobDescriptor.so
vendor/lib/libscveBlobDescriptor_stub.so
vendor/lib/libscveCommon.so
vendor/lib/libscveCommon_stub.so
vendor/lib/libscveImageCorrection.so
vendor/lib/libscveObjectSegmentation.so
vendor/lib/libscveObjectTracker.so
vendor/lib/libscveObjectTracker_stub.so
vendor/lib/libscvePanorama_lite.so
vendor/lib/libscvePanorama.so
vendor/lib/libseemore.so
-vendor/lib/libts_detected_face_hal.so
-vendor/lib/libts_face_beautify_hal.so
vendor/lib/libubifocus.so
vendor/lib/libvideoutils.so
vendor/lib/libXMFD_AgeGender.so

# Camera actuators - from rosy:8.1.0/OPM1.171019.026/V11.0.2.0.ODAMIXM
vendor/lib/libactuator_ad5816g.so
vendor/lib/libactuator_ad5823.so
vendor/lib/libactuator_ak7345.so
vendor/lib/libactuator_ak7371.so
vendor/lib/libactuator_bu64244gwz.so
vendor/lib/libactuator_bu64297.so
vendor/lib/libactuator_dw9714.so
vendor/lib/libactuator_dw9716.so
vendor/lib/libactuator_dw9761b.so
vendor/lib/libactuator_dw9763.so
vendor/lib/libactuator_dw9763_sony_imx486_ii.so
vendor/lib/libactuator_lc898122.so
vendor/lib/libactuator_lc898212xd_qc2002.so
vendor/lib/libactuator_lc898212xd.so
vendor/lib/libactuator_lc898217xc.so
vendor/lib/libactuator_ovt_ov12a10_i_dw9763.so
vendor/lib/libactuator_pseudo.so
vendor/lib/libactuator_rohm_bu64243gwz.so

# Camera chromatix - from rosy:8.1.0/OPM1.171019.026/V11.0.2.0.ODAMIXM
vendor/lib/libchromatix_csidtg_common.so
vendor/lib/libchromatix_csidtg_cpp_preview.so
vendor/lib/libchromatix_csidtg_postproc.so
vendor/lib/libchromatix_csidtg_preview.so
vendor/lib/libchromatix_csidtg_zsl_preview.so
vendor/lib/libchromatix_ov13850_common.so
vendor/lib/libchromatix_ov13850_cpp_ds_chromatix.so
vendor/lib/libchromatix_ov13850_cpp_hfr_120.so
vendor/lib/libchromatix_ov13850_cpp_hfr_60.so
vendor/lib/libchromatix_ov13850_cpp_hfr_90.so
vendor/lib/libchromatix_ov13850_cpp_liveshot.so
vendor/lib/libchromatix_ov13850_cpp_preview.so
vendor/lib/libchromatix_ov13850_cpp_snapshot.so
vendor/lib/libchromatix_ov13850_cpp_us_chromatix.so
vendor/lib/libchromatix_ov13850_cpp_video_full.so
vendor/lib/libchromatix_ov13850_cpp_video.so
vendor/lib/libchromatix_ov13850_default_preview_lc898212xd.so
vendor/lib/libchromatix_ov13850_default_video_lc898212xd.so
vendor/lib/libchromatix_ov13850_default_video.so
vendor/lib/libchromatix_ov13850_hfr_120_lc898212xd.so
vendor/lib/libchromatix_ov13850_hfr_120.so
vendor/lib/libchromatix_ov13850_hfr_60_lc898212xd.so
vendor/lib/libchromatix_ov13850_hfr_60.so
vendor/lib/libchromatix_ov13850_hfr_90_lc898212xd.so
vendor/lib/libchromatix_ov13850_hfr_90.so
vendor/lib/libchromatix_ov13850_postproc.so
vendor/lib/libchromatix_ov13850_preview.so
vendor/lib/libchromatix_ov13850_q13v06k_common.so
vendor/lib/libchromatix_ov13850_q13v06k_cpp_ds_chromatix.so
vendor/lib/libchromatix_ov13850_q13v06k_cpp_hfr_120.so
vendor/lib/libchromatix_ov13850_q13v06k_cpp_hfr_60.so
vendor/lib/libchromatix_ov13850_q13v06k_cpp_hfr_90.so
vendor/lib/libchromatix_ov13850_q13v06k_cpp_liveshot.so
vendor/lib/libchromatix_ov13850_q13v06k_cpp_preview.so
vendor/lib/libchromatix_ov13850_q13v06k_cpp_snapshot.so
vendor/lib/libchromatix_ov13850_q13v06k_cpp_us_chromatix.so
vendor/lib/libchromatix_ov13850_q13v06k_cpp_video_full.so
vendor/lib/libchromatix_ov13850_q13v06k_cpp_video.so
vendor/lib/libchromatix_ov13850_q13v06k_default_preview_bu64297.so
vendor/lib/libchromatix_ov13850_q13v06k_default_video_bu64297.so
vendor/lib/libchromatix_ov13850_q13v06k_default_video.so
vendor/lib/libchromatix_ov13850_q13v06k_hfr_120_bu64297.so
vendor/lib/libchromatix_ov13850_q13v06k_hfr_120.so
vendor/lib/libchromatix_ov13850_q13v06k_hfr_60_bu64297.so
vendor/lib/libchromatix_ov13850_q13v06k_hfr_60.so
vendor/lib/libchromatix_ov13850_q13v06k_hfr_90_bu64297.so
vendor/lib/libchromatix_ov13850_q13v06k_hfr_90.so
vendor/lib/libchromatix_ov13850_q13v06k_postproc.so
vendor/lib/libchromatix_ov13850_q13v06k_preview.so
vendor/lib/libchromatix_ov13850_q13v06k_snapshot.so
vendor/lib/libchromatix_ov13850_q13v06k_video_full.so
vendor/lib/libchromatix_ov13850_q13v06k_zsl_preview_bu64297.so
vendor/lib/libchromatix_ov13850_q13v06k_zsl_video_bu64297.so
vendor/lib/libchromatix_ov13850_snapshot.so
vendor/lib/libchromatix_ov13850_video_full.so
vendor/lib/libchromatix_ov13850_zsl_preview_lc898212xd.so
vendor/lib/libchromatix_ov13850_zsl_video_lc898212xd.so
vendor/lib/libchromatix_ov2281_a3_default_preview.so
vendor/lib/libchromatix_ov2281_a3_default_video.so
vendor/lib/libchromatix_ov2281_common.so
vendor/lib/libchromatix_ov2281_cpp_ds_chromatix.so
vendor/lib/libchromatix_ov2281_cpp_liveshot.so
vendor/lib/libchromatix_ov2281_cpp_preview.so
vendor/lib/libchromatix_ov2281_cpp_snapshot.so
vendor/lib/libchromatix_ov2281_cpp_us_chromatix.so
vendor/lib/libchromatix_ov2281_cpp_video.so
vendor/lib/libchromatix_ov2281_default_video.so
vendor/lib/libchromatix_ov2281_postproc.so
vendor/lib/libchromatix_ov2281_preview.so
vendor/lib/libchromatix_ov2281_snapshot.so
vendor/lib/libchromatix_ov2281_zsl_preview.so
vendor/lib/libchromatix_ov2281_zsl_video.so
vendor/lib/libchromatix_ov2680_a3_default_preview.so
vendor/lib/libchromatix_ov2680_a3_default_video.so
vendor/lib/libchromatix_ov2680_a3_hfr_60.so
vendor/lib/libchromatix_ov2680_common.so
vendor/lib/libchromatix_ov2680_cpp_hfr_60.so
vendor/lib/libchromatix_ov2680_cpp_liveshot.so
vendor/lib/libchromatix_ov2680_cpp_preview.so
vendor/lib/libchromatix_ov2680_cpp_snapshot.so
vendor/lib/libchromatix_ov2680_cpp_video.so
vendor/lib/libchromatix_ov2680_default_video.so
vendor/lib/libchromatix_ov2680_hfr_60.so
vendor/lib/libchromatix_ov2680_liveshot.so
vendor/lib/libchromatix_ov2680_postproc.so
vendor/lib/libchromatix_ov2680_preview.so
vendor/lib/libchromatix_ov2680_snapshot.so
vendor/lib/libchromatix_ov2680_zsl_preview.so
vendor/lib/libchromatix_ov4688_common.so
vendor/lib/libchromatix_ov4688_cpp_hfr_120.so
vendor/lib/libchromatix_ov4688_cpp_hfr_60.so
vendor/lib/libchromatix_ov4688_cpp_hfr_90.so
vendor/lib/libchromatix_ov4688_cpp_liveshot.so
vendor/lib/libchromatix_ov4688_cpp_preview.so
vendor/lib/libchromatix_ov4688_cpp_snapshot.so
vendor/lib/libchromatix_ov4688_cpp_video.so
vendor/lib/libchromatix_ov4688_default_video.so
vendor/lib/libchromatix_ov4688_hfr_120_ad5823.so
vendor/lib/libchromatix_ov4688_hfr_120.so
vendor/lib/libchromatix_ov4688_hfr_60_ad5823.so
vendor/lib/libchromatix_ov4688_hfr_60.so
vendor/lib/libchromatix_ov4688_hfr_90_ad5823.so
vendor/lib/libchromatix_ov4688_hfr_90.so
vendor/lib/libchromatix_ov4688_postproc.so
vendor/lib/libchromatix_ov4688_preview.so
vendor/lib/libchromatix_ov4688_snapshot.so
vendor/lib/libchromatix_ov4688_zsl_preview_ad5823.so
vendor/lib/libchromatix_ov4688_zsl_video_ad5823.so
vendor/lib/libchromatix_ov5670_a3_default_preview.so
vendor/lib/libchromatix_ov5670_a3_default_video.so
vendor/lib/libchromatix_ov5670_a3_hfr_120.so
vendor/lib/libchromatix_ov5670_a3_hfr_60.so
vendor/lib/libchromatix_ov5670_a3_hfr_90.so
vendor/lib/libchromatix_ov5670_common.so
vendor/lib/libchromatix_ov5670_cpp_ds_chromatix.so
vendor/lib/libchromatix_ov5670_cpp_hfr_120.so
vendor/lib/libchromatix_ov5670_cpp_hfr_60.so
vendor/lib/libchromatix_ov5670_cpp_hfr_90.so
vendor/lib/libchromatix_ov5670_cpp_liveshot.so
vendor/lib/libchromatix_ov5670_cpp_preview.so
vendor/lib/libchromatix_ov5670_cpp_snapshot.so
vendor/lib/libchromatix_ov5670_cpp_us_chromatix.so
vendor/lib/libchromatix_ov5670_cpp_video_full.so
vendor/lib/libchromatix_ov5670_cpp_video.so
vendor/lib/libchromatix_ov5670_default_video.so
vendor/lib/libchromatix_ov5670_f5670bq_a3_default_preview.so
vendor/lib/libchromatix_ov5670_f5670bq_a3_default_video.so
vendor/lib/libchromatix_ov5670_f5670bq_a3_hfr_120.so
vendor/lib/libchromatix_ov5670_f5670bq_a3_hfr_60.so
vendor/lib/libchromatix_ov5670_f5670bq_a3_hfr_90.so
vendor/lib/libchromatix_ov5670_f5670bq_common.so
vendor/lib/libchromatix_ov5670_f5670bq_cpp_ds_chromatix.so
vendor/lib/libchromatix_ov5670_f5670bq_cpp_hfr_120.so
vendor/lib/libchromatix_ov5670_f5670bq_cpp_hfr_60.so
vendor/lib/libchromatix_ov5670_f5670bq_cpp_hfr_90.so
vendor/lib/libchromatix_ov5670_f5670bq_cpp_liveshot.so
vendor/lib/libchromatix_ov5670_f5670bq_cpp_preview.so
vendor/lib/libchromatix_ov5670_f5670bq_cpp_snapshot.so
vendor/lib/libchromatix_ov5670_f5670bq_cpp_us_chromatix.so
vendor/lib/libchromatix_ov5670_f5670bq_cpp_video_full.so
vendor/lib/libchromatix_ov5670_f5670bq_cpp_video.so
vendor/lib/libchromatix_ov5670_f5670bq_default_video.so
vendor/lib/libchromatix_ov5670_f5670bq_hfr_120.so
vendor/lib/libchromatix_ov5670_f5670bq_hfr_60.so
vendor/lib/libchromatix_ov5670_f5670bq_hfr_90.so
vendor/lib/libchromatix_ov5670_f5670bq_liveshot.so
vendor/lib/libchromatix_ov5670_f5670bq_postproc.so
vendor/lib/libchromatix_ov5670_f5670bq_preview.so
vendor/lib/libchromatix_ov5670_f5670bq_snapshot.so
vendor/lib/libchromatix_ov5670_f5670bq_video_full.so
vendor/lib/libchromatix_ov5670_f5670bq_zsl_preview.so
vendor/lib/libchromatix_ov5670_f5670bq_zsl_video.so
vendor/lib/libchromatix_ov5670_hfr_120.so
vendor/lib/libchromatix_ov5670_hfr_60.so
vendor/lib/libchromatix_ov5670_hfr_90.so
vendor/lib/libchromatix_ov5670_postproc.so
vendor/lib/libchromatix_ov5670_preview.so
vendor/lib/libchromatix_ov5670_snapshot.so
vendor/lib/libchromatix_ov5670_video_full.so
vendor/lib/libchromatix_ov5670_zsl_preview.so
vendor/lib/libchromatix_ov5670_zsl_video.so
vendor/lib/libchromatix_ov5695_a3_default_preview.so
vendor/lib/libchromatix_ov5695_a3_default_video.so
vendor/lib/libchromatix_ov5695_a3_hfr_120.so
vendor/lib/libchromatix_ov5695_a3_hfr_60.so
vendor/lib/libchromatix_ov5695_a3_hfr_90.so
vendor/lib/libchromatix_ov5695_common.so
vendor/lib/libchromatix_ov5695_cpp_ds_chromatix.so
vendor/lib/libchromatix_ov5695_cpp_hfr_120.so
vendor/lib/libchromatix_ov5695_cpp_hfr_60.so
vendor/lib/libchromatix_ov5695_cpp_hfr_90.so
vendor/lib/libchromatix_ov5695_cpp_liveshot.so
vendor/lib/libchromatix_ov5695_cpp_preview.so
vendor/lib/libchromatix_ov5695_cpp_snapshot.so
vendor/lib/libchromatix_ov5695_cpp_us_chromatix.so
vendor/lib/libchromatix_ov5695_cpp_video_full.so
vendor/lib/libchromatix_ov5695_cpp_video.so
vendor/lib/libchromatix_ov5695_default_video.so
vendor/lib/libchromatix_ov5695_hfr_120.so
vendor/lib/libchromatix_ov5695_hfr_60.so
vendor/lib/libchromatix_ov5695_hfr_90.so
vendor/lib/libchromatix_ov5695_liveshot.so
vendor/lib/libchromatix_ov5695_postproc.so
vendor/lib/libchromatix_ov5695_preview.so
vendor/lib/libchromatix_ov5695_snapshot.so
vendor/lib/libchromatix_ov5695_video_full.so
vendor/lib/libchromatix_ov5695_zsl_preview.so
vendor/lib/libchromatix_ov5695_zsl_video.so
vendor/lib/libchromatix_ov7251_cpp_liveshot.so
vendor/lib/libchromatix_ov7251_cpp_preview.so
vendor/lib/libchromatix_ov7251_cpp_snapshot.so
vendor/lib/libchromatix_ov7251_cpp_video.so
vendor/lib/libchromatix_ov7251_default_video.so
vendor/lib/libchromatix_ov7251_postproc.so
vendor/lib/libchromatix_ov7251_preview.so
vendor/lib/libchromatix_ov7251_snapshot.so
vendor/lib/libchromatix_ov7251_zsl_preview.so
vendor/lib/libchromatix_ov7251_zsl_video.so
vendor/lib/libchromatix_ov8856_a3_default_preview.so
vendor/lib/libchromatix_ov8856_a3_default_video.so
vendor/lib/libchromatix_ov8856_a3_hfr_120.so
vendor/lib/libchromatix_ov8856_a3_hfr_60.so
vendor/lib/libchromatix_ov8856_a3_hfr_90.so
vendor/lib/libchromatix_ov8856_common.so
vendor/lib/libchromatix_ov8856_cpp_ds_chromatix.so
vendor/lib/libchromatix_ov8856_cpp_hfr_120.so
vendor/lib/libchromatix_ov8856_cpp_hfr_60.so
vendor/lib/libchromatix_ov8856_cpp_hfr_90.so
vendor/lib/libchromatix_ov8856_cpp_liveshot.so
vendor/lib/libchromatix_ov8856_cpp_preview.so
vendor/lib/libchromatix_ov8856_cpp_snapshot.so
vendor/lib/libchromatix_ov8856_cpp_us_chromatix.so
vendor/lib/libchromatix_ov8856_cpp_video.so
vendor/lib/libchromatix_ov8856_default_video.so
vendor/lib/libchromatix_ov8856_hfr_120.so
vendor/lib/libchromatix_ov8856_hfr_60.so
vendor/lib/libchromatix_ov8856_hfr_90.so
vendor/lib/libchromatix_ov8856_liveshot.so
vendor/lib/libchromatix_ov8856_postproc.so
vendor/lib/libchromatix_ov8856_preview.so
vendor/lib/libchromatix_ov8856_snapshot.so
vendor/lib/libchromatix_ov8856_zsl_preview.so
vendor/lib/libchromatix_ov8856_zsl_video.so
vendor/lib/libchromatix_ov8858_a3_default_preview.so
vendor/lib/libchromatix_ov8858_a3_default_video.so
vendor/lib/libchromatix_ov8858_a3_hfr_120.so
vendor/lib/libchromatix_ov8858_a3_hfr_60.so
vendor/lib/libchromatix_ov8858_a3_hfr_90.so
vendor/lib/libchromatix_ov8858_common.so
vendor/lib/libchromatix_ov8858_cpp_ds_chromatix.so
vendor/lib/libchromatix_ov8858_cpp_hfr_120.so
vendor/lib/libchromatix_ov8858_cpp_hfr_60.so
vendor/lib/libchromatix_ov8858_cpp_hfr_90.so
vendor/lib/libchromatix_ov8858_cpp_liveshot.so
vendor/lib/libchromatix_ov8858_cpp_preview.so
vendor/lib/libchromatix_ov8858_cpp_snapshot.so
vendor/lib/libchromatix_ov8858_cpp_us_chromatix.so
vendor/lib/libchromatix_ov8858_cpp_video.so
vendor/lib/libchromatix_ov8858_default_video.so
vendor/lib/libchromatix_ov8858_hfr_120.so
vendor/lib/libchromatix_ov8858_hfr_60.so
vendor/lib/libchromatix_ov8858_hfr_90.so
vendor/lib/libchromatix_ov8858_postproc.so
vendor/lib/libchromatix_ov8858_preview.so
vendor/lib/libchromatix_ov8858_snapshot.so
vendor/lib/libchromatix_ov8858_zsl_preview.so
vendor/lib/libchromatix_ov8858_zsl_video.so
vendor/lib/libchromatix_ov8865_common.so
vendor/lib/libchromatix_ov8865_cpp_ds_chromatix.so
vendor/lib/libchromatix_ov8865_cpp_hfr_120.so
vendor/lib/libchromatix_ov8865_cpp_hfr_60.so
vendor/lib/libchromatix_ov8865_cpp_hfr_90.so
vendor/lib/libchromatix_ov8865_cpp_liveshot.so
vendor/lib/libchromatix_ov8865_cpp_preview.so
vendor/lib/libchromatix_ov8865_cpp_snapshot.so
vendor/lib/libchromatix_ov8865_cpp_us_chromatix.so
vendor/lib/libchromatix_ov8865_cpp_video_full.so
vendor/lib/libchromatix_ov8865_cpp_video.so
vendor/lib/libchromatix_ov8865_default_preview_dw9714.so
vendor/lib/libchromatix_ov8865_default_video_dw9714.so
vendor/lib/libchromatix_ov8865_default_video.so
vendor/lib/libchromatix_ov8865_hfr_120_dw9714.so
vendor/lib/libchromatix_ov8865_hfr_120.so
vendor/lib/libchromatix_ov8865_hfr_60_dw9714.so
vendor/lib/libchromatix_ov8865_hfr_60.so
vendor/lib/libchromatix_ov8865_hfr_90_dw9714.so
vendor/lib/libchromatix_ov8865_hfr_90.so
vendor/lib/libchromatix_ov8865_postproc.so
vendor/lib/libchromatix_ov8865_preview.so
vendor/lib/libchromatix_ov8865_snapshot.so
vendor/lib/libchromatix_ov8865_video_full.so
vendor/lib/libchromatix_ov8865_zsl_preview.so
vendor/lib/libchromatix_ov8865_zsl_video.so
vendor/lib/libchromatix_ovt_ov12a10_i_4K_preview_dw9763.so
vendor/lib/libchromatix_ovt_ov12a10_i_4K.so
vendor/lib/libchromatix_ovt_ov12a10_i_4K_video_dw9763.so
vendor/lib/libchromatix_ovt_ov12a10_i_common.so
vendor/lib/libchromatix_ovt_ov12a10_i_cpp_4K.so
vendor/lib/libchromatix_ovt_ov12a10_i_cpp_hfr_120.so
vendor/lib/libchromatix_ovt_ov12a10_i_cpp_hfr_60.so
vendor/lib/libchromatix_ovt_ov12a10_i_cpp_hfr_90.so
vendor/lib/libchromatix_ovt_ov12a10_i_cpp_liveshot.so
vendor/lib/libchromatix_ovt_ov12a10_i_cpp_preview.so
vendor/lib/libchromatix_ovt_ov12a10_i_cpp_snapshot_hht.so
vendor/lib/libchromatix_ovt_ov12a10_i_cpp_snapshot.so
vendor/lib/libchromatix_ovt_ov12a10_i_cpp_video.so
vendor/lib/libchromatix_ovt_ov12a10_i_default_preview_dw9763.so
vendor/lib/libchromatix_ovt_ov12a10_i_default_video_dw9763.so
vendor/lib/libchromatix_ovt_ov12a10_i_default_video.so
vendor/lib/libchromatix_ovt_ov12a10_i_hfr_120_dw9763.so
vendor/lib/libchromatix_ovt_ov12a10_i_hfr_120.so
vendor/lib/libchromatix_ovt_ov12a10_i_hfr_60_dw9763.so
vendor/lib/libchromatix_ovt_ov12a10_i_hfr_60.so
vendor/lib/libchromatix_ovt_ov12a10_i_hfr_90_dw9763.so
vendor/lib/libchromatix_ovt_ov12a10_i_hfr_90.so
vendor/lib/libchromatix_ovt_ov12a10_i_india_4K_preview_dw9763.so
vendor/lib/libchromatix_ovt_ov12a10_i_india_4K.so
vendor/lib/libchromatix_ovt_ov12a10_i_india_4K_video_dw9763.so
vendor/lib/libchromatix_ovt_ov12a10_i_india_common.so
vendor/lib/libchromatix_ovt_ov12a10_i_india_cpp_4K.so
vendor/lib/libchromatix_ovt_ov12a10_i_india_cpp_hfr_120.so
vendor/lib/libchromatix_ovt_ov12a10_i_india_cpp_hfr_60.so
vendor/lib/libchromatix_ovt_ov12a10_i_india_cpp_hfr_90.so
vendor/lib/libchromatix_ovt_ov12a10_i_india_cpp_liveshot.so
vendor/lib/libchromatix_ovt_ov12a10_i_india_cpp_preview.so
vendor/lib/libchromatix_ovt_ov12a10_i_india_cpp_snapshot_hht.so
vendor/lib/libchromatix_ovt_ov12a10_i_india_cpp_snapshot.so
vendor/lib/libchromatix_ovt_ov12a10_i_india_cpp_video.so
vendor/lib/libchromatix_ovt_ov12a10_i_india_default_preview_dw9763.so
vendor/lib/libchromatix_ovt_ov12a10_i_india_default_video_dw9763.so
vendor/lib/libchromatix_ovt_ov12a10_i_india_default_video.so
vendor/lib/libchromatix_ovt_ov12a10_i_india_hfr_120_dw9763.so
vendor/lib/libchromatix_ovt_ov12a10_i_india_hfr_120.so
vendor/lib/libchromatix_ovt_ov12a10_i_india_hfr_60_dw9763.so
vendor/lib/libchromatix_ovt_ov12a10_i_india_hfr_60.so
vendor/lib/libchromatix_ovt_ov12a10_i_india_hfr_90_dw9763.so
vendor/lib/libchromatix_ovt_ov12a10_i_india_hfr_90.so
vendor/lib/libchromatix_ovt_ov12a10_i_india_liveshot.so
vendor/lib/libchromatix_ovt_ov12a10_i_india_postproc.so
vendor/lib/libchromatix_ovt_ov12a10_i_india_preview.so
vendor/lib/libchromatix_ovt_ov12a10_i_india_snapshot.so
vendor/lib/libchromatix_ovt_ov12a10_i_india_zsl_preview_dw9763.so
vendor/lib/libchromatix_ovt_ov12a10_i_india_zsl_video_dw9763.so
vendor/lib/libchromatix_ovt_ov12a10_i_liveshot.so
vendor/lib/libchromatix_ovt_ov12a10_i_postproc.so
vendor/lib/libchromatix_ovt_ov12a10_i_preview.so
vendor/lib/libchromatix_ovt_ov12a10_i_snapshot.so
vendor/lib/libchromatix_ovt_ov12a10_i_zsl_preview_dw9763.so
vendor/lib/libchromatix_ovt_ov12a10_i_zsl_video_dw9763.so
vendor/lib/libchromatix_ovt_ov5675_i_common.so
vendor/lib/libchromatix_ovt_ov5675_i_common_torch.so
vendor/lib/libchromatix_ovt_ov5675_i_cpp_hfr_120.so
vendor/lib/libchromatix_ovt_ov5675_i_cpp_hfr_60.so
vendor/lib/libchromatix_ovt_ov5675_i_cpp_hfr_90.so
vendor/lib/libchromatix_ovt_ov5675_i_cpp_liveshot.so
vendor/lib/libchromatix_ovt_ov5675_i_cpp_liveshot_torch.so
vendor/lib/libchromatix_ovt_ov5675_i_cpp_preview.so
vendor/lib/libchromatix_ovt_ov5675_i_cpp_preview_torch.so
vendor/lib/libchromatix_ovt_ov5675_i_cpp_snapshot_hht.so
vendor/lib/libchromatix_ovt_ov5675_i_cpp_snapshot.so
vendor/lib/libchromatix_ovt_ov5675_i_cpp_snapshot_torch.so
vendor/lib/libchromatix_ovt_ov5675_i_cpp_video.so
vendor/lib/libchromatix_ovt_ov5675_i_cpp_video_torch.so
vendor/lib/libchromatix_ovt_ov5675_i_default_preview_3a.so
vendor/lib/libchromatix_ovt_ov5675_i_default_preview_3a_torch.so
vendor/lib/libchromatix_ovt_ov5675_i_default_video_3a.so
vendor/lib/libchromatix_ovt_ov5675_i_default_video_3a_torch.so
vendor/lib/libchromatix_ovt_ov5675_i_default_video.so
vendor/lib/libchromatix_ovt_ov5675_i_hfr_120_3a.so
vendor/lib/libchromatix_ovt_ov5675_i_hfr_120.so
vendor/lib/libchromatix_ovt_ov5675_i_hfr_60_3a.so
vendor/lib/libchromatix_ovt_ov5675_i_hfr_60.so
vendor/lib/libchromatix_ovt_ov5675_i_hfr_90_3a.so
vendor/lib/libchromatix_ovt_ov5675_i_hfr_90.so
vendor/lib/libchromatix_ovt_ov5675_ii_common.so
vendor/lib/libchromatix_ovt_ov5675_ii_common_torch.so
vendor/lib/libchromatix_ovt_ov5675_ii_cpp_hfr_120.so
vendor/lib/libchromatix_ovt_ov5675_ii_cpp_hfr_60.so
vendor/lib/libchromatix_ovt_ov5675_ii_cpp_hfr_90.so
vendor/lib/libchromatix_ovt_ov5675_ii_cpp_liveshot.so
vendor/lib/libchromatix_ovt_ov5675_ii_cpp_liveshot_torch.so
vendor/lib/libchromatix_ovt_ov5675_ii_cpp_preview.so
vendor/lib/libchromatix_ovt_ov5675_ii_cpp_preview_torch.so
vendor/lib/libchromatix_ovt_ov5675_ii_cpp_snapshot_hht.so
vendor/lib/libchromatix_ovt_ov5675_ii_cpp_snapshot.so
vendor/lib/libchromatix_ovt_ov5675_ii_cpp_snapshot_torch.so
vendor/lib/libchromatix_ovt_ov5675_ii_cpp_video.so
vendor/lib/libchromatix_ovt_ov5675_ii_cpp_video_torch.so
vendor/lib/libchromatix_ovt_ov5675_ii_default_preview_3a.so
vendor/lib/libchromatix_ovt_ov5675_ii_default_preview_3a_torch.so
vendor/lib/libchromatix_ovt_ov5675_ii_default_video_3a.so
vendor/lib/libchromatix_ovt_ov5675_ii_default_video_3a_torch.so
vendor/lib/libchromatix_ovt_ov5675_ii_default_video.so
vendor/lib/libchromatix_ovt_ov5675_ii_hfr_120_3a.so
vendor/lib/libchromatix_ovt_ov5675_ii_hfr_120.so
vendor/lib/libchromatix_ovt_ov5675_ii_hfr_60_3a.so
vendor/lib/libchromatix_ovt_ov5675_ii_hfr_60.so
vendor/lib/libchromatix_ovt_ov5675_ii_hfr_90_3a.so
vendor/lib/libchromatix_ovt_ov5675_ii_hfr_90.so
vendor/lib/libchromatix_ovt_ov5675_ii_india_common.so
vendor/lib/libchromatix_ovt_ov5675_ii_india_common_torch.so
vendor/lib/libchromatix_ovt_ov5675_ii_india_cpp_hfr_120.so
vendor/lib/libchromatix_ovt_ov5675_ii_india_cpp_hfr_60.so
vendor/lib/libchromatix_ovt_ov5675_ii_india_cpp_hfr_90.so
vendor/lib/libchromatix_ovt_ov5675_ii_india_cpp_liveshot.so
vendor/lib/libchromatix_ovt_ov5675_ii_india_cpp_liveshot_torch.so
vendor/lib/libchromatix_ovt_ov5675_ii_india_cpp_preview.so
vendor/lib/libchromatix_ovt_ov5675_ii_india_cpp_preview_torch.so
vendor/lib/libchromatix_ovt_ov5675_ii_india_cpp_snapshot_hht.so
vendor/lib/libchromatix_ovt_ov5675_ii_india_cpp_snapshot.so
vendor/lib/libchromatix_ovt_ov5675_ii_india_cpp_snapshot_torch.so
vendor/lib/libchromatix_ovt_ov5675_ii_india_cpp_video.so
vendor/lib/libchromatix_ovt_ov5675_ii_india_cpp_video_torch.so
vendor/lib/libchromatix_ovt_ov5675_ii_india_default_preview_3a.so
vendor/lib/libchromatix_ovt_ov5675_ii_india_default_preview_3a_torch.so
vendor/lib/libchromatix_ovt_ov5675_ii_india_default_video_3a.so
vendor/lib/libchromatix_ovt_ov5675_ii_india_default_video_3a_torch.so
vendor/lib/libchromatix_ovt_ov5675_ii_india_default_video.so
vendor/lib/libchromatix_ovt_ov5675_ii_india_hfr_120_3a.so
vendor/lib/libchromatix_ovt_ov5675_ii_india_hfr_120.so
vendor/lib/libchromatix_ovt_ov5675_ii_india_hfr_60_3a.so
vendor/lib/libchromatix_ovt_ov5675_ii_india_hfr_60.so
vendor/lib/libchromatix_ovt_ov5675_ii_india_hfr_90_3a.so
vendor/lib/libchromatix_ovt_ov5675_ii_india_hfr_90.so
vendor/lib/libchromatix_ovt_ov5675_ii_india_liveshot.so
vendor/lib/libchromatix_ovt_ov5675_ii_india_postproc.so
vendor/lib/libchromatix_ovt_ov5675_ii_india_postproc_torch.so
vendor/lib/libchromatix_ovt_ov5675_ii_india_preview.so
vendor/lib/libchromatix_ovt_ov5675_ii_india_snapshot.so
vendor/lib/libchromatix_ovt_ov5675_ii_india_snapshot_torch.so
vendor/lib/libchromatix_ovt_ov5675_ii_india_zsl_preview_3a.so
vendor/lib/libchromatix_ovt_ov5675_ii_india_zsl_preview_3a_torch.so
vendor/lib/libchromatix_ovt_ov5675_ii_india_zsl_video_3a.so
vendor/lib/libchromatix_ovt_ov5675_ii_india_zsl_video_3a_torch.so
vendor/lib/libchromatix_ovt_ov5675_ii_liveshot.so
vendor/lib/libchromatix_ovt_ov5675_i_india_common.so
vendor/lib/libchromatix_ovt_ov5675_i_india_common_torch.so
vendor/lib/libchromatix_ovt_ov5675_i_india_cpp_hfr_120.so
vendor/lib/libchromatix_ovt_ov5675_i_india_cpp_hfr_60.so
vendor/lib/libchromatix_ovt_ov5675_i_india_cpp_hfr_90.so
vendor/lib/libchromatix_ovt_ov5675_i_india_cpp_liveshot.so
vendor/lib/libchromatix_ovt_ov5675_i_india_cpp_liveshot_torch.so
vendor/lib/libchromatix_ovt_ov5675_i_india_cpp_preview.so
vendor/lib/libchromatix_ovt_ov5675_i_india_cpp_preview_torch.so
vendor/lib/libchromatix_ovt_ov5675_i_india_cpp_snapshot_hht.so
vendor/lib/libchromatix_ovt_ov5675_i_india_cpp_snapshot.so
vendor/lib/libchromatix_ovt_ov5675_i_india_cpp_snapshot_torch.so
vendor/lib/libchromatix_ovt_ov5675_i_india_cpp_video.so
vendor/lib/libchromatix_ovt_ov5675_i_india_cpp_video_torch.so
vendor/lib/libchromatix_ovt_ov5675_i_india_default_preview_3a.so
vendor/lib/libchromatix_ovt_ov5675_i_india_default_preview_3a_torch.so
vendor/lib/libchromatix_ovt_ov5675_i_india_default_video_3a.so
vendor/lib/libchromatix_ovt_ov5675_i_india_default_video_3a_torch.so
vendor/lib/libchromatix_ovt_ov5675_i_india_default_video.so
vendor/lib/libchromatix_ovt_ov5675_i_india_hfr_120_3a.so
vendor/lib/libchromatix_ovt_ov5675_i_india_hfr_120.so
vendor/lib/libchromatix_ovt_ov5675_i_india_hfr_60_3a.so
vendor/lib/libchromatix_ovt_ov5675_i_india_hfr_60.so
vendor/lib/libchromatix_ovt_ov5675_i_india_hfr_90_3a.so
vendor/lib/libchromatix_ovt_ov5675_i_india_hfr_90.so
vendor/lib/libchromatix_ovt_ov5675_i_india_liveshot.so
vendor/lib/libchromatix_ovt_ov5675_i_india_postproc.so
vendor/lib/libchromatix_ovt_ov5675_i_india_postproc_torch.so
vendor/lib/libchromatix_ovt_ov5675_i_india_preview.so
vendor/lib/libchromatix_ovt_ov5675_i_india_snapshot.so
vendor/lib/libchromatix_ovt_ov5675_i_india_snapshot_torch.so
vendor/lib/libchromatix_ovt_ov5675_i_india_zsl_preview_3a.so
vendor/lib/libchromatix_ovt_ov5675_i_india_zsl_preview_3a_torch.so
vendor/lib/libchromatix_ovt_ov5675_i_india_zsl_video_3a.so
vendor/lib/libchromatix_ovt_ov5675_i_india_zsl_video_3a_torch.so
vendor/lib/libchromatix_ovt_ov5675_ii_postproc.so
vendor/lib/libchromatix_ovt_ov5675_ii_postproc_torch.so
vendor/lib/libchromatix_ovt_ov5675_ii_preview.so
vendor/lib/libchromatix_ovt_ov5675_ii_snapshot.so
vendor/lib/libchromatix_ovt_ov5675_ii_snapshot_torch.so
vendor/lib/libchromatix_ovt_ov5675_ii_zsl_preview_3a.so
vendor/lib/libchromatix_ovt_ov5675_ii_zsl_preview_3a_torch.so
vendor/lib/libchromatix_ovt_ov5675_ii_zsl_video_3a.so
vendor/lib/libchromatix_ovt_ov5675_ii_zsl_video_3a_torch.so
vendor/lib/libchromatix_ovt_ov5675_i_liveshot.so
vendor/lib/libchromatix_ovt_ov5675_i_postproc.so
vendor/lib/libchromatix_ovt_ov5675_i_postproc_torch.so
vendor/lib/libchromatix_ovt_ov5675_i_preview.so
vendor/lib/libchromatix_ovt_ov5675_i_snapshot.so
vendor/lib/libchromatix_ovt_ov5675_i_snapshot_torch.so
vendor/lib/libchromatix_ovt_ov5675_i_zsl_preview_3a.so
vendor/lib/libchromatix_ovt_ov5675_i_zsl_preview_3a_torch.so
vendor/lib/libchromatix_ovt_ov5675_i_zsl_video_3a.so
vendor/lib/libchromatix_ovt_ov5675_i_zsl_video_3a_torch.so
vendor/lib/libchromatix_s5k2l7_4k_preview_ak7371.so
vendor/lib/libchromatix_s5k2l7_4k_video_ak7371.so
vendor/lib/libchromatix_s5k2l7_8953_4k_preview_ak7371.so
vendor/lib/libchromatix_s5k2l7_8953_4k_video_ak7371.so
vendor/lib/libchromatix_s5k2l7_8953_common.so
vendor/lib/libchromatix_s5k2l7_8953_cpp_hfr_120.so
vendor/lib/libchromatix_s5k2l7_8953_cpp_hfr_60.so
vendor/lib/libchromatix_s5k2l7_8953_cpp_hfr_90.so
vendor/lib/libchromatix_s5k2l7_8953_cpp_liveshot.so
vendor/lib/libchromatix_s5k2l7_8953_cpp_preview.so
vendor/lib/libchromatix_s5k2l7_8953_cpp_snapshot.so
vendor/lib/libchromatix_s5k2l7_8953_cpp_video_4k.so
vendor/lib/libchromatix_s5k2l7_8953_cpp_video.so
vendor/lib/libchromatix_s5k2l7_8953_default_preview_ak7371.so
vendor/lib/libchromatix_s5k2l7_8953_default_video_ak7371.so
vendor/lib/libchromatix_s5k2l7_8953_hfr_120_ak7371.so
vendor/lib/libchromatix_s5k2l7_8953_hfr_120.so
vendor/lib/libchromatix_s5k2l7_8953_hfr_60_ak7371.so
vendor/lib/libchromatix_s5k2l7_8953_hfr_60.so
vendor/lib/libchromatix_s5k2l7_8953_hfr_90_ak7371.so
vendor/lib/libchromatix_s5k2l7_8953_hfr_90.so
vendor/lib/libchromatix_s5k2l7_8953_postproc.so
vendor/lib/libchromatix_s5k2l7_8953_preview.so
vendor/lib/libchromatix_s5k2l7_8953_snapshot.so
vendor/lib/libchromatix_s5k2l7_8953_video_4k.so
vendor/lib/libchromatix_s5k2l7_8953_zsl_preview_ak7371.so
vendor/lib/libchromatix_s5k2l7_8953_zsl_video_ak7371.so
vendor/lib/libchromatix_s5k2l7_common.so
vendor/lib/libchromatix_s5k2l7_cpp_hfr_120.so
vendor/lib/libchromatix_s5k2l7_cpp_hfr_60.so
vendor/lib/libchromatix_s5k2l7_cpp_hfr_90.so
vendor/lib/libchromatix_s5k2l7_cpp_liveshot.so
vendor/lib/libchromatix_s5k2l7_cpp_preview.so
vendor/lib/libchromatix_s5k2l7_cpp_snapshot.so
vendor/lib/libchromatix_s5k2l7_cpp_video_4k.so
vendor/lib/libchromatix_s5k2l7_cpp_video.so
vendor/lib/libchromatix_s5k2l7_default_preview_ak7371.so
vendor/lib/libchromatix_s5k2l7_default_video_ak7371.so
vendor/lib/libchromatix_s5k2l7_hfr_120_ak7371.so
vendor/lib/libchromatix_s5k2l7_hfr_120.so
vendor/lib/libchromatix_s5k2l7_hfr_60_ak7371.so
vendor/lib/libchromatix_s5k2l7_hfr_60.so
vendor/lib/libchromatix_s5k2l7_hfr_90_ak7371.so
vendor/lib/libchromatix_s5k2l7_hfr_90.so
vendor/lib/libchromatix_s5k2l7_postproc.so
vendor/lib/libchromatix_s5k2l7_preview.so
vendor/lib/libchromatix_s5k2l7_snapshot.so
vendor/lib/libchromatix_s5k2l7_video_4k.so
vendor/lib/libchromatix_s5k2l7_zsl_preview_ak7371.so
vendor/lib/libchromatix_s5k2l7_zsl_video_ak7371.so
vendor/lib/libchromatix_s5k3m2xm_common_bear.so
vendor/lib/libchromatix_s5k3m2xm_common.so
vendor/lib/libchromatix_s5k3m2xm_cpp_hfr_120_bear.so
vendor/lib/libchromatix_s5k3m2xm_cpp_hfr_120.so
vendor/lib/libchromatix_s5k3m2xm_cpp_hfr_60_bear.so
vendor/lib/libchromatix_s5k3m2xm_cpp_hfr_60.so
vendor/lib/libchromatix_s5k3m2xm_cpp_hfr_90_bear.so
vendor/lib/libchromatix_s5k3m2xm_cpp_hfr_90.so
vendor/lib/libchromatix_s5k3m2xm_cpp_liveshot_bear.so
vendor/lib/libchromatix_s5k3m2xm_cpp_liveshot.so
vendor/lib/libchromatix_s5k3m2xm_cpp_preview_bear.so
vendor/lib/libchromatix_s5k3m2xm_cpp_preview.so
vendor/lib/libchromatix_s5k3m2xm_cpp_snapshot_bear.so
vendor/lib/libchromatix_s5k3m2xm_cpp_snapshot.so
vendor/lib/libchromatix_s5k3m2xm_cpp_video_bear.so
vendor/lib/libchromatix_s5k3m2xm_cpp_video.so
vendor/lib/libchromatix_s5k3m2xm_default_preview_dw9761b_bear.so
vendor/lib/libchromatix_s5k3m2xm_default_preview_dw9761b.so
vendor/lib/libchromatix_s5k3m2xm_default_video_bear.so
vendor/lib/libchromatix_s5k3m2xm_default_video_dw9761b_bear.so
vendor/lib/libchromatix_s5k3m2xm_default_video_dw9761b.so
vendor/lib/libchromatix_s5k3m2xm_default_video.so
vendor/lib/libchromatix_s5k3m2xm_hfr_120_bear.so
vendor/lib/libchromatix_s5k3m2xm_hfr_120_dw9761b_bear.so
vendor/lib/libchromatix_s5k3m2xm_hfr_120_dw9761b.so
vendor/lib/libchromatix_s5k3m2xm_hfr_120.so
vendor/lib/libchromatix_s5k3m2xm_hfr_60_bear.so
vendor/lib/libchromatix_s5k3m2xm_hfr_60_dw9761b_bear.so
vendor/lib/libchromatix_s5k3m2xm_hfr_60_dw9761b.so
vendor/lib/libchromatix_s5k3m2xm_hfr_60.so
vendor/lib/libchromatix_s5k3m2xm_hfr_90_bear.so
vendor/lib/libchromatix_s5k3m2xm_hfr_90_dw9761b_bear.so
vendor/lib/libchromatix_s5k3m2xm_hfr_90_dw9761b.so
vendor/lib/libchromatix_s5k3m2xm_hfr_90.so
vendor/lib/libchromatix_s5k3m2xm_postproc_bear.so
vendor/lib/libchromatix_s5k3m2xm_postproc.so
vendor/lib/libchromatix_s5k3m2xm_preview_bear.so
vendor/lib/libchromatix_s5k3m2xm_preview.so
vendor/lib/libchromatix_s5k3m2xm_snapshot_bear.so
vendor/lib/libchromatix_s5k3m2xm_snapshot.so
vendor/lib/libchromatix_s5k3m2xm_zsl_preview_dw9761b_bear.so
vendor/lib/libchromatix_s5k3m2xm_zsl_preview_dw9761b.so
vendor/lib/libchromatix_s5k3m2xm_zsl_video_dw9761b_bear.so
vendor/lib/libchromatix_s5k3m2xm_zsl_video_dw9761b.so
vendor/lib/libchromatix_s5k3m2xx_1080p_preview_ad5816g.so
vendor/lib/libchromatix_s5k3m2xx_1080p_video_ad5816g.so
vendor/lib/libchromatix_s5k3m2xx_4k_preview_ad5816g.so
vendor/lib/libchromatix_s5k3m2xx_4k_video_ad5816g.so
vendor/lib/libchromatix_s5k3m2xx_common.so
vendor/lib/libchromatix_s5k3m2xx_cpp_hfr_120.so
vendor/lib/libchromatix_s5k3m2xx_cpp_hfr_60.so
vendor/lib/libchromatix_s5k3m2xx_cpp_hfr_90.so
vendor/lib/libchromatix_s5k3m2xx_cpp_liveshot.so
vendor/lib/libchromatix_s5k3m2xx_cpp_preview.so
vendor/lib/libchromatix_s5k3m2xx_cpp_snapshot_downscale.so
vendor/lib/libchromatix_s5k3m2xx_cpp_snapshot.so
vendor/lib/libchromatix_s5k3m2xx_cpp_snapshot_upscale.so
vendor/lib/libchromatix_s5k3m2xx_cpp_video_4k.so
vendor/lib/libchromatix_s5k3m2xx_cpp_video.so
vendor/lib/libchromatix_s5k3m2xx_default_preview_ad5816g.so
vendor/lib/libchromatix_s5k3m2xx_default_video_ad5816g.so
vendor/lib/libchromatix_s5k3m2xx_default_video.so
vendor/lib/libchromatix_s5k3m2xx_hfr_120_ad5816g.so
vendor/lib/libchromatix_s5k3m2xx_hfr_120.so
vendor/lib/libchromatix_s5k3m2xx_hfr_60_ad5816g.so
vendor/lib/libchromatix_s5k3m2xx_hfr_60.so
vendor/lib/libchromatix_s5k3m2xx_hfr_90_ad5816g.so
vendor/lib/libchromatix_s5k3m2xx_hfr_90.so
vendor/lib/libchromatix_s5k3m2xx_postproc.so
vendor/lib/libchromatix_s5k3m2xx_preview.so
vendor/lib/libchromatix_s5k3m2xx_snapshot.so
vendor/lib/libchromatix_s5k3m2xx_video_4k.so
vendor/lib/libchromatix_s5k3m2xx_zsl_preview_ad5816g.so
vendor/lib/libchromatix_s5k3m2xx_zsl_video_ad5816g.so
vendor/lib/libchromatix_s5k3p3sm_common.so
vendor/lib/libchromatix_s5k3p3sm_cpp_liveshot.so
vendor/lib/libchromatix_s5k3p3sm_cpp_preview.so
vendor/lib/libchromatix_s5k3p3sm_cpp_snapshot.so
vendor/lib/libchromatix_s5k3p3sm_cpp_video.so
vendor/lib/libchromatix_s5k3p3sm_default_preview_3a.so
vendor/lib/libchromatix_s5k3p3sm_default_video_3a.so
vendor/lib/libchromatix_s5k3p3sm_default_video.so
vendor/lib/libchromatix_s5k3p3sm_fullsize_preview_3a.so
vendor/lib/libchromatix_s5k3p3sm_fullsize_video_3a.so
vendor/lib/libchromatix_s5k3p3sm_postproc.so
vendor/lib/libchromatix_s5k3p3sm_preview.so
vendor/lib/libchromatix_s5k3p3sm_snapshot.so
vendor/lib/libchromatix_s5k3p8sp_a3_default_preview.so
vendor/lib/libchromatix_s5k3p8sp_a3_default_video.so
vendor/lib/libchromatix_s5k3p8sp_a3_zsl_preview.so
vendor/lib/libchromatix_s5k3p8sp_a3_zsl_video.so
vendor/lib/libchromatix_s5k3p8sp_common.so
vendor/lib/libchromatix_s5k3p8sp_cpp_liveshot.so
vendor/lib/libchromatix_s5k3p8sp_cpp_preview.so
vendor/lib/libchromatix_s5k3p8sp_cpp_snapshot.so
vendor/lib/libchromatix_s5k3p8sp_cpp_video.so
vendor/lib/libchromatix_s5k3p8sp_postproc.so
vendor/lib/libchromatix_s5k3p8sp_preview.so
vendor/lib/libchromatix_s5k3p8sp_snapshot.so
vendor/lib/libchromatix_sony_imx486_ii_common.so
vendor/lib/libchromatix_sony_imx486_ii_cpp_hfr_120.so
vendor/lib/libchromatix_sony_imx486_ii_cpp_hfr_60.so
vendor/lib/libchromatix_sony_imx486_ii_cpp_hfr_90.so
vendor/lib/libchromatix_sony_imx486_ii_cpp_liveshot.so
vendor/lib/libchromatix_sony_imx486_ii_cpp_preview.so
vendor/lib/libchromatix_sony_imx486_ii_cpp_snapshot_hht.so
vendor/lib/libchromatix_sony_imx486_ii_cpp_snapshot.so
vendor/lib/libchromatix_sony_imx486_ii_cpp_video.so
vendor/lib/libchromatix_sony_imx486_ii_default_preview_dw9714v.so
vendor/lib/libchromatix_sony_imx486_ii_default_video_dw9714v.so
vendor/lib/libchromatix_sony_imx486_ii_default_video.so
vendor/lib/libchromatix_sony_imx486_ii_hfr_120_dw9714v.so
vendor/lib/libchromatix_sony_imx486_ii_hfr_120.so
vendor/lib/libchromatix_sony_imx486_ii_hfr_60_dw9714v.so
vendor/lib/libchromatix_sony_imx486_ii_hfr_60.so
vendor/lib/libchromatix_sony_imx486_ii_hfr_90_dw9714v.so
vendor/lib/libchromatix_sony_imx486_ii_hfr_90.so
vendor/lib/libchromatix_sony_imx486_ii_india_common.so
vendor/lib/libchromatix_sony_imx486_ii_india_cpp_hfr_120.so
vendor/lib/libchromatix_sony_imx486_ii_india_cpp_hfr_60.so
vendor/lib/libchromatix_sony_imx486_ii_india_cpp_hfr_90.so
vendor/lib/libchromatix_sony_imx486_ii_india_cpp_liveshot.so
vendor/lib/libchromatix_sony_imx486_ii_india_cpp_preview.so
vendor/lib/libchromatix_sony_imx486_ii_india_cpp_snapshot_hht.so
vendor/lib/libchromatix_sony_imx486_ii_india_cpp_snapshot.so
vendor/lib/libchromatix_sony_imx486_ii_india_cpp_video.so
vendor/lib/libchromatix_sony_imx486_ii_india_default_preview_dw9714v.so
vendor/lib/libchromatix_sony_imx486_ii_india_default_video_dw9714v.so
vendor/lib/libchromatix_sony_imx486_ii_india_default_video.so
vendor/lib/libchromatix_sony_imx486_ii_india_hfr_120_dw9714v.so
vendor/lib/libchromatix_sony_imx486_ii_india_hfr_120.so
vendor/lib/libchromatix_sony_imx486_ii_india_hfr_60_dw9714v.so
vendor/lib/libchromatix_sony_imx486_ii_india_hfr_60.so
vendor/lib/libchromatix_sony_imx486_ii_india_hfr_90_dw9714v.so
vendor/lib/libchromatix_sony_imx486_ii_india_hfr_90.so
vendor/lib/libchromatix_sony_imx486_ii_india_postproc.so
vendor/lib/libchromatix_sony_imx486_ii_india_preview.so
vendor/lib/libchromatix_sony_imx486_ii_india_snapshot.so
vendor/lib/libchromatix_sony_imx486_ii_india_zsl_preview_dw9714v.so
vendor/lib/libchromatix_sony_imx486_ii_india_zsl_video_dw9714v.so
vendor/lib/libchromatix_sony_imx486_ii_postproc.so
vendor/lib/libchromatix_sony_imx486_ii_preview.so
vendor/lib/libchromatix_sony_imx486_ii_snapshot.so
vendor/lib/libchromatix_sony_imx486_ii_zsl_preview_dw9714v.so
vendor/lib/libchromatix_sony_imx486_ii_zsl_video_dw9714v.so

# Camera configs - from rosy:8.1.0/OPM1.171019.026/V11.0.2.0.ODAMIXM
vendor/etc/camera/camera_config.xml
vendor/etc/camera/csidtg_camera.xml
vendor/etc/camera/csidtg_chromatix.xml
vendor/etc/camera/ov13850_chromatix.xml
vendor/etc/camera/ov13850_q13v06k_chromatix.xml
vendor/etc/camera/ov2281_chromatix.xml
vendor/etc/camera/ov2680_chromatix.xml
vendor/etc/camera/ov4688_chromatix.xml
vendor/etc/camera/ov5670_chromatix.xml
vendor/etc/camera/ov5670_f5670bq_chromatix.xml
vendor/etc/camera/ov5695_chromatix.xml
vendor/etc/camera/ov7251_chromatix.xml
vendor/etc/camera/ov8858_chromatix.xml
vendor/etc/camera/ov8865_chromatix.xml
vendor/etc/camera/ovt_ov12a10_i_chromatix.xml
vendor/etc/camera/ovt_ov5675_i_chromatix.xml
vendor/etc/camera/ovt_ov5675_ii_chromatix.xml
vendor/etc/camera/rosy_camera_india.xml
vendor/etc/camera/rosy_imx486_sunny_india_chromatix.xml
vendor/etc/camera/rosy_ov12a10_ofilm_india_chromatix.xml
vendor/etc/camera/rosy_ov5675_ofilm_india_chromatix.xml
vendor/etc/camera/rosy_ov5675_qtech_india_chromatix.xml
vendor/etc/camera/s5k2l7_8953_chromatix.xml
vendor/etc/camera/s5k2l7_chromatix.xml
vendor/etc/camera/s5k3m2xm_chromatix_bear.xml
vendor/etc/camera/s5k3m2xm_chromatix.xml
vendor/etc/camera/s5k3m2xx_chromatix.xml
vendor/etc/camera/s5k3p3sm_chromatix.xml
vendor/etc/camera/s5k3p8sp_chromatix.xml
vendor/etc/camera/sony_imx486_ii_chromatix.xml

# Camera eeproms - from rosy:8.1.0/OPM1.171019.026/V11.0.2.0.ODAMIXM
vendor/lib/libmmcamera_atmel_at24c32e_eeprom.so
vendor/lib/libmmcamera_dw9761b_2d_eeprom.so
vendor/lib/libmmcamera_le2464c_eeprom.so
vendor/lib/libmmcamera_le2464c_master_eeprom.so
vendor/lib/libmmcamera_onsemi_cat24c16_eeprom.so
vendor/lib/libmmcamera_onsemi_cat24c32_eeprom.so
vendor/lib/libmmcamera_ov13850_q13v06k.so
vendor/lib/libmmcamera_ov13850.so
vendor/lib/libmmcamera_ov2281.so
vendor/lib/libmmcamera_ov2680.so
vendor/lib/libmmcamera_ov2685_scv3b4035.so
vendor/lib/libmmcamera_ov2685.so
vendor/lib/libmmcamera_ov4688_eeprom.so
vendor/lib/libmmcamera_ov4688.so
vendor/lib/libmmcamera_ov5645.so
vendor/lib/libmmcamera_ov5670.so
vendor/lib/libmmcamera_ov5695.so
vendor/lib/libmmcamera_ov7251.so
vendor/lib/libmmcamera_ov8856.so
vendor/lib/libmmcamera_ov8858.so
vendor/lib/libmmcamera_ov8865.so
vendor/lib/libmmcamera_ovt_ov12a10_i_eeprom.so
vendor/lib/libmmcamera_ovt_ov12a10_i.so
vendor/lib/libmmcamera_ovt_ov5675_i_eeprom.so
vendor/lib/libmmcamera_ovt_ov5675_ii_eeprom.so
vendor/lib/libmmcamera_ovt_ov5675_ii.so
vendor/lib/libmmcamera_ovt_ov5675_i.so
vendor/lib/libmmcamera_qtech_f3l8yam_eeprom.so
vendor/lib/libmmcamera_qtech_f5670bq_eeprom.so
vendor/lib/libmmcamera_rohm_brcg064gwz_3_eeprom.so
vendor/lib/libmmcamera_s5k2l7.so
vendor/lib/libmmcamera_s5k3m2xm.so
vendor/lib/libmmcamera_s5k3m2xx.so
vendor/lib/libmmcamera_s5k3p3sm.so
vendor/lib/libmmcamera_s5k3p8sp.so
vendor/lib/libmmcamera_sonyimx135_eeprom.so
vendor/lib/libmmcamera_sony_imx486_ii_eeprom.so
vendor/lib/libmmcamera_sony_imx486_ii.so
vendor/lib/libmmcamera_sunny_8865_eeprom.so
vendor/lib/libmmcamera_sunny_gt24c64_s5k2l7_eeprom.so
vendor/lib/libmmcamera_sunny_q13v06k_eeprom.so
vendor/lib/libmmcamera_sunny_q5v41b_eeprom.so
vendor/lib/libmmcamera_truly_cma481_eeprom.so
vendor/lib/libmmcamera_truly_cmb433_eeprom.so

# Camera isp - from rosy:8.1.0/OPM1.171019.026/V11.0.2.0.ODAMIXM
vendor/lib/libmmcamera_isp_abf40.so
vendor/lib/libmmcamera_isp_bcc40.so
vendor/lib/libmmcamera_isp_be_stats44.so
vendor/lib/libmmcamera_isp_bf_stats47.so
vendor/lib/libmmcamera_isp_bg_stats44.so
vendor/lib/libmmcamera_isp_bhist_stats44.so
vendor/lib/libmmcamera_isp_bpc40.so
vendor/lib/libmmcamera_isp_chroma_enhan40.so
vendor/lib/libmmcamera_isp_chroma_suppress40.so
vendor/lib/libmmcamera_isp_clamp_encoder40.so
vendor/lib/libmmcamera_isp_clamp_video40.so
vendor/lib/libmmcamera_isp_clamp_viewfinder40.so
vendor/lib/libmmcamera_isp_color_correct40.so
vendor/lib/libmmcamera_isp_color_xform_encoder40.so
vendor/lib/libmmcamera_isp_color_xform_viewfinder40.so
vendor/lib/libmmcamera_isp_cs_stats44.so
vendor/lib/libmmcamera_isp_demosaic40.so
vendor/lib/libmmcamera_isp_demux40.so
vendor/lib/libmmcamera_isp_fovcrop_encoder40.so
vendor/lib/libmmcamera_isp_fovcrop_viewfinder40.so
vendor/lib/libmmcamera_isp_gamma40.so
vendor/lib/libmmcamera_isp_ihist_stats44.so
vendor/lib/libmmcamera_isp_linearization40.so
vendor/lib/libmmcamera_isp_ltm44.so
vendor/lib/libmmcamera_isp_luma_adaptation40.so
vendor/lib/libmmcamera_isp_mce40.so
vendor/lib/libmmcamera_isp_mesh_rolloff40.so
vendor/lib/libmmcamera_isp_rs_stats44.so
vendor/lib/libmmcamera_isp_scaler_encoder44.so
vendor/lib/libmmcamera_isp_scaler_viewfinder44.so
vendor/lib/libmmcamera_isp_sce40.so
vendor/lib/libmmcamera_isp_sub_module.so
vendor/lib/libmmcamera_isp_template.so
vendor/lib/libmmcamera_isp_wb40.so

# Camera firmware - from rosy:8.1.0/OPM1.171019.026/V11.0.2.0.ODAMIXM
vendor/firmware/cpp_firmware_v1_8_0.fw
vendor/firmware/cpp_firmware_v1_5_0.fw
vendor/firmware/cpp_firmware_v1_6_0.fw
vendor/firmware/cpp_firmware_v1_2_0.fw
vendor/firmware/cpp_firmware_v1_4_0.fw
vendor/firmware/cpp_firmware_v1_1_1.fw
vendor/firmware/cpp_firmware_v1_5_1.fw
vendor/firmware/cpp_firmware_v1_12_0.fw
vendor/firmware/cpp_firmware_v1_10_0.fw
vendor/firmware/cpp_firmware_v1_5_2.fw
vendor/firmware/cpp_firmware_v1_1_6.fw

# Charger - from LA.UM.8.6.r1-04400-89xx.0
vendor/bin/hvdcp_opti|7b7cda55c81d523e0fd5741082209bd60f9f6586

# CNE - from LA.UM.8.6.r1-04400-89xx.0
etc/cne/Nexus/ATT/ATT_profiles.xml|a0039cb3a4c5a4ca1adf897904b61c91e32d06f7
etc/cne/Nexus/ROW/ROW_profiles.xml|e3907ff71cbbe0f1073ec1bf0223d26c8282aa35
etc/cne/Nexus/VZW/VZW_profiles.xml|0d35b3266ea656d8868ae8f5d7e938f4859e9b0a
product/lib64/com.quicinc.cne.api@1.0.so|06764410022518f75a8e7fa1de35b7577cdbe8f9
product/lib64/com.quicinc.cne.api@1.1.so|8940ad6defe4ffba387a259a698c2def51f1d5fa
product/lib64/com.quicinc.cne.constants@1.0.so|e2f9123a013c2c116b02a1e057870f885808f654
product/lib64/com.quicinc.cne.constants@2.0.so|b58e07086d9992d0911391ad185f277e1cfd4fe5
product/lib64/com.quicinc.cne.constants@2.1.so|92fc6a953b061fea1895e58fa298ce8de8a6d03c
-vendor/app/CneApp/CneApp.apk|67dd058d8e665a8606c1ff6c3980e844a9bf323e
-vendor/app/IWlanService/IWlanService.apk|32cb03f65a3412c7e0390b445ce5f36bcedfb809
vendor/bin/cnd|f498307415b2c5b2b4a239964e29962591bf3cc6
vendor/etc/cne/wqeclient/ATT/ATT_profile1.xml|578f3f8f56059bfdbef926bcc68d01c15e06951f
vendor/etc/cne/wqeclient/ATT/ATT_profile2.xml|1fb42c672a12b6660bdce3ea94e0c43719dd9de8
vendor/etc/cne/wqeclient/ATT/ATT_profile3.xml|f88e13f1dd7b82388c90358f71813026370c9ed8
vendor/etc/cne/wqeclient/ATT/ATT_profile4.xml|fb08e04f57797c5684bf734f7ce4bb4968859b18
vendor/etc/cne/wqeclient/ATT/ATT_profile5.xml|eb726ad1a42b9b78b9ee3b821fc108611bc9eeac
vendor/etc/cne/wqeclient/ATT/ATT_profile6.xml|be97b46b0d07ee2f6ebcc677d8099ed2140d5d85
vendor/etc/cne/wqeclient/ROW/ROW_profile1.xml|e7ca213d0998cb3a6a603ad3eca7bda69830ff55
vendor/etc/cne/wqeclient/ROW/ROW_profile15.xml|0130dfd8326ee710bf4e15718ede87c49a85b763
vendor/etc/cne/wqeclient/ROW/ROW_profile16.xml|e05b935d7ccf48d306b71c719b2e4df83187d9c0
vendor/etc/cne/wqeclient/ROW/ROW_profile17.xml|f1b33204799268eda78dd8314f26abf2e37431e2
vendor/etc/cne/wqeclient/ROW/ROW_profile18.xml|19db16f62dabb806a62f192858a9d52b5bc2a064
vendor/etc/cne/wqeclient/ROW/ROW_profile19.xml|1fcc57b1fa4dbbc7d250e8dd92acf1527d447eb3
vendor/etc/cne/wqeclient/ROW/ROW_profile2.xml|169a5209000e357a1a3183e8e5bfdf6fd07c2787
vendor/etc/cne/wqeclient/ROW/ROW_profile20.xml|7be0614cf0116c39b736c58fe5eca36838aeb3db
vendor/etc/cne/wqeclient/ROW/ROW_profile21.xml|cc62517e6c37e12ee1ebebbb27f9c22878749be3
vendor/etc/cne/wqeclient/ROW/ROW_profile3.xml|4be4060e8ac2d9fcea490feec7938cadcff46e1f
vendor/etc/cne/wqeclient/ROW/ROW_profile32.xml|b87542b9284efe4c2bd0ae868bb9a765c2c3dbc5
vendor/etc/cne/wqeclient/ROW/ROW_profile4.xml|f88e13f1dd7b82388c90358f71813026370c9ed8
vendor/etc/cne/wqeclient/ROW/ROW_profile5.xml|96101f6b01436a02572c67a469ff67ccfb738874
vendor/etc/cne/wqeclient/ROW/ROW_profile6.xml|cef14ff8a160c7ad719b85d024a4b3301c3638d0
vendor/etc/cne/wqeclient/ROW/ROW_profile7.xml|8d6773a4c418d0dcc4dc9096017d2681c7a1defe
vendor/etc/cne/wqeclient/VZW/VZW_profile1.xml|c89d3c062790b442cbe941cafc641a4e322f2d59
vendor/etc/cne/wqeclient/VZW/VZW_profile2.xml|ba14a9df975cf872ed0cbe28bee8fac63cd848d4
vendor/etc/cne/wqeclient/VZW/VZW_profile3.xml|9b123d81c9b8991499cda33b0706810e0c8fb974
vendor/etc/cne/wqeclient/VZW/VZW_profile4.xml|ff91feb5060a6df07e3e4d9bc99ae58bccad7649
vendor/etc/cne/wqeclient/VZW/VZW_profile5.xml|f76c894f3c6d5b6ed35113a088dc3174c900501b
vendor/etc/cne/wqeclient/VZW/VZW_profile6.xml|14d136e7fcc682311757d3edc0b9d3eaeba11815
vendor/etc/init/cnd.rc|ff205cff8e00ec6805fd1e19f3ca6ff86700cbb6
vendor/lib64/libcacertclient.so|daa1332db3b07eb75350dee833628bd248d9f03e
vendor/lib64/libcne.so|ba33da44063823d86611999cb6cf655b8a5746b6
vendor/lib64/libcneapiclient.so|9720139912d4a8065589c063919ec6f180f5363d
vendor/lib64/libcneoplookup.so|a43ba898d6d99924a8d404da2622a9b30feeaaba
vendor/lib64/libcneqmiutils.so|5796576202829cfd435c90f30927c667d9e76b12
vendor/lib64/libwms.so|e34c20183b439eef191e382da4af4bd6aca06e9a
vendor/lib64/libwqe.so|87c3ca16c68c24eb74655aaf04376d5803cf108e
vendor/lib64/libxml.so|110636ac7fc0e228faac2b28e0797d9f9592e4e6
vendor/lib64/vendor.qti.data.factory@1.0.so|048b26a8e72c92635d65b7c491d84ccf9f7fa075
vendor/lib64/vendor.qti.data.factory@2.0.so|3d394f6124db5ad1987c67737bbc30d4d761cecb
vendor/lib64/vendor.qti.data.factory@2.1.so|a311260fce9e7627548decfff5198da6730ccac1
vendor/lib64/vendor.qti.data.slm@1.0.so|46c1fdcc98b85d178230c2a3553ba110aecfe01d
vendor/lib64/vendor.qti.hardware.cacert@1.0.so|bb56f65d5251057a306a8175daef9571cfd3457b
vendor/lib64/vendor.qti.hardware.data.cne.internal.api@1.0.so|ed05ca4c09b5913cf5c9d87267a59c25001ddd49
vendor/lib64/vendor.qti.hardware.data.cne.internal.constants@1.0.so|981a7de823c8fe9e19516dce6dcc8414350109aa
vendor/lib64/vendor.qti.hardware.data.cne.internal.server@1.0.so|9ed3d514093cd106590008e87f6170cf001a8519
vendor/lib64/vendor.qti.hardware.data.connection@1.0.so|4cae1e8c64bb5934c6931a0e1412494397e8eeda
vendor/lib64/vendor.qti.hardware.data.connection@1.1.so|a106ffb5cc28b12727d1bbacb5d6b478bf1628cc
vendor/lib64/vendor.qti.hardware.data.dynamicdds@1.0.so|424359305b1d92f3d7f5c65296d0f22358c85521
vendor/lib64/vendor.qti.hardware.data.iwlan@1.0.so|a5c90b8e7d6349fce513440bf26234810316d373
vendor/lib64/vendor.qti.hardware.data.latency@1.0.so|ae979b52234d7e965631394f6e1887a910ce0d36
vendor/lib64/vendor.qti.hardware.data.qmi@1.0.so|35ad6e08d00e8b1695964fa7d6ddbc521eda8628
vendor/lib64/vendor.qti.hardware.slmadapter@1.0.so|9681a0d126f132248a6aabb16d373aa843e230b8
vendor/lib64/vendor.qti.latency@2.0.so|20a3037a1aea98f5f490b14c8f5620d2d3a0cf57

# Consumer IR - from rosy:8.1.0/OPM1.171019.026/V11.0.2.0.ODAMIXM
lib/hw/consumerir.default.so:vendor/lib/hw/consumerir.default.so|b836d25b42b12e88ab0ff4e47c08321a6ddc5285
lib64/hw/consumerir.default.so:vendor/lib64/hw/consumerir.default.so|c7f8fb64d8bda3b16f81700b6d0549e5e2d99531

# Display calibration - from rosy:8.1.0/OPM1.171019.026/V11.0.2.0.ODAMIXM
vendor/etc/qdcm_calib_data_ft8006m_boe_5p7_720p_video.xml
vendor/etc/qdcm_calib_data_ft8613_csot_5p7_720p_video.xml
vendor/etc/qdcm_calib_data_ft8613_ebbg_5p7_720p_video.xml

# DPM - from LA.UM.8.6.r1-04400-89xx.0
product/bin/dpmd|90cdd79b564456cef2a0c011afab3896463df5e4
product/etc/dpm/dpm.conf|95e27da8c989e96c6faea6f0697bce11955b62a5
product/etc/init/dpmd.rc|7f95195a89fddce06b93006a737701270e91f669
product/etc/permissions/com.qti.dpmframework.xml|f57aa37de402a2c239fdadb65ac044d364ec1114
product/etc/permissions/dpmapi.xml|0991b3069308620cfcad53873e9f09af181b981d
product/framework/com.qti.dpmframework.jar|d1f745f1394105d94362bc8dce8920cdd3e07aaa
product/framework/dpmapi.jar|4696df9793ad676b305d53b5d7ce65ecf74771ad
product/lib64/com.qualcomm.qti.dpm.api@1.0.so|a70cfc1be3e06cde6318d6969e114429fe1950bb
product/lib64/libdpmctmgr.so|2e12d384caf2969d4137ceff25cef13781327abf
product/lib64/libdpmfdmgr.so|97b2f505285ed372a9f3d8a13682ea4022dbd70a
product/lib64/libdpmframework.so|d90b87f75a62ed091db5b2478307fc402972be7a
product/lib64/libdpmtcm.so|9f99848e2574d2302692446d5dd87cd90f972b0c
-product/priv-app/dpmserviceapp/dpmserviceapp.apk|68b6f0227ae0b065dff635f30bfdc3c23f90c395
vendor/bin/dpmQmiMgr|088e6513ff702d524fcf1c2a4e84f79f744a0543
vendor/etc/init/dpmQmiMgr.rc|67569302d3a8828a9118c835e5b69c51b0c8ac68
vendor/lib64/com.qualcomm.qti.dpm.api@1.0.so|a70cfc1be3e06cde6318d6969e114429fe1950bb
vendor/lib64/libdpmqmihal.so|3ec8ff45991cdb502e9297e049197d02e2c7e941

# DRM - from LA.UM.8.6.r1-04400-89xx.0
vendor/bin/qseecomd|e43054ef83d7d27a0b1958c693ae07fdac6d73e0
vendor/lib/libQSEEComAPI.so|cfc57d8022dbac5b20249e5ce7137b0834a208a0
vendor/lib64/libGPreqcancel.so|6f59015f1e340dd1c995f0008a5f282037d98867
vendor/lib64/libGPreqcancel_svc.so|84783ffc4dc45a6934a2c87166842fd1d6c73ebe
vendor/lib64/libQSEEComAPI.so|050e9cac4b5bd3c2fd2babc4c567987d7c6ce46b
vendor/lib64/libSecureUILib.so|9462ad202be6df615d008e3c72b2592dc8e20e41
vendor/lib64/libStDrvInt.so|c5413acfc1eb7218c0cff4085c8116e91252acca
vendor/lib64/libdrmfs.so|e72d79579f78501486fbd0883ee620fcb0b726ca
vendor/lib64/libdrmtime.so|7eaed4940c68505b312d26b26585bfc93bbd8d54
vendor/lib64/libqisl.so|491ac949ab488299c7a1ae4fe8257ec0a6f994b1
vendor/lib64/librpmb.so|252757acda40774aebbcb29397eab514595f70db
vendor/lib64/libsecureui.so|4e496259eb6da9b3dcf6fb744da897422350b6c7
vendor/lib64/libsecureui_svcsock.so|060bbd76ead3b3aeb323af0c7352f9445088d3fe
vendor/lib64/libssd.so|33d717f793c2579e3bd17b5ce6534cb68c12887d

# DRM - from lmi:10/QKQ1.191117.002/V12.0.3.0.QJKMIXM
vendor/lib64/libops.so|03dc247cbf3e75f8dedf05b779eb65006f7334cd
vendor/lib64/libspl.so|609af852a498b0a50eb00f2d75913e0fbcbbaee6

# DRM (Widevine) - from LA.UM.8.6.r1-04400-89xx.0
vendor/bin/hw/android.hardware.drm@1.2-service.widevine|f4258fe902140e7a35c59f79d274dde89a80d1e8
vendor/etc/init/android.hardware.drm@1.2-service.widevine.rc|ad2769dc38c425495c80e0a2cc4f3a4012108917
vendor/lib64/libwvhidl.so|1b0dce24a4f77883785999b9cf6cb5686232c3b3

# Fingerprint - from rosy:8.1.0/OPM1.171019.026/V11.0.2.0.ODAMIXM
framework/vendor.qti.hardware.fingerprint-V1.0-java.jar:vendor/framework/vendor.qti.hardware.fingerprint-V1.0-java.jar
lib/android.hardware.biometrics.fingerprint@2.1.so
lib64/android.hardware.biometrics.fingerprint@2.1.so
lib64/hw/goodixfingerprint.default.so:vendor/lib64/hw/goodixfingerprint.default.so
lib64/libgf_ca.so:vendor/lib64/libgf_ca.so
lib64/libgf_hal.so:vendor/lib64/libgf_hal.so
lib64/libgoodixfingerprintd_binder.so:vendor/lib64/libgoodixfingerprintd_binder.so
lib64/libvendor.goodix.hardware.fingerprint@1.0-service.so:vendor/lib64/libvendor.goodix.hardware.fingerprint@1.0-service.so
lib64/libvendor.goodix.hardware.fingerprint@1.0.so:vendor/lib64/libvendor.goodix.hardware.fingerprint@1.0.so
-vendor/app/FingerprintExtensionService/FingerprintExtensionService.apk
vendor/bin/hw/android.hardware.biometrics.fingerprint@2.1-service
vendor/etc/init/android.hardware.biometrics.fingerprint@2.1-service.rc
vendor/etc/permissions/com.fingerprints.extension.xml
vendor/framework/com.fingerprints.extension.jar
vendor/lib/vendor.qti.hardware.fingerprint@1.0.so
vendor/lib64/com.fingerprints.extension@1.0.so
vendor/lib64/hw/fpcfingerprint.default.so
vendor/lib64/vendor.qti.hardware.fingerprint@1.0.so

# FM - from LA.UM.8.6.r1-04400-89xx.0
vendor/bin/fm_qsoc_patches|82ab33e928933b8077e77c1532a58b61a3551932
vendor/bin/init.qti.fm.sh|0ac820dd85ebdf5fa73b5e971f6787ff35ceb65d
vendor/etc/init/init.qti.fm.rc|07cb64e2109a900eb6e1da1950fddba954d0f8d6

# Gatekeeper - from LA.UM.8.6.r1-04400-89xx.0
vendor/lib/hw/gatekeeper.msm8953.so|c17725b59dac2effb3423edc60085366dd629e62
vendor/lib64/hw/gatekeeper.msm8953.so|b3a9d78faa65029b0a20f2ff6dfe986bc80b64c1

# GPS - from LA.UM.8.6.r1-04400-89xx.0
vendor/bin/hw/android.hardware.gnss@2.0-service-qti|c59670c57fad08f9826edeb89d147dd34eab2f4c
vendor/bin/loc_launcher|6fe9d0230143f4aa96ddb9c047abe3d003cc815a
vendor/bin/lowi-server|598f93eec03ff15ec307fae0b7b06e69d2af84b2
vendor/bin/slim_daemon|4210ad8c0efea504a53d4bbe1e5c3f47d42083a5
vendor/bin/xtra-daemon|d0f949cf2406ea7f8227d4a2536537841a531dc2
vendor/bin/xtwifi-client|f7d169a91aa22e35111b863015292467e638901f
vendor/bin/xtwifi-inet-agent|574d0c18b6eb7eb960aec18a52c9bd004d7bb21c
vendor/etc/cacert_location.pem|0789bf799c7e45d352a83e2f79ddb0cea86db85b
vendor/etc/init/android.hardware.gnss@2.0-service-qti.rc|8e0b0596a13b8d653e6f5415c41d8a53bb12b73a
vendor/etc/vintf/manifest/android.hardware.gnss@2.0-service-qti.xml|8d7eafd68db9bbe7ec7a5c4d547f026869766081
vendor/etc/vintf/manifest/vendor.qti.gnss@3.0-service.xml|9b2f6691d6c224bcb9ab9a0d57adfb9e52f1b53e
vendor/etc/xtra_root_cert.pem|f55a31ec4d9cf8ce2724acadecf00c779f8767db
vendor/lib64/hw/android.hardware.gnss@2.0-impl-qti.so|76f1949963502117a63533bdad0ffc4ac98803c7
vendor/lib64/hw/vendor.qti.gnss@3.0-impl.so|32ccc4455dd0809a841f1f38c97ca91f941f7d97
vendor/lib64/libbatching.so|87950c376ec75792cfec3f857a08f1c75bca4107
vendor/lib64/libdataitems.so|9cbb3b845a0defb704679c38a786738f8b8ab70d
vendor/lib64/libgdtap.so|f096509b87e57d0eafed2ad48334f9b6ad6a45c3
vendor/lib64/libgeofencing.so|6f10151c23b4b381d476660b4c55684c11459e56
vendor/lib64/libgnss.so|ff8992a7dcf93c96e377303d275a29584bb9d973
vendor/lib64/libgnsspps.so|67fc82137c2156744c0670bc9408e854a665f5d1
vendor/lib64/libgps.utils.so|9f2b2967b311520502c139ce16cba4b54b8e8af7
vendor/lib64/libizat_client_api.so|a0cfeb9cad8699773c1fa38908d1b3877836f658
vendor/lib64/libizat_core.so|fde1dca74b3c97c0b9bea1d6f68473872b029744
vendor/lib64/liblbs_core.so|3939e93a175a7f8434ad47d44ccfe49d517623cf
-vendor/lib64/libloc_api_v02.so|e404b9746a4c211a982d218544ff0971eaaad739
vendor/lib64/libloc_core.so|846df203c0c6ba9c853e2f9d607723346e675be8
vendor/lib64/liblocation_api.so|e84a40cf441da4a1183eb7ba9b486af2a81c8717
vendor/lib64/liblocationservice.so|3816856d35a63cc614335429d5bba7b7c0bec8a1
vendor/lib64/liblocationservice_glue.so|e7e9510da500d06cb59b210df05238dbafe767f8
vendor/lib64/liblowi_client.so|a25e0e55ad9e767e901c8ef81a763ec431799561
vendor/lib64/liblowi_wifihal.so|b29735e2e7dc13608da5d90eb2d8773608c4e271
vendor/lib64/libqdma_file_agent.so|b9e67ec9c150f9257ed494ea004b4199c9286e64
vendor/lib64/libslimclient.so|362adf562b39da53fb227c9412ba241e96894ad1
vendor/lib64/libxtadapter.so|fd97a58325297458b44de532237caed23347806b
vendor/lib64/vendor.qti.gnss@1.0.so|ce99dc24861514d3444bdaca9336c98227e3d951
vendor/lib64/vendor.qti.gnss@1.1.so|bb56a726390e44e240f5daa26a34e08e87461734
vendor/lib64/vendor.qti.gnss@1.2.so|788ec8d5730ed1201e941abd738dce212074feb3
vendor/lib64/vendor.qti.gnss@2.0.so|dc370cbed727554a69ab283276d757e6597fdb4c
vendor/lib64/vendor.qti.gnss@2.1.so|79d924c8006b33b358bf9e3d9a21ff2fe8a937df
vendor/lib64/vendor.qti.gnss@3.0-service.so|53f5c24b57a3157b6b48fc56e6ab67b70ed8fa48
vendor/lib64/vendor.qti.gnss@3.0.so|48b718e175dbf6156ded10a056a47d4988319395

# Graphics - from LA.UM.8.6.r1-04400-89xx.0
vendor/lib/egl/eglSubDriverAndroid.so|d0f0f243aeb41720cbc052c2344918c5d588659c
vendor/lib/egl/libEGL_adreno.so|677a2312488fe312a301170e70c701832a8bd89d
vendor/lib/egl/libGLESv1_CM_adreno.so|17bbde3fd2a67234581be29370f45d12f91f1869
vendor/lib/egl/libGLESv2_adreno.so|ad18d07d4919c82ecbe007392db9e84776b0c6f4
vendor/lib/egl/libq3dtools_adreno.so|8ac17e630fbc58771efafd30fe7b4c5d919a6b6d
vendor/lib/egl/libq3dtools_esx.so|6eb5f1d407c50f6b961c94ba4ae7a1706ddfcfed
vendor/lib/egl/libQTapGLES.so|08714851b37d164cfde1d991e021d273108c57fd
vendor/lib/libC2D2.so|c04a5ac1e576f63ebe91aba14bf917ee9e382be0
vendor/lib/libCB.so|a86a3d79a63e2433347119beda119bdbb8764e1c
vendor/lib/libOpenCL.so|5445775afc782df5d74880c59967a8a4b5cc1c1c
vendor/lib/libRSDriver_adreno.so|51e8ebcd4584726cbee21a4486b6f37ce5e716f1
vendor/lib/libadreno_utils.so|38fb831e64c26b1aac0fc70c8d83c66d17ad949a
vendor/lib/libbccQTI.so|124156259b7900ac44c48dd9cf83b210d02d8c9d
vendor/lib/libc2d30_bltlib.so|909c928376bbddb1b616834cfced0a7df314d8bc
vendor/lib/libgsl.so|d328851969cb3888dbb5c371095d2e7f2e407daa
vendor/lib/libhdr_tm.so|7627802801cf9f5acf938f10943c32d2755cf68d
vendor/lib/libllvm-glnext.so|56b3b6af433fd9275048ddc98ef3985e64fa40b5
vendor/lib/libllvm-qcom.so|777b740bcc538a7471496f9e3bf8f26ef33ea6be
vendor/lib/libmm-hdcpmgr.so|9a877103235d55a6ba788060cd974c09e769a0b5
vendor/lib/librs_adreno.so|39dc67443757b55c9b5527e85959cfac2a245c36
vendor/lib/librs_adreno_sha1.so|80b816edd0fc02f23aab53114b2331921672d1d4
vendor/lib64/egl/eglSubDriverAndroid.so|8edb19893decd259ba43d752b48e0a69c5788db4
vendor/lib64/egl/libEGL_adreno.so|6de48e6ba79a86a33e6f2aa193102b34200d49e7
vendor/lib64/egl/libGLESv1_CM_adreno.so|9f8f826f14a769965eb77f2a8d7e273fb45eb89c
vendor/lib64/egl/libGLESv2_adreno.so|24ea79287430d2b64c77d5a38cf8d14daa04dd44
vendor/lib64/egl/libq3dtools_adreno.so|df634f895bfc993482613f7026e5bdde3fe7783f
vendor/lib64/egl/libq3dtools_esx.so|b5ac5e5c115bf73ecbb444b0f7e10a55cd5ce103
vendor/lib64/egl/libQTapGLES.so|de76dc6679e392874edf4b1028f7763f39255606
vendor/lib64/libC2D2.so|ff2d4947c7924376ff66517461246d238e221e05
vendor/lib64/libCB.so|c461dd5108f4ff840841acc60cb4f85dc6ca7389
vendor/lib64/libOpenCL.so|9db02d203536f029f206e10033feb5f54de06be6
vendor/lib64/libRSDriver_adreno.so|e7628b78d034500c64d09fcaf5305971242e1acd
vendor/lib64/libadreno_utils.so|d8f0838ac724cae32d6492d26815fc166a49d8a7
vendor/lib64/libbccQTI.so|e79ba0450ce215bfb81e518cce310f378314b4e5
vendor/lib64/libc2d30_bltlib.so|2f3477e9e4b391a9fb3e69ffd8744a55f3b6871a
vendor/lib64/libgsl.so|9600e120e27d919bf5bbe0cbebb21b7c2c569678
vendor/lib64/libhdr_tm.so|70c80f029af379c525acc9ac61719777f303f6b6
vendor/lib64/libllvm-glnext.so|7b35afc89c04dc9c368884f267e0e33b3d60b0a9
vendor/lib64/libllvm-qcom.so|ab7b264dc1f01388d4dffd8ddf056820f8dd8a59
vendor/lib64/libmm-hdcpmgr.so|73d428151e99086ac3e48db95a660e7d7807a8e3
vendor/lib64/librs_adreno.so|5ec4bcbf396d1e2ed97201e84562c410dc1f52d4
vendor/lib64/librs_adreno_sha1.so|a9b829487e668e1f8cf638260b8f90a2b4a30771

# Graphics (Postprocessing) - from LA.UM.8.6.r1-04400-89xx.0
vendor/etc/init/vendor.display.color@1.0-service.rc|5ad673f879b3685a0e79b5633437e5499cb94f48
vendor/bin/hw/vendor.display.color@1.0-service|dd461fbbbdc7175b8e1e37eba19bc1c48111b5b6
vendor/bin/mm-pp-dpps|5d68b2ae07de96e33d1c1b7698994ec2b219e084
vendor/lib64/libdisp-aba.so|8131a967a51959d88006a20b1f12ced0bf075e4c
vendor/lib64/vendor.display.color@1.0.so|f0af4540df53f4b921af726515beda9a1982c79e
vendor/lib64/vendor.display.postproc@1.0.so|b492eb78d6f4c32158883b142f5d731706a2f7dc

# Graphics (SDM) - from LA.UM.8.6.r1-04400-89xx.0
vendor/lib/libscalar.so|2843b818e48b298d51fe1c8c21a6fb8c67c8d18b
vendor/lib/libsdm-color.so|f052cb28efd13d6332402a242f0ad6b9938f50dc
vendor/lib/libsdm-diag.so|4e3449788c769a0eee0f4494ff1ead1072d6c639
-vendor/lib/libsdm-disp-vndapis.so|470b725055f9261a0a97d7f5293c1f3eeb71eb04
vendor/lib/libsdmextension.so|db03cddf373709b70e96449efe0fd71c6b4ea397
vendor/lib/libtinyxml2_1.so|ef2167416f7a5a503256c5e818fcfa660d5146f4
vendor/lib64/libsdm-color.so|e7ab3c8485e6bce768694f62d6d21f49f742da1f
vendor/lib64/libsdm-diag.so|6db8c3e993f4f217e631ef9b83d063f9af0f2a26
-vendor/lib64/libsdm-disp-vndapis.so|a09df3c5521567b292cb0e5f1f53df7d1fe2e1b7
vendor/lib64/libscalar.so|7a4eba33218ad22abfc27d5213711972998bc0ea
vendor/lib64/libsdmextension.so|0b6150765452307c81b5ada615b191527e67c6a8
vendor/lib64/libtinyxml2_1.so|56d4d5d0ea010f951de219c7b9fd2c9695a5b9d2

# Graphics (SDM) - from LA.UM.8.6.r1-03400-89xx.0
vendor/lib/libsdm-color.so|f052cb28efd13d6332402a242f0ad6b9938f50dc
vendor/lib64/libsdm-color.so|e7ab3c8485e6bce768694f62d6d21f49f742da1f

# Graphics (Vulkan) - from LA.UM.8.6.r1-04400-89xx.0
vendor/lib/hw/vulkan.msm8953.so|ce9e86e26d40ecf2f05ad60f93c43ebbb49efa67
vendor/lib64/hw/vulkan.msm8953.so|742c1182ad0ac5e48c12d279e085711d8046da73

# Graphics firmware - from rosy:8.1.0/OPM1.171019.026/V11.0.2.0.ODAMIXM
vendor/firmware/a225p5_pm4.fw
vendor/firmware/a225_pfp.fw
vendor/firmware/a225_pm4.fw
vendor/firmware/a300_pfp.fw
vendor/firmware/a300_pm4.fw
vendor/firmware/a330_pfp.fw
vendor/firmware/a330_pm4.fw
vendor/firmware/a420_pfp.fw
vendor/firmware/a420_pm4.fw
vendor/firmware/a506_zap.b00
vendor/firmware/a506_zap.b01
vendor/firmware/a506_zap.b02
vendor/firmware/a506_zap.elf
vendor/firmware/a506_zap.mdt
vendor/firmware/a530_gpmu.fw2
vendor/firmware/a530_pfp.fw
vendor/firmware/a530_pm4.fw
vendor/firmware/a530v1_pfp.fw
vendor/firmware/a530v1_pm4.fw
vendor/firmware/a530v2_seq.fw2
vendor/firmware/a530v3_gpmu.fw2
vendor/firmware/a530v3_seq.fw2
vendor/firmware/a540_gpmu.fw2
vendor/firmware/leia_pfp_470.fw
vendor/firmware/leia_pm4_470.fw

# Keystore - from LA.UM.8.6.r1-04400-89xx.0
vendor/lib/hw/keystore.msm8953.so|9d4ae263688bcf3f4555255ff2f243f9bdff2032
vendor/lib64/hw/keystore.msm8953.so|265cd4d0246f5e2e80916dd1c96262be28306b31

# Listen - from LA.UM.8.6.r1-04400-89xx.0
vendor/lib/hw/sound_trigger.primary.msm8953.so|53425351a1e5845ae4aafaf2db8206a801aa25a0
vendor/lib/libadpcmdec.so|be5fdf08a08b635816381e61b6bbf2874c62f613
vendor/lib/libsmwrapper.so|1ab31b5378265784145defa47d50435029cf5f57
vendor/lib/vendor.qti.voiceprint@1.0.so|ad4df37a1240290f2c1d678d751a0401509b343f
vendor/lib64/hw/sound_trigger.primary.msm8953.so|62a3b3814deefbb1a83759fea4b6b705af6b36af
vendor/lib64/vendor.qti.voiceprint@1.0.so|5c3794e4541cc916c03f5a2ba26c6c2f43149d16

# Media - from LA.UM.8.6.r1-04400-89xx.0
lib/extractors/libmmparserextractor.so|25e6e1dcf8a2bb76aab935c32428af8f2c7efc69
lib/libFileMux.so|5a7dc70233541e2e5455a0d802076d0ac593af62
lib/libmmosal.so|0bf6e50b59f7e77b40e4d256c6c561be5104a148
lib/libmmparser_lite.so|8178e82b5de51f7292ad738ff66034459d4b7ffa
lib/libOmxMux.so|35fc6a701ad6f983b2df886349064a9d1ad9143c
lib64/libmmosal.so|f2ec52d5ff321b7064dd6102a0ebc7914c11b7c9
-vendor/lib/libgpustats.so|1ebe49e75a0d02e6662108650d15d8dbc988ee64
vendor/lib/libI420colorconvert.so|0dfd4d0e49f4250e98e781483048a296a679e05e
vendor/lib/libmm-color-convertor.so|7c74d36d42dc79fc58afe0f4323b76cc1297d36e
vendor/lib/libmmosal_proprietary.so|b6e3733e84031c17dc408808ae70fb05fc087374
vendor/lib/libOmxAacDec.so|1ad71e69b0311d278b5aad0d9d1163983c3faeef
vendor/lib/libOmxAlacDec.so|887e641f7ecd32eba21de6e0f962053072099be1
vendor/lib/libOmxAlacDecSw.so|f1aac528d09c554ad44d1e611ff91133e1fe680b
vendor/lib/libOmxAmrDec.so|8bb4d90f61f6730c2728833da4a926c7540f8ad6
vendor/lib/libOmxAmrwbplusDec.so|51b1300ca6e5fd7dbfccf214ccdab3e5f44b2aff
vendor/lib/libOmxApeDec.so|f034236491c4b5560276c52fa3b487f4b6cf07d8
vendor/lib/libOmxApeDecSw.so|26468a8985e5d7d14440e854ca777a3a6644d1fd
vendor/lib/libOmxDsdDec.so|0090992cd0147066f90fd0643c2d9ae616f37c2d
vendor/lib/libOmxEvrcDec.so|20a6be418df26f48751b4178f5642e3fc6902690
vendor/lib/libOmxG711Dec.so|567b1698b1313faa0fbd1f80f7a31d761bdf7d7d
vendor/lib/libOmxQcelp13Dec.so|27a75185e62e88ea84ac2448a3842c998899ae90
vendor/lib/libOmxVideoDSMode.so|b25a4993d411313dba2356f568b2d417a0eba271
vendor/lib/libOmxWmaDec.so|404ae6ea303634d96d3ee46bee2c6f898fa46c15
vendor/lib/libvqzip.so|c2cf1d2938c7af82bf011c8d371dfa8ae6cb038e
-vendor/lib64/libgpustats.so|0cc12485618ae67fb327e89d03b78c5018eab7c1

# Perf - from LA.UM.8.6.r1-04400-89xx.0
product/lib/vendor.qti.hardware.perf@1.0.so|b4969fa797d1957ad8f35d4f84615608f0e9cc2e
product/lib/vendor.qti.hardware.perf@2.0.so|71592601eed5e022f4979293d68deb98e688a3d4
product/lib64/vendor.qti.hardware.perf@1.0.so|8858021553ea41933cdaaa4a68e9d4d15609db46
product/lib64/vendor.qti.hardware.perf@2.0.so|9353709cc2e2af8c4edd3967b5362ede79a72805
vendor/bin/energy-awareness|def07e366347c7f0a7778b748acb49557ab21d2a
vendor/bin/msm_irqbalance|b5e55b4b0934b65b7dd5d2201f9a70f6f77a4e7c
vendor/bin/hw/vendor.qti.hardware.perf@2.0-service|6e45f0e5ee264d6b272daf50481770bf013b602e
vendor/etc/init/vendor.qti.hardware.perf@2.0-service.rc|cc8658db5e19f8e5e575fb986e7d38147e675f8d
vendor/lib64/libperfconfig.so|15414e449302575cd9bae3c1e4464e6e695bd5b3
vendor/lib64/libperfgluelayer.so|5dc01df9fb465e67cb0f1e7a225dee85e660cc4a
vendor/lib64/libqti-perfd.so|a0757a68b49b33b6893e586153a8967c1ca8bd3d
vendor/lib64/libqti-perfd-client.so|0cf43512b08ee761fafa86d09bdea4f7b78fcea9
vendor/lib64/libqti-util.so|55219f860b7a39dbcc2947e382355fd71ad8087d
vendor/lib64/vendor.qti.hardware.perf@1.0.so|8858021553ea41933cdaaa4a68e9d4d15609db46
vendor/lib64/vendor.qti.hardware.perf@2.0.so|9353709cc2e2af8c4edd3967b5362ede79a72805
vendor/lib/libperfconfig.so|98bdc89aea45719484980e4c22c7af75926650e9
vendor/lib/libperfgluelayer.so|1226abb3e16d659d2786e1dfad03020b91ee822b
vendor/lib/libqti-perfd.so|69290801f8ba06428fd6c0a408dd9820a744081f
vendor/lib/libqti-perfd-client.so|0bfd938e82f79e0a28b2ab6c4755b089cb1785b6
vendor/lib/libqti-util.so|5baec080c5c5c26778d2242bfc0e570ca92b7724
vendor/lib/vendor.qti.hardware.perf@1.0.so|b4969fa797d1957ad8f35d4f84615608f0e9cc2e
vendor/lib/vendor.qti.hardware.perf@2.0.so|71592601eed5e022f4979293d68deb98e688a3d4

# Peripheral manager - from LA.UM.8.6.r1-04400-89xx.0
vendor/bin/pm-proxy|2ac2d0e897ccb4c9a96b6a4cd3d66c2ef66c5b61
vendor/bin/pm-service|68a46996bcb9014ebc948990fd943c40206dd8f2
vendor/lib/libperipheral_client.so|7c096cff421a96be6490e1f004a57ee3b6b6e088
vendor/lib64/libperipheral_client.so|fe796ff65665d341ddaa5847c26504b96a8c78ee

# Power-off alarm - from LA.UM.8.6.r1-04400-89xx.0
-product/app/PowerOffAlarm/PowerOffAlarm.apk|c214e1f7de878aeebe642857d6283bbeca0c7a3e
vendor/bin/hw/vendor.qti.hardware.alarm@1.0-service|42c161f4b3033ee2ce33ec3e505031e9137577e7
vendor/bin/power_off_alarm|22e0d6e5cab225cb430b2c860f480b43103a4701
vendor/etc/init/vendor.qti.hardware.alarm@1.0-service.rc|a03a9a1c818595b19272ea6ffb466e23a7fc3b05
vendor/lib64/hw/vendor.qti.hardware.alarm@1.0-impl.so|cbf2dd1cd5cbf0dbb90f1563a77bc7fee608fb2e
vendor/lib64/vendor.qti.hardware.alarm@1.0.so|680d4ad1999c8db44ee7d6240dda4ec1873e4c4d

# QMI - from daisy_sprout:10/QKQ1.191002.002/V11.0.10.0.QDLMIXM
etc/permissions/qti_libpermissions.xml|593bcb72cce68ceb0a70f50bcae7d460114e7c62
etc/permissions/qti_permissions.xml|e6ff4572352b1a4f91b6b9d7cbb1cad9924410a0
product/lib/libdiag_system.so|609b90f226d1644411efe707b904518356186b45
product/lib64/libdiag_system.so|d99aab8a67dba954f2cb4270ecc5552a25debd97
vendor/bin/irsc_util|07f4a90a0fb528c5b883a6865184c7d7239e213d
vendor/lib/libdiag.so|9dbf63722cba2b473429eeac2690e5d7c0bd2754
vendor/lib/libdsi_netctrl.so|06f33d3eaa956d045c473d777ca5044c170acca8
vendor/lib/libdsutils.so|acabab426e7db861d9f7381e36bf3534da4d70f0
vendor/lib/libidl.so|e8aaba37dbfc7f90032a4a4fe534743685e1b540
vendor/lib/libqcci_legacy.so|737a1f513172c0412969bc86b75284b27ff3130c
vendor/lib/libqdi.so|b258fb4619370706fa189dcc54c4201b4424ab31
vendor/lib/libqdp.so|1d565054927af2e362ad9962c779b13be1c9df8b
vendor/lib/libqmi.so|b2376449888974e879fa47a3f07de98ae3c01640
vendor/lib/libqmi_client_helper.so|c27e5cacedb9bbeed9f0747afe023714cbb320f4
vendor/lib/libqmi_client_qmux.so|5ac0b07f554360421013acf02dc367717cb40554
vendor/lib/libqmi_common_so.so|2ac03346bd5f942a904dcc0ba48a8105a26539e7
vendor/lib/libqmi_csi.so|eadc82e05ff55f2ccdb548fc54369a19a5641b58
vendor/lib/libqmi_encdec.so|60effd16d5a3bdc12b8ec02a37becc1b21d509ff
vendor/lib/libqmiservices.so|19459461424b02b057878ca20ffe15d5bd3b59a1
vendor/lib64/libdiag.so|2d8a922ef946fa59d827e955808e908f40fd7d54
vendor/lib64/libdsi_netctrl.so|3908c889cc97871ec1c8a840a7aca7d57867dc5a
vendor/lib64/libdsutils.so|8a962926cd4e0ad90522710e415d2a45cd50ae58
vendor/lib64/libidl.so|cdc2c5ee20f8d70d42653c0a234a2999787fd683
vendor/lib64/libqcci_legacy.so|5ff872de76321a9b9d5435747ea16d023836844d
vendor/lib64/libqdi.so|7acd1a297f33000579d731339142521af50793d2
vendor/lib64/libqdp.so|b2c5eb15810c2d8f578bb55c9e6f47cf24089f98
vendor/lib64/libqmi.so|948a862aaefd4c0bf80e91532b64361d4a820d34
vendor/lib64/libqmi_client_helper.so|6dac78cb149927e3599530250f72731a3ef95804
vendor/lib64/libqmi_client_qmux.so|7124bc122f09b324588a8ffd901f9c3c58bdb716
vendor/lib64/libqmi_common_so.so|67dfe570b9063aadb8ae39543c0ad8e34f2c89c1
vendor/lib64/libqmi_csi.so|679da4f1faac703d29fc0875cfd61c8a97d30a33
vendor/lib64/libqmi_encdec.so|be78c960990258d4f2db25d9c9727740fe20a2b0
vendor/lib64/libqmiservices.so|f3186660c8eaeb0b1d6b27346defd2f8b34ab37d

# QMI - from LA.UM.8.6.r1-04400-89xx.0
vendor/lib/libpdmapper.so|0959fa03d43b08dea91a57ed6aea228751f80573
vendor/lib/libqmi_cci.so|475321e87d75f35ecf7c98004ba777064ef11c0d
vendor/lib64/libpdmapper.so|b837641e006ff90a49764d7ac78553de537acd74
vendor/lib64/libqmi_cci.so|301271923d990e035416fb1ebc3d1b8b6f7b55b7

# Radio - from daisy_sprout:10/QKQ1.191002.002/V11.0.10.0.QDLMIXM
-product/app/QtiTelephonyService/QtiTelephonyService.apk|db60b6fe27b3033f6468b3170b23af18dd0bcdaf
product/etc/permissions/qcrilhook.xml|ceb890ab3c1645aa0d0044abab1ba58c4097a991
product/etc/permissions/telephony_product_privapp-permissions-qti.xml|68901007ba1a48ceb1b728fc3b5483dd51b5e3a0
product/etc/permissions/telephonyservice.xml|a39eefcaf85fb8da60044fdbbcfddd95deb031c8
product/framework/qcrilhook.jar|99c85f639bdf74b6779607f1f29628c33d4edc85
product/framework/QtiTelephonyServicelibrary.jar|ea30b05eaad3ebee157421b3f31bf8585566b4cd
vendor/bin/hw/qcrild|c0db5589a45874c31c0bb7e8a7151511505c1e04
vendor/bin/ATFWD-daemon|4d301417b919c784ae19e4fa6733bfdebacbdfd3
vendor/bin/netmgrd|8752fb8cb74bd402a13ff291b7d2074415350984
vendor/bin/qti|08bdcf9cb284cbc9e884fa919f04b560fee44d03
vendor/bin/rmt_storage|4cd57922075ada02799c4ee5fdc2f3eb881d6e52
vendor/bin/tftp_server|c529f5d24ed0188843e4a227cae8245bd60614d6
vendor/bin/qrtr-cfg|1710347c37f0ef2c1f07b52d671e919bf093c7c0
vendor/bin/qrtr-lookup|eaf4bf67ebe8d34df72f996b805598c3a9028be2
vendor/bin/qrtr-ns|c9b51efaa6359bafa6a838f3c47de556dfae5a3f
vendor/etc/data/dsi_config.xml|1e1667f631d81a2d3153b5002b9012c4bc7db393
vendor/etc/data/netmgr_config.xml|a7c0218e8f2304b18576c8d6d659e4890b50d990
vendor/etc/init/dataadpl.rc|cd4907d9bfd438fe5f5c86f5d6cec590ac0bac2a
vendor/etc/init/dataqti.rc|6abfd1a850d782adbbb6f42c9d8ca870036b2ad1
vendor/etc/init/netmgrd.rc|fd3457c69a9fab11b87d0d1b494188fe089684cd
vendor/etc/init/port-bridge.rc|e52d61a0de5e8a3b21bfbfca929e862422645377
vendor/etc/init/qcrild.rc|17cf4934bf443cf6469d8b3ff622eeb0e4a0aac6
vendor/lib/libconfigdb.so|962a1dfea6e8d0f157c2f5276981c5e94420b89f
vendor/lib/libmdmdetect.so|716f635c809b3e90add0e8fa57569a9b630e7d65
vendor/lib/libnetmgr.so|f0dba44c4fdfae34626a66ecb5035fb1d5cf7bea
vendor/lib/libnetmgr_common.so|f51d3dc01c4d80971a579aceea939578d7575b77
vendor/lib/libqrtr.so|604fb64ba9f38cd13177800000513f1c98aadfc4
vendor/lib/libqsocket.so|37dad80324b2c61b153a7b7240dcb4cfae4e9d44
vendor/lib64/libconfigdb.so|517b23ac8fcff847ff99a3fdf037e7ff75a0338e
vendor/lib64/liblqe.so|fd956abb5edf900153b358af3bdde0429a54f698
vendor/lib64/libmdmdetect.so|33c67b87c26c7f01519abe2a70f0940717100210
vendor/lib64/libnetmgr.so|b6a1f48ed8917e2b7cc51fd4fa4b21524688d3e6
vendor/lib64/libnetmgr_common.so|0a6e86949eb2cc89a3061e9dc38972dda451ec73
vendor/lib64/libnetmgr_nr_fusion.so|732228e537db65315d754c45ab070a55ae45053a
vendor/lib64/libnetmgr_rmnet_ext.so|a4a495a7d2f3d2c9400bd0f689e318cf37995628
vendor/lib64/libnlnetmgr.so|54adfd21e03c05946007618150be6fc1eea5f8fd
vendor/lib64/libpdnotifier.so|1acdef1d90be28dc2f4b0fb14a91d42988bc0643
vendor/lib64/libqcmaputils.so|bc02f3f2cf2036c823e465f2bfbe7690201188bd
vendor/lib64/libqcrildatactl.so|d65009e1c5a73c728ec1acc3d2a31c064c9d3adf
vendor/lib64/libqcrilFramework.so|3d8f25d13533f6fa45a36b23feb250291b663370
vendor/lib64/libqrtr.so|f4349657cad3dc73b6264b8e56c4978f145ef088
vendor/lib64/libril-qc-hal-qmi.so|9f58de2abe6a3d67a341692c5870929a66f0b8b2
vendor/lib64/libril-qc-ltedirectdisc.so|0c1aafc35d913980ace095e1225ff5d7a95325dc
vendor/lib64/libril-qc-qmi-1.so|5436da6c6ee67d3a9c3f74178da9c0a4d8bd61fe
vendor/lib64/libril-qc-radioconfig.so|6ebbd05820a8710059e402ec314e0674eb8fdca0
vendor/lib64/libril-qcril-hook-oem.so|a7f9913f870e93760c6ecfd1548704e356d41e2c
vendor/lib64/librilqmiservices.so|7c98179411c97d19b6f7ba4f5cc77a21304a26dc
vendor/lib64/libsettings.so|a315356ae32b15c8300796e23aeb39c5e0da8d3d
vendor/lib64/libsystem_health_mon.so|08c350ccb62970952b111459e31f80c22bca6d88
vendor/lib64/qcrild_librilutils.so|c23470619690a34f7442fb6b26345de5dc4de880
vendor/lib64/qtibus.so|ee4c36f06be6a4175fef97610bf1c1580a1c893f
vendor/lib64/qtimutex.so|e0963a87e9fe282bfd57eed8ad179b9e944643bd
vendor/lib64/vendor.qti.hardware.radio.am@1.0.so|52b799cf6dc71786c44ac92dc3fbe5fc770ce325
vendor/lib64/vendor.qti.hardware.radio.atcmdfwd@1.0.so|bbbc392d6e817deef32c308eb284b97332ba1323
vendor/lib64/vendor.qti.hardware.radio.internal.deviceinfo@1.0.so|f591de5c6556b24af53aa4004a36fd818351510a
vendor/lib64/vendor.qti.hardware.radio.lpa@1.0.so|624ba3bbb9e42d198c72301b2b92db0361c8eb2b
vendor/lib64/vendor.qti.hardware.radio.ims@1.0.so|38cd07d0826479cdc31ec477a885499ae9f2dc86
vendor/lib64/vendor.qti.hardware.radio.ims@1.1.so|d6b6887e93c73c9e087635c9a10ec58afdfbb082
vendor/lib64/vendor.qti.hardware.radio.ims@1.2.so|2b4998c91400f1f6f43ee7a497d1c1116739a463
vendor/lib64/vendor.qti.hardware.radio.ims@1.3.so|180f4852b68aa71e21924b90f2e5c35fc771f66c
vendor/lib64/vendor.qti.hardware.radio.ims@1.4.so|4b811b0d5bfc3488cdda4f3bc636b2dd384b4671
vendor/lib64/vendor.qti.hardware.radio.ims@1.5.so|c5148ec13017daf48e0e4a1c359204b2d51f234e
vendor/lib64/vendor.qti.hardware.radio.ims@1.6.so|f9767027c0dc44adef2c01372af3ae57776d76ce
vendor/lib64/vendor.qti.hardware.radio.qcrilhook@1.0.so|df9eba4d5c1ba1a407667a6ad8da23682ac5a591
vendor/lib64/vendor.qti.hardware.radio.qtiradio@1.0.so|13a000a381da0ccea52abd56b55ee3aeaf14fdad
vendor/lib64/vendor.qti.hardware.radio.qtiradio@2.0.so|c78aee18442402d895b7ff1ec2f742047743aacb
vendor/lib64/vendor.qti.hardware.radio.qtiradio@2.1.so|e338140d02372955e4ad82e6ed3e397e673e333a
vendor/lib64/vendor.qti.hardware.radio.qtiradio@2.2.so|093c75e960dd0d0dc84269732acb064b46b332b9
vendor/lib64/vendor.qti.hardware.radio.qtiradio@2.3.so|7da2a29abb697186dff7ad8f133d4b0547240cdf
vendor/lib64/vendor.qti.hardware.radio.uim@1.0.so|e52f3c57377216d1a7a02cf63fc1f917c07fdda0
vendor/lib64/vendor.qti.hardware.radio.uim@1.1.so|17bc6b7b68d035486347ec4db66f321ecf52140f
vendor/lib64/vendor.qti.hardware.radio.uim@1.2.so|ba859e5e751e8533bb6321e05d0c469931ef56b3
vendor/lib64/vendor.qti.hardware.radio.uim_remote_client@1.0.so|3a93bcc13952ad316c66eecf1c5b01123eacb255
vendor/lib64/vendor.qti.hardware.radio.uim_remote_client@1.1.so|4df2c790a197e7e8de10b46520e6e0a3f1f5030d
vendor/lib64/vendor.qti.hardware.radio.uim_remote_server@1.0.so|87ae478a5ad00967e7ba9106ef85cb17ca4f14ac
vendor/radio/qcril_database/qcril.db|861dc2702acfa940090bbde95ee216ff88f3f82d
vendor/radio/qcril_database/upgrade/0_initial.sql|4c43eb584f34e572d29cae61d29809d21670822c
vendor/radio/qcril_database/upgrade/1_version_intro.sql|67b96cb3e94737bfe271b2519b9eb5fae17373a2
vendor/radio/qcril_database/upgrade/2_version_add_wps_config.sql|b4a825ba20fea3e2f20c7f02c8bd64596c24a75e
vendor/radio/qcril_database/upgrade/3_version_update_wps_config.sql|0571aacaf9fc0868c48bba2f7542f5b4e68c9022
vendor/radio/qcril_database/upgrade/4_version_update_ecc_table.sql|0734c6a2863edadc7a8422b8310d267c594d11a0
vendor/radio/qcril_database/upgrade/5_version_update_ecc_table.sql|fcb2cba3bfd718ecdc8d3cfac3a0b2b2c7e8c506

# Radio - from LA.UM.8.6.r1-04400-89xx.0
product/framework/qti-telephony-common.jar|5abd8bfe210a9c707e31953a7e14d7f7d5a89d92
-product/priv-app/qcrilmsgtunnel/qcrilmsgtunnel.apk|71d083671c3ea4cd5e287a63fb254bb0ab60ed20
vendor/etc/init/vendor.qti.rmt_storage.rc|bc212c6353c2ded44ae4d759605fbbe55aa4fa3f
vendor/etc/init/vendor.qti.tftp.rc|091915c28a3bc574d39189688748cc922d9e65e4
vendor/bin/adpl|5d4b28d054f7209615195cb796e17d6facca33ee
vendor/bin/port-bridge|4d2ecd808da9d3c124e4c38133078e5c51ebf4b1
vendor/lib64/libqsocket.so|6264041e0e897f78dc9b6a4be6424cbd927669d0

# Radio (IMS) - from daisy_sprout:10/QKQ1.191002.002/V11.0.10.0.QDLMIXM
product/lib64/lib-imscamera.so|013f79908a56d9da489516f69d32b2e0e10cc9fd
product/lib64/lib-imsvideocodec.so|d2557183da4626805794529d0d60b01d9aac5588
product/lib64/lib-imsvt.so|d650917fb938a70467f9b0f9f1319714278222cf
product/lib64/lib-imsvtextutils.so|c8065a0ddf21c3ba9cffdc61c2b5b6488081b8be
product/lib64/lib-imsvtutils.so|8e9bba6bbad8e8e5d3cfa40831262db5c745e073
vendor/bin/ims_rtp_daemon|8ff0d162006700c5ca50511402ace426845d427e
vendor/bin/imsdatadaemon|eeabae78397944fdcbccfb34fa03c8669bf1b0ee
vendor/bin/imsqmidaemon|5d11ffc3251085f7cc11a925fea803b2ea8a41f6
vendor/bin/imsrcsd|3a2ab8c9388832ebde08d377335ef5f227801c7b
vendor/etc/init/ims_rtp_daemon.rc|b3c3a380204d7b1b3a58937db8c8e76c00ac8825
vendor/etc/init/imsdatadaemon.rc|29face37c174aebcd1358f7d7ad0bd4baf83063b
vendor/etc/init/imsqmidaemon.rc|dda16d842b7c65296e97bc9921b723a43b152ba3
vendor/etc/init/imsrcsd.rc|2dc42ff6e4b6dd389bd3bc9a7af30dec2f1a45df
vendor/lib64/com.qualcomm.qti.imscmservice@1.0.so|31db727119878064964a0bb48e5f972c5199b7f2
vendor/lib64/com.qualcomm.qti.imscmservice@2.0.so|4c51f1d5bcc893f8869bacf45a8e80b7e269ebe1
vendor/lib64/com.qualcomm.qti.imscmservice@2.1.so|c736e0100d4eecd904aaec5ed6c08c4b3bc85949
vendor/lib64/com.qualcomm.qti.imscmservice@2.2.so|495df27fe7782bfe711da8d49a63668a8b2b7af2
vendor/lib64/com.qualcomm.qti.uceservice@2.0.so|425def95b5f4b3fb3c1e16e0164c8471d5a7bb0e
vendor/lib64/com.qualcomm.qti.uceservice@2.1.so|a4539626beec26036a45a573e1da7f25b4666b02
vendor/lib64/librcc.so|d38cedc99a9987105489876be435648b9de14052
vendor/lib64/lib-imscmservice.so|71bc6584f81b2ce391516b4c83ff0e528fca614b
vendor/lib64/lib-imsdpl.so|94ba439241ff6d207b16a186b76618bf1feb8d15
vendor/lib64/lib-imsqimf.so|a2cc8126802c7473ada881369341345fe2e31de3
vendor/lib64/lib-imsrcs-v2.so|102fe1b75b240fe0aae9bc63ba434223554d44ce
vendor/lib64/lib-imsrcsbaseimpl.so|91d7d52d083de952e30ef747e8af9e02d899c8e9
vendor/lib64/lib-imsSDP.so|d79112189fd592acae63e2cb0e885893440eabc8
vendor/lib64/lib-imsvtcore.so|9844d23c5d6388fc8aefd3eac62bd1aaacdb1ab8
vendor/lib64/lib-imsxml.so|59d28bbde722f8d3d80ad7f442d3ef67f1940d44
vendor/lib64/lib-rtpcommon.so|44d61a79d7089530d2d26965059b2180c5bcceef
vendor/lib64/lib-rtpcore.so|7bfaa41f2be0b5760388990f34989208b903254a
vendor/lib64/lib-rtpsl.so|9b85f3ba7f730bc3a5af803f8592c70fdc5509ce
vendor/lib64/lib-siputility.so|1bda76c4ad6321348d910048e5004871ba7916d5
vendor/lib64/lib-uceservice.so|1e66bf03e7a8d5469f147201d55701a0f36f3477
vendor/lib64/vendor.qti.ims.callinfo@1.0.so|a752c392c4f2dc03180f41bbe286a9daad915d21
vendor/lib64/vendor.qti.ims.rcsconfig@1.0.so|ba5ffc588422c1b0f3ac8135314db2c88d62671e
vendor/lib64/vendor.qti.imsrtpservice@2.0.so|6ef5cd72d34c20e82cb0e58681a4aae9b0dac99a
vendor/lib64/vendor.qti.imsrtpservice@2.1-service-Impl.so|9eb713ce4ffd38006bd0ca794a7e4152b33b3ded
vendor/lib64/vendor.qti.imsrtpservice@2.1.so|6dbe703a5a8389c342008c950aaec7a3a260a055

# Radio (IMS) - from LA.UM.8.6.r1-04400-89xx.0
product/lib64/libimscamera_jni.so|41fd9faa10818c9f7c5a14d372a07f79b0ca0daa
product/lib64/libimsmedia_jni.so|448795a73bbf72fc0c9876f86a13769139ea8022
-product/priv-app/ims/ims.apk|f2f355a2844a49b290bd7512ecb8df7833a1c0e1
vendor/lib64/vendor.qti.ims.rcsconfig@1.1.so|936011dbcfd05ea9350f7410bb6f4d69ddd3fb61

# Sensors - from LA.UM.8.6.r1-04400-89xx.0
vendor/bin/sensors.qti|8915364094374f542e1eb7ad361ab2cb5349afbe
vendor/lib/hw/activity_recognition.msm8953.so|824eb490aee2203d33ea5d864e49b916474cd13e
vendor/lib/libsensor1.so|beefcf50269962c1f45806a2fd3e127ac855d26c
vendor/lib/libsensor_reg.so|db6e00ba09e2d7cb65c070a3aecf374f7ea4cea1
vendor/lib/libsensor_user_cal.so|d4b038e4424af44d4c7ba3b55ff630e98b78527f
vendor/lib/sensors.ssc.so|91aaf89def079fe0c06c80656548f5229802e0cd
vendor/lib64/hw/activity_recognition.msm8953.so|19637d97c2cf50a6c7b34d7529f2636198404522
vendor/lib64/libsensor1.so|4a63118bc426116643216c5f43f70ce0cd52d537
vendor/lib64/libsensor_reg.so|b977629681598d927830ed99986e818c01c2d34a
vendor/lib64/libsensor_user_cal.so|a9cd76f06c02e23cb7f1552aa7d51567259faa47
vendor/lib64/sensors.ssc.so|3642d92d56cd7b21720ff9d11a008040c16e5c5d

# Thermal - from LA.UM.8.6.r1-04400-89xx.0
vendor/bin/thermal-engine|f035777bb32c1f7a4a8ff2687e82a4e975568e52
-vendor/lib/libthermalclient.so|14593d3551af6ce493b8534d123739cc7d146993
-vendor/lib64/libthermalclient.so|c36b6baf6e82a73e7afaf52589dada5248a69daf
vendor/lib64/libthermalfeature.so|829b2fc0aa8c863d4b4b331e0a2c00663e01efe6
vendor/lib64/libthermalioctl.so|1d6587245c7e7148638f14254e2f61f6b5552857

# Time services - from daisy_sprout:10/QKQ1.191002.002/V11.0.10.0.QDLMIXM
-vendor/app/TimeService/TimeService.apk;:timeservice_app_cert-legacy-um|27f9b81621c446baa8c37581d9bfbca2fd67b496
vendor/bin/time_daemon|75b8a6a14cfb4424499ccb2bf1cad011df295d0e
vendor/etc/init/init.time_daemon.rc|b253ca2a498757e14e1d7a051bf504ae09218f51
-vendor/lib64/libtime_genoff.so|06df52867790cdbbcc674a3a28d7ad7c8cc161ac

# TUI - from LA.UM.8.6.r1-04400-89xx.0
vendor/bin/hw/vendor.qti.hardware.tui_comm@1.0-service-qti|05c0a47f24e38b14fc7c1ccfa64c585692277ee5
vendor/etc/init/vendor.qti.hardware.tui_comm@1.0-service-qti.rc|2cfc563d7e1579374f001c94588fae7835a12ffc
vendor/lib/vendor.qti.hardware.tui_comm@1.0.so|19932d88afdf0351d7bfb6dee19a171d85bc1fde
vendor/lib64/vendor.qti.hardware.tui_comm@1.0.so|7343cf8a20fb8e72e17b014cda7b5ae85841354a

# WiFi - from daisy_sprout:10/QKQ1.191002.002/V11.0.10.0.QDLMIXM
vendor/bin/wcnss_service|1a7da5ec11248ea69af665d711a846e4cc7c95be

# WiFi Display - from LA.UM.8.6.r1-04400-89xx.0
bin/wfdservice|934817e5689fe6f8b54032902de58c203b8ec2e7
etc/init/wfdservice.rc|311bfdd1675e56499662f39455536b75b78477bb
etc/wfdconfig.xml|d07f6b0441c0aa8913865100239490fa8687a020
etc/wfdconfigsink.xml|5b4a96f251fd83c2eee520d06bea2b5b159fcd36
-framework/WfdCommon.jar|3440607d29511e1a671e565a2acc4d262e38a9fb
lib/com.qualcomm.qti.wifidisplayhal@1.0.so|ae4ba4448820bae832db16c4d64bd547bff13503
lib/libmmrtpdecoder.so|a990ab20d1c970c827b8e12fe377c4965da7b7f5
lib/libmmrtpencoder.so|c1d969d3600a9b9a7505e4d1f18ab3ac0f111406
lib/libwfdavenhancements.so|638e27b478a40c550e55615aad313073cc34af7b
lib/libwfdclient.so|1aeeff79aeea226a8448d7b6e8e3b79ab5fcdcc3
lib/libwfdcodecv4l2.so|57543179ee4fa13bf48e74e65ebefc3ed8618e88
lib/libwfdcommonutils.so|a1e9da9d78430bdcd4545a5f3671a3cdedf03668
lib/libwfdconfigutils.so|2854b593dfc491ead6f60aab4d016d131dbcd841
lib/libwfdmminterface.so|feb2b5323b5ce8da54b69e0fcec17e02197210fc
lib/libwfdmmsink.so|866b548e1a6eed172896bbf6bd9c501154dc73ca
lib/libwfdmmsrc.so|2f857de6a7109da907b176b36a3605e8951ed2f0
lib/libwfdnative.so|f103071788592614cf0ad50764d3437c94d04a76
lib/libwfdrtsp.so|b45df3a3180cea8b76c2201148a06b045ff26495
lib/libwfdservice.so|93ae07c742ed1d4d76e34094a0534702555fe975
lib/libwfdsm.so|7ce83cb46ecd21613e55b1bd9e873572aaffbf3d
lib/libwfduibcinterface.so|91a3d55861725aef0747c14809c1bd547485de66
lib/libwfduibcsinkinterface.so|dbe5c8f89a37b1d2d27bc3224695b97cfc5a71e3
lib/libwfduibcsink.so|b8ef4abf2c67cf5e9f187b71cda4195171bb15ed
lib/libwfduibcsrcinterface.so|4eba1e3a541bc433eb75cf74807591fd16618c74
lib/libwfduibcsrc.so|58d43f5593a7c0a6929c0ed3aef02386fbc0afc8
lib64/libwfdclient.so|0b2ddc40a0b251e0768a2383c20c318a8c9b0c2d
lib64/libwfdnative.so|b28b0d83b8d52ad3450735bdeea6498b1a7a18c2
-priv-app/WfdService/WfdService.apk|9da05dab9097ef8b016e99fd646b50167309ee5b
vendor/bin/wifidisplayhalservice|53f17ca800499f18514c4a68bff571491404ead6
vendor/etc/init/com.qualcomm.qti.wifidisplayhal@1.0-service.rc|04e463342cbba4c0e9c311a18238f95dec9359fd
vendor/lib/com.qualcomm.qti.wifidisplayhal@1.0-halimpl.so|52a65f99b4c2a9e27aed76c5fa16fd89fabb4558
vendor/lib/libwfdcommonutils_proprietary.so|f9fd5853ab1655e868555c6a20b017509436f07b
vendor/lib/libwfdhaldsmanager.so|fdd9d1c5a7e75684ad2039e0ce24a1e5ee308833
vendor/lib/libwfdhdcpcp.so|a87af0f216f9761d513bab6337783a691b02fd3f
vendor/lib/libwfdmmservice.so|f180f820e507d7ed2676b0d66d6d63cb74458563
vendor/lib/libwfdmodulehdcpsession.so|4800ec57f1a546200389b98221145a310c5d6aca
