(kicad_pcb (version 20171130) (host pcbnew "(5.1.2)-2")

  (general
    (thickness 1.6)
    (drawings 51)
    (tracks 0)
    (zones 0)
    (modules 3)
    (nets 29)
  )

  (page A4)
  (layers
    (0 F.Cu signal)
    (31 B.Cu signal)
    (32 B.Adhes user)
    (33 F.Adhes user)
    (34 B.Paste user)
    (35 F.Paste user)
    (36 B.SilkS user)
    (37 F.SilkS user)
    (38 B.Mask user)
    (39 F.Mask user)
    (40 Dwgs.User user)
    (41 Cmts.User user)
    (42 Eco1.User user)
    (43 Eco2.User user)
    (44 Edge.Cuts user)
    (45 Margin user)
    (46 B.CrtYd user)
    (47 F.CrtYd user)
    (48 B.Fab user)
    (49 F.Fab user)
  )

  (setup
    (last_trace_width 0.25)
    (trace_clearance 0.2)
    (zone_clearance 0.508)
    (zone_45_only no)
    (trace_min 0.2)
    (via_size 0.8)
    (via_drill 0.4)
    (via_min_size 0.4)
    (via_min_drill 0.3)
    (uvia_size 0.3)
    (uvia_drill 0.1)
    (uvias_allowed no)
    (uvia_min_size 0.2)
    (uvia_min_drill 0.1)
    (edge_width 0.05)
    (segment_width 0.2)
    (pcb_text_width 0.3)
    (pcb_text_size 1.5 1.5)
    (mod_edge_width 0.12)
    (mod_text_size 1 1)
    (mod_text_width 0.15)
    (pad_size 1.524 1.524)
    (pad_drill 0.762)
    (pad_to_mask_clearance 0.051)
    (solder_mask_min_width 0.25)
    (aux_axis_origin 0 0)
    (visible_elements 7FFFFFFF)
    (pcbplotparams
      (layerselection 0x010fc_ffffffff)
      (usegerberextensions true)
      (usegerberattributes false)
      (usegerberadvancedattributes false)
      (creategerberjobfile false)
      (excludeedgelayer true)
      (linewidth 0.100000)
      (plotframeref false)
      (viasonmask false)
      (mode 1)
      (useauxorigin false)
      (hpglpennumber 1)
      (hpglpenspeed 20)
      (hpglpendiameter 15.000000)
      (psnegative false)
      (psa4output false)
      (plotreference true)
      (plotvalue true)
      (plotinvisibletext false)
      (padsonsilk false)
      (subtractmaskfromsilk false)
      (outputformat 1)
      (mirror false)
      (drillshape 0)
      (scaleselection 1)
      (outputdirectory "testboardGerber/"))
  )

  (net 0 "")
  (net 1 D9)
  (net 2 D8)
  (net 3 D7)
  (net 4 D6)
  (net 5 D5)
  (net 6 D4)
  (net 7 D3)
  (net 8 D2)
  (net 9 GND)
  (net 10 RST)
  (net 11 RXI)
  (net 12 TX0)
  (net 13 5V)
  (net 14 3.3V)
  (net 15 A6)
  (net 16 A7)
  (net 17 SDA)
  (net 18 SCL)
  (net 19 SS)
  (net 20 MOSI)
  (net 21 MISO)
  (net 22 SCK)
  (net 23 A0)
  (net 24 A1)
  (net 25 A2)
  (net 26 A3)
  (net 27 VCC)
  (net 28 RAW)

  (net_class Default "This is the default net class."
    (clearance 0.2)
    (trace_width 0.25)
    (via_dia 0.8)
    (via_drill 0.4)
    (uvia_dia 0.3)
    (uvia_drill 0.1)
    (add_net 3.3V)
    (add_net 5V)
    (add_net A0)
    (add_net A1)
    (add_net A2)
    (add_net A3)
    (add_net A6)
    (add_net A7)
    (add_net D2)
    (add_net D3)
    (add_net D4)
    (add_net D5)
    (add_net D6)
    (add_net D7)
    (add_net D8)
    (add_net D9)
    (add_net GND)
    (add_net MISO)
    (add_net MOSI)
    (add_net RAW)
    (add_net RST)
    (add_net RXI)
    (add_net SCK)
    (add_net SCL)
    (add_net SDA)
    (add_net SS)
    (add_net TX0)
    (add_net VCC)
  )

  (module pcbTestBoard:astrelogopcb (layer F.Cu) (tedit 0) (tstamp 5E388B0E)
    (at 110 117.5)
    (fp_text reference G*** (at 0 0) (layer F.SilkS) hide
      (effects (font (size 1.524 1.524) (thickness 0.3)))
    )
    (fp_text value LOGO (at 0.75 0) (layer F.SilkS) hide
      (effects (font (size 1.524 1.524) (thickness 0.3)))
    )
    (fp_poly (pts (xy 0.202908 -1.453549) (xy 0.2032 -1.4478) (xy 0.183673 -1.423377) (xy 0.1763 -1.4224)
      (xy 0.161131 -1.437961) (xy 0.1651 -1.4478) (xy 0.187924 -1.472032) (xy 0.191999 -1.4732)
      (xy 0.202908 -1.453549)) (layer F.SilkS) (width 0.01))
    (fp_poly (pts (xy 0.058413 -1.270114) (xy 0.029766 -1.182103) (xy -0.013843 -1.129003) (xy -0.048986 -1.1176)
      (xy -0.074087 -1.137707) (xy -0.0762 -1.15031) (xy -0.060697 -1.188153) (xy -0.021615 -1.245281)
      (xy -0.000665 -1.27096) (xy 0.074871 -1.3589) (xy 0.058413 -1.270114)) (layer F.SilkS) (width 0.01))
    (fp_poly (pts (xy -1.622564 -1.484616) (xy -1.587185 -1.463411) (xy -1.558318 -1.438228) (xy -1.552553 -1.410229)
      (xy -1.569403 -1.361723) (xy -1.583523 -1.330061) (xy -1.622929 -1.252745) (xy -1.663776 -1.186488)
      (xy -1.671243 -1.176378) (xy -1.705874 -1.139833) (xy -1.740111 -1.137448) (xy -1.78435 -1.158139)
      (xy -1.83309 -1.188477) (xy -1.854178 -1.210171) (xy -1.8542 -1.21057) (xy -1.841198 -1.248527)
      (xy -1.808366 -1.309374) (xy -1.764963 -1.378887) (xy -1.720249 -1.442841) (xy -1.683486 -1.487012)
      (xy -1.666691 -1.4986) (xy -1.622564 -1.484616)) (layer F.SilkS) (width 0.01))
    (fp_poly (pts (xy -1.845257 -1.092987) (xy -1.790601 -1.050414) (xy -1.759426 -0.988352) (xy -1.759798 -0.917234)
      (xy -1.799784 -0.847497) (xy -1.80819 -0.83919) (xy -1.877719 -0.794308) (xy -1.946585 -0.797143)
      (xy -2.000949 -0.826941) (xy -2.048407 -0.887305) (xy -2.05912 -0.963484) (xy -2.033696 -1.036866)
      (xy -1.992743 -1.077923) (xy -1.915326 -1.105635) (xy -1.845257 -1.092987)) (layer F.SilkS) (width 0.01))
    (fp_poly (pts (xy -2.031316 -0.748947) (xy -1.980061 -0.717855) (xy -1.956049 -0.694254) (xy -1.9558 -0.692733)
      (xy -1.968893 -0.656844) (xy -2.00195 -0.59759) (xy -2.045644 -0.529027) (xy -2.090646 -0.465211)
      (xy -2.127627 -0.420198) (xy -2.145317 -0.407173) (xy -2.187775 -0.41966) (xy -2.21615 -0.433835)
      (xy -2.248064 -0.459836) (xy -2.256465 -0.494491) (xy -2.239817 -0.548187) (xy -2.19658 -0.63131)
      (xy -2.183478 -0.654349) (xy -2.106832 -0.787997) (xy -2.031316 -0.748947)) (layer F.SilkS) (width 0.01))
    (fp_poly (pts (xy 0.041738 -2.49738) (xy 0.302025 -2.456283) (xy 0.564712 -2.380796) (xy 0.822259 -2.272065)
      (xy 1.046495 -2.144748) (xy 1.306918 -1.946688) (xy 1.532235 -1.713757) (xy 1.720261 -1.449771)
      (xy 1.868813 -1.158545) (xy 1.975705 -0.843897) (xy 2.038753 -0.509643) (xy 2.049849 -0.391707)
      (xy 2.064387 -0.185704) (xy 1.927543 -0.169273) (xy 1.858794 -0.164429) (xy 1.750321 -0.160753)
      (xy 1.613189 -0.158249) (xy 1.458461 -0.156922) (xy 1.2972 -0.156773) (xy 1.140471 -0.157809)
      (xy 0.999337 -0.160031) (xy 0.884862 -0.163443) (xy 0.808108 -0.168051) (xy 0.8001 -0.168895)
      (xy 0.74124 -0.175679) (xy 0.647941 -0.186346) (xy 0.536238 -0.199066) (xy 0.4826 -0.205157)
      (xy 0.336255 -0.224759) (xy 0.179287 -0.2509) (xy 0.019551 -0.281698) (xy -0.135096 -0.315271)
      (xy -0.2768 -0.349738) (xy -0.397703 -0.383217) (xy -0.48995 -0.413826) (xy -0.545683 -0.439683)
      (xy -0.5588 -0.454608) (xy -0.545903 -0.486363) (xy -0.511225 -0.550796) (xy -0.46079 -0.638069)
      (xy -0.400623 -0.738346) (xy -0.336745 -0.841786) (xy -0.275182 -0.938554) (xy -0.221955 -1.018811)
      (xy -0.183089 -1.072719) (xy -0.173188 -1.08441) (xy -0.131998 -1.12246) (xy -0.102692 -1.124707)
      (xy -0.074564 -1.103419) (xy -0.044443 -1.052258) (xy -0.043488 -1.015821) (xy -0.036624 -0.97007)
      (xy -0.00607 -0.894203) (xy 0.041887 -0.799115) (xy 0.10096 -0.695704) (xy 0.164862 -0.594864)
      (xy 0.227306 -0.507493) (xy 0.282007 -0.444486) (xy 0.290907 -0.436255) (xy 0.384307 -0.375999)
      (xy 0.494747 -0.335483) (xy 0.501589 -0.333948) (xy 0.581148 -0.320248) (xy 0.6895 -0.306135)
      (xy 0.815713 -0.292514) (xy 0.948854 -0.280288) (xy 1.077992 -0.270359) (xy 1.192193 -0.263631)
      (xy 1.280524 -0.261008) (xy 1.332054 -0.263392) (xy 1.337843 -0.264852) (xy 1.35482 -0.280184)
      (xy 1.351158 -0.312464) (xy 1.324226 -0.371536) (xy 1.319088 -0.381) (xy 1.9304 -0.381)
      (xy 1.939693 -0.360093) (xy 1.947333 -0.364067) (xy 1.950373 -0.394211) (xy 1.947333 -0.397934)
      (xy 1.932233 -0.394447) (xy 1.9304 -0.381) (xy 1.319088 -0.381) (xy 1.294896 -0.42556)
      (xy 1.225655 -0.543794) (xy 1.138392 -0.684013) (xy 1.040045 -0.835904) (xy 0.937546 -0.989157)
      (xy 0.837833 -1.133463) (xy 0.747839 -1.258509) (xy 0.6745 -1.353985) (xy 0.653519 -1.379123)
      (xy 0.607024 -1.432202) (xy 0.866669 -1.432202) (xy 0.872946 -1.397133) (xy 0.879842 -1.389224)
      (xy 0.911505 -1.384088) (xy 0.937177 -1.409832) (xy 0.9398 -1.4239) (xy 0.919204 -1.445111)
      (xy 0.9017 -1.4478) (xy 0.866669 -1.432202) (xy 0.607024 -1.432202) (xy 0.590443 -1.45113)
      (xy 0.536013 -1.506587) (xy 0.482501 -1.547656) (xy 0.475717 -1.5509) (xy 1.4732 -1.5509)
      (xy 1.491638 -1.525034) (xy 1.4986 -1.524) (xy 1.523339 -1.532667) (xy 1.524 -1.535201)
      (xy 1.506201 -1.556887) (xy 1.4986 -1.5621) (xy 1.475194 -1.560087) (xy 1.4732 -1.5509)
      (xy 0.475717 -1.5509) (xy 0.422183 -1.576496) (xy 0.34733 -1.59527) (xy 0.250218 -1.606137)
      (xy 0.123121 -1.61126) (xy -0.041689 -1.612799) (xy -0.182304 -1.6129) (xy -0.371077 -1.61306)
      (xy -0.517267 -1.611622) (xy -0.629076 -1.605708) (xy -0.714705 -1.592441) (xy -0.782356 -1.568945)
      (xy -0.840229 -1.532341) (xy -0.896526 -1.479753) (xy -0.959448 -1.408304) (xy -1.037197 -1.315116)
      (xy -1.03972 -1.312103) (xy -1.124445 -1.215938) (xy -1.184047 -1.159481) (xy -1.217255 -1.14388)
      (xy -1.221921 -1.147402) (xy -1.241954 -1.207445) (xy -1.255083 -1.301648) (xy -1.260449 -1.413733)
      (xy -1.257191 -1.52742) (xy -1.246623 -1.615241) (xy -1.210593 -1.73704) (xy 1.202531 -1.73704)
      (xy 1.2065 -1.7272) (xy 1.229324 -1.702969) (xy 1.233399 -1.7018) (xy 1.244308 -1.721452)
      (xy 1.2446 -1.7272) (xy 1.225073 -1.751624) (xy 1.2177 -1.7526) (xy 1.202531 -1.73704)
      (xy -1.210593 -1.73704) (xy -1.189209 -1.809324) (xy -0.370354 -1.809324) (xy -0.36696 -1.801231)
      (xy -0.336124 -1.788647) (xy -0.328031 -1.792041) (xy -0.315447 -1.822877) (xy -0.318841 -1.83097)
      (xy -0.349677 -1.843554) (xy -0.35777 -1.84016) (xy -0.370354 -1.809324) (xy -1.189209 -1.809324)
      (xy -1.185112 -1.82317) (xy -1.082713 -2.017238) (xy -1.002392 -2.118002) (xy -0.885931 -2.118002)
      (xy -0.879654 -2.082933) (xy -0.872758 -2.075024) (xy -0.841095 -2.069888) (xy -0.815423 -2.095632)
      (xy -0.8128 -2.1097) (xy -0.833396 -2.130911) (xy -0.8509 -2.1336) (xy -0.885931 -2.118002)
      (xy -1.002392 -2.118002) (xy -0.946485 -2.188138) (xy -0.783488 -2.326561) (xy -0.649286 -2.402842)
      (xy -0.44146 -2.471807) (xy -0.208604 -2.502937) (xy 0.041738 -2.49738)) (layer F.SilkS) (width 0.01))
    (fp_poly (pts (xy -1.763546 -0.248013) (xy -1.768336 -0.220886) (xy -1.792621 -0.159106) (xy -1.832104 -0.072906)
      (xy -1.865253 -0.005927) (xy -1.940976 0.166226) (xy -1.977478 0.314059) (xy -1.972818 0.442837)
      (xy -1.925057 0.55782) (xy -1.832252 0.664272) (xy -1.692463 0.767454) (xy -1.550027 0.848809)
      (xy -1.383724 0.936199) (xy -1.344578 0.8763) (xy -0.8382 0.8763) (xy -0.824485 0.910101)
      (xy -0.8128 0.9144) (xy 0 0.9144) (xy 0.009293 0.935307) (xy 0.016933 0.931333)
      (xy 0.019973 0.901189) (xy 0.016933 0.897466) (xy 0.001833 0.900953) (xy 0 0.9144)
      (xy -0.8128 0.9144) (xy -0.790266 0.893827) (xy -0.7874 0.8763) (xy -0.801116 0.842498)
      (xy -0.8128 0.8382) (xy -0.835335 0.858772) (xy -0.8382 0.8763) (xy -1.344578 0.8763)
      (xy -1.330951 0.855449) (xy -1.301269 0.80765) (xy -1.251354 0.724664) (xy -1.186422 0.615272)
      (xy -1.111687 0.488254) (xy -1.105603 0.477837) (xy -0.40058 0.477837) (xy -0.389525 0.503747)
      (xy -0.370417 0.508) (xy -0.335428 0.487549) (xy -0.3302 0.467783) (xy -0.344868 0.440227)
      (xy 0.787417 0.440227) (xy 0.79881 0.478727) (xy 0.828908 0.546514) (xy 0.871605 0.632317)
      (xy 0.920796 0.724866) (xy 0.970377 0.812892) (xy 1.014243 0.885123) (xy 1.046288 0.93029)
      (xy 1.058027 0.9398) (xy 1.084369 0.927868) (xy 1.143004 0.896209) (xy 1.222542 0.851024)
      (xy 1.2445 0.838258) (xy 1.39781 0.742934) (xy 1.50914 0.658088) (xy 1.584199 0.576688)
      (xy 1.628694 0.4917) (xy 1.648332 0.39609) (xy 1.650611 0.337811) (xy 1.649156 0.260296)
      (xy 1.640268 0.207612) (xy 1.616287 0.176851) (xy 1.569556 0.165104) (xy 1.492417 0.169464)
      (xy 1.377212 0.187022) (xy 1.292221 0.201708) (xy 1.120912 0.232349) (xy 0.993382 0.25825)
      (xy 0.903207 0.282446) (xy 0.843965 0.307973) (xy 0.809231 0.337865) (xy 0.792583 0.375157)
      (xy 0.787598 0.422884) (xy 0.787417 0.440227) (xy -0.344868 0.440227) (xy -0.345007 0.439967)
      (xy -0.375472 0.444403) (xy -0.40058 0.477837) (xy -1.105603 0.477837) (xy -1.063 0.4049)
      (xy -0.7366 0.4049) (xy -0.718162 0.430766) (xy -0.7112 0.4318) (xy -0.686461 0.423133)
      (xy -0.6858 0.420599) (xy -0.703599 0.398913) (xy -0.7112 0.3937) (xy -0.734606 0.395713)
      (xy -0.7366 0.4049) (xy -1.063 0.4049) (xy -1.041621 0.3683) (xy -0.966619 0.239559)
      (xy -0.900824 0.126832) (xy -0.848329 0.037115) (xy -0.813227 -0.022598) (xy -0.79963 -0.045286)
      (xy -0.774189 -0.043249) (xy -0.708551 -0.03254) (xy -0.612253 -0.014842) (xy -0.494831 0.008157)
      (xy -0.477062 0.011742) (xy -0.091877 0.073076) (xy 0.318784 0.107994) (xy 0.736321 0.115344)
      (xy 1.01265 0.10414) (xy 1.183391 0.091137) (xy 1.361035 0.074505) (xy 1.535558 0.055476)
      (xy 1.696935 0.035283) (xy 1.835144 0.015157) (xy 1.94016 -0.003669) (xy 1.990847 -0.016113)
      (xy 2.018986 -0.020345) (xy 2.029684 -0.002053) (xy 2.026194 0.049949) (xy 2.02089 0.087146)
      (xy 1.979975 0.268075) (xy 1.911127 0.47033) (xy 1.82098 0.678009) (xy 1.716168 0.87521)
      (xy 1.645504 0.987038) (xy 1.493203 1.176954) (xy 1.303192 1.360723) (xy 1.088391 1.528029)
      (xy 0.861718 1.668553) (xy 0.688123 1.751641) (xy 0.467506 1.826227) (xy 0.223066 1.88096)
      (xy -0.028707 1.913696) (xy -0.271318 1.922286) (xy -0.487721 1.904673) (xy -0.812417 1.828099)
      (xy -1.119904 1.705576) (xy -1.170279 1.6764) (xy 0.381 1.6764) (xy 0.401572 1.698934)
      (xy 0.4191 1.7018) (xy 0.452901 1.688084) (xy 0.4572 1.6764) (xy 0.436627 1.653865)
      (xy 0.4191 1.651) (xy 0.385298 1.664715) (xy 0.381 1.6764) (xy -1.170279 1.6764)
      (xy -1.405282 1.540292) (xy -1.663655 1.335437) (xy -1.812519 1.176866) (xy -0.042334 1.176866)
      (xy -0.038847 1.191966) (xy -0.0254 1.1938) (xy -0.004493 1.184506) (xy -0.008467 1.176866)
      (xy -0.038611 1.173826) (xy -0.042334 1.176866) (xy -1.812519 1.176866) (xy -1.890125 1.0942)
      (xy -1.901298 1.078747) (xy 0.696465 1.078747) (xy 0.6985 1.0922) (xy 0.720226 1.116404)
      (xy 0.7239 1.1176) (xy 0.744094 1.099884) (xy 0.7493 1.0922) (xy 0.743268 1.070681)
      (xy 0.7239 1.0668) (xy 0.696465 1.078747) (xy -1.901298 1.078747) (xy -1.922182 1.049866)
      (xy -0.016934 1.049866) (xy -0.013447 1.064966) (xy 0 1.0668) (xy 0.020907 1.057506)
      (xy 0.016933 1.049866) (xy -0.013211 1.046826) (xy -0.016934 1.049866) (xy -1.922182 1.049866)
      (xy -2.030378 0.900238) (xy -2.141878 0.702056) (xy -2.208276 0.521835) (xy -2.213454 0.4826)
      (xy -2.0828 0.4826) (xy -2.073507 0.503507) (xy -2.065867 0.499533) (xy -2.062827 0.469389)
      (xy -2.065867 0.465666) (xy -2.080967 0.469153) (xy -2.0828 0.4826) (xy -2.213454 0.4826)
      (xy -2.230231 0.355483) (xy -2.208404 0.198906) (xy -2.162242 0.082554) (xy -2.114093 0.008526)
      (xy -2.047158 -0.06864) (xy -1.970753 -0.141221) (xy -1.894189 -0.201496) (xy -1.826781 -0.241742)
      (xy -1.777842 -0.254238) (xy -1.763546 -0.248013)) (layer F.SilkS) (width 0.01))
  )

  (module Connector_PinHeader_2.54mm:PinHeader_1x16_P2.54mm_Vertical (layer F.Cu) (tedit 59FED5CC) (tstamp 5E2A1592)
    (at 75 76)
    (descr "Through hole straight pin header, 1x16, 2.54mm pitch, single row")
    (tags "Through hole pin header THT 1x16 2.54mm single row")
    (path /5E2A5DC5)
    (fp_text reference J1 (at 0 -2.33) (layer F.SilkS)
      (effects (font (size 1 1) (thickness 0.15)))
    )
    (fp_text value Conn_01x16_Female (at 9.2 34.2) (layer F.Fab)
      (effects (font (size 1 1) (thickness 0.15)))
    )
    (fp_text user %R (at 0 19.05 90) (layer F.Fab)
      (effects (font (size 1 1) (thickness 0.15)))
    )
    (fp_line (start 1.8 -1.8) (end -1.8 -1.8) (layer F.CrtYd) (width 0.05))
    (fp_line (start 1.8 39.9) (end 1.8 -1.8) (layer F.CrtYd) (width 0.05))
    (fp_line (start -1.8 39.9) (end 1.8 39.9) (layer F.CrtYd) (width 0.05))
    (fp_line (start -1.8 -1.8) (end -1.8 39.9) (layer F.CrtYd) (width 0.05))
    (fp_line (start -1.33 -1.33) (end 0 -1.33) (layer F.SilkS) (width 0.12))
    (fp_line (start -1.33 0) (end -1.33 -1.33) (layer F.SilkS) (width 0.12))
    (fp_line (start -1.33 1.27) (end 1.33 1.27) (layer F.SilkS) (width 0.12))
    (fp_line (start 1.33 1.27) (end 1.33 39.43) (layer F.SilkS) (width 0.12))
    (fp_line (start -1.33 1.27) (end -1.33 39.43) (layer F.SilkS) (width 0.12))
    (fp_line (start -1.33 39.43) (end 1.33 39.43) (layer F.SilkS) (width 0.12))
    (fp_line (start -1.27 -0.635) (end -0.635 -1.27) (layer F.Fab) (width 0.1))
    (fp_line (start -1.27 39.37) (end -1.27 -0.635) (layer F.Fab) (width 0.1))
    (fp_line (start 1.27 39.37) (end -1.27 39.37) (layer F.Fab) (width 0.1))
    (fp_line (start 1.27 -1.27) (end 1.27 39.37) (layer F.Fab) (width 0.1))
    (fp_line (start -0.635 -1.27) (end 1.27 -1.27) (layer F.Fab) (width 0.1))
    (pad 16 thru_hole oval (at 0 38.1) (size 1.7 1.7) (drill 1) (layers *.Cu *.Mask)
      (net 1 D9))
    (pad 15 thru_hole oval (at 0 35.56) (size 1.7 1.7) (drill 1) (layers *.Cu *.Mask)
      (net 2 D8))
    (pad 14 thru_hole oval (at 0 33.02) (size 1.7 1.7) (drill 1) (layers *.Cu *.Mask)
      (net 3 D7))
    (pad 13 thru_hole oval (at 0 30.48) (size 1.7 1.7) (drill 1) (layers *.Cu *.Mask)
      (net 4 D6))
    (pad 12 thru_hole oval (at 0 27.94) (size 1.7 1.7) (drill 1) (layers *.Cu *.Mask)
      (net 5 D5))
    (pad 11 thru_hole oval (at 0 25.4) (size 1.7 1.7) (drill 1) (layers *.Cu *.Mask)
      (net 6 D4))
    (pad 10 thru_hole oval (at 0 22.86) (size 1.7 1.7) (drill 1) (layers *.Cu *.Mask)
      (net 7 D3))
    (pad 9 thru_hole oval (at 0 20.32) (size 1.7 1.7) (drill 1) (layers *.Cu *.Mask)
      (net 8 D2))
    (pad 8 thru_hole oval (at 0 17.78) (size 1.7 1.7) (drill 1) (layers *.Cu *.Mask)
      (net 9 GND))
    (pad 7 thru_hole oval (at 0 15.24) (size 1.7 1.7) (drill 1) (layers *.Cu *.Mask)
      (net 10 RST))
    (pad 6 thru_hole oval (at 0 12.7) (size 1.7 1.7) (drill 1) (layers *.Cu *.Mask)
      (net 11 RXI))
    (pad 5 thru_hole oval (at 0 10.16) (size 1.7 1.7) (drill 1) (layers *.Cu *.Mask)
      (net 12 TX0))
    (pad 4 thru_hole oval (at 0 7.62) (size 1.7 1.7) (drill 1) (layers *.Cu *.Mask)
      (net 9 GND))
    (pad 3 thru_hole oval (at 0 5.08) (size 1.7 1.7) (drill 1) (layers *.Cu *.Mask)
      (net 13 5V))
    (pad 2 thru_hole oval (at 0 2.54) (size 1.7 1.7) (drill 1) (layers *.Cu *.Mask)
      (net 9 GND))
    (pad 1 thru_hole rect (at 0 0) (size 1.7 1.7) (drill 1) (layers *.Cu *.Mask)
      (net 14 3.3V))
    (model ${KISYS3DMOD}/Connector_PinHeader_2.54mm.3dshapes/PinHeader_1x16_P2.54mm_Vertical.wrl
      (at (xyz 0 0 0))
      (scale (xyz 1 1 1))
      (rotate (xyz 0 0 0))
    )
  )

  (module Connector_PinHeader_2.54mm:PinHeader_1x16_P2.54mm_Vertical (layer F.Cu) (tedit 59FED5CC) (tstamp 5E2A15B6)
    (at 115 75.84)
    (descr "Through hole straight pin header, 1x16, 2.54mm pitch, single row")
    (tags "Through hole pin header THT 1x16 2.54mm single row")
    (path /5E2A7235)
    (fp_text reference J2 (at 0 -2.33) (layer F.SilkS)
      (effects (font (size 1 1) (thickness 0.15)))
    )
    (fp_text value Conn_01x16_Female (at -10.6 36.46) (layer F.Fab)
      (effects (font (size 1 1) (thickness 0.15)))
    )
    (fp_line (start -0.635 -1.27) (end 1.27 -1.27) (layer F.Fab) (width 0.1))
    (fp_line (start 1.27 -1.27) (end 1.27 39.37) (layer F.Fab) (width 0.1))
    (fp_line (start 1.27 39.37) (end -1.27 39.37) (layer F.Fab) (width 0.1))
    (fp_line (start -1.27 39.37) (end -1.27 -0.635) (layer F.Fab) (width 0.1))
    (fp_line (start -1.27 -0.635) (end -0.635 -1.27) (layer F.Fab) (width 0.1))
    (fp_line (start -1.33 39.43) (end 1.33 39.43) (layer F.SilkS) (width 0.12))
    (fp_line (start -1.33 1.27) (end -1.33 39.43) (layer F.SilkS) (width 0.12))
    (fp_line (start 1.33 1.27) (end 1.33 39.43) (layer F.SilkS) (width 0.12))
    (fp_line (start -1.33 1.27) (end 1.33 1.27) (layer F.SilkS) (width 0.12))
    (fp_line (start -1.33 0) (end -1.33 -1.33) (layer F.SilkS) (width 0.12))
    (fp_line (start -1.33 -1.33) (end 0 -1.33) (layer F.SilkS) (width 0.12))
    (fp_line (start -1.8 -1.8) (end -1.8 39.9) (layer F.CrtYd) (width 0.05))
    (fp_line (start -1.8 39.9) (end 1.8 39.9) (layer F.CrtYd) (width 0.05))
    (fp_line (start 1.8 39.9) (end 1.8 -1.8) (layer F.CrtYd) (width 0.05))
    (fp_line (start 1.8 -1.8) (end -1.8 -1.8) (layer F.CrtYd) (width 0.05))
    (fp_text user %R (at 0 19.05 90) (layer F.Fab)
      (effects (font (size 1 1) (thickness 0.15)))
    )
    (pad 1 thru_hole rect (at 0 0) (size 1.7 1.7) (drill 1) (layers *.Cu *.Mask)
      (net 15 A6))
    (pad 2 thru_hole oval (at 0 2.54) (size 1.7 1.7) (drill 1) (layers *.Cu *.Mask)
      (net 16 A7))
    (pad 3 thru_hole oval (at 0 5.08) (size 1.7 1.7) (drill 1) (layers *.Cu *.Mask)
      (net 17 SDA))
    (pad 4 thru_hole oval (at 0 7.62) (size 1.7 1.7) (drill 1) (layers *.Cu *.Mask)
      (net 18 SCL))
    (pad 5 thru_hole oval (at 0 10.16) (size 1.7 1.7) (drill 1) (layers *.Cu *.Mask)
      (net 19 SS))
    (pad 6 thru_hole oval (at 0 12.7) (size 1.7 1.7) (drill 1) (layers *.Cu *.Mask)
      (net 20 MOSI))
    (pad 7 thru_hole oval (at 0 15.24) (size 1.7 1.7) (drill 1) (layers *.Cu *.Mask)
      (net 21 MISO))
    (pad 8 thru_hole oval (at 0 17.78) (size 1.7 1.7) (drill 1) (layers *.Cu *.Mask)
      (net 22 SCK))
    (pad 9 thru_hole oval (at 0 20.32) (size 1.7 1.7) (drill 1) (layers *.Cu *.Mask)
      (net 23 A0))
    (pad 10 thru_hole oval (at 0 22.86) (size 1.7 1.7) (drill 1) (layers *.Cu *.Mask)
      (net 24 A1))
    (pad 11 thru_hole oval (at 0 25.4) (size 1.7 1.7) (drill 1) (layers *.Cu *.Mask)
      (net 25 A2))
    (pad 12 thru_hole oval (at 0 27.94) (size 1.7 1.7) (drill 1) (layers *.Cu *.Mask)
      (net 26 A3))
    (pad 13 thru_hole oval (at 0 30.48) (size 1.7 1.7) (drill 1) (layers *.Cu *.Mask)
      (net 27 VCC))
    (pad 14 thru_hole oval (at 0 33.02) (size 1.7 1.7) (drill 1) (layers *.Cu *.Mask)
      (net 10 RST))
    (pad 15 thru_hole oval (at 0 35.56) (size 1.7 1.7) (drill 1) (layers *.Cu *.Mask)
      (net 9 GND))
    (pad 16 thru_hole oval (at 0 38.1) (size 1.7 1.7) (drill 1) (layers *.Cu *.Mask)
      (net 28 RAW))
    (model ${KISYS3DMOD}/Connector_PinHeader_2.54mm.3dshapes/PinHeader_1x16_P2.54mm_Vertical.wrl
      (at (xyz 0 0 0))
      (scale (xyz 1 1 1))
      (rotate (xyz 0 0 0))
    )
  )

  (gr_text GND (at 72.1 83.7) (layer F.SilkS)
    (effects (font (size 1 1) (thickness 0.15)))
  )
  (gr_text D9 (at 72.39 114.1095) (layer F.SilkS)
    (effects (font (size 1 1) (thickness 0.15)))
  )
  (gr_text D8 (at 72.39 111.5695) (layer F.SilkS)
    (effects (font (size 1 1) (thickness 0.15)))
  )
  (gr_text D7 (at 72.3265 109.0295) (layer F.SilkS)
    (effects (font (size 1 1) (thickness 0.15)))
  )
  (gr_text D6 (at 72.263 106.3625) (layer F.SilkS)
    (effects (font (size 1 1) (thickness 0.15)))
  )
  (gr_text D5 (at 72.2 103.9495) (layer F.SilkS)
    (effects (font (size 1 1) (thickness 0.15)))
  )
  (gr_text D4 (at 72.263 101.2825) (layer F.SilkS)
    (effects (font (size 1 1) (thickness 0.15)))
  )
  (gr_text D3 (at 72.1995 98.933) (layer F.SilkS)
    (effects (font (size 1 1) (thickness 0.15)))
  )
  (gr_text D2 (at 72.2 96.3) (layer F.SilkS)
    (effects (font (size 1 1) (thickness 0.15)))
  )
  (gr_text GND (at 72.3 93.7) (layer F.SilkS)
    (effects (font (size 1 1) (thickness 0.15)))
  )
  (gr_text RST (at 72.1 91.3) (layer F.SilkS)
    (effects (font (size 1 1) (thickness 0.15)))
  )
  (gr_text RX1 (at 72.2 88.9) (layer F.SilkS)
    (effects (font (size 1 1) (thickness 0.15)))
  )
  (gr_text TX0 (at 72.2 86.36) (layer F.SilkS)
    (effects (font (size 1 1) (thickness 0.15)))
  )
  (gr_text 5V (at 71.9 81.1) (layer F.SilkS)
    (effects (font (size 1 1) (thickness 0.15)))
  )
  (gr_text GND (at 72 78.6) (layer F.SilkS)
    (effects (font (size 1 1) (thickness 0.15)))
  )
  (gr_text 3.3V (at 72.136 76.0095) (layer F.SilkS)
    (effects (font (size 1 1) (thickness 0.15)))
  )
  (gr_text RAW (at 118.1 113.8) (layer F.SilkS)
    (effects (font (size 1 1) (thickness 0.15)))
  )
  (gr_text GND (at 118 111.3) (layer F.SilkS)
    (effects (font (size 1 1) (thickness 0.15)))
  )
  (gr_text RST (at 117.8 108.8) (layer F.SilkS)
    (effects (font (size 1 1) (thickness 0.15)))
  )
  (gr_text VCC (at 118.1 106.4) (layer F.SilkS)
    (effects (font (size 1 1) (thickness 0.15)))
  )
  (gr_text A3 (at 117.8 103.8) (layer F.SilkS)
    (effects (font (size 1 1) (thickness 0.15)))
  )
  (gr_text A2 (at 117.7 101.3) (layer F.SilkS)
    (effects (font (size 1 1) (thickness 0.15)))
  )
  (gr_text A1 (at 117.8 98.8) (layer F.SilkS)
    (effects (font (size 1 1) (thickness 0.15)))
  )
  (gr_text "A0\n" (at 117.8 96.1) (layer F.SilkS)
    (effects (font (size 1 1) (thickness 0.15)))
  )
  (gr_text SCK (at 117.9 93.7) (layer F.SilkS)
    (effects (font (size 1 1) (thickness 0.15)))
  )
  (gr_text "MISO\n" (at 118.1 91.2) (layer F.SilkS)
    (effects (font (size 1 1) (thickness 0.15)))
  )
  (gr_text "MOSI\n" (at 118.1 88.7) (layer F.SilkS)
    (effects (font (size 1 1) (thickness 0.15)))
  )
  (gr_text SS (at 117.8 86) (layer F.SilkS)
    (effects (font (size 1 1) (thickness 0.15)))
  )
  (gr_text "SCL\n" (at 117.9 83.6) (layer F.SilkS)
    (effects (font (size 1 1) (thickness 0.15)))
  )
  (gr_text SDA (at 117.9 81) (layer F.SilkS)
    (effects (font (size 1 1) (thickness 0.15)))
  )
  (gr_text A7 (at 117.8 78.5) (layer F.SilkS)
    (effects (font (size 1 1) (thickness 0.15)))
  )
  (gr_text "A6\n" (at 117.8 76) (layer F.SilkS)
    (effects (font (size 1 1) (thickness 0.15)))
  )
  (gr_text "ASTRE Toulouse - 2020" (at 83.2485 117.9195) (layer B.SilkS)
    (effects (font (size 1 1) (thickness 0.15)) (justify mirror))
  )
  (gr_text "AstreLoon - Rev 1 - Testboard" (at 86.36 118) (layer F.SilkS)
    (effects (font (size 1 1) (thickness 0.15)))
  )
  (dimension 5 (width 0.15) (layer Dwgs.User)
    (gr_text "5.000 mm" (at 72.5 74.7) (layer Dwgs.User)
      (effects (font (size 1 1) (thickness 0.15)))
    )
    (feature1 (pts (xy 70 76) (xy 70 75.413579)))
    (feature2 (pts (xy 75 76) (xy 75 75.413579)))
    (crossbar (pts (xy 75 76) (xy 70 76)))
    (arrow1a (pts (xy 70 76) (xy 71.126504 75.413579)))
    (arrow1b (pts (xy 70 76) (xy 71.126504 76.586421)))
    (arrow2a (pts (xy 75 76) (xy 73.873496 75.413579)))
    (arrow2b (pts (xy 75 76) (xy 73.873496 76.586421)))
  )
  (dimension 6 (width 0.15) (layer Dwgs.User)
    (gr_text "6.000 mm" (at 80.5 73 90) (layer Dwgs.User)
      (effects (font (size 1 1) (thickness 0.15)))
    )
    (feature1 (pts (xy 75 70) (xy 79.786421 70)))
    (feature2 (pts (xy 75 76) (xy 79.786421 76)))
    (crossbar (pts (xy 79.2 76) (xy 79.2 70)))
    (arrow1a (pts (xy 79.2 70) (xy 79.786421 71.126504)))
    (arrow1b (pts (xy 79.2 70) (xy 78.613579 71.126504)))
    (arrow2a (pts (xy 79.2 76) (xy 79.786421 74.873496)))
    (arrow2b (pts (xy 79.2 76) (xy 78.613579 74.873496)))
  )
  (dimension 6 (width 0.15) (layer Dwgs.User)
    (gr_text "6.000 mm" (at 124.3 117 270) (layer Dwgs.User)
      (effects (font (size 1 1) (thickness 0.15)))
    )
    (feature1 (pts (xy 115 120) (xy 123.586421 120)))
    (feature2 (pts (xy 115 114) (xy 123.586421 114)))
    (crossbar (pts (xy 123 114) (xy 123 120)))
    (arrow1a (pts (xy 123 120) (xy 122.413579 118.873496)))
    (arrow1b (pts (xy 123 120) (xy 123.586421 118.873496)))
    (arrow2a (pts (xy 123 114) (xy 122.413579 115.126504)))
    (arrow2b (pts (xy 123 114) (xy 123.586421 115.126504)))
  )
  (dimension 5 (width 0.15) (layer Dwgs.User)
    (gr_text "5.000 mm" (at 117.5 123) (layer Dwgs.User)
      (effects (font (size 1 1) (thickness 0.15)))
    )
    (feature1 (pts (xy 120 114) (xy 120 122.286421)))
    (feature2 (pts (xy 115 114) (xy 115 122.286421)))
    (crossbar (pts (xy 115 121.7) (xy 120 121.7)))
    (arrow1a (pts (xy 120 121.7) (xy 118.873496 122.286421)))
    (arrow1b (pts (xy 120 121.7) (xy 118.873496 121.113579)))
    (arrow2a (pts (xy 115 121.7) (xy 116.126504 122.286421)))
    (arrow2b (pts (xy 115 121.7) (xy 116.126504 121.113579)))
  )
  (dimension 2 (width 0.15) (layer Dwgs.User)
    (gr_text "2.000 mm" (at 109 71 90) (layer Dwgs.User)
      (effects (font (size 1 1) (thickness 0.15)))
    )
    (feature1 (pts (xy 118 70) (xy 109.713579 70)))
    (feature2 (pts (xy 118 72) (xy 109.713579 72)))
    (crossbar (pts (xy 110.3 72) (xy 110.3 70)))
    (arrow1a (pts (xy 110.3 70) (xy 110.886421 71.126504)))
    (arrow1b (pts (xy 110.3 70) (xy 109.713579 71.126504)))
    (arrow2a (pts (xy 110.3 72) (xy 110.886421 70.873496)))
    (arrow2b (pts (xy 110.3 72) (xy 109.713579 70.873496)))
  )
  (dimension 2 (width 0.15) (layer Dwgs.User)
    (gr_text "2.000 mm" (at 119 66.9) (layer Dwgs.User)
      (effects (font (size 1 1) (thickness 0.15)))
    )
    (feature1 (pts (xy 120 72) (xy 120 67.613579)))
    (feature2 (pts (xy 118 72) (xy 118 67.613579)))
    (crossbar (pts (xy 118 68.2) (xy 120 68.2)))
    (arrow1a (pts (xy 120 68.2) (xy 118.873496 68.786421)))
    (arrow1b (pts (xy 120 68.2) (xy 118.873496 67.613579)))
    (arrow2a (pts (xy 118 68.2) (xy 119.126504 68.786421)))
    (arrow2b (pts (xy 118 68.2) (xy 119.126504 67.613579)))
  )
  (gr_circle (center 72 118) (end 72 119.1) (layer Edge.Cuts) (width 0.05))
  (gr_circle (center 118 118) (end 118 119) (layer Edge.Cuts) (width 0.05))
  (gr_circle (center 118 72) (end 118 71) (layer Edge.Cuts) (width 0.05))
  (dimension 2 (width 0.15) (layer Dwgs.User)
    (gr_text "2.000 mm" (at 72 66.500001) (layer Dwgs.User)
      (effects (font (size 1 1) (thickness 0.15)))
    )
    (feature1 (pts (xy 71 72) (xy 71 67.21358)))
    (feature2 (pts (xy 73 72) (xy 73 67.21358)))
    (crossbar (pts (xy 73 67.800001) (xy 71 67.800001)))
    (arrow1a (pts (xy 71 67.800001) (xy 72.126504 67.21358)))
    (arrow1b (pts (xy 71 67.800001) (xy 72.126504 68.386422)))
    (arrow2a (pts (xy 73 67.800001) (xy 71.873496 67.21358)))
    (arrow2b (pts (xy 73 67.800001) (xy 71.873496 68.386422)))
  )
  (dimension 49.9 (width 0.15) (layer Dwgs.User)
    (gr_text "49.900 mm" (at 127.7 95.05 90) (layer Dwgs.User)
      (effects (font (size 1 1) (thickness 0.15)))
    )
    (feature1 (pts (xy 120 70.1) (xy 126.986421 70.1)))
    (feature2 (pts (xy 120 120) (xy 126.986421 120)))
    (crossbar (pts (xy 126.4 120) (xy 126.4 70.1)))
    (arrow1a (pts (xy 126.4 70.1) (xy 126.986421 71.226504)))
    (arrow1b (pts (xy 126.4 70.1) (xy 125.813579 71.226504)))
    (arrow2a (pts (xy 126.4 120) (xy 126.986421 118.873496)))
    (arrow2b (pts (xy 126.4 120) (xy 125.813579 118.873496)))
  )
  (dimension 50 (width 0.15) (layer Dwgs.User)
    (gr_text "50.000 mm" (at 95 61.9) (layer Dwgs.User)
      (effects (font (size 1 1) (thickness 0.15)))
    )
    (feature1 (pts (xy 120 70) (xy 120 62.613579)))
    (feature2 (pts (xy 70 70) (xy 70 62.613579)))
    (crossbar (pts (xy 70 63.2) (xy 120 63.2)))
    (arrow1a (pts (xy 120 63.2) (xy 118.873496 63.786421)))
    (arrow1b (pts (xy 120 63.2) (xy 118.873496 62.613579)))
    (arrow2a (pts (xy 70 63.2) (xy 71.126504 63.786421)))
    (arrow2b (pts (xy 70 63.2) (xy 71.126504 62.613579)))
  )
  (gr_circle (center 72 72) (end 72 71) (layer Edge.Cuts) (width 0.05))
  (gr_line (start 120 70) (end 120 120) (layer Edge.Cuts) (width 0.1))
  (gr_line (start 70 70) (end 120 70) (layer Edge.Cuts) (width 0.1))
  (gr_line (start 70 120) (end 70 70) (layer Edge.Cuts) (width 0.1))
  (gr_line (start 120 120) (end 70 120) (layer Edge.Cuts) (width 0.1))

  (zone (net 0) (net_name "") (layer B.Cu) (tstamp 5E3887A5) (hatch edge 0.508)
    (connect_pads (clearance 0.508))
    (min_thickness 0.254)
    (fill yes (arc_segments 32) (thermal_gap 0.508) (thermal_bridge_width 0.508))
    (polygon
      (pts
        (xy 70 70) (xy 120 70) (xy 120 120) (xy 70 120)
      )
    )
    (filled_polygon
      (pts
        (xy 70.754599 119.271761) (xy 70.808377 119.315) (xy 70.685 119.315) (xy 70.685 119.188816)
      )
    )
    (filled_polygon
      (pts
        (xy 119.315001 119.315) (xy 119.033467 119.315) (xy 119.192079 119.183785) (xy 119.315001 119.033068)
      )
    )
    (filled_polygon
      (pts
        (xy 116.791509 70.832974) (xy 116.587848 71.08993) (xy 116.437976 71.381551) (xy 116.3476 71.696728) (xy 116.320164 72.023456)
        (xy 116.356712 72.349292) (xy 116.455853 72.661822) (xy 116.613809 72.949145) (xy 116.824566 73.200314) (xy 117.080094 73.405764)
        (xy 117.370661 73.557669) (xy 117.685199 73.650243) (xy 118.011729 73.679959) (xy 118.337811 73.645686) (xy 118.651026 73.54873)
        (xy 118.939444 73.392783) (xy 119.192079 73.183785) (xy 119.315 73.033069) (xy 119.315001 116.964629) (xy 119.158561 116.783391)
        (xy 118.900189 116.581529) (xy 118.607529 116.433696) (xy 118.291729 116.345523) (xy 117.964817 116.320368) (xy 117.639245 116.359191)
        (xy 117.327414 116.460511) (xy 117.041201 116.620469) (xy 116.791509 116.832974) (xy 116.587848 117.08993) (xy 116.437976 117.381551)
        (xy 116.3476 117.696728) (xy 116.320164 118.023456) (xy 116.356712 118.349292) (xy 116.455853 118.661822) (xy 116.613809 118.949145)
        (xy 116.824566 119.200314) (xy 116.967206 119.315) (xy 73.189601 119.315) (xy 73.263036 119.254249) (xy 73.4826 118.985037)
        (xy 73.645692 118.678305) (xy 73.7461 118.345737) (xy 73.78 118) (xy 73.779306 117.950299) (xy 73.735766 117.605644)
        (xy 73.626111 117.276009) (xy 73.454518 116.97395) (xy 73.227523 116.710974) (xy 72.953772 116.497096) (xy 72.643692 116.340464)
        (xy 72.309094 116.247042) (xy 71.962722 116.22039) (xy 71.617771 116.261523) (xy 71.287379 116.368874) (xy 70.98413 116.538354)
        (xy 70.719575 116.763508) (xy 70.685 116.807131) (xy 70.685 78.54) (xy 73.507815 78.54) (xy 73.536487 78.831111)
        (xy 73.621401 79.111034) (xy 73.759294 79.369014) (xy 73.944866 79.595134) (xy 74.170986 79.780706) (xy 74.225791 79.81)
        (xy 74.170986 79.839294) (xy 73.944866 80.024866) (xy 73.759294 80.250986) (xy 73.621401 80.508966) (xy 73.536487 80.788889)
        (xy 73.507815 81.08) (xy 73.536487 81.371111) (xy 73.621401 81.651034) (xy 73.759294 81.909014) (xy 73.944866 82.135134)
        (xy 74.170986 82.320706) (xy 74.225791 82.35) (xy 74.170986 82.379294) (xy 73.944866 82.564866) (xy 73.759294 82.790986)
        (xy 73.621401 83.048966) (xy 73.536487 83.328889) (xy 73.507815 83.62) (xy 73.536487 83.911111) (xy 73.621401 84.191034)
        (xy 73.759294 84.449014) (xy 73.944866 84.675134) (xy 74.170986 84.860706) (xy 74.225791 84.89) (xy 74.170986 84.919294)
        (xy 73.944866 85.104866) (xy 73.759294 85.330986) (xy 73.621401 85.588966) (xy 73.536487 85.868889) (xy 73.507815 86.16)
        (xy 73.536487 86.451111) (xy 73.621401 86.731034) (xy 73.759294 86.989014) (xy 73.944866 87.215134) (xy 74.170986 87.400706)
        (xy 74.225791 87.43) (xy 74.170986 87.459294) (xy 73.944866 87.644866) (xy 73.759294 87.870986) (xy 73.621401 88.128966)
        (xy 73.536487 88.408889) (xy 73.507815 88.7) (xy 73.536487 88.991111) (xy 73.621401 89.271034) (xy 73.759294 89.529014)
        (xy 73.944866 89.755134) (xy 74.170986 89.940706) (xy 74.225791 89.97) (xy 74.170986 89.999294) (xy 73.944866 90.184866)
        (xy 73.759294 90.410986) (xy 73.621401 90.668966) (xy 73.536487 90.948889) (xy 73.507815 91.24) (xy 73.536487 91.531111)
        (xy 73.621401 91.811034) (xy 73.759294 92.069014) (xy 73.944866 92.295134) (xy 74.170986 92.480706) (xy 74.225791 92.51)
        (xy 74.170986 92.539294) (xy 73.944866 92.724866) (xy 73.759294 92.950986) (xy 73.621401 93.208966) (xy 73.536487 93.488889)
        (xy 73.507815 93.78) (xy 73.536487 94.071111) (xy 73.621401 94.351034) (xy 73.759294 94.609014) (xy 73.944866 94.835134)
        (xy 74.170986 95.020706) (xy 74.225791 95.05) (xy 74.170986 95.079294) (xy 73.944866 95.264866) (xy 73.759294 95.490986)
        (xy 73.621401 95.748966) (xy 73.536487 96.028889) (xy 73.507815 96.32) (xy 73.536487 96.611111) (xy 73.621401 96.891034)
        (xy 73.759294 97.149014) (xy 73.944866 97.375134) (xy 74.170986 97.560706) (xy 74.225791 97.59) (xy 74.170986 97.619294)
        (xy 73.944866 97.804866) (xy 73.759294 98.030986) (xy 73.621401 98.288966) (xy 73.536487 98.568889) (xy 73.507815 98.86)
        (xy 73.536487 99.151111) (xy 73.621401 99.431034) (xy 73.759294 99.689014) (xy 73.944866 99.915134) (xy 74.170986 100.100706)
        (xy 74.225791 100.13) (xy 74.170986 100.159294) (xy 73.944866 100.344866) (xy 73.759294 100.570986) (xy 73.621401 100.828966)
        (xy 73.536487 101.108889) (xy 73.507815 101.4) (xy 73.536487 101.691111) (xy 73.621401 101.971034) (xy 73.759294 102.229014)
        (xy 73.944866 102.455134) (xy 74.170986 102.640706) (xy 74.225791 102.67) (xy 74.170986 102.699294) (xy 73.944866 102.884866)
        (xy 73.759294 103.110986) (xy 73.621401 103.368966) (xy 73.536487 103.648889) (xy 73.507815 103.94) (xy 73.536487 104.231111)
        (xy 73.621401 104.511034) (xy 73.759294 104.769014) (xy 73.944866 104.995134) (xy 74.170986 105.180706) (xy 74.225791 105.21)
        (xy 74.170986 105.239294) (xy 73.944866 105.424866) (xy 73.759294 105.650986) (xy 73.621401 105.908966) (xy 73.536487 106.188889)
        (xy 73.507815 106.48) (xy 73.536487 106.771111) (xy 73.621401 107.051034) (xy 73.759294 107.309014) (xy 73.944866 107.535134)
        (xy 74.170986 107.720706) (xy 74.225791 107.75) (xy 74.170986 107.779294) (xy 73.944866 107.964866) (xy 73.759294 108.190986)
        (xy 73.621401 108.448966) (xy 73.536487 108.728889) (xy 73.507815 109.02) (xy 73.536487 109.311111) (xy 73.621401 109.591034)
        (xy 73.759294 109.849014) (xy 73.944866 110.075134) (xy 74.170986 110.260706) (xy 74.225791 110.29) (xy 74.170986 110.319294)
        (xy 73.944866 110.504866) (xy 73.759294 110.730986) (xy 73.621401 110.988966) (xy 73.536487 111.268889) (xy 73.507815 111.56)
        (xy 73.536487 111.851111) (xy 73.621401 112.131034) (xy 73.759294 112.389014) (xy 73.944866 112.615134) (xy 74.170986 112.800706)
        (xy 74.225791 112.83) (xy 74.170986 112.859294) (xy 73.944866 113.044866) (xy 73.759294 113.270986) (xy 73.621401 113.528966)
        (xy 73.536487 113.808889) (xy 73.507815 114.1) (xy 73.536487 114.391111) (xy 73.621401 114.671034) (xy 73.759294 114.929014)
        (xy 73.944866 115.155134) (xy 74.170986 115.340706) (xy 74.428966 115.478599) (xy 74.708889 115.563513) (xy 74.92705 115.585)
        (xy 75.07295 115.585) (xy 75.291111 115.563513) (xy 75.571034 115.478599) (xy 75.829014 115.340706) (xy 76.055134 115.155134)
        (xy 76.240706 114.929014) (xy 76.378599 114.671034) (xy 76.463513 114.391111) (xy 76.492185 114.1) (xy 76.463513 113.808889)
        (xy 76.378599 113.528966) (xy 76.240706 113.270986) (xy 76.055134 113.044866) (xy 75.829014 112.859294) (xy 75.774209 112.83)
        (xy 75.829014 112.800706) (xy 76.055134 112.615134) (xy 76.240706 112.389014) (xy 76.378599 112.131034) (xy 76.463513 111.851111)
        (xy 76.492185 111.56) (xy 76.463513 111.268889) (xy 76.378599 110.988966) (xy 76.240706 110.730986) (xy 76.055134 110.504866)
        (xy 75.829014 110.319294) (xy 75.774209 110.29) (xy 75.829014 110.260706) (xy 76.055134 110.075134) (xy 76.240706 109.849014)
        (xy 76.378599 109.591034) (xy 76.463513 109.311111) (xy 76.492185 109.02) (xy 76.463513 108.728889) (xy 76.378599 108.448966)
        (xy 76.240706 108.190986) (xy 76.055134 107.964866) (xy 75.829014 107.779294) (xy 75.774209 107.75) (xy 75.829014 107.720706)
        (xy 76.055134 107.535134) (xy 76.240706 107.309014) (xy 76.378599 107.051034) (xy 76.463513 106.771111) (xy 76.492185 106.48)
        (xy 76.463513 106.188889) (xy 76.378599 105.908966) (xy 76.240706 105.650986) (xy 76.055134 105.424866) (xy 75.829014 105.239294)
        (xy 75.774209 105.21) (xy 75.829014 105.180706) (xy 76.055134 104.995134) (xy 76.240706 104.769014) (xy 76.378599 104.511034)
        (xy 76.463513 104.231111) (xy 76.492185 103.94) (xy 76.463513 103.648889) (xy 76.378599 103.368966) (xy 76.240706 103.110986)
        (xy 76.055134 102.884866) (xy 75.829014 102.699294) (xy 75.774209 102.67) (xy 75.829014 102.640706) (xy 76.055134 102.455134)
        (xy 76.240706 102.229014) (xy 76.378599 101.971034) (xy 76.463513 101.691111) (xy 76.492185 101.4) (xy 76.463513 101.108889)
        (xy 76.378599 100.828966) (xy 76.240706 100.570986) (xy 76.055134 100.344866) (xy 75.829014 100.159294) (xy 75.774209 100.13)
        (xy 75.829014 100.100706) (xy 76.055134 99.915134) (xy 76.240706 99.689014) (xy 76.378599 99.431034) (xy 76.463513 99.151111)
        (xy 76.492185 98.86) (xy 76.463513 98.568889) (xy 76.378599 98.288966) (xy 76.240706 98.030986) (xy 76.055134 97.804866)
        (xy 75.829014 97.619294) (xy 75.774209 97.59) (xy 75.829014 97.560706) (xy 76.055134 97.375134) (xy 76.240706 97.149014)
        (xy 76.378599 96.891034) (xy 76.463513 96.611111) (xy 76.492185 96.32) (xy 76.463513 96.028889) (xy 76.378599 95.748966)
        (xy 76.240706 95.490986) (xy 76.055134 95.264866) (xy 75.829014 95.079294) (xy 75.774209 95.05) (xy 75.829014 95.020706)
        (xy 76.055134 94.835134) (xy 76.240706 94.609014) (xy 76.378599 94.351034) (xy 76.463513 94.071111) (xy 76.492185 93.78)
        (xy 76.463513 93.488889) (xy 76.378599 93.208966) (xy 76.240706 92.950986) (xy 76.055134 92.724866) (xy 75.829014 92.539294)
        (xy 75.774209 92.51) (xy 75.829014 92.480706) (xy 76.055134 92.295134) (xy 76.240706 92.069014) (xy 76.378599 91.811034)
        (xy 76.463513 91.531111) (xy 76.492185 91.24) (xy 76.463513 90.948889) (xy 76.378599 90.668966) (xy 76.240706 90.410986)
        (xy 76.055134 90.184866) (xy 75.829014 89.999294) (xy 75.774209 89.97) (xy 75.829014 89.940706) (xy 76.055134 89.755134)
        (xy 76.240706 89.529014) (xy 76.378599 89.271034) (xy 76.463513 88.991111) (xy 76.492185 88.7) (xy 76.463513 88.408889)
        (xy 76.378599 88.128966) (xy 76.240706 87.870986) (xy 76.055134 87.644866) (xy 75.829014 87.459294) (xy 75.774209 87.43)
        (xy 75.829014 87.400706) (xy 76.055134 87.215134) (xy 76.240706 86.989014) (xy 76.378599 86.731034) (xy 76.463513 86.451111)
        (xy 76.492185 86.16) (xy 76.463513 85.868889) (xy 76.378599 85.588966) (xy 76.240706 85.330986) (xy 76.055134 85.104866)
        (xy 75.829014 84.919294) (xy 75.774209 84.89) (xy 75.829014 84.860706) (xy 76.055134 84.675134) (xy 76.240706 84.449014)
        (xy 76.378599 84.191034) (xy 76.463513 83.911111) (xy 76.492185 83.62) (xy 76.463513 83.328889) (xy 76.378599 83.048966)
        (xy 76.240706 82.790986) (xy 76.055134 82.564866) (xy 75.829014 82.379294) (xy 75.774209 82.35) (xy 75.829014 82.320706)
        (xy 76.055134 82.135134) (xy 76.240706 81.909014) (xy 76.378599 81.651034) (xy 76.463513 81.371111) (xy 76.492185 81.08)
        (xy 76.463513 80.788889) (xy 76.378599 80.508966) (xy 76.240706 80.250986) (xy 76.055134 80.024866) (xy 75.829014 79.839294)
        (xy 75.774209 79.81) (xy 75.829014 79.780706) (xy 76.055134 79.595134) (xy 76.240706 79.369014) (xy 76.378599 79.111034)
        (xy 76.463513 78.831111) (xy 76.492185 78.54) (xy 76.476427 78.38) (xy 113.507815 78.38) (xy 113.536487 78.671111)
        (xy 113.621401 78.951034) (xy 113.759294 79.209014) (xy 113.944866 79.435134) (xy 114.170986 79.620706) (xy 114.225791 79.65)
        (xy 114.170986 79.679294) (xy 113.944866 79.864866) (xy 113.759294 80.090986) (xy 113.621401 80.348966) (xy 113.536487 80.628889)
        (xy 113.507815 80.92) (xy 113.536487 81.211111) (xy 113.621401 81.491034) (xy 113.759294 81.749014) (xy 113.944866 81.975134)
        (xy 114.170986 82.160706) (xy 114.225791 82.19) (xy 114.170986 82.219294) (xy 113.944866 82.404866) (xy 113.759294 82.630986)
        (xy 113.621401 82.888966) (xy 113.536487 83.168889) (xy 113.507815 83.46) (xy 113.536487 83.751111) (xy 113.621401 84.031034)
        (xy 113.759294 84.289014) (xy 113.944866 84.515134) (xy 114.170986 84.700706) (xy 114.225791 84.73) (xy 114.170986 84.759294)
        (xy 113.944866 84.944866) (xy 113.759294 85.170986) (xy 113.621401 85.428966) (xy 113.536487 85.708889) (xy 113.507815 86)
        (xy 113.536487 86.291111) (xy 113.621401 86.571034) (xy 113.759294 86.829014) (xy 113.944866 87.055134) (xy 114.170986 87.240706)
        (xy 114.225791 87.27) (xy 114.170986 87.299294) (xy 113.944866 87.484866) (xy 113.759294 87.710986) (xy 113.621401 87.968966)
        (xy 113.536487 88.248889) (xy 113.507815 88.54) (xy 113.536487 88.831111) (xy 113.621401 89.111034) (xy 113.759294 89.369014)
        (xy 113.944866 89.595134) (xy 114.170986 89.780706) (xy 114.225791 89.81) (xy 114.170986 89.839294) (xy 113.944866 90.024866)
        (xy 113.759294 90.250986) (xy 113.621401 90.508966) (xy 113.536487 90.788889) (xy 113.507815 91.08) (xy 113.536487 91.371111)
        (xy 113.621401 91.651034) (xy 113.759294 91.909014) (xy 113.944866 92.135134) (xy 114.170986 92.320706) (xy 114.225791 92.35)
        (xy 114.170986 92.379294) (xy 113.944866 92.564866) (xy 113.759294 92.790986) (xy 113.621401 93.048966) (xy 113.536487 93.328889)
        (xy 113.507815 93.62) (xy 113.536487 93.911111) (xy 113.621401 94.191034) (xy 113.759294 94.449014) (xy 113.944866 94.675134)
        (xy 114.170986 94.860706) (xy 114.225791 94.89) (xy 114.170986 94.919294) (xy 113.944866 95.104866) (xy 113.759294 95.330986)
        (xy 113.621401 95.588966) (xy 113.536487 95.868889) (xy 113.507815 96.16) (xy 113.536487 96.451111) (xy 113.621401 96.731034)
        (xy 113.759294 96.989014) (xy 113.944866 97.215134) (xy 114.170986 97.400706) (xy 114.225791 97.43) (xy 114.170986 97.459294)
        (xy 113.944866 97.644866) (xy 113.759294 97.870986) (xy 113.621401 98.128966) (xy 113.536487 98.408889) (xy 113.507815 98.7)
        (xy 113.536487 98.991111) (xy 113.621401 99.271034) (xy 113.759294 99.529014) (xy 113.944866 99.755134) (xy 114.170986 99.940706)
        (xy 114.225791 99.97) (xy 114.170986 99.999294) (xy 113.944866 100.184866) (xy 113.759294 100.410986) (xy 113.621401 100.668966)
        (xy 113.536487 100.948889) (xy 113.507815 101.24) (xy 113.536487 101.531111) (xy 113.621401 101.811034) (xy 113.759294 102.069014)
        (xy 113.944866 102.295134) (xy 114.170986 102.480706) (xy 114.225791 102.51) (xy 114.170986 102.539294) (xy 113.944866 102.724866)
        (xy 113.759294 102.950986) (xy 113.621401 103.208966) (xy 113.536487 103.488889) (xy 113.507815 103.78) (xy 113.536487 104.071111)
        (xy 113.621401 104.351034) (xy 113.759294 104.609014) (xy 113.944866 104.835134) (xy 114.170986 105.020706) (xy 114.225791 105.05)
        (xy 114.170986 105.079294) (xy 113.944866 105.264866) (xy 113.759294 105.490986) (xy 113.621401 105.748966) (xy 113.536487 106.028889)
        (xy 113.507815 106.32) (xy 113.536487 106.611111) (xy 113.621401 106.891034) (xy 113.759294 107.149014) (xy 113.944866 107.375134)
        (xy 114.170986 107.560706) (xy 114.225791 107.59) (xy 114.170986 107.619294) (xy 113.944866 107.804866) (xy 113.759294 108.030986)
        (xy 113.621401 108.288966) (xy 113.536487 108.568889) (xy 113.507815 108.86) (xy 113.536487 109.151111) (xy 113.621401 109.431034)
        (xy 113.759294 109.689014) (xy 113.944866 109.915134) (xy 114.170986 110.100706) (xy 114.225791 110.13) (xy 114.170986 110.159294)
        (xy 113.944866 110.344866) (xy 113.759294 110.570986) (xy 113.621401 110.828966) (xy 113.536487 111.108889) (xy 113.507815 111.4)
        (xy 113.536487 111.691111) (xy 113.621401 111.971034) (xy 113.759294 112.229014) (xy 113.944866 112.455134) (xy 114.170986 112.640706)
        (xy 114.225791 112.67) (xy 114.170986 112.699294) (xy 113.944866 112.884866) (xy 113.759294 113.110986) (xy 113.621401 113.368966)
        (xy 113.536487 113.648889) (xy 113.507815 113.94) (xy 113.536487 114.231111) (xy 113.621401 114.511034) (xy 113.759294 114.769014)
        (xy 113.944866 114.995134) (xy 114.170986 115.180706) (xy 114.428966 115.318599) (xy 114.708889 115.403513) (xy 114.92705 115.425)
        (xy 115.07295 115.425) (xy 115.291111 115.403513) (xy 115.571034 115.318599) (xy 115.829014 115.180706) (xy 116.055134 114.995134)
        (xy 116.240706 114.769014) (xy 116.378599 114.511034) (xy 116.463513 114.231111) (xy 116.492185 113.94) (xy 116.463513 113.648889)
        (xy 116.378599 113.368966) (xy 116.240706 113.110986) (xy 116.055134 112.884866) (xy 115.829014 112.699294) (xy 115.774209 112.67)
        (xy 115.829014 112.640706) (xy 116.055134 112.455134) (xy 116.240706 112.229014) (xy 116.378599 111.971034) (xy 116.463513 111.691111)
        (xy 116.492185 111.4) (xy 116.463513 111.108889) (xy 116.378599 110.828966) (xy 116.240706 110.570986) (xy 116.055134 110.344866)
        (xy 115.829014 110.159294) (xy 115.774209 110.13) (xy 115.829014 110.100706) (xy 116.055134 109.915134) (xy 116.240706 109.689014)
        (xy 116.378599 109.431034) (xy 116.463513 109.151111) (xy 116.492185 108.86) (xy 116.463513 108.568889) (xy 116.378599 108.288966)
        (xy 116.240706 108.030986) (xy 116.055134 107.804866) (xy 115.829014 107.619294) (xy 115.774209 107.59) (xy 115.829014 107.560706)
        (xy 116.055134 107.375134) (xy 116.240706 107.149014) (xy 116.378599 106.891034) (xy 116.463513 106.611111) (xy 116.492185 106.32)
        (xy 116.463513 106.028889) (xy 116.378599 105.748966) (xy 116.240706 105.490986) (xy 116.055134 105.264866) (xy 115.829014 105.079294)
        (xy 115.774209 105.05) (xy 115.829014 105.020706) (xy 116.055134 104.835134) (xy 116.240706 104.609014) (xy 116.378599 104.351034)
        (xy 116.463513 104.071111) (xy 116.492185 103.78) (xy 116.463513 103.488889) (xy 116.378599 103.208966) (xy 116.240706 102.950986)
        (xy 116.055134 102.724866) (xy 115.829014 102.539294) (xy 115.774209 102.51) (xy 115.829014 102.480706) (xy 116.055134 102.295134)
        (xy 116.240706 102.069014) (xy 116.378599 101.811034) (xy 116.463513 101.531111) (xy 116.492185 101.24) (xy 116.463513 100.948889)
        (xy 116.378599 100.668966) (xy 116.240706 100.410986) (xy 116.055134 100.184866) (xy 115.829014 99.999294) (xy 115.774209 99.97)
        (xy 115.829014 99.940706) (xy 116.055134 99.755134) (xy 116.240706 99.529014) (xy 116.378599 99.271034) (xy 116.463513 98.991111)
        (xy 116.492185 98.7) (xy 116.463513 98.408889) (xy 116.378599 98.128966) (xy 116.240706 97.870986) (xy 116.055134 97.644866)
        (xy 115.829014 97.459294) (xy 115.774209 97.43) (xy 115.829014 97.400706) (xy 116.055134 97.215134) (xy 116.240706 96.989014)
        (xy 116.378599 96.731034) (xy 116.463513 96.451111) (xy 116.492185 96.16) (xy 116.463513 95.868889) (xy 116.378599 95.588966)
        (xy 116.240706 95.330986) (xy 116.055134 95.104866) (xy 115.829014 94.919294) (xy 115.774209 94.89) (xy 115.829014 94.860706)
        (xy 116.055134 94.675134) (xy 116.240706 94.449014) (xy 116.378599 94.191034) (xy 116.463513 93.911111) (xy 116.492185 93.62)
        (xy 116.463513 93.328889) (xy 116.378599 93.048966) (xy 116.240706 92.790986) (xy 116.055134 92.564866) (xy 115.829014 92.379294)
        (xy 115.774209 92.35) (xy 115.829014 92.320706) (xy 116.055134 92.135134) (xy 116.240706 91.909014) (xy 116.378599 91.651034)
        (xy 116.463513 91.371111) (xy 116.492185 91.08) (xy 116.463513 90.788889) (xy 116.378599 90.508966) (xy 116.240706 90.250986)
        (xy 116.055134 90.024866) (xy 115.829014 89.839294) (xy 115.774209 89.81) (xy 115.829014 89.780706) (xy 116.055134 89.595134)
        (xy 116.240706 89.369014) (xy 116.378599 89.111034) (xy 116.463513 88.831111) (xy 116.492185 88.54) (xy 116.463513 88.248889)
        (xy 116.378599 87.968966) (xy 116.240706 87.710986) (xy 116.055134 87.484866) (xy 115.829014 87.299294) (xy 115.774209 87.27)
        (xy 115.829014 87.240706) (xy 116.055134 87.055134) (xy 116.240706 86.829014) (xy 116.378599 86.571034) (xy 116.463513 86.291111)
        (xy 116.492185 86) (xy 116.463513 85.708889) (xy 116.378599 85.428966) (xy 116.240706 85.170986) (xy 116.055134 84.944866)
        (xy 115.829014 84.759294) (xy 115.774209 84.73) (xy 115.829014 84.700706) (xy 116.055134 84.515134) (xy 116.240706 84.289014)
        (xy 116.378599 84.031034) (xy 116.463513 83.751111) (xy 116.492185 83.46) (xy 116.463513 83.168889) (xy 116.378599 82.888966)
        (xy 116.240706 82.630986) (xy 116.055134 82.404866) (xy 115.829014 82.219294) (xy 115.774209 82.19) (xy 115.829014 82.160706)
        (xy 116.055134 81.975134) (xy 116.240706 81.749014) (xy 116.378599 81.491034) (xy 116.463513 81.211111) (xy 116.492185 80.92)
        (xy 116.463513 80.628889) (xy 116.378599 80.348966) (xy 116.240706 80.090986) (xy 116.055134 79.864866) (xy 115.829014 79.679294)
        (xy 115.774209 79.65) (xy 115.829014 79.620706) (xy 116.055134 79.435134) (xy 116.240706 79.209014) (xy 116.378599 78.951034)
        (xy 116.463513 78.671111) (xy 116.492185 78.38) (xy 116.463513 78.088889) (xy 116.378599 77.808966) (xy 116.240706 77.550986)
        (xy 116.055134 77.324866) (xy 116.025313 77.300393) (xy 116.09418 77.279502) (xy 116.204494 77.220537) (xy 116.301185 77.141185)
        (xy 116.380537 77.044494) (xy 116.439502 76.93418) (xy 116.475812 76.814482) (xy 116.488072 76.69) (xy 116.488072 74.99)
        (xy 116.475812 74.865518) (xy 116.439502 74.74582) (xy 116.380537 74.635506) (xy 116.301185 74.538815) (xy 116.204494 74.459463)
        (xy 116.09418 74.400498) (xy 115.974482 74.364188) (xy 115.85 74.351928) (xy 114.15 74.351928) (xy 114.025518 74.364188)
        (xy 113.90582 74.400498) (xy 113.795506 74.459463) (xy 113.698815 74.538815) (xy 113.619463 74.635506) (xy 113.560498 74.74582)
        (xy 113.524188 74.865518) (xy 113.511928 74.99) (xy 113.511928 76.69) (xy 113.524188 76.814482) (xy 113.560498 76.93418)
        (xy 113.619463 77.044494) (xy 113.698815 77.141185) (xy 113.795506 77.220537) (xy 113.90582 77.279502) (xy 113.974687 77.300393)
        (xy 113.944866 77.324866) (xy 113.759294 77.550986) (xy 113.621401 77.808966) (xy 113.536487 78.088889) (xy 113.507815 78.38)
        (xy 76.476427 78.38) (xy 76.463513 78.248889) (xy 76.378599 77.968966) (xy 76.240706 77.710986) (xy 76.055134 77.484866)
        (xy 76.025313 77.460393) (xy 76.09418 77.439502) (xy 76.204494 77.380537) (xy 76.301185 77.301185) (xy 76.380537 77.204494)
        (xy 76.439502 77.09418) (xy 76.475812 76.974482) (xy 76.488072 76.85) (xy 76.488072 75.15) (xy 76.475812 75.025518)
        (xy 76.439502 74.90582) (xy 76.380537 74.795506) (xy 76.301185 74.698815) (xy 76.204494 74.619463) (xy 76.09418 74.560498)
        (xy 75.974482 74.524188) (xy 75.85 74.511928) (xy 74.15 74.511928) (xy 74.025518 74.524188) (xy 73.90582 74.560498)
        (xy 73.795506 74.619463) (xy 73.698815 74.698815) (xy 73.619463 74.795506) (xy 73.560498 74.90582) (xy 73.524188 75.025518)
        (xy 73.511928 75.15) (xy 73.511928 76.85) (xy 73.524188 76.974482) (xy 73.560498 77.09418) (xy 73.619463 77.204494)
        (xy 73.698815 77.301185) (xy 73.795506 77.380537) (xy 73.90582 77.439502) (xy 73.974687 77.460393) (xy 73.944866 77.484866)
        (xy 73.759294 77.710986) (xy 73.621401 77.968966) (xy 73.536487 78.248889) (xy 73.507815 78.54) (xy 70.685 78.54)
        (xy 70.685 73.033987) (xy 70.824566 73.200314) (xy 71.080094 73.405764) (xy 71.370661 73.557669) (xy 71.685199 73.650243)
        (xy 72.011729 73.679959) (xy 72.337811 73.645686) (xy 72.651026 73.54873) (xy 72.939444 73.392783) (xy 73.192079 73.183785)
        (xy 73.399308 72.929698) (xy 73.553237 72.640198) (xy 73.648005 72.326314) (xy 73.68 72) (xy 73.679345 71.953092)
        (xy 73.638251 71.627799) (xy 73.534756 71.316682) (xy 73.372803 71.031594) (xy 73.158561 70.783391) (xy 73.032626 70.685)
        (xy 116.965377 70.685)
      )
    )
    (filled_polygon
      (pts
        (xy 70.791509 70.832974) (xy 70.685 70.967355) (xy 70.685 70.685) (xy 70.965377 70.685)
      )
    )
    (filled_polygon
      (pts
        (xy 119.315 70.964628) (xy 119.158561 70.783391) (xy 119.032626 70.685) (xy 119.315 70.685)
      )
    )
  )
  (zone (net 0) (net_name "") (layer F.Cu) (tstamp 5E3887A2) (hatch edge 0.508)
    (connect_pads (clearance 0.508))
    (min_thickness 0.254)
    (fill yes (arc_segments 32) (thermal_gap 0.508) (thermal_bridge_width 0.508))
    (polygon
      (pts
        (xy 119.888 70.231) (xy 120.015 120.015) (xy 70.104 120.015) (xy 69.977 70.104)
      )
    )
    (filled_polygon
      (pts
        (xy 70.754599 119.271761) (xy 70.808377 119.315) (xy 70.685 119.315) (xy 70.685 119.188816)
      )
    )
    (filled_polygon
      (pts
        (xy 119.315001 119.315) (xy 119.033467 119.315) (xy 119.192079 119.183785) (xy 119.315001 119.033068)
      )
    )
    (filled_polygon
      (pts
        (xy 116.791509 70.832974) (xy 116.587848 71.08993) (xy 116.437976 71.381551) (xy 116.3476 71.696728) (xy 116.320164 72.023456)
        (xy 116.356712 72.349292) (xy 116.455853 72.661822) (xy 116.613809 72.949145) (xy 116.824566 73.200314) (xy 117.080094 73.405764)
        (xy 117.370661 73.557669) (xy 117.685199 73.650243) (xy 118.011729 73.679959) (xy 118.337811 73.645686) (xy 118.651026 73.54873)
        (xy 118.939444 73.392783) (xy 119.192079 73.183785) (xy 119.315 73.033069) (xy 119.315001 116.964629) (xy 119.158561 116.783391)
        (xy 118.900189 116.581529) (xy 118.607529 116.433696) (xy 118.291729 116.345523) (xy 117.964817 116.320368) (xy 117.639245 116.359191)
        (xy 117.327414 116.460511) (xy 117.041201 116.620469) (xy 116.791509 116.832974) (xy 116.587848 117.08993) (xy 116.437976 117.381551)
        (xy 116.3476 117.696728) (xy 116.320164 118.023456) (xy 116.356712 118.349292) (xy 116.455853 118.661822) (xy 116.613809 118.949145)
        (xy 116.824566 119.200314) (xy 116.967206 119.315) (xy 73.189601 119.315) (xy 73.263036 119.254249) (xy 73.4826 118.985037)
        (xy 73.645692 118.678305) (xy 73.7461 118.345737) (xy 73.78 118) (xy 73.779306 117.950299) (xy 73.735766 117.605644)
        (xy 73.626111 117.276009) (xy 73.454518 116.97395) (xy 73.227523 116.710974) (xy 72.953772 116.497096) (xy 72.643692 116.340464)
        (xy 72.309094 116.247042) (xy 71.962722 116.22039) (xy 71.617771 116.261523) (xy 71.287379 116.368874) (xy 70.98413 116.538354)
        (xy 70.719575 116.763508) (xy 70.685 116.807131) (xy 70.685 78.54) (xy 73.507815 78.54) (xy 73.536487 78.831111)
        (xy 73.621401 79.111034) (xy 73.759294 79.369014) (xy 73.944866 79.595134) (xy 74.170986 79.780706) (xy 74.225791 79.81)
        (xy 74.170986 79.839294) (xy 73.944866 80.024866) (xy 73.759294 80.250986) (xy 73.621401 80.508966) (xy 73.536487 80.788889)
        (xy 73.507815 81.08) (xy 73.536487 81.371111) (xy 73.621401 81.651034) (xy 73.759294 81.909014) (xy 73.944866 82.135134)
        (xy 74.170986 82.320706) (xy 74.225791 82.35) (xy 74.170986 82.379294) (xy 73.944866 82.564866) (xy 73.759294 82.790986)
        (xy 73.621401 83.048966) (xy 73.536487 83.328889) (xy 73.507815 83.62) (xy 73.536487 83.911111) (xy 73.621401 84.191034)
        (xy 73.759294 84.449014) (xy 73.944866 84.675134) (xy 74.170986 84.860706) (xy 74.225791 84.89) (xy 74.170986 84.919294)
        (xy 73.944866 85.104866) (xy 73.759294 85.330986) (xy 73.621401 85.588966) (xy 73.536487 85.868889) (xy 73.507815 86.16)
        (xy 73.536487 86.451111) (xy 73.621401 86.731034) (xy 73.759294 86.989014) (xy 73.944866 87.215134) (xy 74.170986 87.400706)
        (xy 74.225791 87.43) (xy 74.170986 87.459294) (xy 73.944866 87.644866) (xy 73.759294 87.870986) (xy 73.621401 88.128966)
        (xy 73.536487 88.408889) (xy 73.507815 88.7) (xy 73.536487 88.991111) (xy 73.621401 89.271034) (xy 73.759294 89.529014)
        (xy 73.944866 89.755134) (xy 74.170986 89.940706) (xy 74.225791 89.97) (xy 74.170986 89.999294) (xy 73.944866 90.184866)
        (xy 73.759294 90.410986) (xy 73.621401 90.668966) (xy 73.536487 90.948889) (xy 73.507815 91.24) (xy 73.536487 91.531111)
        (xy 73.621401 91.811034) (xy 73.759294 92.069014) (xy 73.944866 92.295134) (xy 74.170986 92.480706) (xy 74.225791 92.51)
        (xy 74.170986 92.539294) (xy 73.944866 92.724866) (xy 73.759294 92.950986) (xy 73.621401 93.208966) (xy 73.536487 93.488889)
        (xy 73.507815 93.78) (xy 73.536487 94.071111) (xy 73.621401 94.351034) (xy 73.759294 94.609014) (xy 73.944866 94.835134)
        (xy 74.170986 95.020706) (xy 74.225791 95.05) (xy 74.170986 95.079294) (xy 73.944866 95.264866) (xy 73.759294 95.490986)
        (xy 73.621401 95.748966) (xy 73.536487 96.028889) (xy 73.507815 96.32) (xy 73.536487 96.611111) (xy 73.621401 96.891034)
        (xy 73.759294 97.149014) (xy 73.944866 97.375134) (xy 74.170986 97.560706) (xy 74.225791 97.59) (xy 74.170986 97.619294)
        (xy 73.944866 97.804866) (xy 73.759294 98.030986) (xy 73.621401 98.288966) (xy 73.536487 98.568889) (xy 73.507815 98.86)
        (xy 73.536487 99.151111) (xy 73.621401 99.431034) (xy 73.759294 99.689014) (xy 73.944866 99.915134) (xy 74.170986 100.100706)
        (xy 74.225791 100.13) (xy 74.170986 100.159294) (xy 73.944866 100.344866) (xy 73.759294 100.570986) (xy 73.621401 100.828966)
        (xy 73.536487 101.108889) (xy 73.507815 101.4) (xy 73.536487 101.691111) (xy 73.621401 101.971034) (xy 73.759294 102.229014)
        (xy 73.944866 102.455134) (xy 74.170986 102.640706) (xy 74.225791 102.67) (xy 74.170986 102.699294) (xy 73.944866 102.884866)
        (xy 73.759294 103.110986) (xy 73.621401 103.368966) (xy 73.536487 103.648889) (xy 73.507815 103.94) (xy 73.536487 104.231111)
        (xy 73.621401 104.511034) (xy 73.759294 104.769014) (xy 73.944866 104.995134) (xy 74.170986 105.180706) (xy 74.225791 105.21)
        (xy 74.170986 105.239294) (xy 73.944866 105.424866) (xy 73.759294 105.650986) (xy 73.621401 105.908966) (xy 73.536487 106.188889)
        (xy 73.507815 106.48) (xy 73.536487 106.771111) (xy 73.621401 107.051034) (xy 73.759294 107.309014) (xy 73.944866 107.535134)
        (xy 74.170986 107.720706) (xy 74.225791 107.75) (xy 74.170986 107.779294) (xy 73.944866 107.964866) (xy 73.759294 108.190986)
        (xy 73.621401 108.448966) (xy 73.536487 108.728889) (xy 73.507815 109.02) (xy 73.536487 109.311111) (xy 73.621401 109.591034)
        (xy 73.759294 109.849014) (xy 73.944866 110.075134) (xy 74.170986 110.260706) (xy 74.225791 110.29) (xy 74.170986 110.319294)
        (xy 73.944866 110.504866) (xy 73.759294 110.730986) (xy 73.621401 110.988966) (xy 73.536487 111.268889) (xy 73.507815 111.56)
        (xy 73.536487 111.851111) (xy 73.621401 112.131034) (xy 73.759294 112.389014) (xy 73.944866 112.615134) (xy 74.170986 112.800706)
        (xy 74.225791 112.83) (xy 74.170986 112.859294) (xy 73.944866 113.044866) (xy 73.759294 113.270986) (xy 73.621401 113.528966)
        (xy 73.536487 113.808889) (xy 73.507815 114.1) (xy 73.536487 114.391111) (xy 73.621401 114.671034) (xy 73.759294 114.929014)
        (xy 73.944866 115.155134) (xy 74.170986 115.340706) (xy 74.428966 115.478599) (xy 74.708889 115.563513) (xy 74.92705 115.585)
        (xy 75.07295 115.585) (xy 75.291111 115.563513) (xy 75.571034 115.478599) (xy 75.829014 115.340706) (xy 76.055134 115.155134)
        (xy 76.240706 114.929014) (xy 76.378599 114.671034) (xy 76.463513 114.391111) (xy 76.492185 114.1) (xy 76.463513 113.808889)
        (xy 76.378599 113.528966) (xy 76.240706 113.270986) (xy 76.055134 113.044866) (xy 75.829014 112.859294) (xy 75.774209 112.83)
        (xy 75.829014 112.800706) (xy 76.055134 112.615134) (xy 76.240706 112.389014) (xy 76.378599 112.131034) (xy 76.463513 111.851111)
        (xy 76.492185 111.56) (xy 76.463513 111.268889) (xy 76.378599 110.988966) (xy 76.240706 110.730986) (xy 76.055134 110.504866)
        (xy 75.829014 110.319294) (xy 75.774209 110.29) (xy 75.829014 110.260706) (xy 76.055134 110.075134) (xy 76.240706 109.849014)
        (xy 76.378599 109.591034) (xy 76.463513 109.311111) (xy 76.492185 109.02) (xy 76.463513 108.728889) (xy 76.378599 108.448966)
        (xy 76.240706 108.190986) (xy 76.055134 107.964866) (xy 75.829014 107.779294) (xy 75.774209 107.75) (xy 75.829014 107.720706)
        (xy 76.055134 107.535134) (xy 76.240706 107.309014) (xy 76.378599 107.051034) (xy 76.463513 106.771111) (xy 76.492185 106.48)
        (xy 76.463513 106.188889) (xy 76.378599 105.908966) (xy 76.240706 105.650986) (xy 76.055134 105.424866) (xy 75.829014 105.239294)
        (xy 75.774209 105.21) (xy 75.829014 105.180706) (xy 76.055134 104.995134) (xy 76.240706 104.769014) (xy 76.378599 104.511034)
        (xy 76.463513 104.231111) (xy 76.492185 103.94) (xy 76.463513 103.648889) (xy 76.378599 103.368966) (xy 76.240706 103.110986)
        (xy 76.055134 102.884866) (xy 75.829014 102.699294) (xy 75.774209 102.67) (xy 75.829014 102.640706) (xy 76.055134 102.455134)
        (xy 76.240706 102.229014) (xy 76.378599 101.971034) (xy 76.463513 101.691111) (xy 76.492185 101.4) (xy 76.463513 101.108889)
        (xy 76.378599 100.828966) (xy 76.240706 100.570986) (xy 76.055134 100.344866) (xy 75.829014 100.159294) (xy 75.774209 100.13)
        (xy 75.829014 100.100706) (xy 76.055134 99.915134) (xy 76.240706 99.689014) (xy 76.378599 99.431034) (xy 76.463513 99.151111)
        (xy 76.492185 98.86) (xy 76.463513 98.568889) (xy 76.378599 98.288966) (xy 76.240706 98.030986) (xy 76.055134 97.804866)
        (xy 75.829014 97.619294) (xy 75.774209 97.59) (xy 75.829014 97.560706) (xy 76.055134 97.375134) (xy 76.240706 97.149014)
        (xy 76.378599 96.891034) (xy 76.463513 96.611111) (xy 76.492185 96.32) (xy 76.463513 96.028889) (xy 76.378599 95.748966)
        (xy 76.240706 95.490986) (xy 76.055134 95.264866) (xy 75.829014 95.079294) (xy 75.774209 95.05) (xy 75.829014 95.020706)
        (xy 76.055134 94.835134) (xy 76.240706 94.609014) (xy 76.378599 94.351034) (xy 76.463513 94.071111) (xy 76.492185 93.78)
        (xy 76.463513 93.488889) (xy 76.378599 93.208966) (xy 76.240706 92.950986) (xy 76.055134 92.724866) (xy 75.829014 92.539294)
        (xy 75.774209 92.51) (xy 75.829014 92.480706) (xy 76.055134 92.295134) (xy 76.240706 92.069014) (xy 76.378599 91.811034)
        (xy 76.463513 91.531111) (xy 76.492185 91.24) (xy 76.463513 90.948889) (xy 76.378599 90.668966) (xy 76.240706 90.410986)
        (xy 76.055134 90.184866) (xy 75.829014 89.999294) (xy 75.774209 89.97) (xy 75.829014 89.940706) (xy 76.055134 89.755134)
        (xy 76.240706 89.529014) (xy 76.378599 89.271034) (xy 76.463513 88.991111) (xy 76.492185 88.7) (xy 76.463513 88.408889)
        (xy 76.378599 88.128966) (xy 76.240706 87.870986) (xy 76.055134 87.644866) (xy 75.829014 87.459294) (xy 75.774209 87.43)
        (xy 75.829014 87.400706) (xy 76.055134 87.215134) (xy 76.240706 86.989014) (xy 76.378599 86.731034) (xy 76.463513 86.451111)
        (xy 76.492185 86.16) (xy 76.463513 85.868889) (xy 76.378599 85.588966) (xy 76.240706 85.330986) (xy 76.055134 85.104866)
        (xy 75.829014 84.919294) (xy 75.774209 84.89) (xy 75.829014 84.860706) (xy 76.055134 84.675134) (xy 76.240706 84.449014)
        (xy 76.378599 84.191034) (xy 76.463513 83.911111) (xy 76.492185 83.62) (xy 76.463513 83.328889) (xy 76.378599 83.048966)
        (xy 76.240706 82.790986) (xy 76.055134 82.564866) (xy 75.829014 82.379294) (xy 75.774209 82.35) (xy 75.829014 82.320706)
        (xy 76.055134 82.135134) (xy 76.240706 81.909014) (xy 76.378599 81.651034) (xy 76.463513 81.371111) (xy 76.492185 81.08)
        (xy 76.463513 80.788889) (xy 76.378599 80.508966) (xy 76.240706 80.250986) (xy 76.055134 80.024866) (xy 75.829014 79.839294)
        (xy 75.774209 79.81) (xy 75.829014 79.780706) (xy 76.055134 79.595134) (xy 76.240706 79.369014) (xy 76.378599 79.111034)
        (xy 76.463513 78.831111) (xy 76.492185 78.54) (xy 76.476427 78.38) (xy 113.507815 78.38) (xy 113.536487 78.671111)
        (xy 113.621401 78.951034) (xy 113.759294 79.209014) (xy 113.944866 79.435134) (xy 114.170986 79.620706) (xy 114.225791 79.65)
        (xy 114.170986 79.679294) (xy 113.944866 79.864866) (xy 113.759294 80.090986) (xy 113.621401 80.348966) (xy 113.536487 80.628889)
        (xy 113.507815 80.92) (xy 113.536487 81.211111) (xy 113.621401 81.491034) (xy 113.759294 81.749014) (xy 113.944866 81.975134)
        (xy 114.170986 82.160706) (xy 114.225791 82.19) (xy 114.170986 82.219294) (xy 113.944866 82.404866) (xy 113.759294 82.630986)
        (xy 113.621401 82.888966) (xy 113.536487 83.168889) (xy 113.507815 83.46) (xy 113.536487 83.751111) (xy 113.621401 84.031034)
        (xy 113.759294 84.289014) (xy 113.944866 84.515134) (xy 114.170986 84.700706) (xy 114.225791 84.73) (xy 114.170986 84.759294)
        (xy 113.944866 84.944866) (xy 113.759294 85.170986) (xy 113.621401 85.428966) (xy 113.536487 85.708889) (xy 113.507815 86)
        (xy 113.536487 86.291111) (xy 113.621401 86.571034) (xy 113.759294 86.829014) (xy 113.944866 87.055134) (xy 114.170986 87.240706)
        (xy 114.225791 87.27) (xy 114.170986 87.299294) (xy 113.944866 87.484866) (xy 113.759294 87.710986) (xy 113.621401 87.968966)
        (xy 113.536487 88.248889) (xy 113.507815 88.54) (xy 113.536487 88.831111) (xy 113.621401 89.111034) (xy 113.759294 89.369014)
        (xy 113.944866 89.595134) (xy 114.170986 89.780706) (xy 114.225791 89.81) (xy 114.170986 89.839294) (xy 113.944866 90.024866)
        (xy 113.759294 90.250986) (xy 113.621401 90.508966) (xy 113.536487 90.788889) (xy 113.507815 91.08) (xy 113.536487 91.371111)
        (xy 113.621401 91.651034) (xy 113.759294 91.909014) (xy 113.944866 92.135134) (xy 114.170986 92.320706) (xy 114.225791 92.35)
        (xy 114.170986 92.379294) (xy 113.944866 92.564866) (xy 113.759294 92.790986) (xy 113.621401 93.048966) (xy 113.536487 93.328889)
        (xy 113.507815 93.62) (xy 113.536487 93.911111) (xy 113.621401 94.191034) (xy 113.759294 94.449014) (xy 113.944866 94.675134)
        (xy 114.170986 94.860706) (xy 114.225791 94.89) (xy 114.170986 94.919294) (xy 113.944866 95.104866) (xy 113.759294 95.330986)
        (xy 113.621401 95.588966) (xy 113.536487 95.868889) (xy 113.507815 96.16) (xy 113.536487 96.451111) (xy 113.621401 96.731034)
        (xy 113.759294 96.989014) (xy 113.944866 97.215134) (xy 114.170986 97.400706) (xy 114.225791 97.43) (xy 114.170986 97.459294)
        (xy 113.944866 97.644866) (xy 113.759294 97.870986) (xy 113.621401 98.128966) (xy 113.536487 98.408889) (xy 113.507815 98.7)
        (xy 113.536487 98.991111) (xy 113.621401 99.271034) (xy 113.759294 99.529014) (xy 113.944866 99.755134) (xy 114.170986 99.940706)
        (xy 114.225791 99.97) (xy 114.170986 99.999294) (xy 113.944866 100.184866) (xy 113.759294 100.410986) (xy 113.621401 100.668966)
        (xy 113.536487 100.948889) (xy 113.507815 101.24) (xy 113.536487 101.531111) (xy 113.621401 101.811034) (xy 113.759294 102.069014)
        (xy 113.944866 102.295134) (xy 114.170986 102.480706) (xy 114.225791 102.51) (xy 114.170986 102.539294) (xy 113.944866 102.724866)
        (xy 113.759294 102.950986) (xy 113.621401 103.208966) (xy 113.536487 103.488889) (xy 113.507815 103.78) (xy 113.536487 104.071111)
        (xy 113.621401 104.351034) (xy 113.759294 104.609014) (xy 113.944866 104.835134) (xy 114.170986 105.020706) (xy 114.225791 105.05)
        (xy 114.170986 105.079294) (xy 113.944866 105.264866) (xy 113.759294 105.490986) (xy 113.621401 105.748966) (xy 113.536487 106.028889)
        (xy 113.507815 106.32) (xy 113.536487 106.611111) (xy 113.621401 106.891034) (xy 113.759294 107.149014) (xy 113.944866 107.375134)
        (xy 114.170986 107.560706) (xy 114.225791 107.59) (xy 114.170986 107.619294) (xy 113.944866 107.804866) (xy 113.759294 108.030986)
        (xy 113.621401 108.288966) (xy 113.536487 108.568889) (xy 113.507815 108.86) (xy 113.536487 109.151111) (xy 113.621401 109.431034)
        (xy 113.759294 109.689014) (xy 113.944866 109.915134) (xy 114.170986 110.100706) (xy 114.225791 110.13) (xy 114.170986 110.159294)
        (xy 113.944866 110.344866) (xy 113.759294 110.570986) (xy 113.621401 110.828966) (xy 113.536487 111.108889) (xy 113.507815 111.4)
        (xy 113.536487 111.691111) (xy 113.621401 111.971034) (xy 113.759294 112.229014) (xy 113.944866 112.455134) (xy 114.170986 112.640706)
        (xy 114.225791 112.67) (xy 114.170986 112.699294) (xy 113.944866 112.884866) (xy 113.759294 113.110986) (xy 113.621401 113.368966)
        (xy 113.536487 113.648889) (xy 113.507815 113.94) (xy 113.536487 114.231111) (xy 113.621401 114.511034) (xy 113.759294 114.769014)
        (xy 113.944866 114.995134) (xy 114.170986 115.180706) (xy 114.428966 115.318599) (xy 114.708889 115.403513) (xy 114.92705 115.425)
        (xy 115.07295 115.425) (xy 115.291111 115.403513) (xy 115.571034 115.318599) (xy 115.829014 115.180706) (xy 116.055134 114.995134)
        (xy 116.240706 114.769014) (xy 116.378599 114.511034) (xy 116.463513 114.231111) (xy 116.492185 113.94) (xy 116.463513 113.648889)
        (xy 116.378599 113.368966) (xy 116.240706 113.110986) (xy 116.055134 112.884866) (xy 115.829014 112.699294) (xy 115.774209 112.67)
        (xy 115.829014 112.640706) (xy 116.055134 112.455134) (xy 116.240706 112.229014) (xy 116.378599 111.971034) (xy 116.463513 111.691111)
        (xy 116.492185 111.4) (xy 116.463513 111.108889) (xy 116.378599 110.828966) (xy 116.240706 110.570986) (xy 116.055134 110.344866)
        (xy 115.829014 110.159294) (xy 115.774209 110.13) (xy 115.829014 110.100706) (xy 116.055134 109.915134) (xy 116.240706 109.689014)
        (xy 116.378599 109.431034) (xy 116.463513 109.151111) (xy 116.492185 108.86) (xy 116.463513 108.568889) (xy 116.378599 108.288966)
        (xy 116.240706 108.030986) (xy 116.055134 107.804866) (xy 115.829014 107.619294) (xy 115.774209 107.59) (xy 115.829014 107.560706)
        (xy 116.055134 107.375134) (xy 116.240706 107.149014) (xy 116.378599 106.891034) (xy 116.463513 106.611111) (xy 116.492185 106.32)
        (xy 116.463513 106.028889) (xy 116.378599 105.748966) (xy 116.240706 105.490986) (xy 116.055134 105.264866) (xy 115.829014 105.079294)
        (xy 115.774209 105.05) (xy 115.829014 105.020706) (xy 116.055134 104.835134) (xy 116.240706 104.609014) (xy 116.378599 104.351034)
        (xy 116.463513 104.071111) (xy 116.492185 103.78) (xy 116.463513 103.488889) (xy 116.378599 103.208966) (xy 116.240706 102.950986)
        (xy 116.055134 102.724866) (xy 115.829014 102.539294) (xy 115.774209 102.51) (xy 115.829014 102.480706) (xy 116.055134 102.295134)
        (xy 116.240706 102.069014) (xy 116.378599 101.811034) (xy 116.463513 101.531111) (xy 116.492185 101.24) (xy 116.463513 100.948889)
        (xy 116.378599 100.668966) (xy 116.240706 100.410986) (xy 116.055134 100.184866) (xy 115.829014 99.999294) (xy 115.774209 99.97)
        (xy 115.829014 99.940706) (xy 116.055134 99.755134) (xy 116.240706 99.529014) (xy 116.378599 99.271034) (xy 116.463513 98.991111)
        (xy 116.492185 98.7) (xy 116.463513 98.408889) (xy 116.378599 98.128966) (xy 116.240706 97.870986) (xy 116.055134 97.644866)
        (xy 115.829014 97.459294) (xy 115.774209 97.43) (xy 115.829014 97.400706) (xy 116.055134 97.215134) (xy 116.240706 96.989014)
        (xy 116.378599 96.731034) (xy 116.463513 96.451111) (xy 116.492185 96.16) (xy 116.463513 95.868889) (xy 116.378599 95.588966)
        (xy 116.240706 95.330986) (xy 116.055134 95.104866) (xy 115.829014 94.919294) (xy 115.774209 94.89) (xy 115.829014 94.860706)
        (xy 116.055134 94.675134) (xy 116.240706 94.449014) (xy 116.378599 94.191034) (xy 116.463513 93.911111) (xy 116.492185 93.62)
        (xy 116.463513 93.328889) (xy 116.378599 93.048966) (xy 116.240706 92.790986) (xy 116.055134 92.564866) (xy 115.829014 92.379294)
        (xy 115.774209 92.35) (xy 115.829014 92.320706) (xy 116.055134 92.135134) (xy 116.240706 91.909014) (xy 116.378599 91.651034)
        (xy 116.463513 91.371111) (xy 116.492185 91.08) (xy 116.463513 90.788889) (xy 116.378599 90.508966) (xy 116.240706 90.250986)
        (xy 116.055134 90.024866) (xy 115.829014 89.839294) (xy 115.774209 89.81) (xy 115.829014 89.780706) (xy 116.055134 89.595134)
        (xy 116.240706 89.369014) (xy 116.378599 89.111034) (xy 116.463513 88.831111) (xy 116.492185 88.54) (xy 116.463513 88.248889)
        (xy 116.378599 87.968966) (xy 116.240706 87.710986) (xy 116.055134 87.484866) (xy 115.829014 87.299294) (xy 115.774209 87.27)
        (xy 115.829014 87.240706) (xy 116.055134 87.055134) (xy 116.240706 86.829014) (xy 116.378599 86.571034) (xy 116.463513 86.291111)
        (xy 116.492185 86) (xy 116.463513 85.708889) (xy 116.378599 85.428966) (xy 116.240706 85.170986) (xy 116.055134 84.944866)
        (xy 115.829014 84.759294) (xy 115.774209 84.73) (xy 115.829014 84.700706) (xy 116.055134 84.515134) (xy 116.240706 84.289014)
        (xy 116.378599 84.031034) (xy 116.463513 83.751111) (xy 116.492185 83.46) (xy 116.463513 83.168889) (xy 116.378599 82.888966)
        (xy 116.240706 82.630986) (xy 116.055134 82.404866) (xy 115.829014 82.219294) (xy 115.774209 82.19) (xy 115.829014 82.160706)
        (xy 116.055134 81.975134) (xy 116.240706 81.749014) (xy 116.378599 81.491034) (xy 116.463513 81.211111) (xy 116.492185 80.92)
        (xy 116.463513 80.628889) (xy 116.378599 80.348966) (xy 116.240706 80.090986) (xy 116.055134 79.864866) (xy 115.829014 79.679294)
        (xy 115.774209 79.65) (xy 115.829014 79.620706) (xy 116.055134 79.435134) (xy 116.240706 79.209014) (xy 116.378599 78.951034)
        (xy 116.463513 78.671111) (xy 116.492185 78.38) (xy 116.463513 78.088889) (xy 116.378599 77.808966) (xy 116.240706 77.550986)
        (xy 116.055134 77.324866) (xy 116.025313 77.300393) (xy 116.09418 77.279502) (xy 116.204494 77.220537) (xy 116.301185 77.141185)
        (xy 116.380537 77.044494) (xy 116.439502 76.93418) (xy 116.475812 76.814482) (xy 116.488072 76.69) (xy 116.488072 74.99)
        (xy 116.475812 74.865518) (xy 116.439502 74.74582) (xy 116.380537 74.635506) (xy 116.301185 74.538815) (xy 116.204494 74.459463)
        (xy 116.09418 74.400498) (xy 115.974482 74.364188) (xy 115.85 74.351928) (xy 114.15 74.351928) (xy 114.025518 74.364188)
        (xy 113.90582 74.400498) (xy 113.795506 74.459463) (xy 113.698815 74.538815) (xy 113.619463 74.635506) (xy 113.560498 74.74582)
        (xy 113.524188 74.865518) (xy 113.511928 74.99) (xy 113.511928 76.69) (xy 113.524188 76.814482) (xy 113.560498 76.93418)
        (xy 113.619463 77.044494) (xy 113.698815 77.141185) (xy 113.795506 77.220537) (xy 113.90582 77.279502) (xy 113.974687 77.300393)
        (xy 113.944866 77.324866) (xy 113.759294 77.550986) (xy 113.621401 77.808966) (xy 113.536487 78.088889) (xy 113.507815 78.38)
        (xy 76.476427 78.38) (xy 76.463513 78.248889) (xy 76.378599 77.968966) (xy 76.240706 77.710986) (xy 76.055134 77.484866)
        (xy 76.025313 77.460393) (xy 76.09418 77.439502) (xy 76.204494 77.380537) (xy 76.301185 77.301185) (xy 76.380537 77.204494)
        (xy 76.439502 77.09418) (xy 76.475812 76.974482) (xy 76.488072 76.85) (xy 76.488072 75.15) (xy 76.475812 75.025518)
        (xy 76.439502 74.90582) (xy 76.380537 74.795506) (xy 76.301185 74.698815) (xy 76.204494 74.619463) (xy 76.09418 74.560498)
        (xy 75.974482 74.524188) (xy 75.85 74.511928) (xy 74.15 74.511928) (xy 74.025518 74.524188) (xy 73.90582 74.560498)
        (xy 73.795506 74.619463) (xy 73.698815 74.698815) (xy 73.619463 74.795506) (xy 73.560498 74.90582) (xy 73.524188 75.025518)
        (xy 73.511928 75.15) (xy 73.511928 76.85) (xy 73.524188 76.974482) (xy 73.560498 77.09418) (xy 73.619463 77.204494)
        (xy 73.698815 77.301185) (xy 73.795506 77.380537) (xy 73.90582 77.439502) (xy 73.974687 77.460393) (xy 73.944866 77.484866)
        (xy 73.759294 77.710986) (xy 73.621401 77.968966) (xy 73.536487 78.248889) (xy 73.507815 78.54) (xy 70.685 78.54)
        (xy 70.685 73.033987) (xy 70.824566 73.200314) (xy 71.080094 73.405764) (xy 71.370661 73.557669) (xy 71.685199 73.650243)
        (xy 72.011729 73.679959) (xy 72.337811 73.645686) (xy 72.651026 73.54873) (xy 72.939444 73.392783) (xy 73.192079 73.183785)
        (xy 73.399308 72.929698) (xy 73.553237 72.640198) (xy 73.648005 72.326314) (xy 73.68 72) (xy 73.679345 71.953092)
        (xy 73.638251 71.627799) (xy 73.534756 71.316682) (xy 73.372803 71.031594) (xy 73.158561 70.783391) (xy 73.032626 70.685)
        (xy 116.965377 70.685)
      )
    )
    (filled_polygon
      (pts
        (xy 70.791509 70.832974) (xy 70.685 70.967355) (xy 70.685 70.685) (xy 70.965377 70.685)
      )
    )
    (filled_polygon
      (pts
        (xy 119.315 70.964628) (xy 119.158561 70.783391) (xy 119.032626 70.685) (xy 119.315 70.685)
      )
    )
  )
)
