(module LOGO (layer F.Cu)
  (at 0 0)
 (fp_text reference "G***" (at 0 0) (layer F.SilkS) hide
  (effects (font (thickness 0.3)))
  )
  (fp_text value "LOGO" (at 0.75 0) (layer F.SilkS) hide
  (effects (font (thickness 0.3)))
  )
  (fp_poly (pts (xy -5.878485 -0.826707) (xy -5.894451 -0.736283) (xy -5.975403 -0.530352) (xy -6.107012 -0.243017) (xy -6.217510 -0.019754) (xy -6.469918 0.554088) (xy -6.591591 1.046867) (xy -6.576060 1.476124)
     (xy -6.416854 1.859401) (xy -6.107504 2.214240) (xy -5.641542 2.558183) (xy -5.166754 2.829366) (xy -4.612411 3.120665) (xy -4.481924 2.921000) (xy -2.794000 2.921000) (xy -2.748282 3.033672)
     (xy -2.709333 3.048000) (xy 0.000000 3.048000) (xy 0.030978 3.117690) (xy 0.056445 3.104445) (xy 0.066578 3.003965) (xy 0.056445 2.991556) (xy 0.006110 3.003178) (xy 0.000000 3.048000)
     (xy -2.709333 3.048000) (xy -2.634219 2.979424) (xy -2.624666 2.921000) (xy -2.670384 2.808328) (xy -2.709333 2.794000) (xy -2.784448 2.862577) (xy -2.794000 2.921000) (xy -4.481924 2.921000)
     (xy -4.436502 2.851499) (xy -4.337560 2.692168) (xy -4.171178 2.415548) (xy -3.954738 2.050908) (xy -3.705623 1.627515) (xy -3.685342 1.592792) (xy -1.335264 1.592792) (xy -1.298415 1.679158)
     (xy -1.234722 1.693334) (xy -1.118090 1.625164) (xy -1.100666 1.559278) (xy -1.149559 1.467425) (xy 2.624724 1.467425) (xy 2.662702 1.595758) (xy 2.763028 1.821714) (xy 2.905351 2.107725)
     (xy 3.069323 2.416223) (xy 3.234593 2.709641) (xy 3.380812 2.950412) (xy 3.487629 3.100967) (xy 3.526758 3.132667) (xy 3.614564 3.092895) (xy 3.810015 2.987364) (xy 4.075141 2.836747)
     (xy 4.148335 2.794194) (xy 4.659368 2.476448) (xy 5.030470 2.193629) (xy 5.280667 1.922295) (xy 5.428982 1.639001) (xy 5.494441 1.320303) (xy 5.502037 1.126038) (xy 5.497189 0.867655)
     (xy 5.467561 0.692042) (xy 5.387625 0.589504) (xy 5.231856 0.550349) (xy 4.974725 0.564881) (xy 4.590708 0.623408) (xy 4.307404 0.672363) (xy 3.736376 0.774497) (xy 3.311276 0.860834)
     (xy 3.010693 0.941488) (xy 2.813218 1.026577) (xy 2.697439 1.126217) (xy 2.641946 1.250525) (xy 2.625330 1.409616) (xy 2.624724 1.467425) (xy -1.149559 1.467425) (xy -1.150020 1.466560)
     (xy -1.251570 1.481344) (xy -1.335264 1.592792) (xy -3.685342 1.592792) (xy -3.543332 1.349670) (xy -2.455333 1.349670) (xy -2.393873 1.435888) (xy -2.370666 1.439334) (xy -2.288201 1.410447)
     (xy -2.286000 1.401997) (xy -2.345329 1.329711) (xy -2.370666 1.312334) (xy -2.448685 1.319046) (xy -2.455333 1.349670) (xy -3.543332 1.349670) (xy -3.472068 1.227667) (xy -3.222062 0.798531)
     (xy -3.002746 0.422776) (xy -2.827763 0.123718) (xy -2.710756 -0.075324) (xy -2.665433 -0.150950) (xy -2.580628 -0.144163) (xy -2.361835 -0.108463) (xy -2.040842 -0.049472) (xy -1.649435 0.027192)
     (xy -1.590205 0.039142) (xy -0.306254 0.243588) (xy 1.062615 0.359983) (xy 2.454406 0.384482) (xy 3.375501 0.347135) (xy 3.944638 0.303792) (xy 4.536784 0.248352) (xy 5.118527 0.184922)
     (xy 5.656453 0.117611) (xy 6.117149 0.050525) (xy 6.467201 -0.012228) (xy 6.636159 -0.053707) (xy 6.729957 -0.067813) (xy 6.765615 -0.006841) (xy 6.753983 0.166499) (xy 6.736302 0.290489)
     (xy 6.599918 0.893586) (xy 6.370425 1.567768) (xy 6.069936 2.260031) (xy 5.720560 2.917369) (xy 5.485015 3.290128) (xy 4.977344 3.923181) (xy 4.343975 4.535746) (xy 3.627971 5.093431)
     (xy 2.872397 5.561844) (xy 2.293747 5.838806) (xy 1.558356 6.087425) (xy 0.743554 6.269870) (xy -0.095687 6.378987) (xy -0.904393 6.407621) (xy -1.625734 6.348912) (xy -2.708055 6.093666)
     (xy -3.733010 5.685255) (xy -3.900930 5.588000) (xy 1.270000 5.588000) (xy 1.338577 5.663115) (xy 1.397000 5.672667) (xy 1.509672 5.626949) (xy 1.524000 5.588000) (xy 1.455424 5.512886)
     (xy 1.397000 5.503334) (xy 1.284328 5.549051) (xy 1.270000 5.588000) (xy -3.900930 5.588000) (xy -4.684272 5.134309) (xy -5.545516 4.451459) (xy -6.041729 3.922889) (xy -0.141111 3.922889)
     (xy -0.129489 3.973223) (xy -0.084666 3.979334) (xy -0.014976 3.948355) (xy -0.028222 3.922889) (xy -0.128702 3.912756) (xy -0.141111 3.922889) (xy -6.041729 3.922889) (xy -6.300415 3.647335)
     (xy -6.337662 3.595824) (xy 2.321553 3.595824) (xy 2.328334 3.640667) (xy 2.400754 3.721349) (xy 2.413000 3.725334) (xy 2.480314 3.666282) (xy 2.497667 3.640667) (xy 2.477561 3.568938)
     (xy 2.413000 3.556000) (xy 2.321553 3.595824) (xy -6.337662 3.595824) (xy -6.407273 3.499556) (xy -0.056444 3.499556) (xy -0.044822 3.549890) (xy 0.000000 3.556000) (xy 0.069690 3.525022)
     (xy 0.056445 3.499556) (xy -0.044035 3.489423) (xy -0.056444 3.499556) (xy -6.407273 3.499556) (xy -6.767925 3.000796) (xy -7.139593 2.340188) (xy -7.360919 1.739452) (xy -7.378180 1.608667)
     (xy -6.942666 1.608667) (xy -6.911688 1.678357) (xy -6.886222 1.665111) (xy -6.876089 1.564632) (xy -6.886222 1.552222) (xy -6.936556 1.563845) (xy -6.942666 1.608667) (xy -7.378180 1.608667)
     (xy -7.434103 1.184944) (xy -7.361346 0.663020) (xy -7.207473 0.275182) (xy -7.046973 0.028421) (xy -6.823859 -0.228798) (xy -6.569173 -0.470735) (xy -6.313962 -0.671651) (xy -6.089269 -0.805805)
     (xy -5.926138 -0.847459) (xy -5.878485 -0.826707) )(layer Eco2.User) (width  0.010000)
  )
  (fp_poly (pts (xy 0.139130 -8.324598) (xy 1.006751 -8.187609) (xy 1.882377 -7.935984) (xy 2.740864 -7.573547) (xy 3.488317 -7.149157) (xy 4.356395 -6.488959) (xy 5.107452 -5.712523) (xy 5.734206 -4.832568)
     (xy 6.229377 -3.861816) (xy 6.585684 -2.812989) (xy 6.795846 -1.698807) (xy 6.832833 -1.305690) (xy 6.881292 -0.619012) (xy 6.425146 -0.564242) (xy 6.195981 -0.548094) (xy 5.834405 -0.535841)
     (xy 5.377298 -0.527496) (xy 4.861538 -0.523070) (xy 4.324003 -0.522576) (xy 3.801573 -0.526027) (xy 3.331126 -0.533434) (xy 2.949541 -0.544810) (xy 2.693697 -0.560167) (xy 2.667000 -0.562982)
     (xy 2.470803 -0.585594) (xy 2.159804 -0.621152) (xy 1.787462 -0.663551) (xy 1.608667 -0.683856) (xy 1.120853 -0.749195) (xy 0.597627 -0.836331) (xy 0.065173 -0.938991) (xy -0.450319 -1.050902)
     (xy -0.922664 -1.165792) (xy -1.325675 -1.277388) (xy -1.633163 -1.379417) (xy -1.818943 -1.465607) (xy -1.862666 -1.515357) (xy -1.819674 -1.621207) (xy -1.704081 -1.835985) (xy -1.535966 -2.126896)
     (xy -1.335407 -2.461150) (xy -1.122483 -2.805953) (xy -0.917270 -3.128512) (xy -0.739849 -3.396035) (xy -0.610296 -3.575730) (xy -0.577292 -3.614699) (xy -0.439990 -3.741530) (xy -0.342304 -3.749022)
     (xy -0.248545 -3.678063) (xy -0.148143 -3.507525) (xy -0.144958 -3.386068) (xy -0.122077 -3.233565) (xy -0.020231 -2.980674) (xy 0.139624 -2.663716) (xy 0.336534 -2.319010) (xy 0.549541 -1.982878)
     (xy 0.757690 -1.691641) (xy 0.940024 -1.481618) (xy 0.969693 -1.454180) (xy 1.281026 -1.253329) (xy 1.649159 -1.118273) (xy 1.671966 -1.113159) (xy 1.937160 -1.067491) (xy 2.298334 -1.020450)
     (xy 2.719044 -0.975046) (xy 3.162849 -0.934290) (xy 3.593308 -0.901194) (xy 3.973977 -0.878768) (xy 4.268416 -0.870024) (xy 4.440181 -0.877972) (xy 4.459477 -0.882840) (xy 4.516067 -0.933945)
     (xy 4.503860 -1.041546) (xy 4.414089 -1.238450) (xy 4.396961 -1.270000) (xy 6.434667 -1.270000) (xy 6.465645 -1.200310) (xy 6.491111 -1.213555) (xy 6.501244 -1.314035) (xy 6.491111 -1.326444)
     (xy 6.440777 -1.314822) (xy 6.434667 -1.270000) (xy 4.396961 -1.270000) (xy 4.316322 -1.418532) (xy 4.085517 -1.812646) (xy 3.794643 -2.280040) (xy 3.466817 -2.786344) (xy 3.125156 -3.297190)
     (xy 2.792778 -3.778207) (xy 2.492799 -4.195027) (xy 2.248336 -4.513281) (xy 2.178397 -4.597076) (xy 2.023416 -4.774003) (xy 2.888900 -4.774003) (xy 2.909822 -4.657108) (xy 2.932809 -4.630746)
     (xy 3.038351 -4.613623) (xy 3.123925 -4.699437) (xy 3.132667 -4.746330) (xy 3.064015 -4.817036) (xy 3.005667 -4.826000) (xy 2.888900 -4.774003) (xy 2.023416 -4.774003) (xy 1.968146 -4.837099)
     (xy 1.786711 -5.021956) (xy 1.608340 -5.158851) (xy 1.585727 -5.169663) (xy 4.910667 -5.169663) (xy 4.972127 -5.083445) (xy 4.995334 -5.080000) (xy 5.077799 -5.108887) (xy 5.080000 -5.117336)
     (xy 5.020671 -5.189622) (xy 4.995334 -5.207000) (xy 4.917315 -5.200287) (xy 4.910667 -5.169663) (xy 1.585727 -5.169663) (xy 1.407278 -5.254985) (xy 1.157770 -5.317564) (xy 0.834063 -5.353789)
     (xy 0.410404 -5.370864) (xy -0.138963 -5.375994) (xy -0.607679 -5.376333) (xy -1.236922 -5.376866) (xy -1.724223 -5.372071) (xy -2.096920 -5.352358) (xy -2.382350 -5.308135) (xy -2.607851 -5.229813)
     (xy -2.800761 -5.107801) (xy -2.988418 -4.932508) (xy -3.198159 -4.694344) (xy -3.457321 -4.383718) (xy -3.465730 -4.373676) (xy -3.748147 -4.053125) (xy -3.946821 -3.864934) (xy -4.057516 -3.812931)
     (xy -4.073067 -3.824670) (xy -4.139845 -4.024814) (xy -4.183609 -4.338825) (xy -4.201494 -4.712441) (xy -4.190635 -5.091400) (xy -4.155408 -5.384134) (xy -4.035303 -5.790130) (xy 4.008437 -5.790130)
     (xy 4.021667 -5.757333) (xy 4.097749 -5.676563) (xy 4.111330 -5.672666) (xy 4.147696 -5.738172) (xy 4.148667 -5.757333) (xy 4.083579 -5.838746) (xy 4.059003 -5.842000) (xy 4.008437 -5.790130)
     (xy -4.035303 -5.790130) (xy -3.964024 -6.031077) (xy -1.234512 -6.031077) (xy -1.223197 -6.004102) (xy -1.120410 -5.962154) (xy -1.093435 -5.973469) (xy -1.051487 -6.076256) (xy -1.062802 -6.103231)
     (xy -1.165590 -6.145179) (xy -1.192565 -6.133864) (xy -1.234512 -6.031077) (xy -3.964024 -6.031077) (xy -3.950370 -6.077232) (xy -3.609040 -6.724126) (xy -3.341305 -7.060003) (xy -2.953100 -7.060003)
     (xy -2.932178 -6.943108) (xy -2.909191 -6.916746) (xy -2.803649 -6.899623) (xy -2.718075 -6.985437) (xy -2.709333 -7.032330) (xy -2.777985 -7.103036) (xy -2.836333 -7.112000) (xy -2.953100 -7.060003)
     (xy -3.341305 -7.060003) (xy -3.154948 -7.293790) (xy -2.611624 -7.755200) (xy -2.164285 -8.009471) (xy -1.471531 -8.239355) (xy -0.695345 -8.343122) (xy 0.139130 -8.324598) )(layer Eco2.User) (width  0.010000)
  )
  (fp_poly (pts (xy -6.771052 -2.496487) (xy -6.600201 -2.392847) (xy -6.520161 -2.314179) (xy -6.519333 -2.309107) (xy -6.562974 -2.189478) (xy -6.673165 -1.991965) (xy -6.818812 -1.763421) (xy -6.968818 -1.550700)
     (xy -7.092088 -1.400657) (xy -7.151055 -1.357241) (xy -7.292581 -1.398864) (xy -7.387166 -1.446115) (xy -7.493543 -1.532784) (xy -7.521550 -1.648301) (xy -7.466056 -1.827288) (xy -7.321932 -2.104365)
     (xy -7.278258 -2.181161) (xy -7.022772 -2.626656) (xy -6.771052 -2.496487) )(layer Eco2.User) (width  0.010000)
  )
  (fp_poly (pts (xy -6.150855 -3.643289) (xy -5.968669 -3.501379) (xy -5.864751 -3.294504) (xy -5.865991 -3.057445) (xy -5.999277 -2.824987) (xy -6.027298 -2.797298) (xy -6.259062 -2.647691) (xy -6.488615 -2.657142)
     (xy -6.669828 -2.756467) (xy -6.828021 -2.957680) (xy -6.863730 -3.211611) (xy -6.778986 -3.456217) (xy -6.642474 -3.593076) (xy -6.384420 -3.685449) (xy -6.150855 -3.643289) )(layer Eco2.User) (width  0.010000)
  )
  (fp_poly (pts (xy -5.408545 -4.948717) (xy -5.290615 -4.878034) (xy -5.194392 -4.794091) (xy -5.175174 -4.700762) (xy -5.231341 -4.539074) (xy -5.278408 -4.433534) (xy -5.409761 -4.175816) (xy -5.545918 -3.954958)
     (xy -5.570808 -3.921259) (xy -5.686244 -3.799443) (xy -5.800368 -3.791491) (xy -5.947833 -3.860463) (xy -6.110297 -3.961588) (xy -6.180591 -4.033902) (xy -6.180666 -4.035231) (xy -6.137326 -4.161754)
     (xy -6.027884 -4.364578) (xy -5.883207 -4.596287) (xy -5.734162 -4.809468) (xy -5.611618 -4.956704) (xy -5.555635 -4.995333) (xy -5.408545 -4.948717) )(layer Eco2.User) (width  0.010000)
  )
  (fp_poly (pts (xy 0.194712 -4.233711) (xy 0.099223 -3.940341) (xy -0.046143 -3.763342) (xy -0.163286 -3.725333) (xy -0.246956 -3.792355) (xy -0.254000 -3.834365) (xy -0.202322 -3.960510) (xy -0.072048 -4.150936)
     (xy -0.002214 -4.236531) (xy 0.249572 -4.529666) (xy 0.194712 -4.233711) )(layer Eco2.User) (width  0.010000)
  )
  (fp_poly (pts (xy 0.676363 -4.845161) (xy 0.677334 -4.826000) (xy 0.612246 -4.744587) (xy 0.587670 -4.741333) (xy 0.537104 -4.793203) (xy 0.550334 -4.826000) (xy 0.626416 -4.906770) (xy 0.639997 -4.910666)
     (xy 0.676363 -4.845161) )(layer Eco2.User) (width  0.010000)
  )
)
