(export (version D)
  (design
    (source C:\Users\Owner\Desktop\Astre\pcb\pcb.sch)
    (date "1/23/2020 4:52:18 PM")
    (tool "Eeschema (5.1.5)-3")
    (sheet (number 1) (name /) (tstamps /)
      (title_block
        (title)
        (company)
        (rev)
        (date)
        (source pcb.sch)
        (comment (number 1) (value ""))
        (comment (number 2) (value ""))
        (comment (number 3) (value ""))
        (comment (number 4) (value "")))))
  (components
    (comp (ref J2)
      (value Conn_01x16_Female)
      (footprint Connector_PinHeader_2.54mm:PinHeader_1x16_P2.54mm_Vertical)
      (datasheet ~)
      (libsource (lib Connector) (part Conn_01x16_Female) (description "Generic connector, single row, 01x16, script generated (kicad-library-utils/schlib/autogen/connector/)"))
      (sheetpath (names /) (tstamps /))
      (tstamp 5E2A7235))
    (comp (ref J1)
      (value Conn_01x16_Female)
      (footprint Connector_PinHeader_2.54mm:PinHeader_1x16_P2.54mm_Vertical)
      (datasheet ~)
      (libsource (lib Connector) (part Conn_01x16_Female) (description "Generic connector, single row, 01x16, script generated (kicad-library-utils/schlib/autogen/connector/)"))
      (sheetpath (names /) (tstamps /))
      (tstamp 5E2A5DC5)))
  (libparts
    (libpart (lib Connector) (part Conn_01x16_Female)
      (description "Generic connector, single row, 01x16, script generated (kicad-library-utils/schlib/autogen/connector/)")
      (docs ~)
      (footprints
        (fp Connector*:*_1x??_*))
      (fields
        (field (name Reference) J)
        (field (name Value) Conn_01x16_Female))
      (pins
        (pin (num 1) (name Pin_1) (type passive))
        (pin (num 2) (name Pin_2) (type passive))
        (pin (num 3) (name Pin_3) (type passive))
        (pin (num 4) (name Pin_4) (type passive))
        (pin (num 5) (name Pin_5) (type passive))
        (pin (num 6) (name Pin_6) (type passive))
        (pin (num 7) (name Pin_7) (type passive))
        (pin (num 8) (name Pin_8) (type passive))
        (pin (num 9) (name Pin_9) (type passive))
        (pin (num 10) (name Pin_10) (type passive))
        (pin (num 11) (name Pin_11) (type passive))
        (pin (num 12) (name Pin_12) (type passive))
        (pin (num 13) (name Pin_13) (type passive))
        (pin (num 14) (name Pin_14) (type passive))
        (pin (num 15) (name Pin_15) (type passive))
        (pin (num 16) (name Pin_16) (type passive)))))
  (libraries
    (library (logical Connector)
      (uri "C:\\Program Files\\KiCad\\share\\kicad\\library/Connector.lib")))
  (nets
    (net (code 1) (name SCL)
      (node (ref J2) (pin 4)))
    (net (code 2) (name RXI)
      (node (ref J1) (pin 6)))
    (net (code 3) (name TX0)
      (node (ref J1) (pin 5)))
    (net (code 4) (name 5V)
      (node (ref J1) (pin 3)))
    (net (code 5) (name 3.3V)
      (node (ref J1) (pin 1)))
    (net (code 6) (name A6)
      (node (ref J2) (pin 1)))
    (net (code 7) (name A7)
      (node (ref J2) (pin 2)))
    (net (code 8) (name SDA)
      (node (ref J2) (pin 3)))
    (net (code 9) (name D2)
      (node (ref J1) (pin 9)))
    (net (code 10) (name SS)
      (node (ref J2) (pin 5)))
    (net (code 11) (name MOSI)
      (node (ref J2) (pin 6)))
    (net (code 12) (name MISO)
      (node (ref J2) (pin 7)))
    (net (code 13) (name SCK)
      (node (ref J2) (pin 8)))
    (net (code 14) (name A0)
      (node (ref J2) (pin 9)))
    (net (code 15) (name A1)
      (node (ref J2) (pin 10)))
    (net (code 16) (name A2)
      (node (ref J2) (pin 11)))
    (net (code 17) (name A3)
      (node (ref J2) (pin 12)))
    (net (code 18) (name VCC)
      (node (ref J2) (pin 13)))
    (net (code 19) (name GND)
      (node (ref J1) (pin 8))
      (node (ref J1) (pin 2))
      (node (ref J1) (pin 4))
      (node (ref J2) (pin 15)))
    (net (code 20) (name RST)
      (node (ref J2) (pin 14))
      (node (ref J1) (pin 7)))
    (net (code 21) (name RAW)
      (node (ref J2) (pin 16)))
    (net (code 22) (name D9)
      (node (ref J1) (pin 16)))
    (net (code 23) (name D8)
      (node (ref J1) (pin 15)))
    (net (code 24) (name D7)
      (node (ref J1) (pin 14)))
    (net (code 25) (name D6)
      (node (ref J1) (pin 13)))
    (net (code 26) (name D5)
      (node (ref J1) (pin 12)))
    (net (code 27) (name D4)
      (node (ref J1) (pin 11)))
    (net (code 28) (name D3)
      (node (ref J1) (pin 10)))))