(export (version D)
  (design
<<<<<<< HEAD
    (source "C:\\Users\\Rémy\\Astre\\Projet Ballon\\AstreLoon GIT\\uastreloon\\PCB\\pcbOdbRev2\\pcb.sch")
    (date "13/02/2020 15:04:07")
    (tool "Eeschema (5.1.2)-2")
    (sheet (number 1) (name /) (tstamps /)
      (title_block
        (title "Pinout PCB AstreLoon")
        (company ASTRE)
        (rev 1)
        (date 30/01/2020)
=======
    (source C:\Users\Owner\Desktop\Astre\pcb\pcb.sch)
    (date "1/23/2020 4:52:18 PM")
    (tool "Eeschema (5.1.5)-3")
    (sheet (number 1) (name /) (tstamps /)
      (title_block
        (title)
        (company)
        (rev)
        (date)
>>>>>>> 355f5829e446ff1ec2ebe3a819facc5eaa077a11
        (source pcb.sch)
        (comment (number 1) (value ""))
        (comment (number 2) (value ""))
        (comment (number 3) (value ""))
        (comment (number 4) (value "")))))
  (components
    (comp (ref J2)
      (value Conn_01x16_Female)
      (footprint Connector_PinHeader_2.54mm:PinHeader_1x16_P2.54mm_Vertical)
      (datasheet ~)
      (libsource (lib Connector) (part Conn_01x16_Female) (description "Generic connector, single row, 01x16, script generated (kicad-library-utils/schlib/autogen/connector/)"))
      (sheetpath (names /) (tstamps /))
      (tstamp 5E2A7235))
    (comp (ref J1)
      (value Conn_01x16_Female)
      (footprint Connector_PinHeader_2.54mm:PinHeader_1x16_P2.54mm_Vertical)
      (datasheet ~)
      (libsource (lib Connector) (part Conn_01x16_Female) (description "Generic connector, single row, 01x16, script generated (kicad-library-utils/schlib/autogen/connector/)"))
      (sheetpath (names /) (tstamps /))
<<<<<<< HEAD
      (tstamp 5E2A5DC5))
    (comp (ref U1)
      (value ATmega328P-PU)
      (footprint Housings_DIP:DIP-28_W7.62mm_Socket)
      (datasheet http://ww1.microchip.com/downloads/en/DeviceDoc/ATmega328_P%20AVR%20MCU%20with%20picoPower%20Technology%20Data%20Sheet%2040001984A.pdf)
      (libsource (lib MCU_Microchip_ATmega) (part ATmega328P-PU) (description "20MHz, 32kB Flash, 2kB SRAM, 1kB EEPROM, DIP-28"))
      (sheetpath (names /) (tstamps /))
      (tstamp 5E3DBF29))
    (comp (ref Y1)
      (value Crystal)
      (datasheet ~)
      (libsource (lib Device) (part Crystal) (description "Two pin crystal"))
      (sheetpath (names /) (tstamps /))
      (tstamp 5E442234))
    (comp (ref J3)
      (value SD_Card)
      (datasheet http://portal.fciconnect.com/Comergent//fci/drawing/10067847.pdf)
      (libsource (lib Connector) (part SD_Card) (description "SD Card Reader"))
      (sheetpath (names /) (tstamps /))
      (tstamp 5E451C3B)))
=======
      (tstamp 5E2A5DC5)))
>>>>>>> 355f5829e446ff1ec2ebe3a819facc5eaa077a11
  (libparts
    (libpart (lib Connector) (part Conn_01x16_Female)
      (description "Generic connector, single row, 01x16, script generated (kicad-library-utils/schlib/autogen/connector/)")
      (docs ~)
      (footprints
        (fp Connector*:*_1x??_*))
      (fields
        (field (name Reference) J)
        (field (name Value) Conn_01x16_Female))
      (pins
        (pin (num 1) (name Pin_1) (type passive))
        (pin (num 2) (name Pin_2) (type passive))
        (pin (num 3) (name Pin_3) (type passive))
        (pin (num 4) (name Pin_4) (type passive))
        (pin (num 5) (name Pin_5) (type passive))
        (pin (num 6) (name Pin_6) (type passive))
        (pin (num 7) (name Pin_7) (type passive))
        (pin (num 8) (name Pin_8) (type passive))
        (pin (num 9) (name Pin_9) (type passive))
        (pin (num 10) (name Pin_10) (type passive))
        (pin (num 11) (name Pin_11) (type passive))
        (pin (num 12) (name Pin_12) (type passive))
        (pin (num 13) (name Pin_13) (type passive))
        (pin (num 14) (name Pin_14) (type passive))
        (pin (num 15) (name Pin_15) (type passive))
<<<<<<< HEAD
        (pin (num 16) (name Pin_16) (type passive))))
    (libpart (lib Connector) (part SD_Card)
      (description "SD Card Reader")
      (docs http://portal.fciconnect.com/Comergent//fci/drawing/10067847.pdf)
      (footprints
        (fp SD*))
      (fields
        (field (name Reference) J)
        (field (name Value) SD_Card))
      (pins
        (pin (num 1) (name CD/DAT3) (type input))
        (pin (num 2) (name CMD) (type input))
        (pin (num 3) (name VSS) (type power_in))
        (pin (num 4) (name VDD) (type power_in))
        (pin (num 5) (name CLK) (type input))
        (pin (num 6) (name VSS) (type power_in))
        (pin (num 7) (name DAT0) (type input))
        (pin (num 8) (name DAT1) (type input))
        (pin (num 9) (name DAT2) (type input))
        (pin (num 10) (name CARD_DETECT) (type input))
        (pin (num 11) (name WRITE_PROTECT) (type input))
        (pin (num 12) (name SHELL1) (type input))
        (pin (num 13) (name SHELL2) (type input))))
    (libpart (lib Device) (part Crystal)
      (description "Two pin crystal")
      (docs ~)
      (footprints
        (fp Crystal*))
      (fields
        (field (name Reference) Y)
        (field (name Value) Crystal))
      (pins
        (pin (num 1) (name 1) (type passive))
        (pin (num 2) (name 2) (type passive))))
    (libpart (lib MCU_Microchip_ATmega) (part ATmega48PV-10PU)
      (aliases
        (alias ATmega48P-20PU)
        (alias ATmega48A-PU)
        (alias ATmega48PA-PU)
        (alias ATmega88PV-10PU)
        (alias ATmega88P-20PU)
        (alias ATmega88A-PU)
        (alias ATmega88PA-PU)
        (alias ATmega168PV-10PU)
        (alias ATmega168P-20PU)
        (alias ATmega168A-PU)
        (alias ATmega168PA-PU)
        (alias ATmega328-PU)
        (alias ATmega328P-PU))
      (description "10MHz, 4kB Flash, 512B SRAM, 256B EEPROM, DIP-28")
      (docs http://ww1.microchip.com/downloads/en/DeviceDoc/Atmel-8025-8-bit-AVR-Microcontroller-ATmega48P-88P-168P_Datasheet.pdf)
      (footprints
        (fp DIP*W7.62mm*))
      (fields
        (field (name Reference) U)
        (field (name Value) ATmega48PV-10PU)
        (field (name Footprint) Package_DIP:DIP-28_W7.62mm))
      (pins
        (pin (num 1) (name ~RESET~/PC6) (type 3state))
        (pin (num 2) (name PD0) (type 3state))
        (pin (num 3) (name PD1) (type 3state))
        (pin (num 4) (name PD2) (type 3state))
        (pin (num 5) (name PD3) (type 3state))
        (pin (num 6) (name PD4) (type 3state))
        (pin (num 7) (name VCC) (type power_in))
        (pin (num 8) (name GND) (type power_in))
        (pin (num 9) (name XTAL1/PB6) (type 3state))
        (pin (num 10) (name XTAL2/PB7) (type 3state))
        (pin (num 11) (name PD5) (type 3state))
        (pin (num 12) (name PD6) (type 3state))
        (pin (num 13) (name PD7) (type 3state))
        (pin (num 14) (name PB0) (type 3state))
        (pin (num 15) (name PB1) (type 3state))
        (pin (num 16) (name PB2) (type 3state))
        (pin (num 17) (name PB3) (type 3state))
        (pin (num 18) (name PB4) (type 3state))
        (pin (num 19) (name PB5) (type 3state))
        (pin (num 20) (name AVCC) (type power_in))
        (pin (num 21) (name AREF) (type passive))
        (pin (num 22) (name GND) (type passive))
        (pin (num 23) (name PC0) (type 3state))
        (pin (num 24) (name PC1) (type 3state))
        (pin (num 25) (name PC2) (type 3state))
        (pin (num 26) (name PC3) (type 3state))
        (pin (num 27) (name PC4) (type 3state))
        (pin (num 28) (name PC5) (type 3state)))))
  (libraries
    (library (logical Connector)
      (uri "C:\\Program Files\\KiCad\\share\\kicad\\library/Connector.lib"))
    (library (logical Device)
      (uri "C:\\Program Files\\KiCad\\share\\kicad\\library/Device.lib"))
    (library (logical MCU_Microchip_ATmega)
      (uri "C:\\Program Files\\KiCad\\share\\kicad\\library/MCU_Microchip_ATmega.lib")))
  (nets
    (net (code 1) (name "Net-(U1-Pad9)")
      (node (ref U1) (pin 9))
      (node (ref Y1) (pin 1)))
    (net (code 2) (name "Net-(U1-Pad10)")
      (node (ref Y1) (pin 2))
      (node (ref U1) (pin 10)))
    (net (code 3) (name 3.3V)
      (node (ref U1) (pin 7))
      (node (ref J2) (pin 16))
      (node (ref U1) (pin 20))
      (node (ref J1) (pin 1)))
    (net (code 4) (name SDA)
      (node (ref U1) (pin 28))
      (node (ref J1) (pin 6)))
    (net (code 5) (name SCL)
      (node (ref J1) (pin 5))
      (node (ref U1) (pin 27)))
    (net (code 6) (name Reset)
      (node (ref U1) (pin 1)))
    (net (code 7) (name A0)
      (node (ref U1) (pin 23)))
    (net (code 8) (name "Net-(U1-Pad16)")
      (node (ref U1) (pin 16)))
    (net (code 9) (name "Net-(U1-Pad21)")
      (node (ref U1) (pin 21)))
    (net (code 10) (name A1)
      (node (ref U1) (pin 24))
      (node (ref J2) (pin 12)))
    (net (code 11) (name TXD:D1)
      (node (ref U1) (pin 3)))
    (net (code 12) (name GND)
      (node (ref J1) (pin 16))
      (node (ref J2) (pin 1))
      (node (ref U1) (pin 8))
      (node (ref U1) (pin 22)))
    (net (code 13) (name "Net-(J3-Pad9)")
      (node (ref J3) (pin 9)))
    (net (code 14) (name "Net-(J3-Pad1)")
      (node (ref J3) (pin 1)))
    (net (code 15) (name "Net-(J3-Pad10)")
      (node (ref J3) (pin 10)))
    (net (code 16) (name "Net-(J3-Pad11)")
      (node (ref J3) (pin 11)))
    (net (code 17) (name "Net-(J3-Pad12)")
      (node (ref J3) (pin 12)))
    (net (code 18) (name "Net-(J3-Pad13)")
      (node (ref J3) (pin 13)))
    (net (code 19) (name "Net-(J3-Pad2)")
      (node (ref J3) (pin 2)))
    (net (code 20) (name "Net-(J3-Pad3)")
      (node (ref J3) (pin 3)))
    (net (code 21) (name "Net-(J3-Pad4)")
      (node (ref J3) (pin 4)))
    (net (code 22) (name "Net-(J3-Pad6)")
      (node (ref J3) (pin 6)))
    (net (code 23) (name "Net-(J3-Pad7)")
      (node (ref J3) (pin 7)))
    (net (code 24) (name "Net-(J3-Pad8)")
      (node (ref J3) (pin 8)))
    (net (code 25) (name D7)
      (node (ref U1) (pin 13))
      (node (ref J1) (pin 12))
      (node (ref J1) (pin 14)))
    (net (code 26) (name SCK)
      (node (ref J2) (pin 13))
      (node (ref J3) (pin 5))
      (node (ref U1) (pin 19)))
    (net (code 27) (name D8)
      (node (ref J1) (pin 15))
      (node (ref U1) (pin 14)))
    (net (code 28) (name D9)
      (node (ref U1) (pin 15)))
    (net (code 29) (name MOSI)
      (node (ref J2) (pin 15))
      (node (ref U1) (pin 17)))
    (net (code 30) (name MISO)
      (node (ref J2) (pin 14))
      (node (ref U1) (pin 18)))
    (net (code 31) (name A2)
      (node (ref J2) (pin 11))
      (node (ref U1) (pin 25)))
    (net (code 32) (name A3)
      (node (ref J2) (pin 10))
      (node (ref U1) (pin 26)))
    (net (code 33) (name RXD:D0)
      (node (ref U1) (pin 2)))
    (net (code 34) (name D2)
      (node (ref J1) (pin 7))
      (node (ref U1) (pin 4)))
    (net (code 35) (name D3)
      (node (ref J1) (pin 8))
      (node (ref U1) (pin 5)))
    (net (code 36) (name D4)
      (node (ref U1) (pin 6))
      (node (ref J1) (pin 9)))
    (net (code 37) (name D5)
      (node (ref U1) (pin 11))
      (node (ref J1) (pin 10)))
    (net (code 38) (name D6)
      (node (ref J1) (pin 13))
      (node (ref U1) (pin 12))
      (node (ref J1) (pin 11)))
    (net (code 39) (name "#")
      (node (ref J1) (pin 4))
      (node (ref J1) (pin 3))
      (node (ref J1) (pin 2))
      (node (ref J2) (pin 9))
      (node (ref J2) (pin 5))
      (node (ref J2) (pin 7))
      (node (ref J2) (pin 6))
      (node (ref J2) (pin 4))
      (node (ref J2) (pin 3))
      (node (ref J2) (pin 8)))
    (net (code 40) (name 5V)
      (node (ref J2) (pin 2)))))
=======
        (pin (num 16) (name Pin_16) (type passive)))))
  (libraries
    (library (logical Connector)
      (uri "C:\\Program Files\\KiCad\\share\\kicad\\library/Connector.lib")))
  (nets
    (net (code 1) (name SCL)
      (node (ref J2) (pin 4)))
    (net (code 2) (name RXI)
      (node (ref J1) (pin 6)))
    (net (code 3) (name TX0)
      (node (ref J1) (pin 5)))
    (net (code 4) (name 5V)
      (node (ref J1) (pin 3)))
    (net (code 5) (name 3.3V)
      (node (ref J1) (pin 1)))
    (net (code 6) (name A6)
      (node (ref J2) (pin 1)))
    (net (code 7) (name A7)
      (node (ref J2) (pin 2)))
    (net (code 8) (name SDA)
      (node (ref J2) (pin 3)))
    (net (code 9) (name D2)
      (node (ref J1) (pin 9)))
    (net (code 10) (name SS)
      (node (ref J2) (pin 5)))
    (net (code 11) (name MOSI)
      (node (ref J2) (pin 6)))
    (net (code 12) (name MISO)
      (node (ref J2) (pin 7)))
    (net (code 13) (name SCK)
      (node (ref J2) (pin 8)))
    (net (code 14) (name A0)
      (node (ref J2) (pin 9)))
    (net (code 15) (name A1)
      (node (ref J2) (pin 10)))
    (net (code 16) (name A2)
      (node (ref J2) (pin 11)))
    (net (code 17) (name A3)
      (node (ref J2) (pin 12)))
    (net (code 18) (name VCC)
      (node (ref J2) (pin 13)))
    (net (code 19) (name GND)
      (node (ref J1) (pin 8))
      (node (ref J1) (pin 2))
      (node (ref J1) (pin 4))
      (node (ref J2) (pin 15)))
    (net (code 20) (name RST)
      (node (ref J2) (pin 14))
      (node (ref J1) (pin 7)))
    (net (code 21) (name RAW)
      (node (ref J2) (pin 16)))
    (net (code 22) (name D9)
      (node (ref J1) (pin 16)))
    (net (code 23) (name D8)
      (node (ref J1) (pin 15)))
    (net (code 24) (name D7)
      (node (ref J1) (pin 14)))
    (net (code 25) (name D6)
      (node (ref J1) (pin 13)))
    (net (code 26) (name D5)
      (node (ref J1) (pin 12)))
    (net (code 27) (name D4)
      (node (ref J1) (pin 11)))
    (net (code 28) (name D3)
      (node (ref J1) (pin 10)))))
>>>>>>> 355f5829e446ff1ec2ebe3a819facc5eaa077a11
