EESchema Schematic File Version 4
LIBS:pcb-cache
EELAYER 29 0
EELAYER END
$Descr A4 8268 11693 portrait
encoding utf-8
Sheet 1 1
Title "Pinout PCB AstreLoon"
Date "30/01/2020"
Rev "1"
Comp "ASTRE"
Comment1 ""
Comment2 ""
Comment3 ""
Comment4 ""
$EndDescr
Text GLabel 4700 8100 0    50   Input ~ 0
<<<<<<< HEAD
#
=======
GND
>>>>>>> 355f5829e446ff1ec2ebe3a819facc5eaa077a11
Text GLabel 4700 8000 0    50   Input ~ 0
3.3V
$Comp
L Connector:Conn_01x16_Female J2
U 1 1 5E2A7235
<<<<<<< HEAD
P 6350 8800
F 0 "J2" H 6242 7775 50  0000 C CNN
F 1 "Conn_01x16_Female" H 6242 7866 50  0000 C CNN
F 2 "Connector_PinHeader_2.54mm:PinHeader_1x16_P2.54mm_Vertical" H 6350 8800 50  0001 C CNN
F 3 "~" H 6350 8800 50  0001 C CNN
	1    6350 8800
=======
P 6400 8850
F 0 "J2" H 6292 7825 50  0000 C CNN
F 1 "Conn_01x16_Female" H 6292 7916 50  0000 C CNN
F 2 "Connector_PinHeader_2.54mm:PinHeader_1x16_P2.54mm_Vertical" H 6400 8850 50  0001 C CNN
F 3 "~" H 6400 8850 50  0001 C CNN
	1    6400 8850
>>>>>>> 355f5829e446ff1ec2ebe3a819facc5eaa077a11
	-1   0    0    1   
$EndComp
$Comp
L Connector:Conn_01x16_Female J1
U 1 1 5E2A5DC5
P 5200 8700
<<<<<<< HEAD
F 0 "J1" H 4850 9650 50  0000 L CNN
F 1 "Conn_01x16_Female" H 4600 9550 50  0000 L CNN
=======
F 0 "J1" H 5228 8676 50  0000 L CNN
F 1 "Conn_01x16_Female" H 5228 8585 50  0000 L CNN
>>>>>>> 355f5829e446ff1ec2ebe3a819facc5eaa077a11
F 2 "Connector_PinHeader_2.54mm:PinHeader_1x16_P2.54mm_Vertical" H 5200 8700 50  0001 C CNN
F 3 "~" H 5200 8700 50  0001 C CNN
	1    5200 8700
	1    0    0    -1  
$EndComp
Text GLabel 4700 8200 0    50   Input ~ 0
<<<<<<< HEAD
#
Text GLabel 4700 8300 0    50   Input ~ 0
#
Text GLabel 4700 8400 0    50   Input ~ 0
SCL
Text GLabel 4700 8500 0    50   Input ~ 0
SDA
Text GLabel 4700 8600 0    50   Input ~ 0
D2
Text GLabel 4700 8700 0    50   Input ~ 0
D3
Text GLabel 4700 8800 0    50   Input ~ 0
D4
Text GLabel 4700 8900 0    50   Input ~ 0
D5
Text GLabel 4700 9000 0    50   Input ~ 0
D6
Text GLabel 4700 9100 0    50   Input ~ 0
D7
=======
5V
Text GLabel 4700 8300 0    50   Input ~ 0
GND
Text GLabel 4700 8400 0    50   Input ~ 0
TX0
Text GLabel 4700 8500 0    50   Input ~ 0
RXI
Text GLabel 4700 8600 0    50   Input ~ 0
RST
Text GLabel 4700 8700 0    50   Input ~ 0
GND
Text GLabel 4700 8800 0    50   Input ~ 0
D2
Text GLabel 4700 8900 0    50   Input ~ 0
D3
Text GLabel 4700 9000 0    50   Input ~ 0
D4
Text GLabel 4700 9100 0    50   Input ~ 0
D5
>>>>>>> 355f5829e446ff1ec2ebe3a819facc5eaa077a11
Text GLabel 4700 9200 0    50   Input ~ 0
D6
Text GLabel 4700 9300 0    50   Input ~ 0
D7
Text GLabel 4700 9400 0    50   Input ~ 0
D8
Text GLabel 4700 9500 0    50   Input ~ 0
<<<<<<< HEAD
GND
Text GLabel 6900 8000 2    50   Input ~ 0
3.3V
Text GLabel 6900 8200 2    50   Input ~ 0
MISO
Text GLabel 6900 8100 2    50   Input ~ 0
MOSI
Text GLabel 6900 8300 2    50   Input ~ 0
SCK
Text GLabel 6900 8400 2    50   Input ~ 0
A1
Text GLabel 6900 8500 2    50   Input ~ 0
A2
Text GLabel 6900 8600 2    50   Input ~ 0
A3
Text GLabel 6900 8700 2    50   Input ~ 0
#
Text GLabel 6900 8800 2    50   Input ~ 0
#
Text GLabel 6900 8900 2    50   Input ~ 0
#
Text GLabel 6900 9000 2    50   Input ~ 0
#
Text GLabel 6900 9100 2    50   Input ~ 0
#
Text GLabel 6900 9200 2    50   Input ~ 0
#
Text GLabel 6900 9300 2    50   Input ~ 0
#
Text GLabel 6900 9400 2    50   Input ~ 0
5V
Text GLabel 6900 9500 2    50   Input ~ 0
GND
=======
D9
Text GLabel 6950 8050 2    50   Input ~ 0
RAW
Text GLabel 6950 8250 2    50   Input ~ 0
RST
Text GLabel 6950 8150 2    50   Input ~ 0
GND
Text GLabel 6950 8350 2    50   Input ~ 0
VCC
Text GLabel 6950 8450 2    50   Input ~ 0
A3
Text GLabel 6950 8550 2    50   Input ~ 0
A2
Text GLabel 6950 8650 2    50   Input ~ 0
A1
Text GLabel 6950 8750 2    50   Input ~ 0
A0
Text GLabel 6950 8850 2    50   Input ~ 0
SCK
Text GLabel 6950 8950 2    50   Input ~ 0
MISO
Text GLabel 6950 9050 2    50   Input ~ 0
MOSI
Text GLabel 6950 9150 2    50   Input ~ 0
SS
Text GLabel 6950 9250 2    50   Input ~ 0
SCL
Text GLabel 6950 9350 2    50   Input ~ 0
SDA
Text GLabel 6950 9450 2    50   Input ~ 0
A7
Text GLabel 6950 9550 2    50   Input ~ 0
A6
>>>>>>> 355f5829e446ff1ec2ebe3a819facc5eaa077a11
Wire Wire Line
	4700 8000 5000 8000
Wire Wire Line
	4700 8100 5000 8100
Wire Wire Line
	4700 8200 5000 8200
Wire Wire Line
	4700 8300 5000 8300
Wire Wire Line
	4700 8400 5000 8400
Wire Wire Line
	4700 8500 5000 8500
Wire Wire Line
	4700 8600 5000 8600
Wire Wire Line
	4700 8700 5000 8700
Wire Wire Line
	4700 8800 5000 8800
Wire Wire Line
	4700 8900 5000 8900
Wire Wire Line
	4700 9000 5000 9000
Wire Wire Line
	4700 9100 5000 9100
Wire Wire Line
	5000 9200 4700 9200
Wire Wire Line
	4700 9300 5000 9300
Wire Wire Line
	4700 9400 5000 9400
Wire Wire Line
	4700 9500 5000 9500
Wire Wire Line
<<<<<<< HEAD
	6550 9500 6900 9500
Wire Wire Line
	6550 9400 6900 9400
Wire Wire Line
	6550 9300 6900 9300
Wire Wire Line
	6900 9200 6550 9200
Wire Wire Line
	6550 9100 6900 9100
Wire Wire Line
	6550 9000 6900 9000
Wire Wire Line
	6550 8900 6900 8900
Wire Wire Line
	6550 8800 6900 8800
Wire Wire Line
	6900 8700 6550 8700
Wire Wire Line
	6550 8600 6900 8600
Wire Wire Line
	6550 8500 6900 8500
Wire Wire Line
	6900 8400 6550 8400
Wire Wire Line
	6550 8300 6900 8300
Wire Wire Line
	6900 8200 6550 8200
Wire Wire Line
	6550 8100 6900 8100
Wire Wire Line
	6900 8000 6550 8000
=======
	6600 9550 6950 9550
Wire Wire Line
	6600 9450 6950 9450
Wire Wire Line
	6600 9350 6950 9350
Wire Wire Line
	6950 9250 6600 9250
Wire Wire Line
	6600 9150 6950 9150
Wire Wire Line
	6600 9050 6950 9050
Wire Wire Line
	6600 8950 6950 8950
Wire Wire Line
	6600 8850 6950 8850
Wire Wire Line
	6950 8750 6600 8750
Wire Wire Line
	6600 8650 6950 8650
Wire Wire Line
	6600 8550 6950 8550
Wire Wire Line
	6950 8450 6600 8450
Wire Wire Line
	6600 8350 6950 8350
Wire Wire Line
	6950 8250 6600 8250
Wire Wire Line
	6600 8150 6950 8150
Wire Wire Line
	6950 8050 6600 8050
>>>>>>> 355f5829e446ff1ec2ebe3a819facc5eaa077a11
$Comp
L MCU_Microchip_ATmega:ATmega328P-PU U1
U 1 1 5E3DBF29
P 4200 3200
F 0 "U1" H 3556 3246 50  0000 R CNN
F 1 "ATmega328P-PU" H 3556 3155 50  0000 R CNN
<<<<<<< HEAD
F 2 "Housings_DIP:DIP-28_W7.62mm_Socket" H 4200 3200 50  0001 C CIN
=======
F 2 "Package_DIP:DIP-28_W7.62mm" H 4200 3200 50  0001 C CIN
>>>>>>> 355f5829e446ff1ec2ebe3a819facc5eaa077a11
F 3 "http://ww1.microchip.com/downloads/en/DeviceDoc/ATmega328_P%20AVR%20MCU%20with%20picoPower%20Technology%20Data%20Sheet%2040001984A.pdf" H 4200 3200 50  0001 C CNN
	1    4200 3200
	1    0    0    -1  
$EndComp
$Comp
<<<<<<< HEAD
L power:GND #PWR0101
U 1 1 5E3F5673
P 4200 4900
F 0 "#PWR0101" H 4200 4650 50  0001 C CNN
=======
L power:GND #PWR?
U 1 1 5E3F5673
P 4200 4900
F 0 "#PWR?" H 4200 4650 50  0001 C CNN
>>>>>>> 355f5829e446ff1ec2ebe3a819facc5eaa077a11
F 1 "GND" H 4205 4727 50  0000 C CNN
F 2 "" H 4200 4900 50  0001 C CNN
F 3 "" H 4200 4900 50  0001 C CNN
	1    4200 4900
	1    0    0    -1  
$EndComp
Wire Wire Line
	4200 4900 4200 4700
$Comp
L Device:Crystal Y1
U 1 1 5E442234
P 5650 2650
F 0 "Y1" V 5604 2781 50  0000 L CNN
F 1 "Crystal" V 5695 2781 50  0000 L CNN
F 2 "" H 5650 2650 50  0001 C CNN
F 3 "~" H 5650 2650 50  0001 C CNN
	1    5650 2650
	0    1    1    0   
$EndComp
Wire Wire Line
	4800 2600 5400 2600
Wire Wire Line
	5400 2600 5400 2500
Wire Wire Line
	5400 2500 5650 2500
Wire Wire Line
	5650 2800 5400 2800
Wire Wire Line
	5400 2800 5400 2700
Wire Wire Line
	5400 2700 4800 2700
Wire Wire Line
	5650 2500 6400 2500
Connection ~ 5650 2500
Wire Wire Line
	5650 2800 6400 2800
Connection ~ 5650 2800
$Comp
<<<<<<< HEAD
L power:+3.3V #PWR0102
U 1 1 5E447585
P 4250 1250
F 0 "#PWR0102" H 4250 1100 50  0001 C CNN
=======
L power:+3.3V #PWR?
U 1 1 5E447585
P 4250 1250
F 0 "#PWR?" H 4250 1100 50  0001 C CNN
>>>>>>> 355f5829e446ff1ec2ebe3a819facc5eaa077a11
F 1 "+3.3V" H 4265 1423 50  0000 C CNN
F 2 "" H 4250 1250 50  0001 C CNN
F 3 "" H 4250 1250 50  0001 C CNN
	1    4250 1250
	1    0    0    -1  
$EndComp
Wire Wire Line
	4300 1700 4300 1250
Wire Wire Line
	4300 1250 4250 1250
Wire Wire Line
	4200 1700 4200 1250
Wire Wire Line
	4200 1250 4250 1250
Connection ~ 4250 1250
Text GLabel 5250 3400 2    50   Input ~ 0
SDA
Wire Wire Line
	5250 3400 4800 3400
Wire Wire Line
	4800 3300 5250 3300
<<<<<<< HEAD
=======
$Comp
L Connector:SD_Card J1
U 1 1 5E44C058
P 1850 6350
F 0 "J1" H 1850 5685 50  0000 C CNN
F 1 "SD_Card" H 1850 5776 50  0000 C CNN
F 2 "" H 1850 6350 50  0001 C CNN
F 3 "http://portal.fciconnect.com/Comergent//fci/drawing/10067847.pdf" H 1850 6350 50  0001 C CNN
	1    1850 6350
	-1   0    0    1   
$EndComp
>>>>>>> 355f5829e446ff1ec2ebe3a819facc5eaa077a11
Text GLabel 5250 3500 2    50   Input ~ 0
Reset
Wire Wire Line
	4800 3500 5250 3500
Text GLabel 5150 2900 2    50   Input ~ 0
A0
Text GLabel 5150 3000 2    50   Input ~ 0
A1
Wire Wire Line
	4800 2900 5150 2900
Wire Wire Line
	4800 3000 5150 3000
Text GLabel 5150 3100 2    50   Input ~ 0
A2
Wire Wire Line
	4800 3100 5150 3100
Text GLabel 5150 3200 2    50   Input ~ 0
A3
Wire Wire Line
	4800 3200 5150 3200
Text GLabel 1850 1250 2    50   Input ~ 0
3.3V
$Comp
<<<<<<< HEAD
L power:+3.3V #PWR0103
U 1 1 5E456600
P 1600 1250
F 0 "#PWR0103" H 1600 1100 50  0001 C CNN
=======
L power:+3.3V #PWR?
U 1 1 5E456600
P 1600 1250
F 0 "#PWR?" H 1600 1100 50  0001 C CNN
>>>>>>> 355f5829e446ff1ec2ebe3a819facc5eaa077a11
F 1 "+3.3V" V 1615 1378 50  0000 L CNN
F 2 "" H 1600 1250 50  0001 C CNN
F 3 "" H 1600 1250 50  0001 C CNN
	1    1600 1250
	0    -1   -1   0   
$EndComp
Wire Wire Line
	1850 1250 1600 1250
Text GLabel 5250 3300 2    50   Input ~ 0
SCL
Text GLabel 5200 3700 2    50   Input ~ 0
RXD:D0
Text GLabel 5200 3800 2    50   Input ~ 0
TXD:D1
Wire Wire Line
	5200 3700 4800 3700
Wire Wire Line
	4800 3800 5200 3800
<<<<<<< HEAD
Text GLabel 5200 3900 2    50   Input ~ 0
D2
Text GLabel 5200 4000 2    50   Input ~ 0
D3
Text GLabel 5200 4100 2    50   Input ~ 0
D4
Text GLabel 5200 4200 2    50   Input ~ 0
D5
Text GLabel 5200 4300 2    50   Input ~ 0
D6
Wire Wire Line
	4800 3900 5200 3900
Wire Wire Line
	4800 4000 5200 4000
Wire Wire Line
	4800 4100 5200 4100
Wire Wire Line
	4800 4200 5200 4200
Wire Wire Line
	4800 4300 5200 4300
Text GLabel 5200 4400 2    50   Input ~ 0
D7
Wire Wire Line
	5200 4400 4800 4400
$Comp
L Connector:SD_Card J3
U 1 1 5E451C3B
P 2550 6300
F 0 "J3" H 2550 5635 50  0000 C CNN
F 1 "SD_Card" H 2550 5726 50  0000 C CNN
F 2 "" H 2550 6300 50  0001 C CNN
F 3 "http://portal.fciconnect.com/Comergent//fci/drawing/10067847.pdf" H 2550 6300 50  0001 C CNN
	1    2550 6300
	-1   0    0    1   
$EndComp
Text GLabel 3700 6200 2    50   Input ~ 0
SCK
Wire Wire Line
	3450 6200 3700 6200
Text GLabel 5150 2000 2    50   Input ~ 0
D8
Text GLabel 5150 2100 2    50   Input ~ 0
D9
Text GLabel 5150 2300 2    50   Input ~ 0
MOSI
Text GLabel 5150 2400 2    50   Input ~ 0
MISO
Text GLabel 5150 2500 2    50   Input ~ 0
SCK
Wire Wire Line
	5150 2000 4800 2000
Wire Wire Line
	4800 2300 5150 2300
Wire Wire Line
	4800 2100 5150 2100
Wire Wire Line
	4800 2400 5150 2400
Wire Wire Line
	4800 2500 5150 2500
=======
>>>>>>> 355f5829e446ff1ec2ebe3a819facc5eaa077a11
$EndSCHEMATC
