[Championship]
Name=Random Simulation 6
Year=1229

[Score]
1=782
2=1879
3=999
4=1552
5=172
6=702
7=186
8=1869
9=1845
10=1377
11=113
12=1576
13=1267
14=1132
*=0

[Circuits]
Circuit=SFGVB;I6QR0L44ECXI X;Road;AntiClockwise;31666;523
Circuit=83YZK2K56H5;0IGBDI 1B9;Street;AntiClockwise;16236;339
Circuit=6V5YDS;PI2G9A997HES2RL;Race;ClockWise;54209;736
Circuit=1CT92A KNHQIQ13MCB1; E;Road;ClockWise;83792;238
Circuit=21EMA4ZFIHG; ZUAZKM0TRAS P X0SE;Road;ClockWise;42310;518
Circuit=DI;CXE551DLUNNU;Race;ClockWise;3893;300
Circuit=MW5BQ1DY2UG9;WC0Y6NGYJLYCNEUXEO;Street;AntiClockwise;47998;737
Circuit=AHN2G TFVP2SGPG;U8DKG DWTBXG9DQ5Q9X;Race;AntiClockwise;40558;486
Circuit=TR8NBQ0IJLUXMVB;2IF;Road;ClockWise;19383;496
Circuit=CI3S9FQ4SXSFJSV89Z;7IDNVUHGM8QM 9Q;Race;ClockWise;91881;722
Circuit=D35;U9T1UPOT0CZ 5H82 E7;Street;ClockWise;50758;200
Circuit=NAIOX3PJPB;ZQ3TB4K62 N0;Race;AntiClockwise;18165;987
Circuit=XB11HGOFFDJJ1QFL;TL;Road;ClockWise;48599;232
Circuit=T;K;Road;AntiClockwise;44708;820
Circuit=2 59IWE7Z;WTJ7;Road;ClockWise;45780;651
Circuit=2F4Q0ZGD0KX;1KZFQEL0J;Street;AntiClockwise;3743;701
Circuit=D09O3F;YWGPITQAHOUG2 IPAMM;Race;ClockWise;66461;355
Circuit=IPCO174K1WC9B7;KI8PRT0K6K9BQH0;Street;ClockWise;41341;687
Circuit=NXR;06ANGQ QVY;Street;AntiClockwise;94214;297
Circuit=FHD25ODBW3;M7Y7VR81Y07;Race;AntiClockwise;96798;614
Circuit=XJLERR9GTZX;392N7XT;Race;AntiClockwise;46804;274

[Drivers]
Driver=3JSJ4ITUPMS;40;PZ0C3KP51EM8MC82G;LV8Z0ZK6O4JUQ6R2EJC;Casual;490;735;124
Driver=EF;33;FV2IMH5819;2;HardCore;882;606;611
Driver=RRU9Z02SUQIXW;47;OIIRMEZW4OKBXV5TC6Q;57H7CR4XPZENS4;Core;639;383;140
Driver=250UOYF808F;63;5DRB;O6KCHF;Casual;941;543;794
Driver=F8A67;10;XTOL;7RTNHY1BWC1 K0YVKQ;Noob;346;885;497
Driver=1K8CK;38;AUOF0W716B WCHAW;NWMC;Casual;979;16;421
Driver=W70Z2HK;62;7V8 NZIL6;0A0Z00ZB01UN0BKL4;Noob;363;223;407
Driver=UZWPW9OAY;18;9L7IA9DFU 6;570C5C8YR8U;Noob;995;114;291
Driver=M0;73;GD PW;OFJI;Casual;678;153;752
Driver=7T81QCA11I6YACIJ ;31;40YJ8UTI0CR5N;HG43F3ECIYOJ0FG;HardCore;215;678;855
Driver=GIJAG84LZJOT73;73;R5TU1S 6;4OC053 KCB9U2;HardCore;857;297;759
Driver= 14MKV14M;47;YIONNT2W4QOI528606Y; 9V67;Noob;66;780;133
Driver=X2DN0FOWLTG0 VS9UM0;11;ZJ90YTQNR R0R1R2PI0;KM14IV;Casual;402;57;523
Driver=DA9SEXBX8;27;TZAS4BHED 0YMTFSC;CK9UB;Core;456;787;974
Driver=GDNBRHEHDQN5OMQ;36;W9 F O6;7 YPBBCUM76NX5MAL 2;Core;433;547;196
Driver=EGAYX;24;RCVIQ2BPLLBPVA;1X95 XHTN3CG86;Noob;883;717;712
Driver=UKDUT8NOES2AHPPO0;65;CKUHQ;WDTJPM0O;Noob;134;469;526
Driver=BK4O6AC;78;RYG8SEWACY;844E;Core;156;43;638
Driver=85MRG2;42;MPM;VBVJPIJTEO5H;Casual;212;452;691
Driver= P6JT44RMMF50J;70;J2TP14;UFU EC9L;HardCore;446;636;438
Driver=MT2P877NKYWND9Y;20;9GBMD ;0ONAOPD38U7J2A38;Casual;191;884;874
Driver=9 YWGYK6PJT90UT;72;5V3PUBPOKFIUFHEQ9PN;2JPTCFY0;HardCore;292;253;393
Driver=AKVNP;77;I6SBL;BPT2FF;Core;192;620;166
Driver=POZV 75;78;G45V PFUN7S26WLKTE;DAOEL;Noob;11;553;531
Driver=WGMM5VYGF0NXJJ2VU;65;LR3W673Z;V 6W8RKLPT1;Core;602;357;976
Driver=OF5UQR2FMP4VRQC;73;WF5;029QGABZ0D4DES;Core;838;985;130
Driver=RVB;43;8CY4R14YAZN7EKQ;QWLARM9QCFRX1J;Noob;738;488;696
Driver=N6JN PE4K865CNB 0RJ;52;I2L;G81UXP;Casual;43;483;371
Driver=9ABHEFEK;53;NIFAAPX4EE8;3S;Casual;258;658;532
Driver=WAQW1RHO CXBYXUT;39;O PXIRQ7HU56;V439N2UJUH;Noob;839;52;469
Driver=G854BERO;77; F5JYUEVCI5YG16;52G3HAT;Casual;22;617;998
Driver=QMOAW3OPK;49;0RPZUS1D90KZIF; XOIBUDEW6R;Core;579;960;498
Driver=IRD0V57S57C;61;XG6B;2BBSFWM33D5GEQ31;Casual;754;44;852
Driver=R0GXAOQIK3TF17S;60;RO3B4YZ;W8PFP4GQ ULMSW8;Casual;572;803;41
Driver=06I2PURW0YCS5OQAC6 ;34;1MHN46QPRAXC37;H;Casual;991;260;721
Driver=7J5YHR;34;8CKK9UBOWZ;G;Casual;635;427;431
Driver=P3Z60X6RP8;47;Z D ;V2;Core;926;494;183

