URL
http://users.nik.uni-obuda.hu/szabozs/K24/

WIFI
SSID: Kockanap X 2019
pass: kockanap2k19

SERVER IP:
192.168.1.20

PHPMYADMIN URL:
http://192.168.1.20/phpmyadmin/

GET TRACK MASK URL:
http://192.168.1.20/geekday/
					DRserver.php?track=TR0

SOAP URL:
http://192.168.1.20:8888/DrService