WWWWWWWWWWWWWWWWWWWW
W1                 W
WOV V V V V V V V VW
W        P        QW
WV V V V V V V V VOW
WR       S         W
WOV V V V V V V V VW
W                  W
WV V V V V V V V VRW
W   T    T  U T    W
W    T U  T    T   W
WRV V V V V V V V VW
W                  W
WV V V V V V V V VOW
W        S        RW
WOV V V V V V V V VW
WQ       P         W
WV V V V V V V V VOW
W                 0W
WWWWWWWWWWWWWWWWWWWW
