{
  "general": {
    "url": "https://github.com/opencv/opencv_contrib"
  },

  "update": {
    "git": {
      "https_url": "https://github.com/opencv/opencv_contrib.git",
      "default_checkout_ref": "4.6.0"
    }
  },
  "install": {
    "env": {
      "opencv_contrib_DIR": "$MODULE_PATH"
    }
  }
}
