{
  "install": {
    "run": {
      "script": "scripts/install_cuda_10.1_cudnn_7.6.sh"
    },
    "env": {
      "CUDA_10_1_CUDNN_7_6_HOME": "$MODULE_PATH",
      "CUDA_10_1_CUDNN_7_6_ROOT": "$CUDA_10_1_CUDNN_7_6_HOME/bin",
      "CUDA_10_1_CUDNN_7_6_TOOLKIT_ROOT_DIR": "$CUDA_10_1_CUDNN_7_6_HOME",
      "CUDA_10_1_CUDNN_7_6_PATH": "$CUDA_10_1_CUDNN_7_6_HOME/bin",
      "CUDA_10_1_CUDNN_7_6_LD_LIBRARY_PATH": "$CUDA_10_1_CUDNN_7_6_HOME/lib64"
    },
    "source": {
      "paths": [
        "scripts/activate_cuda_10.1_cudnn_7.6.sh"
      ]
    }
  },

  "required_modules": {
    "deps/cuda/cuda-util": {}
  }
}
