{
  "general": {
    "url": "https://developer.android.com/studio"
  },

  "update": {
    "archive": {
      "url": "https://redirector.gvt1.com/edgedl/android/studio/ide-zips/2020.3.1.25/android-studio-2020.3.1.25-linux.tar.gz",
      "extract": true
    }
  },

  "install": {
    "env": {
      "PATH": "$MODULE_PATH/android-studio/bin:$PATH"
    }
  }
}
