{
  "general": {
    "url": "https://git.h2t.iar.kit.edu/sw/simox/simox"
  },

  "update": {
    "git": {
      "ssh_url": "git@git.h2t.iar.kit.edu:sw/simox/simox.git",
      "https_url": "https://git.h2t.iar.kit.edu/sw/simox/simox.git"
    }
  },

  "prepare": {
    "cmake": {
      "project_name": "Simox",
      "definitions": {
        "CMAKE_C_COMPILER": "$AXII_DEFAULT_C_COMPILER",
        "CMAKE_CXX_COMPILER": "$AXII_DEFAULT_CXX_COMPILER",
        "BUILD_TESTING": "ON",
        "BULLET_ROOT": "$BULLET_ROOT"
      }
    },
    "python": {
      "packages": {
        "python/convert_meshes": {}
      }
    }
  },

  "build": "cmake",

  "install":
  {
    "env": {
      "PATH": "$MODULE_PATH/build/bin:$PATH"
    }
  },

  "required_modules": {
    "meta/default_compiler": {},

    "apt/assimp": {},
    "apt/boost": {},
    "apt/eigen3": {},
    "apt/freeglut3": {},
    "apt/nlopt": {},
    "apt/qhull": {},
    "apt/qt5": {},
    "apt/tiff": {},
    "apt/urdfdom": {},

    "deps/coin/coin": {},
    "deps/coin/soqt": {},
    "deps/bullet3": {}
  }
}
