{
  "general": {
    "url": "https://github.com/roboception/rc_genicam_api"
  },

  "update": {
    "git": {
      "ssh_url": "git@github.com:roboception/rc_genicam_api.git",
      "https_url": "https://github.com/roboception/rc_genicam_api",
      "default_checkout_ref": "master"
    }
  },

  "prepare": {
    "cmake": {
      "definitions": {
        "CMAKE_INSTALL_PREFIX": "install"
      }
    }
  },

  "build": "cmake",

  "install": {
    "cmake": {},
    "env": {
      "RC_GENICAM_API_DIR": "$MODULE_PATH/build/install/lib/rc_genicam_api",
      "GENICAM_GENTL32_PATH": "$MODULE_PATH/build/install/lib/rc_genicam_api",
      "GENICAM_GENTL64_PATH": "$MODULE_PATH/build/install/lib/rc_genicam_api"
    }
  },

  "required_modules": {
    "apt/gxx-6": {}
  }
}
