{
  "system": {
    "packages": {
      "apt": [
        "libnlopt-dev",
        {
          "axii.switch_os": {
            "bionic": null,
            "default": "libnlopt-cxx-dev"
          }
        }
      ]
    }
  }
}
