{
  "system": {
    "packages": {
      "apt": [
        "openvpn",
        "ssh",
        "openssh-client",
        "openssh-server",
        "network-manager",
        "network-manager-openvpn-gnome",
        "fping"
      ]
    }
  }
}
