{
  "general": {
    "url": "https://git.h2t.iar.kit.edu/sw/armarx-integration/robots/armarde/skills"
  },

  "update": {
    "git": {
      "ssh_url": "git@git.h2t.iar.kit.edu:sw/armarx-integration/robots/armarde/skills.git",
      "https_url": "https://git.h2t.iar.kit.edu/sw/armarx-integration/robots/armarde/skills.git"
    }
  },
  "prepare": {
    "cmake": {
      "project_name": "armarde_skills",
      "definitions": {
        "CMAKE_C_COMPILER": "$ARMARX_C_COMPILER",
        "CMAKE_CXX_COMPILER": "$ARMARX_CXX_COMPILER"
      }
    }
  },
  "build": "cmake",

  "required_modules": {
    "apt/ssh": {},
    "apt/fftw3": {},

    "armarx/meta/compiler": {},
    "armarx/ArmarXCore": {},
    "armarx/ArmarXGui": {},
    "armarx/RobotAPI": {},
    "armarx/MemoryX": {},
    "armarx/VisionX": {
        "features": ["azure-kinect", "azure-kinect-body-tracking", "openpose"]
    },
    "armarx/RobotComponents": {},
    "armarx/RobotSkillTemplates": {},
    "armarx/SpeechX": {},
    "armarx/ArmarXSimulation": {},

    "armarx_integration/robots/armarde/models": {}
  }

}
