{
  "general": {
    "url": "https://gitlab.com/h2t/software/external/dynamic_obstacle_avoidance"
  },

  "update": {
    "git": {
      "ssh_url": "git@gitlab.com:h2t/software/external/dynamic_obstacle_avoidance.git",
      "https_url": "https://gitlab.com/h2t/software/external/dynamic_obstacle_avoidance.git",
      "default_checkout_ref": "h2t"
    }
  },
  "prepare": "cmake",
  "build": "cmake",

  "required_modules": {
    "deps/epfl-dynamical-system/ds-adaptor": {}
  }
}
