{
  "general": {
    "url": "https://git.h2t.iar.kit.edu/sw/armarx/robot-skill-templates"
  },

  "update": {
    "git": {
      "ssh_url": "git@git.h2t.iar.kit.edu:sw/armarx/robot-skill-templates.git",
      "https_url": "https://git.h2t.iar.kit.edu/sw/armarx/robot-skill-templates.git"
    }
  },
  "prepare": {
    "cmake": {
      "project_name": "RobotSkillTemplates",
      "definitions": {
        "CMAKE_C_COMPILER": "$ARMARX_C_COMPILER",
        "CMAKE_CXX_COMPILER": "$ARMARX_CXX_COMPILER"
      }
    }
  },
  "build": "cmake",

  "required_modules": {
    "armarx/meta/compiler": {},
    "armarx/RobotComponents": {}
  }
}
