<?xml version="1.0" standalone="yes"?>

<svg version="1.1" viewBox="0.0 0.0 64.0 64.0" fill="none" stroke="none" stroke-linecap="square" stroke-miterlimit="10" xmlns="http://www.w3.org/2000/svg" xmlns:xlink="http://www.w3.org/1999/xlink"><clipPath id="p.0"><path d="m0 0l64.0 0l0 64.0l-64.0 0l0 -64.0z" clip-rule="nonzero"></path></clipPath><g clip-path="url(#p.0)"><path fill="#000000" fill-opacity="0.0" d="m0 0l64.0 0l0 64.0l-64.0 0z" fill-rule="nonzero"></path><path fill="#073763" d="m0.003555643 10.670436l0 0c0 -5.8911552 4.775725 -10.666881 10.666881 -10.666881l42.666237 0l0 0c2.829033 0 5.542198 1.1238288 7.5426254 3.1242568c2.0004272 2.0004282 3.1242561 4.7135906 3.1242561 7.5426235l0 42.666237c0 5.8911552 -4.7757263 10.666882 -10.666882 10.666882l-42.666237 0c-5.8911552 0 -10.666881 -4.7757263 -10.666881 -10.666882z" fill-rule="nonzero"></path><path fill="#000000" fill-opacity="0.0" d="m6.997333 -11.084444l62.582676 0l0 53.66929l-62.582676 0z" fill-rule="nonzero"></path><path fill="#ffffff" d="m51.95046 52.075554l-9.953125 0l-3.65625 -10.765625l-14.921875 0l-3.59375 10.765625l-9.703126 0l15.125001 -40.890625l11.96875 0l14.734375 40.890625zm-15.75 -17.328125l-5.15625 -15.374998l-0.25 0l-5.171875 15.374998l10.578125 0z" fill-rule="nonzero"></path><path fill="#000000" fill-opacity="0.0" d="m35.54933 -4.750222l61.70079 0l0 61.259842l-61.70079 0z" fill-rule="nonzero"></path><path fill="#9fc5e8" d="m56.58058 23.849775l-4.875 0l-4.0 -6.203125l-4.03125 6.203125l-4.859375 0l6.453125 -8.937499l-6.171875 -8.578125l4.859375 0l3.75 5.828125l3.71875 -5.828125l4.859375 0l-6.171875 8.578125l6.46875 8.937499z" fill-rule="nonzero"></path></g></svg>

