// Jest Snapshot v1, https://goo.gl/fbAQLP

exports[`should test Board component 1`] = `
<div
  className="root"
  style={
    Object {
      "gridTemplateColumns": "repeat(undefined, 50px)",
      "gridTemplateRows": "repeat(undefined, 50px)",
    }
  }
>
  <div
    className="missLevel"
  >
    <Title
      classTitles="error"
      value="IN PROGRESS"
    />
    <img
      alt="frog"
      src="sleptFrog.png"
    />
  </div>
</div>
`;

exports[`should test Board component wit Walls more than board can accept 1`] = `
<div
  className="root"
  style={
    Object {
      "gridTemplateColumns": "repeat(2, 50px)",
      "gridTemplateRows": "repeat(2, 50px)",
    }
  }
>
  <div
    className="missLevel"
  >
    <Title
      classTitles="error"
      value="IN PROGRESS"
    />
    <img
      alt="frog"
      src="sleptFrog.png"
    />
  </div>
</div>
`;

exports[`should test Board component without Walls  1`] = `
<div
  className="root"
  style={
    Object {
      "gridTemplateColumns": "repeat(undefined, 50px)",
      "gridTemplateRows": "repeat(undefined, 50px)",
    }
  }
>
  <div
    className="missLevel"
  >
    <Title
      classTitles="error"
      value="IN PROGRESS"
    />
    <img
      alt="frog"
      src="sleptFrog.png"
    />
  </div>
</div>
`;
