[
    {
        "filename" : "The Circles That You Find",
        "author": "**sanction**",
        "chat" : [
            {
                "id": "1",
                "player": "Soleil",
                "message": "I knew you'd come",
                "time_milisecond": 1000,
                "options": [
                    {
                        "id": "option_11",
                        "message": "There's no way I'd let you go"
                    },
                    {
                        "id": "option_12",
                        "message": "Do you have any idea what you put me through?"
                    },
                    {
                        "id": "option_13",
                        "message": "Please, we can still be happy. Stay with me."
                    }
                ]
            },
            {
                "id": "2",
                "player": "Soleil",
                "message": "I know",
                "time_milisecond": 1000
            },
            {
                "id": "3",
                "player": "NPC",
                "message": "She steps away from the edge and faces you, waiting for your questions",
                "time_milisecond": 1500,
                "options": [
                    {
                        "id": "option_31",
                        "message": "Why did you leave?"
                    },
                    {
                        "id": "option_32",
                        "message": "You could have talked to me!"
                    }
                ]
            },
            {
                "id": "4",
                "option_id": "option_31",
                "player": "Soleil",
                "message": "If you can believe one thing, please believe that I never wanted to hurt you.",
                "time_milisecond": 1500
            },
            {
                "id": "5",
                "option_id": "option_31",
                "player": "Soleil",
                "message": "But I had to go, or else nothing would change.",
                "time_milisecond": 1200
            },
            {
                "id": "6",
                "option_id": "option_32",
                "player": "Soleil",
                "message": "If there was something wrong, we could have worked it out together. We built our marriage on that trust.",
                "time_milisecond": 1500
            },
            {
                "id": "7",
                "option_id": "option_32",
                "player": "Soleil",
                "message": "I know you, love.",
                "time_milisecond": 1000
            },
            {
                "id": "8",
                "option_id": "option_32",
                "player": "Soleil",
                "message": "You always want things to remain the way they are.",
                "time_milisecond": 1000
            },
            {
                "id": "9",
                "option_id": "option_32",
                "player": "Soleil",
                "message": "You would have tried to convince me to stay.",
                "time_milisecond": 1000
            },
            {
                "id": "10",
                "option_id": "option_32",
                "player": "Soleil",
                "message": "And if I did, I would forget why I wanted to leave.",
                "time_milisecond": 1000
            },
            {
                "id": "11",
                "option_id": "option_32",
                "player": "Soleil",
                "message": "She turns her eyes to the river Seine, taking time to process her words carefully.",
                "time_milisecond": 1200
            },
            {
                "id": "12",
                "option_id": "option_32",
                "player": "Soleil",
                "message": "I was being kept prisoner—I could feel it in my bones. I had to make you follow me somewhere we could think for ourselves, where our memories would remain intact.",
                "time_milisecond": 1700,
                "options": [
                    {
                        "id": "option_121",
                        "message": "What do you mean by you're a “prisoner”?"
                    },
                    {
                        "id": "option_122",
                        "message": "Soleil, I don't remember ever having entered a VR!"
                    },
                    {
                        "id": "option_123",
                        "message": "Soleil—"
                    },
                    {
                        "id": "option_124",
                        "message": "No no no, that can't be true!"
                    },
                    {
                        "id": "option_125",
                        "message": "Stop. Please, just stop..."
                    }
                ]
            },
            {
                "id": "13",
                "option_id": "option_121",
                "player": "Soleil",
                "message": "I mean Project Eurydice.",
                "time_milisecond": 800
            },
            {
                "id": "14",
                "option_id": "option_121",
                "player": "Soleil",
                "message": "It's a virtual reality world I helped build for Meteor.",
                "time_milisecond": 1000
            },
            {
                "id": "15",
                "option_id": "option_121",
                "player": "Soleil",
                "message": "In it, a person’s consciousness can reside for however long they want while their body is kept in stasis.",
                "time_milisecond": 1500
            },
            {
                "id": "16",
                "option_id": "option_121",
                "player": "Soleil",
                "message": "We're in Eurydice right now. None of this is real. Yes, I know how that sounds, but I also know my own creation.",
                "time_milisecond": 1500
            },
            {
                "id": "17",
                "player": "",
                "message": "",
                "time_milisecond": 0,
                "options": [
                    {
                        "id": "option_171",
                        "message": "Why come here?"
                    }
                ]
            },
            {
                "id": "18",
                "player": "",
                "message": "",
                "time_milisecond": 0,
                "options": [
                    {
                        "id": "option_181",
                        "message": "WWhat's so special about this place?"
                    }
                ]
            },
            {
                "id": "19",
                "player": "Soleil",
                "message": "There are gaps in my memory I can’t fill in.",
                "time_milisecond": 1000
            },
            {
                "id": "20",
                "player": "Soleil",
                "message": "I know something important happened here, but I'm not sure what.",
                "time_milisecond": 1200
            },
            {
                "id": "21",
                "player": "Soleil",
                "message": "All I know is that this bridge is where it began. That’s why I came.",
                "time_milisecond": 1200
            },
            {
                "id": "22",
                "player": "",
                "message": "",
                "time_milisecond": 0,
                "options": [
                    {
                        "id": "option_181",
                        "message": "I can’t remember anything important that happened here, Soleil."
                    }
                ]
            },
            {
                "id": "23",
                "player": "",
                "message": "",
                "time_milisecond": 0,
                "options": [
                    {
                        "id": "option_181",
                        "message": "I feel it too. My memory's fuzzy, but being back here... something's missing."
                    }
                ]
            },
            {
                "id": "24",
                "player": "",
                "message": "",
                "time_milisecond": 0,
                "options": [
                    {
                        "id": "option_181",
                        "message": "I don't know, I... this is too much."
                    }
                ]
            }
        ]
    }
]