<<<<<<< HEAD
<<<<<<< HEAD
Fix_event_propagation_from_inactive_and_disabled_dropdowns_(#30510)-3f114b4.patch


git@gitlab.com:Archangel.Ambriel/build-commands.git eeb8d35
=======
=======
>>>>>>> master
❤️❤️❤️.wav


workflows 87d5224
<<<<<<< HEAD
>>>>>>> master
=======
>>>>>>> master

