Save AS... 5 
ry APP_CeMlel-ZULUU4U4LZ5L6 
Geer Ke fa go 

f(O0860965/91c99c88f06d36e..
VO es fs OO 

git-2.htm| > qt Ti) «:: 

| for hallande ja till vad.htm| 

ry Import-202004050116.log 
SEGRE vitor ce 
ry service. 

2:77 42. 7 6 ie 

345 KE 
mata ets 