From 80225f5bd473fba4bc74dd79240268dc902ce20c Mon Sep 17 00:00:00 2001
From: Ambriel Skoeld <ambriel.archangel@icloud.com>
Date: Sun, 5 Apr 2020 00:01:13 +0200
Subject: [PATCH] import-202004042342.log 🔥🔥🔥

---
 3b/import-202004042342.log | 0
 1 file changed, 0 insertions(+), 0 deletions(-)
 create mode 100644 3b/import-202004042342.log

diff --git a/3b/import-202004042342.log b/3b/import-202004042342.log
new file mode 100644
index 0000000..e69de29
--- /dev/null
+++ b/3b/import-202004042342.log
--
Working Copy 4.1.6
	◦	Passar ✨🔆✨💥
