From d8fd18964190d5ddd1160094922fce58adfb048f Mon Sep 17 00:00:00 2001
From: Ambriel Skoeld <ambriel.archangel@icloud.com>
Date: Sun, 29 Mar 2020 11:49:42 +0200
Subject: [PATCH] .eslintrc.json

---
 .eslintrc.json                | 11 +++++++++++
 build/import-202003291146.log | 23 +++++++++++++++++++++++
 build/text.txt                |  4 ++++
 target/README.sample          |  5 +++++
 4 files changed, 43 insertions(+)
 create mode 100644 .eslintrc.json
 create mode 100644 build/import-202003291146.log
 create mode 100644 build/text.txt
 create mode 100755 target/README.sample

diff --git a/.eslintrc.json b/.eslintrc.json
new file mode 100644
index 0000000..500da03
--- /dev/null
+++ b/.eslintrc.json
@@ -0,0 +1,11 @@
+{
+  "extends": [
+    "plugin:github/es6",
+    "plugin:github/browser",
+    "plugin:github/flow"
+  ],
+  "rules": {
+    "github/no-then": "off",
+    "no-invalid-this": "off"
+  }
+}
diff --git a/build/import-202003291146.log b/build/import-202003291146.log
new file mode 100644
index 0000000..96bc0e7
--- /dev/null
+++ b/build/import-202003291146.log
@@ -0,0 +1,23 @@
+From f1845ffb6687b86ca73216d24522b19e43ad61ed Mon Sep 17 00:00:00 2001
+From: Ambriel Skoeld <ambriel.archangel@icloud.com>
+Date: Sun, 29 Mar 2020 11:45:57 +0200
+Subject: [PATCH] README.sample
+
+---
+ README.sample | 5 +++++
+ 1 file changed, 5 insertions(+)
+ create mode 100755 README.sample
+
+diff --git a/README.sample b/README.sample
+new file mode 100755
+index 0000000..d125ec8
+--- /dev/null
++++ b/README.sample
+@@ -0,0 +1,5 @@
++#!/bin/sh
++#
++# Place appropriately named executable hook scripts into this directory
++# to intercept various actions that git takes.  See `git help hooks` for
++# more information.
+--
+Working Copy 4.1.4
\ No newline at end of file
diff --git a/build/text.txt b/build/text.txt
new file mode 100644
index 0000000..a03f58d
--- /dev/null
+++ b/build/text.txt
@@ -0,0 +1,4 @@
+README.sample
+
+hooks f1845ff
+
diff --git a/target/README.sample b/target/README.sample
new file mode 100755
index 0000000..d125ec8
--- /dev/null
+++ b/target/README.sample
@@ -0,0 +1,5 @@
+#!/bin/sh
+#
+# Place appropriately named executable hook scripts into this directory
+# to intercept various actions that git takes.  See `git help hooks` for
+# more information.
--
Working Copy 4.1.4