{
	"name": "test-tags",
	"description": "This app is to detect what tags are available on a system or build-setup.",
    "license": "MIT",
	"authors": [ "SpiceyWolf" ],
	
	"targetType": "executable",
	"targetPath": "bin"
}