[gd_scene load_steps=3 format=3 uid="uid://bl63ufu6ytkbm"]

[ext_resource type="PackedScene" uid="uid://km1k8q80l437" path="res://scenes/screens/Editor.tscn" id="1_mv1yu"]
[ext_resource type="Script" path="res://scenes/screens/editors/SupplyEditor.gd" id="2_npde3"]

[node name="Editor Screen" instance=ExtResource("1_mv1yu")]

[node name="Contents" parent="Split" index="1"]
script = ExtResource("2_npde3")
