[gd_scene load_steps=2 format=3 uid="uid://c7jgkh4akticr"]

[ext_resource type="Script" path="res://scenes/screens/game/bank.gd" id="1_kdtvj"]

[node name="Bank" type="Panel"]
anchors_preset = 15
anchor_right = 1.0
anchor_bottom = 1.0
grow_horizontal = 2
grow_vertical = 2
script = ExtResource("1_kdtvj")
