<svg width="28" height="28" viewBox="0 0 28 28" fill="none" xmlns="http://www.w3.org/2000/svg">
<g clip-path="url(#clip0_2_487)">
<path d="M23.7851 0.875L23.8761 0.912625L27.0874 4.12125L27.125 4.21225V23.6565L27.0874 23.7475L23.7431 27.0874L23.653 27.125H4.21487L4.12387 27.0874L0.912625 23.8796L0.875 23.7886V4.34438L0.912625 4.25338L4.25775 0.912625L4.34787 0.875H23.7851ZM21.4156 24.1579H6.48637L4.47125 26.8686H23.4001L21.4165 24.1579H21.4156ZM4.10813 21.7962L1.20225 23.8053L4.2 26.8021L6.23263 24.0704L4.14575 21.9852L4.10813 21.8942V21.798V21.7962ZM23.8919 21.7V21.8068L23.8551 21.8969L21.6729 24.0756L23.6679 26.8004L26.796 23.6749L23.8927 21.7H23.8919ZM19.2273 21.1663H8.71062L6.67712 23.9006H21.2284L19.2273 21.1671V21.1663ZM20.8687 19.6438L19.46 21.0516L21.5198 23.8656L23.6364 21.7525V21.5259L20.8687 19.6446V19.6438ZM7.13125 19.7059L4.36363 21.6213V21.8417L6.3875 23.8612L8.47875 21.0516L7.13125 19.7059ZM1.1305 4.58588V23.5445L4.10813 21.4856V6.61062L1.1305 4.585V4.58588ZM26.8678 4.45637L23.8927 6.5135V21.392L26.8678 23.4141V4.45637ZM4.36363 6.78387V21.3089L7.01837 19.474V8.58812L4.36363 6.78387ZM23.6364 6.69112L20.9816 8.52688V19.4119L23.6364 21.217V6.69112ZM19.3008 7.08838H8.76137L7.27387 8.57325V19.4889L8.70012 20.9116H19.2386L20.7253 19.4259V8.512L19.3008 7.08838ZM6.48025 4.13175L4.36363 6.2475V6.475L7.13125 8.3545L8.54 6.94575L6.48025 4.13088V4.13175ZM21.6125 4.137L19.5212 6.9475L20.8687 8.29325L23.6364 6.37962V6.15912L21.6125 4.137ZM21.322 4.0985H6.7725L8.77363 6.83288H19.2876L21.322 4.0985ZM4.333 1.19875L1.20225 4.32512L4.10725 6.3L4.10813 6.195L4.14575 6.104L6.32625 3.9235L4.33213 1.19875H4.333ZM23.7991 1.19875L21.7674 3.92875L23.8551 6.01562L23.8927 6.10663V6.20288L26.7977 4.19388L23.8 1.19875H23.7991ZM23.5296 1.13137H4.59987L6.58612 3.843H21.5119L23.5296 1.1305V1.13137Z" fill="#242424" stroke="#242424" stroke-width="0.5"/>
</g>
<defs>
<clipPath id="clip0_2_487">
<rect width="28" height="28" fill="white"/>
</clipPath>
</defs>
</svg>
