<svg width="28" height="28" viewBox="0 0 28 28" fill="none" xmlns="http://www.w3.org/2000/svg">
<g clip-path="url(#clip0_2_467)">
<path d="M27.8652 0C27.9396 0 28 0.06125 28 0.13475V27.8652C28 27.9396 27.9388 28 27.8652 28H0.13475C0.0990121 28 0.0647379 27.9858 0.0394674 27.9605C0.0141968 27.9353 0 27.901 0 27.8652L0 0.13475C0 0.06125 0.06125 0 0.13475 0H27.8652ZM23.9137 24.1062H4.08625L0.462 27.7288H27.538L23.9155 24.1062H23.9137ZM0.2695 0.46025V27.5398L3.89375 23.9137V4.08625L0.2695 0.46025ZM27.7296 0.462L24.1071 4.0845V23.9155L27.7296 27.538V0.462ZM19.7129 19.9045H8.28625L4.35488 23.835H23.6451L19.7129 19.9028V19.9045ZM4.16412 4.354V23.6442L8.0955 19.712V8.28712L4.16325 4.35488L4.16412 4.354ZM23.8359 4.354L19.9028 8.288V19.7102L23.8359 23.6442V4.35488V4.354ZM19.6332 8.36588H8.365V19.6324H19.6324V8.36675L19.6332 8.36588ZM23.6451 4.16237H4.35488L8.288 8.0955H19.712L23.6451 4.16237ZM27.5389 0.268625H0.461125L4.0845 3.89375H23.9155L27.5398 0.2695L27.5389 0.268625Z" fill="#242424" stroke="#242424" stroke-width="0.5"/>
</g>
<defs>
<clipPath id="clip0_2_467">
<rect width="28" height="28" fill="white"/>
</clipPath>
</defs>
</svg>
