<svg width="28" height="28" viewBox="0 0 28 28" fill="none" xmlns="http://www.w3.org/2000/svg">
<path d="M21.0639 0.875L21.1566 0.912625L24.4615 4.12125L24.5 4.21225V23.6565L24.4615 23.7475L21.021 27.0874L20.9274 27.125H6.93613L6.8425 27.0874L3.5385 23.8796L3.5 23.7886V4.34438L3.5385 4.25338L6.979 0.912625L7.07263 0.875H21.0639ZM18.8352 24.4247H9.06675L7.19775 26.8686H20.6675L18.8352 24.4247ZM6.64125 22.1874L3.843 23.814L6.9195 26.8021L8.82525 24.3092L6.64125 22.1874ZM21.357 22.0929L19.075 24.3101L20.9431 26.7995L24.1535 23.6828L21.357 22.0929ZM14 22.0342L9.56375 24.1693H18.3487L14 22.0334V22.0342ZM18.039 21.462L14.427 21.9564L18.7058 24.0564L18.039 21.462ZM9.95925 21.462L9.20762 24.0546L13.5616 21.959L9.95925 21.462ZM9.67575 21.4926L6.92562 22.0999L8.93463 24.0511L9.67575 21.4926ZM18.3164 21.4848L18.9753 24.0459L21.0691 22.0115L18.3164 21.4848ZM3.76338 4.5675V23.562L6.531 21.9538V6.14075L3.7625 4.5675H3.76338ZM24.2358 4.438L21.469 6.04625V21.8601L24.2358 23.4334V4.43625V4.438ZM9.03525 14.658L6.85212 21.854L9.7195 21.2205L9.03525 14.658ZM18.9665 14.658L18.2805 21.217L21.1479 21.7656L18.9665 14.6571V14.658ZM14.1111 6.23787L9.71863 6.59137L9.22862 13.9869L9.982 21.2074L13.9808 21.7639L18.0171 21.2074L18.7714 14.0061L18.3916 6.5905L14.1111 6.23787ZM6.79437 6.94663V21.1383L8.95913 14L6.79437 6.94575V6.94663ZM21.2056 6.86175L19.04 14L21.2048 21.0543V6.86175H21.2056ZM6.84775 6.223L9.01337 13.2773L9.45525 6.5835L6.84775 6.22213V6.223ZM21.1496 6.13637L18.6559 6.57912L18.9945 13.2431L21.1496 6.13637ZM9.2715 3.92963L9.70462 6.33588L13.629 6.01912L9.2715 3.92963ZM18.8396 3.93225L14.5863 6.02L18.41 6.335L18.8405 3.93225H18.8396ZM9.01075 3.96725L6.94225 5.97625L9.43425 6.32188L9.01075 3.96725ZM19.0986 3.98037L18.6804 6.314L21.0656 5.89137L19.0986 3.98037ZM18.4625 3.83075H9.66L14.1111 5.96575L18.4625 3.83075ZM7.056 1.19875L3.84475 4.31725L6.64125 5.90625L8.925 3.68813L7.05512 1.19875H7.056ZM21.0779 1.19875L19.1721 3.68988L21.3579 5.81262L24.1553 4.186L21.0779 1.19787V1.19875ZM20.8014 1.13137H7.3325L9.16563 3.57438H18.9333L20.8022 1.13137H20.8014Z" fill="#242424" stroke="#242424" stroke-width="0.5"/>
</svg>
