<svg width="24" height="24" viewBox="0 0 24 24" fill="none" xmlns="http://www.w3.org/2000/svg">
<path d="M2.25694 18.0108C2.45501 18.0061 2.64319 17.9232 2.78038 17.7803L12.0001 8.56058L21.2198 17.7803C21.2897 17.8523 21.3734 17.9095 21.4658 17.9486C21.5582 17.9877 21.6576 18.0078 21.7579 18.0078C21.9072 18.0078 22.053 17.9632 22.1768 17.8798C22.3006 17.7965 22.3967 17.678 22.4528 17.5397C22.5089 17.4014 22.5225 17.2495 22.4918 17.1034C22.461 16.9573 22.3874 16.8238 22.2804 16.7198L12.5304 6.96976C12.3897 6.82916 12.199 6.75018 12.0001 6.75018C11.8012 6.75018 11.6105 6.82916 11.4698 6.96976L1.71983 16.7198C1.61077 16.8244 1.53588 16.9596 1.50498 17.1076C1.47409 17.2556 1.48863 17.4095 1.5467 17.549C1.60476 17.6886 1.70365 17.8074 1.83039 17.8898C1.95713 17.9722 2.10581 18.0143 2.25694 18.0108Z" fill="#5B5B5B"/>
</svg>
