<svg width="28" height="28" viewBox="0 0 28 28" fill="none" xmlns="http://www.w3.org/2000/svg">
<path d="M14.1295 1.74994L14.3334 1.75169L14.1295 1.74994ZM14.3334 1.75169C21.1549 1.87944 26.5808 7.51182 26.4539 14.3342C26.327 21.1539 20.6938 26.5807 13.8731 26.4529C7.05163 26.3269 1.62488 20.6937 1.75175 13.8731C1.8795 7.05157 7.51275 1.62482 14.3343 1.75169H14.3334ZM10.563 22.6957L5.712 22.8698C7.91184 24.9811 10.828 26.1833 13.8766 26.2359H13.8863L10.563 22.6957ZM17.6768 22.6808L14.3693 26.2351C17.4205 26.1718 20.3351 24.9576 22.5286 22.8357L17.6768 22.6808ZM14.1006 21.1811L10.7511 22.5776L14.1269 26.1747L17.4799 22.5732L14.1006 21.1819V21.1811ZM5.74 17.7379L5.58338 22.6554L10.479 22.4804L9.07463 19.1117L5.74 17.7379ZM22.4796 17.6907L19.1196 19.0907L17.7301 22.4647L22.6564 22.6222L22.4796 17.6907ZM1.9705 14.3683C2.0335 17.4199 3.24779 20.3348 5.36988 22.5286L5.52388 17.6758L1.97138 14.3683H1.9705ZM26.236 14.3202L22.6958 17.6417L22.8708 22.4927C24.9816 20.293 26.1836 17.3771 26.236 14.3289V14.3202ZM9.35988 19.2289L10.6706 22.3746L13.8163 21.0638L9.35988 19.2289ZM18.8353 19.2088L14.3859 21.0629L17.5376 22.3606L18.8353 19.2088ZM14.0726 7.21257L9.22163 9.23382L7.2205 14.0936L9.24175 18.9437L14.1015 20.9457L18.9516 18.9244L20.9536 14.0638L18.9324 9.21369L14.0726 7.21257ZM7.10325 14.3779L5.80563 17.5297L8.9565 18.8273L7.10325 14.3779ZM21.0718 14.3491L19.2369 18.8063L22.3834 17.4947L21.0718 14.3491ZM5.60175 10.7756L2.03088 14.1268L5.60175 17.4518L6.98425 14.0927L5.60175 10.7756ZM22.568 10.7196L21.189 14.0647L22.5951 17.4378L26.1748 14.0778L22.5671 10.7196H22.568ZM5.33488 5.71369C3.22384 7.91331 2.02156 10.8292 1.96875 13.8774V13.8862L5.509 10.5647L5.334 5.71369H5.33488ZM22.8349 5.67869L22.6809 10.5306L26.2343 13.8381C26.1713 10.7865 24.957 7.8716 22.8349 5.67782V5.67869ZM8.93638 9.35369L5.79075 10.6636L7.1015 13.8092L8.93638 9.35282V9.35369ZM19.2168 9.33182L21.07 13.7803L22.3676 10.6303L19.2168 9.33182ZM5.55013 5.58332L5.72425 10.4544L9.0545 9.06757L10.4256 5.73819L5.54925 5.58332H5.55013ZM22.6214 5.54919L17.7153 5.72419L19.0986 9.04657L22.4674 10.4343L22.6223 5.54919H22.6214ZM10.6365 5.79769L9.33888 8.94857L13.7883 7.09532L10.6374 5.79769H10.6365ZM17.5035 5.78369L14.3588 7.09444L18.8151 8.92932L17.5044 5.78369H17.5035ZM14.0788 2.02994L10.7494 5.60869L14.0744 6.97719L17.4151 5.58507L14.0788 2.03082V2.02994ZM13.8373 1.97044C10.786 2.03366 7.87144 3.24794 5.67788 5.36982L10.5298 5.52382L13.8373 1.97132V1.97044ZM14.3299 1.97044H14.3211L17.6426 5.50982L22.4945 5.33482C20.2948 3.22395 17.379 2.02197 14.3308 1.96957L14.3299 1.97044Z" fill="#242424" stroke="#242424" stroke-width="0.5"/>
</svg>
