<svg width="148" height="24" viewBox="0 0 148 24" fill="none" xmlns="http://www.w3.org/2000/svg">
<path d="M48.6719 9.4929C48.6188 9.02225 48.4001 8.65767 48.0156 8.39915C47.6312 8.13731 47.1473 8.00639 46.5639 8.00639C46.1463 8.00639 45.785 8.07268 45.4801 8.20526C45.1752 8.33452 44.9382 8.51349 44.7692 8.74219C44.6035 8.96757 44.5206 9.22443 44.5206 9.51278C44.5206 9.75473 44.5769 9.96354 44.6896 10.1392C44.8056 10.3149 44.9564 10.4624 45.142 10.5817C45.331 10.6977 45.5331 10.7955 45.7486 10.875C45.964 10.9512 46.1712 11.0142 46.37 11.0639L47.3643 11.3224C47.6892 11.402 48.0223 11.5097 48.3636 11.6456C48.705 11.7815 49.0215 11.9605 49.3132 12.1825C49.6049 12.4046 49.8402 12.6797 50.0192 13.0078C50.2015 13.3359 50.2926 13.7287 50.2926 14.1861C50.2926 14.7628 50.1435 15.2749 49.8452 15.7223C49.5502 16.1697 49.121 16.5227 48.5575 16.7812C47.9974 17.0398 47.3196 17.169 46.5241 17.169C45.7618 17.169 45.1023 17.0481 44.5455 16.8061C43.9886 16.5642 43.5528 16.2211 43.2379 15.777C42.9231 15.3295 42.7491 14.7992 42.7159 14.1861H44.2571C44.2869 14.554 44.4063 14.8606 44.6151 15.1058C44.8272 15.3478 45.0973 15.5284 45.4254 15.6477C45.7569 15.7637 46.1198 15.8217 46.5142 15.8217C46.9484 15.8217 47.3345 15.7538 47.6726 15.6179C48.014 15.4787 48.2824 15.2865 48.478 15.0412C48.6735 14.7926 48.7713 14.5026 48.7713 14.1712C48.7713 13.8696 48.6851 13.6226 48.5128 13.4304C48.3438 13.2382 48.1134 13.0791 47.8217 12.9531C47.5334 12.8272 47.2069 12.7161 46.8423 12.62L45.6392 12.2919C44.8239 12.0698 44.1776 11.7434 43.7003 11.3125C43.2263 10.8816 42.9893 10.3116 42.9893 9.60227C42.9893 9.01562 43.1484 8.50355 43.4666 8.06605C43.7848 7.62855 44.2157 7.28883 44.7592 7.04688C45.3028 6.80161 45.916 6.67898 46.5987 6.67898C47.2881 6.67898 47.8963 6.79995 48.4233 7.0419C48.9536 7.28385 49.3712 7.61695 49.6761 8.04119C49.9811 8.46212 50.1402 8.94602 50.1534 9.4929H48.6719ZM55.0646 6.81818V17H53.5284V6.81818H55.0646ZM61.998 17H58.7018V6.81818H62.1024C63.1 6.81818 63.9568 7.02202 64.6727 7.42969C65.3886 7.83404 65.9371 8.41572 66.3183 9.17472C66.7028 9.9304 66.895 10.8369 66.895 11.8942C66.895 12.9548 66.7011 13.8662 66.3133 14.6286C65.9288 15.3909 65.372 15.9775 64.6429 16.3885C63.9137 16.7962 63.0321 17 61.998 17ZM60.238 15.6577H61.9135C62.689 15.6577 63.3337 15.5118 63.8474 15.2202C64.3611 14.9252 64.7456 14.4993 65.0008 13.9425C65.256 13.3823 65.3836 12.6996 65.3836 11.8942C65.3836 11.0954 65.256 10.4176 65.0008 9.8608C64.7489 9.30398 64.3727 8.88139 63.8723 8.59304C63.3718 8.30469 62.7503 8.16051 62.0079 8.16051H60.238V15.6577ZM70.2053 17V6.81818H76.5889V8.14062H71.7415V11.2429H76.2558V12.5604H71.7415V15.6776H76.6485V17H70.2053ZM90.6992 9.4929C90.6462 9.02225 90.4274 8.65767 90.043 8.39915C89.6585 8.13731 89.1746 8.00639 88.5913 8.00639C88.1737 8.00639 87.8124 8.07268 87.5075 8.20526C87.2025 8.33452 86.9656 8.51349 86.7965 8.74219C86.6308 8.96757 86.5479 9.22443 86.5479 9.51278C86.5479 9.75473 86.6043 9.96354 86.717 10.1392C86.833 10.3149 86.9838 10.4624 87.1694 10.5817C87.3583 10.6977 87.5605 10.7955 87.7759 10.875C87.9914 10.9512 88.1985 11.0142 88.3974 11.0639L89.3917 11.3224C89.7165 11.402 90.0496 11.5097 90.391 11.6456C90.7324 11.7815 91.0489 11.9605 91.3406 12.1825C91.6322 12.4046 91.8675 12.6797 92.0465 13.0078C92.2288 13.3359 92.32 13.7287 92.32 14.1861C92.32 14.7628 92.1708 15.2749 91.8725 15.7223C91.5775 16.1697 91.1483 16.5227 90.5849 16.7812C90.0247 17.0398 89.3469 17.169 88.5515 17.169C87.7892 17.169 87.1296 17.0481 86.5728 16.8061C86.016 16.5642 85.5801 16.2211 85.2653 15.777C84.9504 15.3295 84.7764 14.7992 84.7433 14.1861H86.2844C86.3143 14.554 86.4336 14.8606 86.6424 15.1058C86.8545 15.3478 87.1246 15.5284 87.4528 15.6477C87.7842 15.7637 88.1471 15.8217 88.5415 15.8217C88.9757 15.8217 89.3619 15.7538 89.6999 15.6179C90.0413 15.4787 90.3098 15.2865 90.5053 15.0412C90.7009 14.7926 90.7987 14.5026 90.7987 14.1712C90.7987 13.8696 90.7125 13.6226 90.5401 13.4304C90.3711 13.2382 90.1407 13.0791 89.8491 12.9531C89.5607 12.8272 89.2343 12.7161 88.8697 12.62L87.6665 12.2919C86.8512 12.0698 86.2049 11.7434 85.7276 11.3125C85.2537 10.8816 85.0167 10.3116 85.0167 9.60227C85.0167 9.01562 85.1758 8.50355 85.494 8.06605C85.8121 7.62855 86.243 7.28883 86.7866 7.04688C87.3301 6.80161 87.9433 6.67898 88.6261 6.67898C89.3155 6.67898 89.9237 6.79995 90.4506 7.0419C90.9809 7.28385 91.3986 7.61695 91.7035 8.04119C92.0084 8.46212 92.1675 8.94602 92.1808 9.4929H90.6992ZM95.0536 8.14062V6.81818H102.934V8.14062H99.7567V17H98.2255V8.14062H95.0536ZM114.482 11.9091C114.482 12.9962 114.283 13.9309 113.885 14.7131C113.487 15.492 112.942 16.0919 112.25 16.5128C111.56 16.9304 110.776 17.1392 109.898 17.1392C109.016 17.1392 108.229 16.9304 107.537 16.5128C106.847 16.0919 106.304 15.4903 105.906 14.7081C105.508 13.9259 105.309 12.9929 105.309 11.9091C105.309 10.822 105.508 9.88897 105.906 9.11008C106.304 8.32789 106.847 7.72798 107.537 7.31037C108.229 6.88944 109.016 6.67898 109.898 6.67898C110.776 6.67898 111.56 6.88944 112.25 7.31037C112.942 7.72798 113.487 8.32789 113.885 9.11008C114.283 9.88897 114.482 10.822 114.482 11.9091ZM112.961 11.9091C112.961 11.0805 112.826 10.3828 112.558 9.81605C112.293 9.24598 111.928 8.8151 111.464 8.52344C111.003 8.22846 110.481 8.08097 109.898 8.08097C109.311 8.08097 108.788 8.22846 108.327 8.52344C107.866 8.8151 107.502 9.24598 107.233 9.81605C106.968 10.3828 106.836 11.0805 106.836 11.9091C106.836 12.7377 106.968 13.437 107.233 14.0071C107.502 14.5739 107.866 15.0047 108.327 15.2997C108.788 15.5914 109.311 15.7372 109.898 15.7372C110.481 15.7372 111.003 15.5914 111.464 15.2997C111.928 15.0047 112.293 14.5739 112.558 14.0071C112.826 13.437 112.961 12.7377 112.961 11.9091ZM126.015 6.81818V17H124.603L119.428 9.53267H119.333V17H117.797V6.81818H119.219L124.399 14.2955H124.494V6.81818H126.015ZM129.656 17V6.81818H136.04V8.14062H131.192V11.2429H135.707V12.5604H131.192V15.6776H136.099V17H129.656ZM145.045 9.4929C144.992 9.02225 144.773 8.65767 144.389 8.39915C144.004 8.13731 143.52 8.00639 142.937 8.00639C142.519 8.00639 142.158 8.07268 141.853 8.20526C141.548 8.33452 141.311 8.51349 141.142 8.74219C140.977 8.96757 140.894 9.22443 140.894 9.51278C140.894 9.75473 140.95 9.96354 141.063 10.1392C141.179 10.3149 141.329 10.4624 141.515 10.5817C141.704 10.6977 141.906 10.7955 142.122 10.875C142.337 10.9512 142.544 11.0142 142.743 11.0639L143.737 11.3224C144.062 11.402 144.395 11.5097 144.737 11.6456C145.078 11.7815 145.395 11.9605 145.686 12.1825C145.978 12.4046 146.213 12.6797 146.392 13.0078C146.575 13.3359 146.666 13.7287 146.666 14.1861C146.666 14.7628 146.517 15.2749 146.218 15.7223C145.923 16.1697 145.494 16.5227 144.931 16.7812C144.37 17.0398 143.693 17.169 142.897 17.169C142.135 17.169 141.475 17.0481 140.919 16.8061C140.362 16.5642 139.926 16.2211 139.611 15.777C139.296 15.3295 139.122 14.7992 139.089 14.1861H140.63C140.66 14.554 140.779 14.8606 140.988 15.1058C141.2 15.3478 141.47 15.5284 141.798 15.6477C142.13 15.7637 142.493 15.8217 142.887 15.8217C143.321 15.8217 143.708 15.7538 144.046 15.6179C144.387 15.4787 144.655 15.2865 144.851 15.0412C145.047 14.7926 145.144 14.5026 145.144 14.1712C145.144 13.8696 145.058 13.6226 144.886 13.4304C144.717 13.2382 144.486 13.0791 144.195 12.9531C143.906 12.8272 143.58 12.7161 143.215 12.62L142.012 12.2919C141.197 12.0698 140.551 11.7434 140.073 11.3125C139.599 10.8816 139.362 10.3116 139.362 9.60227C139.362 9.01562 139.521 8.50355 139.84 8.06605C140.158 7.62855 140.589 7.28883 141.132 7.04688C141.676 6.80161 142.289 6.67898 142.972 6.67898C143.661 6.67898 144.269 6.79995 144.796 7.0419C145.327 7.28385 145.744 7.61695 146.049 8.04119C146.354 8.46212 146.513 8.94602 146.526 9.4929H145.045Z" fill="#242424"/>
<path d="M8.50008 17.875L1.41675 9.375L3.54175 5.125H13.4584L15.5834 9.375L8.50008 17.875ZM6.51675 8.84375H10.4834L9.15529 6.1875H7.84487L6.51675 8.84375ZM7.96883 15.5906V9.90625H3.24071L7.96883 15.5906ZM9.03133 15.5906L13.7595 9.90625H9.03133V15.5906ZM11.6699 8.84375H14.0782L12.7501 6.1875H10.3417L11.6699 8.84375ZM2.92196 8.84375H5.33029L6.65841 6.1875H4.25008L2.92196 8.84375Z" fill="#242424"/>
<path d="M5.54346 9.28259L7.62566 14.4881C7.95332 15.3073 9.104 15.3316 9.46605 14.5271L11.8261 9.28259" stroke="#242424"/>
<path d="M25.5001 17.875L18.4167 9.375L20.5417 5.125H30.4584L32.5834 9.375L25.5001 17.875ZM23.5167 8.84375H27.4834L26.1553 6.1875H24.8449L23.5167 8.84375ZM24.9688 15.5906V9.90625H20.2407L24.9688 15.5906ZM26.0313 15.5906L30.7595 9.90625H26.0313V15.5906ZM28.6699 8.84375H31.0782L29.7501 6.1875H27.3417L28.6699 8.84375ZM19.922 8.84375H22.3303L23.6584 6.1875H21.2501L19.922 8.84375Z" fill="#242424"/>
<path d="M22.5435 9.28259L24.6257 14.4881C24.9533 15.3073 26.104 15.3316 26.4661 14.5271L28.8261 9.28259" stroke="#242424"/>
</svg>
