<svg width="28" height="28" viewBox="0 0 28 28" fill="none" xmlns="http://www.w3.org/2000/svg">
<path d="M14.392 1.001L14.5171 1.10163L14.686 1.24163L14.7787 1.32038C15.9996 2.36573 17.1201 3.52284 18.1256 4.77663C20.4689 7.70438 21.875 10.8176 21.875 13.9895C21.875 16.1578 21.2135 18.3593 20.0454 20.3884L19.9316 20.5809V20.6001C19.9252 20.672 19.8936 20.7392 19.8424 20.79L19.81 20.8224C18.8527 22.4105 17.6698 23.8831 16.3896 25.1869L16.2076 25.3698L16.0256 25.5491L15.8454 25.7241L15.5802 25.9735L15.3274 26.2054L15.0911 26.4154L14.8776 26.6009L14.6912 26.7558L14.5364 26.8774L14.4541 26.9378L14.3894 26.9798C14.1531 27.1583 13.9037 27.1714 13.6657 27.0183L13.6106 26.9798L13.6736 26.8949L13.6054 26.9754L13.1959 26.6333C11.9866 25.6003 10.8758 24.4573 9.87787 23.219C9.12207 22.2882 8.4487 21.2933 7.86538 20.2458L7.84875 20.2291L7.854 20.2239C6.74712 18.2053 6.125 16.1158 6.125 13.9904C6.125 9.47013 9.3275 4.30763 13.6106 0.999254C13.8434 0.824254 14.1549 0.842629 14.392 1.001ZM17.1964 17.6348L14.021 26.9028C14.0911 26.8961 14.1585 26.872 14.217 26.8328L14.329 26.7566L14.4095 26.698L14.4559 26.663L14.5609 26.579L14.7446 26.4268L14.8811 26.3086L15.1069 26.1091L15.3519 25.8869L15.6091 25.6463L15.7859 25.4765L16.0545 25.214L16.2339 25.0329C17.5026 23.7405 18.6751 22.281 19.6385 20.6876C19.691 20.6369 19.7085 20.6124 19.7129 20.5739L19.7146 20.5494L19.7304 20.4925L19.8161 20.3455L17.1964 17.6348ZM10.7196 17.5753L8.12525 20.2606C8.68715 21.2523 9.33044 22.1956 10.0485 23.0808C10.9927 24.2525 12.0389 25.3383 13.1749 26.3253L13.4855 26.5913L13.7042 26.7724L10.7205 17.5761L10.7196 17.5753ZM10.9174 17.4738L13.8854 26.6219L16.9295 17.7371L14.2459 19.6499L14.1216 19.6508L10.9174 17.4738ZM21.6484 14.3763L17.3267 17.4536L19.9307 20.1469C20.965 18.3068 21.5775 16.331 21.6484 14.3754V14.3763ZM8.015 20.0576L10.6435 17.3381L10.6225 17.2716L6.3525 14.3693C6.42075 16.303 7.0105 18.2079 8.015 20.0585V20.0576ZM14.1076 8.57588L10.8894 10.9086L9.84112 14.1514L10.8071 17.1299L14.182 19.4241L17.052 17.3793L18.1597 14.1505L17.0476 10.7669L14.1076 8.57588ZM17.3539 10.9944L18.3794 14.1164V14.1873L17.3591 17.1605L21.5862 14.1488L17.3539 10.9944ZM10.5884 11.1265L6.41813 14.1488L10.5105 16.9304L9.62062 14.1864V14.1181L10.5875 11.1274L10.5884 11.1265ZM6.34462 13.93L10.6216 10.8299L7.94763 8.064C6.94663 10.0083 6.35775 12.0278 6.3455 13.93H6.34462ZM20.0025 7.97125L17.3477 10.7188L21.6545 13.9283L21.6536 13.7795C21.6134 11.8134 21.0245 9.8665 20.0025 7.97125ZM13.7436 1.176C11.4021 2.98375 9.38787 5.35238 8.05437 7.86013L10.7441 10.6426L13.8162 1.1305C13.7902 1.14234 13.7656 1.15701 13.7427 1.17425L13.7436 1.176ZM13.965 1.386L11.0023 10.556L14.0429 8.35188L14.1724 8.35275L16.9286 10.4064L13.965 1.38513V1.386ZM14.1059 1.11038L17.206 10.5481L19.8529 7.80938L19.9841 7.938C19.3984 6.87231 18.7194 5.86064 17.955 4.91488C16.958 3.67225 15.8472 2.5254 14.637 1.48925L14.4594 1.3405L14.2625 1.18038C14.2147 1.14828 14.1617 1.12461 14.1059 1.11038Z" fill="#242424" stroke="#242424" stroke-width="0.5"/>
</svg>
