<svg width="25" height="25" viewBox="0 0 25 25" fill="none" xmlns="http://www.w3.org/2000/svg">
<path d="M12.7631 3.82593C9.83898 3.82593 7.45407 6.21084 7.45407 9.13495C7.45407 10.9629 8.3873 12.5864 9.80047 13.5433C7.09559 14.7047 5.17877 17.3888 5.17877 20.5114H6.69564C6.69564 17.1518 9.40348 14.444 12.7631 14.444C16.1227 14.444 18.8306 17.1518 18.8306 20.5114H20.3474C20.3474 17.3888 18.4306 14.7047 15.7257 13.5433C17.1389 12.5864 18.0721 10.9629 18.0721 9.13495C18.0721 6.21084 15.6872 3.82593 12.7631 3.82593ZM12.7631 5.34279C14.8666 5.34279 16.5553 7.03149 16.5553 9.13495C16.5553 11.2384 14.8666 12.9271 12.7631 12.9271C10.6596 12.9271 8.97093 11.2384 8.97093 9.13495C8.97093 7.03149 10.6596 5.34279 12.7631 5.34279Z" fill="#5B5B5B"/>
</svg>
