<svg width="24" height="24" viewBox="0 0 24 24" fill="none" xmlns="http://www.w3.org/2000/svg">
<path d="M2.25694 5.98922C2.45501 5.9939 2.64319 6.07675 2.78038 6.21969L12.0001 15.4394L21.2198 6.21969C21.2897 6.1477 21.3734 6.09047 21.4658 6.05138C21.5582 6.0123 21.6576 5.99216 21.7579 5.99215C21.9072 5.99219 22.053 6.03676 22.1768 6.12015C22.3006 6.20355 22.3967 6.32198 22.4528 6.4603C22.5089 6.59861 22.5225 6.75052 22.4918 6.89659C22.461 7.04266 22.3874 7.17624 22.2804 7.28024L12.5304 17.0302C12.3897 17.1708 12.199 17.2498 12.0001 17.2498C11.8012 17.2498 11.6105 17.1708 11.4698 17.0302L1.71983 7.28024C1.61077 7.17556 1.53588 7.04037 1.50498 6.89239C1.47409 6.74441 1.48863 6.59054 1.5467 6.45097C1.60476 6.31139 1.70365 6.19262 1.83039 6.11023C1.95713 6.02783 2.10581 5.98565 2.25694 5.98922Z" fill="#242424"/>
</svg>
