<svg width="28" height="28" viewBox="0 0 28 28" fill="none" xmlns="http://www.w3.org/2000/svg">
<path d="M14.1636 0.877708C19.0041 1.01333 22.8375 7.00446 22.7483 14.2442C22.659 21.4848 18.6778 27.2581 13.8364 27.1225C8.99502 26.9868 5.16252 20.9966 5.25177 13.756C5.34102 6.51533 9.3214 0.742083 14.1636 0.877708ZM19.838 23.3985H16.5288L14.2231 26.8897C16.387 26.8066 18.3593 25.4985 19.8389 23.3985H19.838ZM11.473 23.3985H8.16115C9.6504 25.5125 11.6428 26.8293 13.8408 26.8915L13.7769 26.8888L11.4713 23.3985H11.473ZM14 21.8436L11.6821 23.3136L14.0009 26.8223L16.3179 23.3136L14 21.8436ZM19.9264 18.0837L17.577 19.5747L16.611 23.1666H19.9264V18.0837ZM8.07365 18.0837V23.1675H11.389L10.423 19.5747L8.07365 18.0837ZM10.6969 19.748L11.5981 23.0983L13.7865 21.7088L10.6969 19.7488V19.748ZM17.3023 19.748L14.2135 21.708L16.4019 23.0975L17.3023 19.7488V19.748ZM5.47052 14.3151C5.52302 17.6576 6.42077 20.6912 7.85577 22.9417V17.9245L5.46965 14.3151H5.47052ZM22.5286 14.3151L20.1451 17.9236V22.9408C21.5854 20.6816 22.4884 17.627 22.5304 14.2407L22.5286 14.3151ZM13.9991 6.40071L10.5954 8.52696L9.1394 13.9528L10.6094 19.4225L14 21.5741L17.3906 19.4225L18.8606 13.9537L17.4055 8.52696L14 6.40071H13.9991ZM9.02565 14.3755L8.09902 17.83L10.3355 19.2501L9.02565 14.3763V14.3755ZM18.9744 14.3772L17.6645 19.2483L19.901 17.8308L18.9735 14.3772H18.9744ZM7.92665 10.2848L5.48977 13.9397L7.92665 17.6287L8.91277 13.9537L7.92665 10.2848ZM20.0743 10.2857L19.0873 13.9546L20.0734 17.6287L22.5103 13.9397L20.0743 10.2857ZM20.1443 5.05846V9.99083L22.5269 13.5643C22.4551 10.2708 21.5618 7.28183 20.1443 5.05933V5.05846ZM7.8549 5.05846C6.41465 7.31858 5.51252 10.3732 5.46965 13.7603L5.47315 13.5635L7.8549 9.99083V5.05933V5.05846ZM10.3224 8.69671L8.0999 10.0853L9.02565 13.5311L10.3224 8.69671ZM17.6768 8.69671L18.9735 13.5302L19.9001 10.0853L17.6776 8.69671H17.6768ZM11.3593 4.83271H8.07365V9.83333L10.4099 8.37471L11.3593 4.83271ZM19.9264 4.83271H16.6399L17.5901 8.37471L19.9264 9.83333V4.83271ZM11.5728 4.88521L10.6811 8.20408L13.7848 6.26596L11.5728 4.88521ZM16.4273 4.88521L14.2144 6.26508L17.318 8.20321L16.4273 4.88433V4.88521ZM14 1.17696L11.6673 4.67521L13.9991 6.13208L16.3328 4.67521L14 1.17696ZM14.224 1.11133L16.5515 4.60083H19.838C18.3488 2.48771 16.3564 1.17083 14.1584 1.10958L14.224 1.11133ZM13.7769 1.11133C11.6139 1.19446 9.64165 2.50258 8.16202 4.60083H11.4485L13.776 1.11046L13.7769 1.11133Z" fill="#242424" stroke="#242424" stroke-width="0.5"/>
</svg>
