<svg width="28" height="28" viewBox="0 0 28 28" fill="none" xmlns="http://www.w3.org/2000/svg">
<path d="M20.8425 0.875L20.9291 0.91175L24.0266 4.12125L24.0625 4.2105V23.6574L24.0275 23.7466L20.8014 27.0883L20.7139 27.125H7.595L7.50838 27.0883L4.41087 23.8788L4.375 23.7878V4.34263L4.41 4.25338L7.63613 0.91175L7.72362 0.875H20.8425ZM18.2761 23.6924H10.0791L7.83475 26.8713H20.4767L18.2761 23.6924ZM8.03512 21.6895L4.69262 23.8131L7.58012 26.8039L9.85687 23.5786L8.03512 21.6895ZM20.4024 21.6055L18.4984 23.5786L20.7296 26.8021L23.7422 23.6819L20.4024 21.6055ZM4.61912 4.56488V23.5638L7.931 21.4594V6.60625L4.61912 4.56488ZM17.1272 20.7244H11.3067L9.2015 22.5409L10.0677 23.4395H18.2875L19.1887 22.5033L17.1272 20.7244ZM23.8175 4.43625L20.5056 6.54063V21.3745L23.8175 23.4343V4.43625ZM9.09125 5.65688L8.17513 6.60625V21.476L9.02825 22.3598L11.1825 20.5013V7.46113L9.09125 5.65688ZM19.3882 5.6175L17.255 7.4585V20.5048L19.3629 22.3239L20.2615 21.3929V6.52313L19.3882 5.6175ZM17.01 7.5285H11.4275V20.4706H17.01V7.5285ZM18.3689 4.5605H10.1491L9.26537 5.47663L11.3479 7.27475H17.0852L19.215 5.43725L18.3689 4.5605ZM7.69562 1.2075L4.69437 4.31638L8.04562 6.38313L9.95312 4.40563L7.69562 1.2075ZM20.8556 1.19525L18.5806 4.4205L20.4015 6.3105L23.744 4.186L20.8565 1.19525H20.8556ZM20.6019 1.12788H7.9415L10.185 4.30675H18.3575L20.6019 1.12788Z" fill="#242424" stroke="#242424" stroke-width="0.5"/>
</svg>
