{
  "sections": {
    "hero_banner_z74Ggn": {
      "type": "hero-banner",
      "settings": {
        "container_width": "full",
        "info_floating": "right",
        "banner_bg_img": "shopify:\/\/shop_images\/hero.jpg",
        "banner_title": "Make an Appointment",
        "text_color": "white",
        "banner_description": "Like the diamond's enduring beauty, an engagement ring signifies the timelessness of the couple's love and their desire to create a lasting legacy.",
        "button_text": "SCHDEULE APPOINTMENT",
        "button_link": "shopify:\/\/collections"
      }
    },
    "home_diamond_shapes_4angY7": {
      "type": "home-diamond-shapes",
      "blocks": {
        "shape_ziTwCR": {
          "type": "shape",
          "settings": {
            "shape_icon": "shopify:\/\/shop_images\/round.svg",
            "shape_title": "Round"
          }
        },
        "shape_mQEijg": {
          "type": "shape",
          "settings": {
            "shape_icon": "shopify:\/\/shop_images\/masquisa.svg",
            "shape_title": "Oval"
          }
        },
        "shape_Pxf3Pj": {
          "type": "shape",
          "settings": {
            "shape_icon": "shopify:\/\/shop_images\/cushion.svg",
            "shape_title": "Cushion"
          }
        },
        "shape_64rBjn": {
          "type": "shape",
          "settings": {
            "shape_icon": "shopify:\/\/shop_images\/pear.svg",
            "shape_title": "Pear"
          }
        },
        "shape_HdTixw": {
          "type": "shape",
          "settings": {
            "shape_icon": "shopify:\/\/shop_images\/princess.svg",
            "shape_title": "Princess"
          }
        },
        "shape_JJjXcc": {
          "type": "shape",
          "settings": {
            "shape_icon": "shopify:\/\/shop_images\/emerald.svg",
            "shape_title": "Emerald"
          }
        },
        "shape_y9B3HH": {
          "type": "shape",
          "settings": {
            "shape_icon": "shopify:\/\/shop_images\/masquisa.svg",
            "shape_title": "Masquisa"
          }
        },
        "shape_Ah8GKj": {
          "type": "shape",
          "settings": {
            "shape_icon": "shopify:\/\/shop_images\/asscher.svg",
            "shape_title": "Asscher"
          }
        },
        "shape_peTMdK": {
          "type": "shape",
          "settings": {
            "shape_icon": "shopify:\/\/shop_images\/radiant.svg",
            "shape_title": "Radiant"
          }
        },
        "shape_Hxawqm": {
          "type": "shape",
          "settings": {
            "shape_icon": "shopify:\/\/shop_images\/heart.svg",
            "shape_title": "Heart"
          }
        }
      },
      "block_order": [
        "shape_ziTwCR",
        "shape_mQEijg",
        "shape_Pxf3Pj",
        "shape_64rBjn",
        "shape_HdTixw",
        "shape_JJjXcc",
        "shape_y9B3HH",
        "shape_Ah8GKj",
        "shape_peTMdK",
        "shape_Hxawqm"
      ],
      "settings": {
        "title": "Find the Perfect Diamond",
        "description": "Vestibulum ullamcorper donec amet est sit tristique a. \nEst sit\nconsequat dolor aliquam lectus etiam.",
        "button_text": "Diamond Search",
        "button_link": "#"
      }
    },
    "brands_mHVxL3": {
      "type": "brands",
      "blocks": {
        "brand_GeUGeq": {
          "type": "brand",
          "settings": {
            "brand_icon": "shopify:\/\/shop_images\/tacori.svg",
            "brand_link": "#"
          }
        },
        "brand_HjEqNf": {
          "type": "brand",
          "settings": {
            "brand_icon": "shopify:\/\/shop_images\/justiesi.svg",
            "brand_link": "#"
          }
        },
        "brand_jgEKJc": {
          "type": "brand",
          "settings": {
            "brand_icon": "shopify:\/\/shop_images\/tiffanyco.svg",
            "brand_link": "#"
          }
        },
        "brand_QEh8r4": {
          "type": "brand",
          "settings": {
            "brand_icon": "shopify:\/\/shop_images\/simong.svg",
            "brand_link": ""
          }
        },
        "brand_DJaHdX": {
          "type": "brand",
          "settings": {
            "brand_icon": "shopify:\/\/shop_images\/cartier.svg",
            "brand_link": ""
          }
        }
      },
      "block_order": [
        "brand_GeUGeq",
        "brand_HjEqNf",
        "brand_jgEKJc",
        "brand_QEh8r4",
        "brand_DJaHdX"
      ],
      "settings": {
      }
    },
    "featured_product_grid_zLcekb": {
      "type": "featured-product-grid",
      "settings": {
        "featured_collection": "frontpage",
        "section_title": "Find the Perfect Diamond"
      }
    },
    "main": {
      "type": "main-index",
      "settings": {
      }
    }
  },
  "order": [
    "hero_banner_z74Ggn",
    "home_diamond_shapes_4angY7",
    "brands_mHVxL3",
    "featured_product_grid_zLcekb",
    "main"
  ]
}