<svg width="18" height="14" viewBox="0 0 18 14" fill="none" xmlns="http://www.w3.org/2000/svg">
<path d="M16.9004 0.741878C16.6839 0.748329 16.4784 0.838812 16.3275 0.994157L6.08332 11.2383L1.67251 6.82749C1.59573 6.74751 1.50375 6.68366 1.40198 6.63967C1.3002 6.59569 1.19068 6.57245 1.07981 6.57132C0.968943 6.57019 0.858965 6.5912 0.756318 6.6331C0.65367 6.67501 0.560416 6.73698 0.482017 6.81538C0.403618 6.89378 0.34165 6.98703 0.299743 7.08968C0.257835 7.19233 0.23683 7.3023 0.237958 7.41317C0.239086 7.52404 0.262324 7.63357 0.306311 7.73534C0.350299 7.83711 0.414151 7.92909 0.494128 8.00588L5.49413 13.0059C5.65041 13.1621 5.86234 13.2499 6.08332 13.2499C6.3043 13.2499 6.51623 13.1621 6.67251 13.0059L17.5058 2.17254C17.6263 2.05549 17.7085 1.90479 17.7418 1.74019C17.7751 1.57559 17.7579 1.40477 17.6925 1.25012C17.627 1.09546 17.5164 0.964186 17.375 0.873495C17.2337 0.782805 17.0682 0.736928 16.9004 0.741878Z" fill="#5B5B5B"/>
</svg>
