<svg width="140" height="25" viewBox="0 0 140 25" fill="none" xmlns="http://www.w3.org/2000/svg">
<path d="M31.1186 18V7.81818H34.7479C35.5367 7.81818 36.1913 7.95407 36.7116 8.22585C37.2353 8.49763 37.6264 8.87382 37.8849 9.3544C38.1435 9.83168 38.2727 10.3835 38.2727 11.0099C38.2727 11.633 38.1418 12.1816 37.88 12.6555C37.6214 13.1262 37.2304 13.4924 36.7067 13.7543C36.1863 14.0161 35.5317 14.147 34.7429 14.147H31.9936V12.8246H34.6037C35.1009 12.8246 35.5052 12.7533 35.8168 12.6108C36.1316 12.4683 36.362 12.2611 36.5078 11.9893C36.6536 11.7176 36.7266 11.3911 36.7266 11.0099C36.7266 10.6255 36.652 10.2924 36.5028 10.0107C36.357 9.72893 36.1267 9.51349 35.8118 9.36435C35.5002 9.21188 35.0909 9.13565 34.5838 9.13565H32.6548V18H31.1186ZM36.1449 13.4062L38.6605 18H36.9105L34.4446 13.4062H36.1449ZM43.0783 7.81818V18H41.542V7.81818H43.0783ZM54.9335 7.81818V18H53.5216L48.3462 10.5327H48.2517V18H46.7155V7.81818H48.1374L53.3178 15.2955H53.4122V7.81818H54.9335ZM65.4651 11.0348C65.369 10.7332 65.2397 10.4631 65.0773 10.2244C64.9182 9.98248 64.7276 9.77699 64.5056 9.60795C64.2835 9.43561 64.03 9.30469 63.7449 9.2152C63.4632 9.12571 63.1533 9.08097 62.8152 9.08097C62.2418 9.08097 61.7248 9.22846 61.2641 9.52344C60.8034 9.81842 60.4388 10.2509 60.1703 10.821C59.9052 11.3878 59.7726 12.0821 59.7726 12.9041C59.7726 13.7294 59.9069 14.4271 60.1753 14.9972C60.4438 15.5672 60.8117 15.9998 61.279 16.2947C61.7463 16.5897 62.2783 16.7372 62.8749 16.7372C63.4284 16.7372 63.9106 16.6245 64.3216 16.3991C64.7359 16.1738 65.0558 15.8556 65.2811 15.4446C65.5098 15.0303 65.6242 14.5431 65.6242 13.983L66.0219 14.0575H63.1086V12.7898H67.1107V13.9482C67.1107 14.8033 66.9284 15.5457 66.5638 16.1754C66.2025 16.8018 65.7021 17.2857 65.0624 17.6271C64.426 17.9685 63.6969 18.1392 62.8749 18.1392C61.9535 18.1392 61.1448 17.9271 60.4488 17.5028C59.756 17.0786 59.2158 16.477 58.828 15.6982C58.4402 14.916 58.2463 13.9879 58.2463 12.9141C58.2463 12.102 58.359 11.3729 58.5844 10.7266C58.8098 10.0803 59.1263 9.53172 59.534 9.08097C59.945 8.62689 60.4272 8.28054 60.9807 8.0419C61.5375 7.79995 62.1457 7.67898 62.8053 7.67898C63.3555 7.67898 63.8676 7.76018 64.3415 7.92258C64.8188 8.08499 65.243 8.31534 65.6142 8.61364C65.9888 8.91193 66.2987 9.26657 66.5439 9.67756C66.7892 10.0852 66.9549 10.5376 67.0411 11.0348H65.4651ZM78.862 18H75.5659V7.81818H78.9664C79.9641 7.81818 80.8208 8.02202 81.5368 8.42969C82.2527 8.83404 82.8012 9.41572 83.1824 10.1747C83.5668 10.9304 83.7591 11.8369 83.7591 12.8942C83.7591 13.9548 83.5652 14.8662 83.1774 15.6286C82.7929 16.3909 82.2361 16.9775 81.5069 17.3885C80.7778 17.7962 79.8961 18 78.862 18ZM77.1021 16.6577H78.7775C79.5531 16.6577 80.1977 16.5118 80.7115 16.2202C81.2252 15.9252 81.6097 15.4993 81.8649 14.9425C82.1201 14.3823 82.2477 13.6996 82.2477 12.8942C82.2477 12.0954 82.1201 11.4176 81.8649 10.8608C81.613 10.304 81.2368 9.88139 80.7363 9.59304C80.2359 9.30469 79.6144 9.16051 78.872 9.16051H77.1021V16.6577ZM87.0694 18V7.81818H93.4529V9.14062H88.6056V12.2429H93.1198V13.5604H88.6056V16.6776H93.5126V18H87.0694ZM96.4028 9.14062V7.81818H104.283V9.14062H101.106V18H99.5747V9.14062H96.4028ZM107.081 18H105.45L109.114 7.81818H110.889L114.553 18H112.923L110.044 9.66761H109.965L107.081 18ZM107.354 14.0128H112.644V15.3054H107.354V14.0128ZM118.96 7.81818V18H117.424V7.81818H118.96ZM122.597 18V7.81818H124.133V16.6776H128.747V18H122.597ZM137.453 10.4929C137.4 10.0223 137.181 9.65767 136.796 9.39915C136.412 9.13731 135.928 9.00639 135.345 9.00639C134.927 9.00639 134.566 9.07268 134.261 9.20526C133.956 9.33452 133.719 9.51349 133.55 9.74219C133.384 9.96757 133.301 10.2244 133.301 10.5128C133.301 10.7547 133.358 10.9635 133.47 11.1392C133.586 11.3149 133.737 11.4624 133.923 11.5817C134.112 11.6977 134.314 11.7955 134.529 11.875C134.745 11.9512 134.952 12.0142 135.151 12.0639L136.145 12.3224C136.47 12.402 136.803 12.5097 137.144 12.6456C137.486 12.7815 137.802 12.9605 138.094 13.1825C138.386 13.4046 138.621 13.6797 138.8 14.0078C138.982 14.3359 139.073 14.7287 139.073 15.1861C139.073 15.7628 138.924 16.2749 138.626 16.7223C138.331 17.1697 137.902 17.5227 137.338 17.7812C136.778 18.0398 136.1 18.169 135.305 18.169C134.543 18.169 133.883 18.0481 133.326 17.8061C132.769 17.5642 132.334 17.2211 132.019 16.777C131.704 16.3295 131.53 15.7992 131.497 15.1861H133.038C133.068 15.554 133.187 15.8606 133.396 16.1058C133.608 16.3478 133.878 16.5284 134.206 16.6477C134.538 16.7637 134.901 16.8217 135.295 16.8217C135.729 16.8217 136.115 16.7538 136.453 16.6179C136.795 16.4787 137.063 16.2865 137.259 16.0412C137.454 15.7926 137.552 15.5026 137.552 15.1712C137.552 14.8696 137.466 14.6226 137.294 14.4304C137.125 14.2382 136.894 14.0791 136.603 13.9531C136.314 13.8272 135.988 13.7161 135.623 13.62L134.42 13.2919C133.605 13.0698 132.958 12.7434 132.481 12.3125C132.007 11.8816 131.77 11.3116 131.77 10.6023C131.77 10.0156 131.929 9.50355 132.247 9.06605C132.566 8.62855 132.997 8.28883 133.54 8.04688C134.084 7.80161 134.697 7.67898 135.38 7.67898C136.069 7.67898 136.677 7.79995 137.204 8.0419C137.734 8.28385 138.152 8.61695 138.457 9.04119C138.762 9.46212 138.921 9.94602 138.934 10.4929H137.453Z" fill="#242424"/>
<circle cx="11" cy="13" r="10.25" stroke="#242424" stroke-width="1.5"/>
<circle cx="11" cy="13" r="7.25" stroke="#242424" stroke-width="1.5"/>
<line x1="9" y1="1" x2="13" y2="1" stroke="#242424" stroke-width="2"/>
</svg>
