<svg width="151" height="23" viewBox="0 0 151 23" fill="none" xmlns="http://www.w3.org/2000/svg">
<path d="M6.35365 0.771787V1.25718C5.80353 1.27336 5.38286 1.33808 5.09162 1.45134C4.81656 1.54842 4.63049 1.74258 4.53341 2.03382C4.43633 2.30888 4.38779 2.74573 4.38779 3.34439V15.3822C4.38779 15.9647 4.43633 16.4016 4.53341 16.6928C4.63049 16.984 4.81656 17.1782 5.09162 17.2753C5.38286 17.3562 5.80353 17.3966 6.35365 17.3966H8.12535C8.8858 17.3966 9.50064 17.3157 9.96986 17.1539C10.4553 16.9921 10.8355 16.7413 11.1105 16.4016C11.4018 16.0456 11.6202 15.5764 11.7658 14.9939C11.9114 14.4114 12.0247 13.6995 12.1056 12.8582H12.6638C12.6153 13.3597 12.591 14.0231 12.591 14.8483C12.591 15.1557 12.5991 15.6007 12.6153 16.1831C12.6476 16.7494 12.6962 17.34 12.7609 17.9548C11.9357 17.9225 11.0054 17.9063 9.96986 17.9063C8.93434 17.8901 8.01209 17.882 7.2031 17.882C6.84714 17.882 6.38601 17.882 5.81971 17.882C5.2696 17.882 4.67094 17.8901 4.02375 17.9063C3.37655 17.9063 2.72126 17.9144 2.05789 17.9306C1.39451 17.9306 0.763497 17.9387 0.164841 17.9548V17.4694C0.714958 17.4371 1.12754 17.3724 1.4026 17.2753C1.69384 17.1782 1.888 16.984 1.98508 16.6928C2.08216 16.4016 2.1307 15.9647 2.1307 15.3822V3.34439C2.1307 2.74573 2.08216 2.30888 1.98508 2.03382C1.888 1.74258 1.69384 1.54842 1.4026 1.45134C1.12754 1.33808 0.714958 1.27336 0.164841 1.25718V0.771787C0.504619 0.787967 0.949566 0.804146 1.49968 0.820326C2.0498 0.836506 2.64037 0.844596 3.27138 0.844596C3.83768 0.844596 4.39588 0.836506 4.946 0.820326C5.5123 0.804146 5.98151 0.787967 6.35365 0.771787ZM21.2527 0.650436L27.1745 15.9162C27.4172 16.531 27.6923 16.9436 27.9997 17.1539C28.3071 17.3481 28.5903 17.4533 28.8491 17.4694V17.9548C28.5255 17.9225 28.1291 17.9063 27.6599 17.9063C27.1907 17.8901 26.7215 17.882 26.2523 17.882C25.6212 17.882 25.0307 17.8901 24.4806 17.9063C23.9305 17.9063 23.4855 17.9225 23.1457 17.9548V17.4694C23.9709 17.4371 24.4967 17.2995 24.7233 17.0568C24.9498 16.798 24.9012 16.2559 24.5776 15.4308L20.0635 3.36866L20.4518 3.05315L16.2288 14.0231C15.9699 14.6703 15.8162 15.2204 15.7677 15.6735C15.7192 16.1103 15.7596 16.4582 15.889 16.7171C16.0347 16.976 16.2693 17.162 16.5929 17.2753C16.9326 17.3885 17.3533 17.4533 17.8549 17.4694V17.9548C17.4019 17.9225 16.9246 17.9063 16.423 17.9063C15.9376 17.8901 15.4845 17.882 15.0639 17.882C14.6594 17.882 14.3115 17.8901 14.0203 17.9063C13.7452 17.9063 13.4863 17.9225 13.2436 17.9548V17.4694C13.5672 17.3885 13.8989 17.2025 14.2387 16.9112C14.5785 16.6038 14.8859 16.0861 15.1609 15.358L20.8644 0.650436C20.9291 0.650436 20.9938 0.650436 21.0585 0.650436C21.1232 0.650436 21.188 0.650436 21.2527 0.650436ZM24.2136 10.9651V11.4505H16.9812L17.2239 10.9651H24.2136ZM34.259 22.5176V22.0564C34.9871 22.0403 35.5939 21.8623 36.0793 21.5225C36.5809 21.1827 36.953 20.6164 37.1957 19.8236C37.4546 19.047 37.584 18.0034 37.584 16.6928V3.34439C37.584 2.74573 37.5355 2.30888 37.4384 2.03382C37.3413 1.74258 37.1471 1.54842 36.8559 1.45134C36.5809 1.33808 36.1683 1.27336 35.6181 1.25718V0.771787C35.9579 0.787967 36.4029 0.804146 36.953 0.820326C37.5031 0.836506 38.0775 0.844596 38.6761 0.844596C39.2748 0.844596 39.8492 0.836506 40.3993 0.820326C40.9656 0.804146 41.4348 0.787967 41.807 0.771787V1.25718C41.2568 1.27336 40.8362 1.33808 40.5449 1.45134C40.2699 1.54842 40.0838 1.74258 39.9867 2.03382C39.8896 2.30888 39.8411 2.74573 39.8411 3.34439V12.2272C39.8411 12.8905 39.833 13.6105 39.8168 14.3872C39.8007 15.1638 39.7602 15.9162 39.6955 16.6443C39.6469 17.3724 39.558 18.0115 39.4285 18.5616C39.1535 19.6942 38.571 20.6326 37.6811 21.3769C36.8074 22.1373 35.6667 22.5176 34.259 22.5176ZM55.7906 0.771787C55.7258 1.33808 55.6773 1.8882 55.6449 2.42214C55.6288 2.95607 55.6207 3.36057 55.6207 3.63563C55.6207 3.92687 55.6288 4.21001 55.6449 4.48507C55.6611 4.74395 55.6773 4.96238 55.6935 5.14036H55.1353C55.0382 4.18574 54.9007 3.43338 54.7227 2.88326C54.5447 2.31697 54.2373 1.92056 53.8004 1.69404C53.3798 1.45134 52.7406 1.32999 51.8831 1.32999H49.8687C49.3186 1.32999 48.8979 1.37853 48.6067 1.47561C48.3316 1.55651 48.1456 1.74258 48.0485 2.03382C47.9514 2.30888 47.9029 2.74573 47.9029 3.34439V15.3822C47.9029 15.9647 47.9514 16.4016 48.0485 16.6928C48.1456 16.984 48.3316 17.1782 48.6067 17.2753C48.8979 17.3562 49.3186 17.3966 49.8687 17.3966H51.6404C52.6597 17.3966 53.4283 17.2591 53.946 16.984C54.48 16.709 54.8602 16.264 55.0867 15.6492C55.3294 15.0182 55.5074 14.1687 55.6207 13.1009H56.1789C56.1303 13.5377 56.1061 14.1202 56.1061 14.8483C56.1061 15.1557 56.1142 15.6007 56.1303 16.1831C56.1627 16.7494 56.2112 17.34 56.276 17.9548C55.4508 17.9225 54.5204 17.9063 53.4849 17.9063C52.4494 17.8901 51.5272 17.882 50.7182 17.882C50.3622 17.882 49.9011 17.882 49.3348 17.882C48.7847 17.882 48.186 17.8901 47.5388 17.9063C46.8916 17.9063 46.2363 17.9144 45.573 17.9306C44.9096 17.9306 44.2786 17.9387 43.6799 17.9548V17.4694C44.23 17.4371 44.6426 17.3724 44.9177 17.2753C45.2089 17.1782 45.4031 16.984 45.5001 16.6928C45.5972 16.4016 45.6458 15.9647 45.6458 15.3822V3.34439C45.6458 2.74573 45.5972 2.30888 45.5001 2.03382C45.4031 1.74258 45.2089 1.54842 44.9177 1.45134C44.6426 1.33808 44.23 1.27336 43.6799 1.25718V0.771787C44.2786 0.787967 44.9096 0.804146 45.573 0.820326C46.2363 0.820326 46.8916 0.828416 47.5388 0.844596C48.186 0.844596 48.7847 0.844596 49.3348 0.844596C49.9011 0.844596 50.3622 0.844596 50.7182 0.844596C51.4624 0.844596 52.3038 0.844596 53.2422 0.844596C54.1968 0.828416 55.0463 0.804146 55.7906 0.771787ZM51.6161 9.07207C51.6161 9.07207 51.6161 9.15297 51.6161 9.31477C51.6161 9.47657 51.6161 9.55747 51.6161 9.55747H47.1748C47.1748 9.55747 47.1748 9.47657 47.1748 9.31477C47.1748 9.15297 47.1748 9.07207 47.1748 9.07207H51.6161ZM52.32 5.86845C52.2552 6.79071 52.2229 7.49453 52.2229 7.97993C52.2391 8.46533 52.2472 8.91027 52.2472 9.31477C52.2472 9.71927 52.2552 10.1642 52.2714 10.6496C52.2876 11.135 52.3281 11.8388 52.3928 12.7611H51.8346C51.7699 12.2433 51.689 11.7418 51.5919 11.2564C51.511 10.7548 51.3168 10.3503 51.0094 10.0429C50.7182 9.71927 50.2166 9.55747 49.5047 9.55747V9.07207C50.0386 9.07207 50.4431 8.9669 50.7182 8.75656C51.0094 8.53005 51.2197 8.2469 51.3492 7.90712C51.4786 7.56734 51.5676 7.21947 51.6161 6.86352C51.6647 6.49138 51.7132 6.15969 51.7618 5.86845H52.32ZM79.4628 0.771787V1.25718C79.1553 1.3219 78.8156 1.50797 78.4434 1.81539C78.0713 2.10663 77.772 2.62438 77.5454 3.36866L72.9584 18.0762C72.9261 18.0762 72.8937 18.0762 72.8614 18.0762C72.829 18.0762 72.7966 18.0762 72.7643 18.0762C72.7319 18.0762 72.6996 18.0762 72.6672 18.0762C72.6348 18.0762 72.6025 18.0762 72.5701 18.0762L67.4249 2.81045C67.2146 2.17944 66.98 1.76685 66.7211 1.57269C66.4622 1.37853 66.2195 1.27336 65.993 1.25718V0.771787C66.2842 0.787967 66.6483 0.804146 67.0851 0.820326C67.522 0.836506 67.9427 0.844596 68.3472 0.844596C68.9782 0.844596 69.5687 0.836506 70.1189 0.820326C70.669 0.804146 71.1139 0.787967 71.4537 0.771787V1.25718C70.9683 1.27336 70.58 1.3219 70.2888 1.4028C70.0137 1.4837 69.8519 1.66168 69.8034 1.93674C69.771 2.2118 69.8519 2.66483 70.0461 3.29585L73.6623 14.4842L73.3225 14.7755L76.5261 4.7035C76.8173 3.81361 76.9468 3.12596 76.9144 2.64056C76.8982 2.13899 76.7203 1.79112 76.3805 1.59696C76.0407 1.38662 75.531 1.27336 74.8515 1.25718V0.771787C75.3207 0.787967 75.798 0.804146 76.2834 0.820326C76.7688 0.836506 77.2218 0.844596 77.6425 0.844596C78.0632 0.844596 78.4111 0.836506 78.6861 0.820326C78.9612 0.804146 79.2201 0.787967 79.4628 0.771787ZM62.4981 0.771787V1.25718C62.0775 1.28954 61.77 1.37044 61.5759 1.49988C61.3979 1.62932 61.3089 1.83966 61.3089 2.1309C61.3251 2.40596 61.4141 2.79427 61.5759 3.29585L65.3377 14.7755L64.731 15.3822L68.1287 4.53361L68.4928 5.11609L64.4883 18.0762C64.4559 18.0762 64.4235 18.0762 64.3912 18.0762C64.3588 18.0762 64.3265 18.0762 64.2941 18.0762C64.2617 18.0762 64.2294 18.0762 64.197 18.0762C64.1647 18.0762 64.1323 18.0762 64.0999 18.0762L58.9547 2.81045C58.7444 2.17944 58.4774 1.76685 58.1538 1.57269C57.8302 1.37853 57.539 1.27336 57.2801 1.25718V0.771787C57.6037 0.787967 58.0001 0.804146 58.4693 0.820326C58.9547 0.836506 59.424 0.844596 59.877 0.844596C60.4109 0.844596 60.9044 0.836506 61.3574 0.820326C61.8267 0.804146 62.2069 0.787967 62.4981 0.771787ZM92.5508 0.771787C92.4861 1.33808 92.4376 1.8882 92.4052 2.42214C92.389 2.95607 92.3809 3.36057 92.3809 3.63563C92.3809 3.92687 92.389 4.21001 92.4052 4.48507C92.4214 4.74395 92.4376 4.96238 92.4537 5.14036H91.8955C91.7985 4.18574 91.6609 3.43338 91.483 2.88326C91.305 2.31697 90.9976 1.92056 90.5607 1.69404C90.14 1.45134 89.5009 1.32999 88.6434 1.32999H86.629C86.0789 1.32999 85.6582 1.37853 85.367 1.47561C85.0919 1.55651 84.9058 1.74258 84.8087 2.03382C84.7117 2.30888 84.6631 2.74573 84.6631 3.34439V15.3822C84.6631 15.9647 84.7117 16.4016 84.8087 16.6928C84.9058 16.984 85.0919 17.1782 85.367 17.2753C85.6582 17.3562 86.0789 17.3966 86.629 17.3966H88.4007C89.42 17.3966 90.1886 17.2591 90.7063 16.984C91.2403 16.709 91.6205 16.264 91.847 15.6492C92.0897 15.0182 92.2677 14.1687 92.3809 13.1009H92.9391C92.8906 13.5377 92.8663 14.1202 92.8663 14.8483C92.8663 15.1557 92.8744 15.6007 92.8906 16.1831C92.923 16.7494 92.9715 17.34 93.0362 17.9548C92.2111 17.9225 91.2807 17.9063 90.2452 17.9063C89.2097 17.8901 88.2874 17.882 87.4784 17.882C87.1225 17.882 86.6613 17.882 86.0951 17.882C85.5449 17.882 84.9463 17.8901 84.2991 17.9063C83.6519 17.9063 82.9966 17.9144 82.3332 17.9306C81.6699 17.9306 81.0388 17.9387 80.4402 17.9548V17.4694C80.9903 17.4371 81.4029 17.3724 81.6779 17.2753C81.9692 17.1782 82.1633 16.984 82.2604 16.6928C82.3575 16.4016 82.406 15.9647 82.406 15.3822V3.34439C82.406 2.74573 82.3575 2.30888 82.2604 2.03382C82.1633 1.74258 81.9692 1.54842 81.6779 1.45134C81.4029 1.33808 80.9903 1.27336 80.4402 1.25718V0.771787C81.0388 0.787967 81.6699 0.804146 82.3332 0.820326C82.9966 0.820326 83.6519 0.828416 84.2991 0.844596C84.9463 0.844596 85.5449 0.844596 86.0951 0.844596C86.6613 0.844596 87.1225 0.844596 87.4784 0.844596C88.2227 0.844596 89.0641 0.844596 90.0025 0.844596C90.9571 0.828416 91.8066 0.804146 92.5508 0.771787ZM88.3764 9.07207C88.3764 9.07207 88.3764 9.15297 88.3764 9.31477C88.3764 9.47657 88.3764 9.55747 88.3764 9.55747H83.935C83.935 9.55747 83.935 9.47657 83.935 9.31477C83.935 9.15297 83.935 9.07207 83.935 9.07207H88.3764ZM89.0802 5.86845C89.0155 6.79071 88.9832 7.49453 88.9832 7.97993C88.9993 8.46533 89.0074 8.91027 89.0074 9.31477C89.0074 9.71927 89.0155 10.1642 89.0317 10.6496C89.0479 11.135 89.0883 11.8388 89.1531 12.7611H88.5948C88.5301 12.2433 88.4492 11.7418 88.3521 11.2564C88.2712 10.7548 88.0771 10.3503 87.7697 10.0429C87.4784 9.71927 86.9769 9.55747 86.2649 9.55747V9.07207C86.7989 9.07207 87.2034 8.9669 87.4784 8.75656C87.7697 8.53005 87.98 8.2469 88.1094 7.90712C88.2389 7.56734 88.3279 7.21947 88.3764 6.86352C88.425 6.49138 88.4735 6.15969 88.522 5.86845H89.0802ZM101.418 0.771787V1.25718C100.868 1.27336 100.448 1.33808 100.156 1.45134C99.8813 1.54842 99.6953 1.74258 99.5982 2.03382C99.5011 2.30888 99.4526 2.74573 99.4526 3.34439V15.3822C99.4526 15.9647 99.5011 16.4016 99.5982 16.6928C99.6953 16.984 99.8813 17.1782 100.156 17.2753C100.448 17.3562 100.868 17.3966 101.418 17.3966H103.19C103.951 17.3966 104.565 17.3157 105.035 17.1539C105.52 16.9921 105.9 16.7413 106.175 16.4016C106.467 16.0456 106.685 15.5764 106.831 14.9939C106.976 14.4114 107.089 13.6995 107.17 12.8582H107.729C107.68 13.3597 107.656 14.0231 107.656 14.8483C107.656 15.1557 107.664 15.6007 107.68 16.1831C107.712 16.7494 107.761 17.34 107.826 17.9548C107 17.9225 106.07 17.9063 105.035 17.9063C103.999 17.8901 103.077 17.882 102.268 17.882C101.912 17.882 101.451 17.882 100.884 17.882C100.334 17.882 99.7357 17.8901 99.0885 17.9063C98.4413 17.9063 97.786 17.9144 97.1227 17.9306C96.4593 17.9306 95.8283 17.9387 95.2296 17.9548V17.4694C95.7797 17.4371 96.1923 17.3724 96.4674 17.2753C96.7586 17.1782 96.9528 16.984 97.0499 16.6928C97.1469 16.4016 97.1955 15.9647 97.1955 15.3822V3.34439C97.1955 2.74573 97.1469 2.30888 97.0499 2.03382C96.9528 1.74258 96.7586 1.54842 96.4674 1.45134C96.1923 1.33808 95.7797 1.27336 95.2296 1.25718V0.771787C95.5694 0.787967 96.0143 0.804146 96.5645 0.820326C97.1146 0.836506 97.7051 0.844596 98.3362 0.844596C98.9025 0.844596 99.4607 0.836506 100.011 0.820326C100.577 0.804146 101.046 0.787967 101.418 0.771787ZM121.608 0.771787C121.544 1.33808 121.495 1.8882 121.463 2.42214C121.446 2.95607 121.438 3.36057 121.438 3.63563C121.438 3.92687 121.446 4.21001 121.463 4.48507C121.479 4.74395 121.495 4.96238 121.511 5.14036H120.953C120.856 4.18574 120.718 3.43338 120.54 2.88326C120.362 2.31697 120.055 1.92056 119.618 1.69404C119.197 1.45134 118.558 1.32999 117.701 1.32999H115.686C115.136 1.32999 114.716 1.37853 114.424 1.47561C114.149 1.55651 113.963 1.74258 113.866 2.03382C113.769 2.30888 113.721 2.74573 113.721 3.34439V15.3822C113.721 15.9647 113.769 16.4016 113.866 16.6928C113.963 16.984 114.149 17.1782 114.424 17.2753C114.716 17.3562 115.136 17.3966 115.686 17.3966H117.458C118.477 17.3966 119.246 17.2591 119.764 16.984C120.298 16.709 120.678 16.264 120.904 15.6492C121.147 15.0182 121.325 14.1687 121.438 13.1009H121.997C121.948 13.5377 121.924 14.1202 121.924 14.8483C121.924 15.1557 121.932 15.6007 121.948 16.1831C121.98 16.7494 122.029 17.34 122.094 17.9548C121.269 17.9225 120.338 17.9063 119.303 17.9063C118.267 17.8901 117.345 17.882 116.536 17.882C116.18 17.882 115.719 17.882 115.153 17.882C114.602 17.882 114.004 17.8901 113.357 17.9063C112.709 17.9063 112.054 17.9144 111.391 17.9306C110.727 17.9306 110.096 17.9387 109.498 17.9548V17.4694C110.048 17.4371 110.46 17.3724 110.735 17.2753C111.027 17.1782 111.221 16.984 111.318 16.6928C111.415 16.4016 111.463 15.9647 111.463 15.3822V3.34439C111.463 2.74573 111.415 2.30888 111.318 2.03382C111.221 1.74258 111.027 1.54842 110.735 1.45134C110.46 1.33808 110.048 1.27336 109.498 1.25718V0.771787C110.096 0.787967 110.727 0.804146 111.391 0.820326C112.054 0.820326 112.709 0.828416 113.357 0.844596C114.004 0.844596 114.602 0.844596 115.153 0.844596C115.719 0.844596 116.18 0.844596 116.536 0.844596C117.28 0.844596 118.122 0.844596 119.06 0.844596C120.015 0.828416 120.864 0.804146 121.608 0.771787ZM117.434 9.07207C117.434 9.07207 117.434 9.15297 117.434 9.31477C117.434 9.47657 117.434 9.55747 117.434 9.55747H112.992C112.992 9.55747 112.992 9.47657 112.992 9.31477C112.992 9.15297 112.992 9.07207 112.992 9.07207H117.434ZM118.138 5.86845C118.073 6.79071 118.041 7.49453 118.041 7.97993C118.057 8.46533 118.065 8.91027 118.065 9.31477C118.065 9.71927 118.073 10.1642 118.089 10.6496C118.105 11.135 118.146 11.8388 118.211 12.7611H117.652C117.588 12.2433 117.507 11.7418 117.41 11.2564C117.329 10.7548 117.135 10.3503 116.827 10.0429C116.536 9.71927 116.034 9.55747 115.322 9.55747V9.07207C115.856 9.07207 116.261 8.9669 116.536 8.75656C116.827 8.53005 117.037 8.2469 117.167 7.90712C117.296 7.56734 117.385 7.21947 117.434 6.86352C117.482 6.49138 117.531 6.15969 117.579 5.86845H118.138ZM124.287 0.771787C124.627 0.787967 125.072 0.804146 125.622 0.820326C126.172 0.836506 126.714 0.844596 127.248 0.844596C128.008 0.844596 128.737 0.836506 129.432 0.820326C130.128 0.804146 130.621 0.796057 130.913 0.796057C132.223 0.796057 133.307 0.982125 134.165 1.35426C135.039 1.7264 135.686 2.23607 136.106 2.88326C136.543 3.51428 136.762 4.22619 136.762 5.01901C136.762 5.50441 136.665 6.02216 136.471 6.57228C136.276 7.12239 135.937 7.64015 135.451 8.12555C134.982 8.61094 134.335 9.01544 133.51 9.33904C132.684 9.64646 131.641 9.80017 130.379 9.80017H128.049V9.31477H130.136C131.285 9.31477 132.159 9.13679 132.757 8.78083C133.372 8.4087 133.785 7.9233 133.995 7.32464C134.222 6.70981 134.335 6.03025 134.335 5.28598C134.335 4.00777 134.027 3.02079 133.413 2.32506C132.814 1.61314 131.778 1.25718 130.306 1.25718C129.562 1.25718 129.076 1.39471 128.85 1.66977C128.623 1.94483 128.51 2.50303 128.51 3.34439V15.3822C128.51 15.9647 128.559 16.4016 128.656 16.6928C128.753 16.984 128.939 17.1782 129.214 17.2753C129.505 17.3724 129.926 17.4371 130.476 17.4694V17.9548C130.104 17.9225 129.635 17.9063 129.068 17.9063C128.518 17.8901 127.96 17.882 127.394 17.882C126.763 17.882 126.172 17.8901 125.622 17.9063C125.072 17.9063 124.627 17.9225 124.287 17.9548V17.4694C124.837 17.4371 125.25 17.3724 125.525 17.2753C125.816 17.1782 126.01 16.984 126.107 16.6928C126.204 16.4016 126.253 15.9647 126.253 15.3822V3.34439C126.253 2.74573 126.204 2.30888 126.107 2.03382C126.01 1.74258 125.816 1.54842 125.525 1.45134C125.25 1.33808 124.837 1.27336 124.287 1.25718V0.771787ZM128.146 9.38758C129.02 9.41994 129.707 9.46039 130.209 9.50893C130.71 9.54129 131.115 9.57365 131.422 9.60601C131.746 9.63837 132.053 9.67882 132.345 9.72736C133.429 9.90534 134.205 10.237 134.675 10.7224C135.16 11.1916 135.516 11.9278 135.742 12.931L136.349 15.4065C136.511 16.1184 136.673 16.6362 136.835 16.9598C137.013 17.2672 137.28 17.4128 137.635 17.3966C137.911 17.3804 138.137 17.2915 138.315 17.1297C138.509 16.9679 138.711 16.7494 138.922 16.4744L139.286 16.7413C138.946 17.2429 138.59 17.6312 138.218 17.9063C137.862 18.1652 137.352 18.2946 136.689 18.2946C136.09 18.2946 135.564 18.1166 135.111 17.7607C134.658 17.4047 134.319 16.709 134.092 15.6735L133.558 13.2465C133.413 12.5507 133.243 11.9521 133.048 11.4505C132.87 10.9328 132.612 10.5283 132.272 10.237C131.948 9.94579 131.463 9.80017 130.816 9.80017H128.195L128.146 9.38758ZM145.218 0.504818C146.027 0.504818 146.642 0.601897 147.063 0.796057C147.483 0.974035 147.856 1.17628 148.179 1.4028C148.373 1.51606 148.527 1.60505 148.64 1.66977C148.77 1.71831 148.891 1.74258 149.004 1.74258C149.166 1.74258 149.279 1.65359 149.344 1.47561C149.425 1.29763 149.49 1.03066 149.538 0.674707H150.097C150.08 0.949765 150.056 1.28145 150.024 1.66977C150.008 2.04191 149.991 2.54349 149.975 3.1745C149.975 3.78934 149.975 4.60642 149.975 5.62575H149.417C149.368 4.84912 149.199 4.10484 148.907 3.39293C148.616 2.68101 148.187 2.09854 147.621 1.6455C147.071 1.19246 146.343 0.965945 145.437 0.965945C144.579 0.965945 143.867 1.22482 143.301 1.74258C142.751 2.26034 142.476 2.93989 142.476 3.78125C142.476 4.50934 142.662 5.12418 143.034 5.62575C143.406 6.11115 143.9 6.5561 144.514 6.9606C145.145 7.34891 145.825 7.76959 146.553 8.22263C147.394 8.74038 148.139 9.25814 148.786 9.7759C149.449 10.2775 149.967 10.8357 150.339 11.4505C150.728 12.0654 150.922 12.8096 150.922 13.6833C150.922 14.7189 150.687 15.5764 150.218 16.2559C149.749 16.9355 149.126 17.4452 148.349 17.7849C147.572 18.1247 146.715 18.2946 145.776 18.2946C144.919 18.2946 144.239 18.1975 143.738 18.0034C143.236 17.8092 142.807 17.607 142.452 17.3966C142.096 17.1701 141.821 17.0568 141.626 17.0568C141.465 17.0568 141.343 17.1458 141.262 17.3238C141.198 17.5018 141.141 17.7688 141.092 18.1247H140.534C140.567 17.7849 140.583 17.3885 140.583 16.9355C140.599 16.4663 140.607 15.8595 140.607 15.1153C140.623 14.371 140.631 13.4326 140.631 12.3H141.189C141.254 13.2708 141.432 14.1768 141.723 15.0182C142.031 15.8595 142.492 16.5391 143.107 17.0568C143.738 17.5584 144.571 17.8092 145.607 17.8092C146.141 17.8092 146.642 17.704 147.111 17.4937C147.597 17.2672 147.993 16.9193 148.301 16.4501C148.608 15.9647 148.762 15.3418 148.762 14.5813C148.762 13.918 148.6 13.3436 148.276 12.8582C147.969 12.3566 147.532 11.8955 146.966 11.4748C146.399 11.0379 145.736 10.593 144.976 10.1399C144.215 9.67073 143.503 9.19342 142.84 8.70802C142.176 8.22263 141.643 7.66442 141.238 7.03341C140.85 6.38621 140.656 5.60958 140.656 4.7035C140.656 3.74889 140.866 2.96416 141.287 2.34933C141.723 1.71831 142.29 1.25718 142.985 0.965945C143.681 0.658527 144.425 0.504818 145.218 0.504818Z" fill="#242424"/>
</svg>
